##TITLE=1H_85-2025-Bay
 200.13MHz,CDCl3,
 8 sc
 
 28.7.2025
##JCAMPDX= 6.0         $$ Bruker NMR JCAMP-DX V2.0
##DATA TYPE= NMR FID
##DATA CLASS= NTUPLES
##ORIGIN= UXNMR, Bruker Analytische Messtechnik GmbH
##OWNER= pz
$$ XWIN-NMR		Version 3.5
$$ Mon Jul 28 15:11:31 2025 Russian Standard Time (UT+4h)  she@DPX200
##.OBSERVE FREQUENCY= 200.1313
##.OBSERVE NUCLEUS= ^1H
##.DELAY= (6, 6)
##.ACQUISITION MODE= SIMULTANEOUS
##.ACQUISITION SCHEME= undefined
##.AVERAGES= 8
##.DIGITISER RES= 18
##SPECTROMETER/DATA SYSTEM= spect
##.PULSE SEQUENCE= zg30
##.SOLVENT NAME= CDCl3
##.SHIFT REFERENCE= (INTERNAL, CDCl3, 0, 14.3821)
##AUDIT TRAIL= $$ (NUMBER, WHEN, WHO, WHERE, WHAT)
$$ ##TITLE= Audit trail, XWIN-NMR		Version 3.5
$$ ##JCAMPDX= 5.01
$$ ##ORIGIN= Bruker BioSpin GmbH
$$ ##OWNER= she
$$ F:/spectra/data/she/nmr/H-C/1/audita.txt
$$ ##AUDIT TRAIL=  $$ (NUMBER, WHEN, WHO, WHERE, WHAT)
(   1,<2025-07-28 15:09:57.89 +0400>,<she>,<DPX200>,
      <created by zg, POWCHK disabled, PULCHK disabled
       configuration hash MD5:
       00 E9 B6 7A A2 85 ED C7 34 08 36 98 17 FE 4E 26
       data hash MD5: 16K
       61 F2 A4 09 58 A8 AA F2 BA 09 D5 9D 98 05 63 A2>)
$$ ##END=
$$ 
$$ hash MD5
$$ BD 2B 7E 49 64 F1 88 CD 56 AC FD 58 AC F6 6E E8
##$RELAX= 
##$RELAX= 
##$RELAX= 
##$RELAX= 
##$RELAX= 
##$RELAX= 
$$ Bruker specific parameters
$$ --------------------------
##$DU= <F:/spectra>
##$EXPNO= 1
##$NAME= <H-C>
##$PROCNO= 1
##$TYPE= <nmr>
##$USER= <she>
##$AMP= (0..31)
100 100 100 100 100 100 100 100 100 100 100 100 100 100 100 100 100 100 
100 100 100 100 100 100 100 100 100 100 100 100 100 100 
##$AQSEQ= 0
##$AQ_mod= 1
##$AUNM= <au_zg>
##$AUTOPOS= <>
##$BF1= 200.13
##$BF2= 200.13
##$BF3= 200.13
##$BF4= 200.13
##$BF5= 200.13
##$BF6= 200.13
##$BF7= 200.13
##$BF8= 200.13
##$BYTORDA= 1
##$CFDGTYP= 0
##$CFRGTYP= 5
##$CHEMSTR= <none>
##$CNST= (0..31)
1 1 145 1 1 1 1 1 1 1 1 1 1 1 1 1 1 1 1 1 1 1 1 1 1 1 1 1 1 1 1 1 
##$CPDPRG= <>
##$CPDPRG1= <>
##$CPDPRG2= <>
##$CPDPRG3= <>
##$CPDPRG4= <mlev>
##$CPDPRG5= <mlev>
##$CPDPRG6= <mlev>
##$CPDPRG7= <mlev>
##$CPDPRG8= <mlev>
##$CPDPRGB= <>
##$CPDPRGT= <>
##$D= (0..31)
0 0.7 0 0 0 0 0 0 0 0 0 0.03 0 0 0 0 0 0 0 0 0 0 0 0 0 0 0 0 0 0 0 0 
##$DATE= 1753700997
##$DBL= (0..7)
120 120 120 120 120 120 120 120 
##$DBP= (0..7)
150 150 150 150 150 150 150 150 
##$DBP07= 0
##$DBPNAM0= <>
##$DBPNAM1= <>
##$DBPNAM2= <>
##$DBPNAM3= <>
##$DBPNAM4= <>
##$DBPNAM5= <>
##$DBPNAM6= <>
##$DBPNAM7= <>
##$DBPOAL= (0..7)
0.5 0.5 0.5 0.5 0.5 0.5 0.5 0.5 
##$DBPOFFS= (0..7)
0 0 0 0 0 0 0 0 
##$DE= 6
##$DECBNUC= <off>
##$DECIM= 32
##$DECNUC= <off>
##$DECSTAT= 4
##$DIGMOD= 1
##$DIGTYP= 9
##$DL= (0..7)
0 120 120 120 120 120 120 120 
##$DP= (0..7)
150 150 150 150 150 150 150 150 
##$DP07= 0
##$DPNAME0= <>
##$DPNAME1= <>
##$DPNAME2= <>
##$DPNAME3= <>
##$DPNAME4= <>
##$DPNAME5= <>
##$DPNAME6= <>
##$DPNAME7= <>
##$DPOAL= (0..7)
0.5 0.5 0.5 0.5 0.5 0.5 0.5 0.5 
##$DPOFFS= (0..7)
0 0 0 0 0 0 0 0 
##$DQDMODE= 0
##$DR= 18
##$DS= 0
##$DSLIST= <SSSSSSSSSSSSSSS>
$$ [...]
##$SUBNAM0= <"">
##$SUBNAM1= <"">
##$SUBNAM2= <"">
##$SUBNAM3= <"">
##$SUBNAM4= <"">
##$SUBNAM5= <"">
##$SUBNAM6= <"">
##$SUBNAM7= <"">
##$SUBNAM8= <"">
##$SUBNAM9= <"">
##$SW= 18.0517328524113
##$SWIBOX= (0..15)
0 0 2 0 0 0 0 0 0 0 0 0 0 0 0 0 
##$SW_h= 3612.71676300578
##$TD= 16384
##$TD0= 1
##$TE= 0
##$TE2= 300
##$TE3= 300
##$TEG= 300
##$TL= (0..7)
0 120 120 120 120 120 120 120 
##$TP= (0..7)
150 150 150 150 150 150 150 150 
##$TP07= 0
##$TPNAME0= <>
##$TPNAME1= <>
##$TPNAME2= <>
##$TPNAME3= <>
##$TPNAME4= <>
##$TPNAME5= <>
##$TPNAME6= <>
##$TPNAME7= <>
##$TPOAL= (0..7)
0.5 0.5 0.5 0.5 0.5 0.5 0.5 0.5 
##$TPOFFS= (0..7)
0 0 0 0 0 0 0 0 
##$TUNHIN= 0
##$TUNHOUT= 0
##$TUNXOUT= 0
##$USERA1= <user>
##$USERA2= <user>
##$USERA3= <user>
##$USERA4= <user>
##$USERA5= <user>
##$V9= 5
##$VALIST= <valist>
##$VCLIST= <CCCCCCCCCCCCCCC>
##$VD= 0
##$VDLIST= <DDDDDDDDDDDDDDD>
##$VPLIST= <PPPPPPPPPPPPPPP>
##$VTLIST= <TTTTTTTTTTTTTTT>
##$WBST= 1024
##$WBSW= 4
##$XGAIN= (0..3)
0 0 0 0 
##$XL= 0
##$YL= 0
##$YMAX_a= 119683
##$YMIN_a= -138620
##$ZGOPTNS= <>
##$ZL1= 120
##$ZL2= 120
##$ZL3= 120
##$ZL4= 120
##$ABSF1= 10
##$ABSF2= 0
##$ABSG= 5
##$ABSL= 3
##$ALPHA= 0
##$AQORDER= 0
##$ASSFAC= 0
##$ASSFACI= 0
##$ASSFACX= 0
##$ASSWID= 0
##$AUNMP= <proc_1d>
##$AZFE= 0.1
##$AZFW= 0.1
##$BCFW= 1
##$BC_mod= 2
##$BYTORDP= 1
##$COROFFS= 0
##$CY= -3
##$DATMOD= 1
##$DC= 2
##$DFILT= <>
##$DTYPP= 0
##$F1P= 0
##$F2P= 0
##$FCOR= 0.5
##$FTSIZE= 0
##$FT_mod= 4
##$GAMMA= 1
##$GB= 0.15
##$INTBC= 1
##$INTSCL= 1
##$ISEN= 128
##$LB= 0.25
##$LEV0= 0
##$LPBIN= 0
##$MAXI= 10000
##$MC2= 0
##$MEAN= 0
##$ME_mod= 0
##$MI= 1.114404
##$NCOEF= 0
##$NC_proc= 0
##$NLEV= 6
##$NOISF1= 3.799351
##$NOISF2= 2.8
##$NSP= 1
##$NTH_PI= 0
##$NZP= 0
##$OFFSET= 14.38212
##$PC= 1
##$PHC0= -1198.448
##$PHC1= 10.39254
##$PH_mod= 1
##$PKNL= yes
##$PPARMOD= 0
##$PSCAL= 0
##$PSIGN= 0
##$REVERSE= no
##$SF= 200.129724274929
##$SI= 16384
##$SIGF1= 3
##$SIGF2= 2
##$SINO= 400
##$SIOLD= 16384
##$SREGLST= <1H.CDCl3>
##$SSB= 0
##$STSI= 0
##$STSR= 0
##$SW_p= 3205.1282051282
##$SYMM= 0
##$S_DEV= 0
##$TDeff= 0
##$TDoff= 0
##$TI= <>
##$TILT= no
##$TM1= 0
##$TM2= 0
##$TOPLEV= 0
##$USERP1= <user>
##$USERP2= <user>
##$USERP3= <user>
##$USERP4= <user>
##$USERP5= <user>
##$WDW= 1
##$XDIM= 8192
##$YMAX_p= 0
##$YMIN_p= 0
$$ End of Bruker specific parameters
$$ ---------------------------------
##NTUPLES= NMR FID
##VAR_NAME=  TIME,          FID/REAL,        FID/IMAG
##SYMBOL=    X,             R,               I
##VAR_TYPE=  INDEPENDENT,   DEPENDENT,       DEPENDENT
##VAR_FORM=  AFFN,          ASDF,            ASDF
##VAR_DIM=   8192,          8192,            8192
##UNITS=     SECONDS,       ARBITRARY UNITS, ARBITRARY UNITS
##FACTOR=    0.0002768,     1,               1
##FIRST=     0,             0,               0
##LAST=      2.2672688,     0,               0
##MIN=       0,             -138620,         0
##MAX=       2.2672688,     119683,          0
$$ Real data points
##PAGE= N=1
##DATA TABLE= (X++(R..R)), XYDATA
0@%%%%%%%%%%%%%%%qJ6j6J6j6J7k5L2l2M0m8N4o2P2q5R6j07J21j38J57j77J97
$$ 0 0 0 0 0 0 0 0 0 0 0 0 0 0 0 0 -8 8 -8 8 -8 9 -16 16 -16 24 -24 30 -32 40 -45 51 -56 65 -73 84 -93 104
37A04k21K48k75L05l39L75m16M61n08N58o16O81p48Q25r09R99j103J219j351J503
$$ 104 -117 131 -144 161 -178 197 -219 242 -266 292 -324 357 -391 434 -475 524 -579 640 -711 792
57G92j677J879k117K406k762L213l809M626n825P747j1285J9809p7341n4232K17611
$$ 792 -885 994 -1123 1283 -1479 1734 -2075 2551 -3274 4473 -6812 12997 -64344 -118576 99035
72I9035P889k1688L4447l9265O836k8879q9531O692m8357j0154M3668p8303N6243
$$ 99035 106924 85236 119683 80418 87254 58375 -31156 -24464 -72821 -82975 -39307 -117610 -61367
85f1367J36553p6132N552Q1510l6485J2010k2425o2585M1646l8809m0878M3955
$$ -61367 75186 -946 4606 86116 49631 61641 39216 -23369 18277 -20532 -61410 -17455
97a7455l0488L7782M5348q9105N3108P4821q1885J314J5450j9664M0757m7662
$$ -17455 -47943 -10161 35187 -53918 -810 74011 -7874 -6560 8890 -10774 29983 -17679
109a7679k2360O8464l3431J857K2166o2018N6856K8849r1597M0526K9636m1387
$$ -17679 -40039 28425 -5006 -3149 19017 -43001 13855 42704 -48893 -8367 21269 -20118
121b0118L3483k1523j267N9274n0273m915L4561m3847L1634m540o7452O1806j459
$$ -20118 13365 -8158 -9425 49849 -424 -5339 29222 -14625 17009 12469 -54983 6823 5364
134E364n7212N8186n811j5946M3360l7813J7328M4745n1989J1935K022m1515M7525
$$ 5364 -51848 6338 527 -15419 27941 -9872 7456 52201 212 12147 14169 -27346 20179
147B0179k4508m3994O1530k3332j9404M9103l5491J2862L4973n4041K1224J9106
$$ 20179 -4329 -48323 13207 -10125 -29529 19574 -15917 -3055 31918 -22123 -899 18207
159A8207l6618L3757j7676k3669N4366l2320r332M9574m5771N862L3307m9903
$$ 18207 -18411 15346 -2330 -25999 28367 -3953 -13285 36289 -9482 -3620 29687 -20216
171b0216K2593J3194l9752L4997j1468k2251M5130l1891m957M0680m6690J6920
$$ -20216 2377 15571 -24181 10816 -652 -22903 22227 -9664 -14621 26059 -20631 -3711
183c711L1862n2749K8538J6891m2808L1776q496j8478M0504l2877m901L5689l8960
$$ -3711 28151 -24598 3940 20831 -21977 9799 1303 -17175 23329 -9548 -14449 21240 -17720
196a7720K0985J9157n2291L9208J4301n0373L2188q75j9375K9972l0996M185L7339
$$ -17720 3265 22422 -29869 9339 23640 -26733 5455 4580 -14795 15177 -15819 -11634 25705
209B5705l8127J4863J5930l7608L9708l043m7400M5626n448l2483K8252j9408
$$ 25705 -12422 2441 18371 -19237 20471 17428 -29972 15654 10206 -22277 5975 -13433
221a3433M622K4039m1231K0979K4387l2972K7493p377k5709N1873k2010l5698
$$ -13433 -8811 15228 -26003 -5024 19363 -13609 13884 6507 -19202 32671 10661 -25037
233b5037M3224j3601q092J3369l3279K7293J4339m2886K7304K768k0186L6377
$$ -25037 18187 4586 -3506 9863 -23416 3877 18216 -24670 2634 5402 -14784 21593
245B1593k9597j6159N1054k8572j4668K6279k1537J8566K983l5819L7455J627
$$ 21593 -8004 -24163 26891 -1681 -16349 9930 -11607 6959 9942 -25877 11578 13205
257A3205k8713L0436j7129l639L4283m3303j756L8032l1767K765O630j9708L5199
$$ 13205 -15508 14928 -2201 -5840 28443 -14860 -16616 21416 -10351 -7586 -956 -20664 14535
270A4535j0912k7694M0035q346q605K2657l2488J3566K7783m5491P574J7415k3112
$$ 14535 3623 -24071 15964 7618 -987 21670 -10818 2748 30531 -14960 -7386 10029 -13083
283a3083J9972j3000j6329M0696j8949j4799K7813j9912J1040J2924l9321K4924
$$ -13083 6889 -6111 -22440 18256 -693 -15492 12321 -7591 3449 16373 -22948 1976
295A976J4785l5097J9999j488j1867K9233k4506n140L4272k5516Q18J3775k5978
$$ 1976 16761 -18336 1663 175 -11692 17541 -6965 -12105 22167 -3349 -2531 11244 -14734
308a4734K5492l39l6572L1133N58j9962K3270j8105J830K9926l0038N667K0453
$$ -14734 10758 10419 -26153 4980 5538 -14424 8846 -9259 -7429 22497 -7541 -1874 18579
321A8579k4313J6728k560k4714L2312j1560k4280K7671j4312l415K1012k7453
$$ 18579 -5734 10994 8434 -16280 16032 4472 -19808 7863 -6449 -9864 11148 -16305
333a6305J1666J8781k7418J6834L515j9999K6186j3309j4873L1304j8646o858
$$ -16305 -4639 14142 -13276 3558 7073 -12926 13260 -49 -14922 16382 -2264 -9122
345i122K1413k1892J0912J2643k8386J8866L988k1707K3324j1790j1896K6971
$$ -9122 12291 -9601 1311 13954 -14432 4434 8422 -13285 10039 -1751 -13647 13324
357A3324k0484k132K3485k3089R820J2014k4604K1060J320k1659K3460j1744j1439
$$ 13324 -7160 -9292 14193 -8896 924 12938 -11666 9394 10714 -10945 12515 771 -10668
370a0668K5049k0798k555J9494k3297J1290R915k4511K0896J18j9414K3816j0465
$$ -10668 14381 -6417 -8972 10522 -12775 -1485 8430 -16081 4815 4933 -14481 9335 -1130
383a130q608K4485k0775j09K1276k1523Q455O633k0459K1499m281k0788K3797
$$ -1130 -9738 14747 -6028 -6137 15139 -6384 2071 8704 -11755 9744 5463 -15325 8472
396H472j0317q193K0563k0230L659K0749k3387Q485R934j6229J6769p599j5188
$$ 8472 -1845 -10038 10525 -9705 -6046 14703 -8684 -199 9735 -6494 10275 2676 -12512
409a2512K6867j3233j1969K0321j6865M962J4298k5914J2972J2197k0602J2305
$$ -12512 14355 1122 -10847 9474 -7391 -2429 11869 -14045 -1073 11124 -9478 2827
421B827l620q557K2881j8824p846K5928j6819Q37J2096j9956J7264O715k5907
$$ 2827 -793 -9350 13531 -5293 -13139 12789 -4030 -3193 8903 -11053 6211 12926 -12981
434a2981J6679J650j1040J4373j7168O86K3248k3557Q72J6704j6634J2010O7j9040
$$ -12981 3698 5348 -5692 8681 -8487 -7801 15447 -8110 -7238 9466 -7168 4842 4909 -14131
448a4131K4256k345j9198J6348o922J983J2940k5316Q948J7219k1423Q139K110
$$ -14131 10125 7780 -11418 4930 -1992 -9 12931 -12385 -3437 13782 -7641 498 2608
461B608j2517K0754j1189j5545K5644p289p784R795j4222J3295R450k5700J2354
$$ 2608 -9909 10845 -344 -15889 9755 2466 -5318 4477 -9745 3550 13000 -12700 -346
474c46O967j3935J5129r973o943K5016j7427q175J9930j1865K539K427j7538J8113
$$ -346 6621 -7314 7815 -2158 -9101 15915 -1512 -9687 10243 -1622 917 3344 -14194 3919
488C919K198j8823J5374l782l284J8020k0814O11K3212k0153j707R283j0989J2491
$$ 3919 6117 -12706 2668 -1114 -4398 13622 -7192 -6581 16631 -3522 -5229 4054 -6935 5556
502E556m771j4176K2029m236p396J3721j6458O076J6083k7016L284J4202j6018
$$ 5556 785 -13391 8638 4402 -2994 10727 -5731 345 16428 -10588 -7304 6898 -9120
515i120P402O05q114J7744q965m894J7283j2896L193Q739k3940J2231J1666k4154
$$ -9120 -1718 -1113 -9227 8517 -448 -5342 11941 -955 2238 10977 -12963 -732 10934 -13220
529a3220R180O299r507J1787o473n13J4915j5652K395R563j7621J3298L482k4584
$$ -13220 -4040 2259 -7248 4539 -1934 -2447 12468 -3184 -789 8774 -8847 4451 7933 -16651
543a6651J7376O750j4595J2348l719k526J1661j3964L622P023j8398J1829J125
$$ -16651 725 7475 -7120 5228 1509 -1017 10644 -3320 302 7325 -11073 756 1881
556A881j8702K0598Q61j6093J7783k873n739J1702j0837K668M694j5393J2368
$$ 1881 -16821 3777 4638 -11455 6328 3455 -2284 9418 -1419 1249 5943 -9450 2918
569B918J04j5440J9594l899j3641J9601p002q575J3047j0552O48O083j1954J0846
$$ 2918 3022 -12418 7176 3277 -10364 9237 2235 -6340 6707 -3845 -3197 2886 -9068 1778
583A778L77j0941J8012p067j0744K0700r428p605J3239j2214J115Q393j2805P591
$$ 1778 2155 -8786 9226 2159 -8585 12115 2687 -4918 8321 -3893 -2778 5615 -7190 401
597D01J619q842J4531q601o475K0180j2934o901J4516j1654K766P120j4803R285
$$ 401 2020 -6822 7709 -892 -7367 12813 -121 -7022 7494 -4160 -1394 5726 -9077 208
611B08L363j0369J1661n454l776J5003j5519j712J6153j4152J416P002j2365J2237
$$ 208 3571 -6798 4863 -591 -4367 10636 -4883 -6595 9558 -4594 -3178 3824 -8541 3696
625C696J228j3199J3399k522n626J0157j2160L265J2637j7745L507R402j1029
$$ 3696 4924 -8275 5124 2602 -3024 7133 -5027 -1762 10875 -6870 -3363 6039 -4990
638d990R475k090j1068J5950n172r788J1266p030K158O855j5317R336Q915j4339
$$ -4990 4485 2395 -8673 7277 2105 -7683 3583 -3447 -1289 5566 -9751 -415 8500 -5839
652e839Q035Q1p709J4246r133p620J5818q213l267O739r215R735K193j5467J2137
$$ -5839 2196 2277 -5432 8814 -319 -7939 7879 -334 -3601 3138 -6077 3658 5851 -9616 2521
667B521J269r404J1249r074k782J6045j2956k968J2039p886M321J54j0037J4056
$$ 2521 3790 -5614 5635 -3439 -6221 9824 -3132 -6100 5939 -1947 2374 2528 -7509 6547
681F547k673j1192J2789o979k440J2110j4277J612J3754j3250J312N325o234R239
$$ 6547 3874 -7318 5471 -1508 -3948 8162 -6115 -4503 9251 -3999 -2687 2638 -3596 5643
695E643o753o609J5343q219m162J1448j1750M356R675j5969N209Q474r962M994
$$ 5643 -1110 -7719 7624 -595 -4757 6691 -5059 -703 8972 -6997 -1788 6686 -3276 1718
709A718l474k856J2470j0584k584J2092j1424L523P520j4553Q874N828j2806P546
$$ 1718 -1756 -4612 7858 -2726 -5310 6782 -4642 -1119 6401 -8152 722 6550 -6256 1290
723A290N84m245Q197r540J051J0609j3618M005P678j2987Q684K934j2294J0851
$$ 1290 1874 -2371 5826 -3714 -2663 7946 -5672 -1667 6011 -6976 1708 4642 -7652 3199
737C199j0p956Q538n657Q77P375j2589O055O797j3142R080J094j1119J2335k426
$$ 3199 3189 -4767 3771 -1886 -1009 6366 -6223 -168 6629 -6513 2567 3661 -7458 4877 2451
752B451r043J0785n292j205P040r784N429L965j1269R808k17j0018J2513l823
$$ 2451 -6592 4193 -1099 -2304 4736 -5048 381 4346 -6923 2885 2668 -7350 5163 1340
766A340p405J2106o477j523P725r593M077M200r669Q365j447q645J2168n719n550
$$ 1340 -6065 6041 -436 -1959 5766 -3827 250 4450 -5219 3146 1699 -6946 5222 -497 -6047
781f047J1976q172j419Q598r216M175M385r929Q568l95o809R940o803l422J2268
$$ -6047 5929 -2243 -3662 4936 -4280 -105 4280 -5649 2919 2524 -4285 5655 -1148 -4570 7698
796G698j0320q81R518r943L960L367r628Q878j4q147Q778m802j256R595j1098
$$ 7698 -2622 -3503 6015 -3928 32 3399 -6229 2649 2635 -5512 3266 -1536 -2792 6803 -4295
811d295J176J0140j1328L777M261r194R145j485q113J0024l723l132P429q966
$$ -4295 -3119 7021 -4307 -530 3731 -5463 3682 2197 -5916 4108 385 -2747 4682 -4284
825d284M019P151j3077N454N329r192P324j824n905J1087n588m232Q653o754K010
$$ -4284 -265 6886 -6191 -737 4592 -4600 2724 900 -5005 6082 494 -3738 4915 -1839 171
840A71L760j1113Q274L211j1327P917k58m904R391o857k110J0583p986J67M607
$$ 171 3931 -7182 1092 4303 -7024 893 635 -4269 5122 -1735 -3845 6738 -1248 -1081 3526
855C526p895P860m39j0592J1062n39p347Q493n489k63Q545j0568J507O810q403
$$ 3526 -4369 3491 3052 -7540 3522 2983 -4364 4129 -1360 -1623 6922 -3646 -2139 4671 -3732
870c732M550o67p039J1098l793p225J0802m011j548O925r036M331N709j0666M551
$$ -3732 818 151 -6888 4210 417 -6808 3994 -17 -1565 5360 -3676 655 6364 -4302 249
885B49J937o022P722n359m408J1502o844k270P757o991L575L805j0666P730J987
$$ 249 2186 -3836 3886 -1473 -5881 5621 -1223 -3493 4264 -2727 848 4653 -6013 1717 3704
900C704q240O749k750k667Q752q430q90R422q344K451L154q055Q091m19q591R221
$$ 3704 -4536 2213 -537 -3204 5548 -2882 -3772 5650 -2694 -243 2911 -5144 2947 2528 -6063 3158
916C158k338l706O959p463K085P394j0074L206M740p751O402j165o507R545l907
$$ 3158 820 -2886 4073 -3390 -1305 6089 -3985 -779 3961 -3790 2612 1447 -5060 4485 578
931E78m346P979o383Q09N373r149M840L783r061O840j93n223Q581m705l019Q920
$$ 578 -3768 4211 -2172 -1363 4010 -5139 -299 3484 -5577 1263 1070 -4153 4428 -277 -3296 5624
947E624o702L76N366q331M906K239q818P018m30n929P937m530k000Q065p350J089
$$ 5624 -1078 -702 4664 -3667 1239 3478 -5340 1678 1248 -4681 3256 -1274 -3274 4791 -2559 -1470
963a470N732q220M692K288q102P544j162n775Q595m653k090P420o972J563M706
$$ -1470 4262 -3958 734 3022 -5080 2464 1302 -4473 4122 -531 -2621 4799 -2173 -610 4096
978D096q295N291J655q149P950j523n656Q237m513j737P469p200J798M536p700
$$ 4096 -4199 1092 2747 -5402 2548 1025 -4631 3606 -907 -2644 4825 -2375 -577 3959 -3741
993c741N970J38p462Q408k544n788Q459m231j879O667p104K298M670p118M667
$$ -3741 2229 2367 -5095 3313 769 -5019 3440 -791 -2670 3997 -3107 -809 3861 -3257 1410
1008A410P6n641Q155l781n056R493n060k714O860n941K463L480p307M849P57n388
$$ 1410 1486 -4155 4000 219 -4837 4656 -404 -3118 3742 -2199 264 3744 -3563 1286 2043 -3345
1024c345O477m205k998Q817o972j855Q079o065J383L383o170N889M23o003O407
$$ -3345 3132 -1073 -4071 4746 -2226 -4081 3998 -2067 -684 2699 -3471 2418 2841 -3162 3245
1039C245l207k252P030q334Q08Q193q732J324M511n560M911p97m998P353l201
$$ 3245 38 -2214 4816 -3518 -2710 5483 -3249 -1925 2586 -2974 1937 1140 -3858 3495 294
1054B94k752N876n979J644N866r511L376N618p348M015j11m044P151m351k823
$$ 294 -2458 3418 -2561 -917 4949 -4562 -1186 4432 -2916 1099 988 -3056 4095 -256 -3079
1069c079O781n415Q77L978p822N277L494q832N158J523m343N411l899j328O808
$$ -3079 3702 -1713 -836 3142 -4680 597 4091 -4741 417 1940 -2403 3008 -891 -2219 4589
1084D589o057L98M657o439M234J001p672P158j06n931N901k733j031N910o582
$$ 4589 -1468 -1070 3587 -2852 1382 2383 -5289 1869 1763 -4168 1733 -1000 -2031 3879 -2703
1099b703J554N220o592L164J674o296O903j847n605P454k987j820M960n731K295
$$ -2703 -1149 4071 -2521 643 2317 -3979 2924 1077 -4528 2926 -61 -1881 3079 -2652 -357
1114c57M036p374M097J897n491N433k251l562P233m263k014O071n425K068L395
$$ -357 3679 -3695 402 2299 -3192 2241 -10 -3572 3661 -602 -2616 3455 -1970 98 3493
1129C493o663M108J873o135N090j603l084O267n121q36O294o171J358M099o259
$$ 3493 -3170 938 2811 -3324 1766 163 -2921 3346 -1775 -2611 3683 -2488 -1130 2969 -3290
1144c290M656J160n925N386r92l164N281m536N9N106o702K706L347o930M860R80
$$ -3290 1366 2526 -3399 1987 995 -2169 3112 -1424 -1365 3741 -2961 -255 3092 -3838 1022 2002
1160B002n838N943j441l374N553l955K77M129o264L015K724o431N414J85n608
$$ 2002 -3836 2107 666 -2708 2845 -1110 -833 3296 -2968 47 2771 -3660 1754 1939 -3669
1175c669O099j383l719N287l712n3L475n552L241K166n742N260l92n283O981k188
$$ -3669 2430 1047 -2672 2615 -1097 -1150 2325 -3227 14 2180 -3562 1698 1306 -3977 3004 816
1191H16l706N895l373p36L752m913L230J349n419N187j533m062O482l595k966
$$ 816 -2890 3005 -368 -1104 2648 -2265 965 2314 -3105 2082 549 -3513 2969 -626 -3592
1206c592O720l876r73M193m222K411J162m609M602r76l874O088l772j842O575
$$ -3592 3128 -748 -1721 2472 -1750 661 1823 -2786 1816 840 -3034 3054 -718 -2560 4015
1221D015n462m53N127m814J466J442m166M976j634l260N316l619r58N695n774
$$ 4015 -1447 -1900 3227 -1587 -121 1321 -2845 2131 497 -2763 2553 -1066 -2024 3671 -2103
1236b103R44N035o100K117K336m303L754j399k858N296l711j075M489m944K062
$$ -2103 -1159 3876 -2224 -107 2229 -2074 1680 281 -2577 2719 -992 -2067 2422 -2522 -460
1251d60L607o265L191K978n268L392n72k387M479l809o71M654m827J911K578n463
$$ -460 3147 -3118 73 3051 -2217 1175 603 -1784 2695 -1114 -1785 2869 -1958 -47 2531 -2932
1267b932L995J118n659M538o3l367M047k843k33M609m964J328K696m820L959J76
$$ -2932 1063 2181 -3478 1060 997 -2370 1677 -1166 -1399 3210 -1754 -426 2270 -2550 1409 1585
1283A585n035N809j001l933M730k451n69L378m651J654K632m776L359k5l773N478
$$ 1585 -3450 2359 1358 -2575 2155 -296 -865 2513 -2138 -484 2148 -2628 731 706 -3067 2411
1299B411k257l063N529k967j210L832l941J933J890m380L392K68l668M374k460
$$ 2411 154 -2909 2620 -347 -1557 2275 -1666 267 2157 -2223 1169 1437 -2231 2143 -317
1314c17k269N479l940j011M616l965J325K093m375L436K86l704M263k095j778
$$ -317 -2586 2893 -1047 -2058 2558 -1407 -82 2011 -2364 1072 1358 -2346 1917 -178 -1956
1329a956M522m118j1M376m747J438K677m211L070J44l441M080k189j344M136m246
$$ -1956 2566 -1552 -1563 2813 -1934 -496 2181 -2030 1040 1184 -2257 1823 -366 -1710 2426 -1820
1345a820R27L615m921K264K407m394K995K88l470M213k196j712L950l859P17L234
$$ -1820 -893 2722 -2199 65 2472 -1922 1073 1361 -2109 2104 -92 -1804 2146 -1713 -996 2238
1361B238n051L028J460m381L926k97k923L941j816j516L816l502O39K551m186
$$ 2238 -2813 215 1675 -2706 1220 923 -2000 1941 125 -1391 2425 -1077 -438 2113 -2073
1376b073K894J157m518L967n63l262M266k172j619L712k952N95K359m075K918
$$ -2073 821 1978 -2540 1427 864 -2398 1868 -304 -1923 1789 -1163 -568 1791 -2284 634
1391F34O37l675M082q81k655L977k603j209M134l698O07K422l585K542L94l290
$$ 634 1271 -2404 1678 797 -1858 2119 -484 -1693 2441 -1257 -650 1772 -1813 729 1123 -2167
1407b167L869j046k793M284k699r29L795l780Q35K573l939K609N58l280L863j570
$$ -2167 1702 656 -2137 2147 -552 -1481 2314 -1466 -631 1942 -1997 612 1170 -2110 1753 183
1423A83k355M312k805r14L653m039J202K622l922K225J005k763L275j309j856
$$ 183 -2172 2140 -665 -1579 2074 -1965 -763 1859 -2063 162 1167 -1596 1679 370 -1486
1438a486M150k913o51L161l362Q56K050m217K887O73l289L100j295j189L630l056
$$ -1486 2664 -249 -900 2261 -1101 -245 1805 -2412 475 1148 -2141 959 -336 -1525 2105 -951
1454i51l47L600l571Q57K004l669L053J62l305L454q67j668L056l001N03L135
$$ -951 -1298 2302 -1269 -412 1592 -2077 976 1138 -2167 1287 420 -1248 1808 -1193 -690 2445
1470B445m011J376J849l558K438j04k760L730j337j731L471k801N58K357l717
$$ 2445 -1566 -190 1659 -1899 539 435 -2325 1405 68 -1663 1808 -993 -435 1922 -1795
1485a795K087J645l855K495K08k484L273j738j673L573k737J47K331l113K038
$$ -1795 292 1937 -1918 577 785 -1699 1574 -164 -1837 1736 -1001 -854 1477 -1636 402
1500D02J256l728L023J82k734K953j898n52L056l069O00K356l275K057P80l528
$$ 402 1658 -2070 953 1135 -1599 1354 -544 -1096 1960 -1109 -509 1847 -1428 629 1409 -2119
1516b119L166j96k769K989j333p24K573k890J023K074l267K019Q27l005L028o01
$$ -2119 1047 851 -1918 1071 -262 -986 1587 -1303 -280 1794 -1473 546 1373 -1632 1396 795
1532G95k575L255j767j064K719k586J192J619l249K211N19l045L031p16k103L426
$$ 795 -1780 1475 -292 -1356 1363 -1223 -31 1588 -1661 550 1069 -1976 1055 339 -1764 1662
1548A662k095o63K925k928J035J406k924K330M28l073L157p52k136L117k083m19
$$ 1662 -433 -1096 1829 -1099 -64 1342 -1582 748 1176 -1897 1260 508 -1628 1489 -594 -1013
1564a013K520k713R67J416k813K476K3k310K980j167j753L288k415m72K664k646
$$ -1013 1507 -1206 -239 1177 -1636 840 863 -1447 1533 366 -1387 1901 -514 -986 1678 -968
1580i68P60J690k958K064L37k594K911j282j385L055k399k40K554k683J116J488
$$ -968 -208 1482 -1476 588 925 -1669 1242 -40 -1425 1630 -769 -1009 1545 -1138 -22 1466
1596A466k789K256l97k216L036j390j297K744k271L3K335k578R69J431k826K192
$$ 1466 -1323 933 536 -1680 1356 -34 -1331 1413 -858 -825 1510 -1068 -99 1332 -1494 698
1612F98k59j934K851j551j111K726k106J11J868k580J368J133k514K101k73j764
$$ 698 439 -1495 1356 -195 -1306 1420 -686 -575 1293 -1287 81 1214 -1300 801 528 -1236
1628a236K506j768q68L073k567%K125k234J363Q71k608K567o57j906L052k127
$$ -1236 1270 -498 -1366 1707 -860 -860 1265 -969 394 1265 -1343 1224 567 -1339 1713 -414
1644d14p21K817k647N6K461k677J067Q50j991J929o21j512K996k314K6K235k485
$$ -414 -1135 1682 -965 -909 1552 -1125 -58 792 -1199 730 109 -1403 1593 -721 -695 1540 -945
1661i45P47K028k959J410Q63k217J872q00j243K567k075j82K252k333R49J624
$$ -945 -198 1830 -1129 281 1144 -1073 799 -1 -1244 1323 -752 -934 1318 -1015 -66 1558
1677A558l029J783Q36k500K051p08q07J823j798O3K310k535R13J590k722J435
$$ 1558 -1471 312 1148 -1352 699 -9 -816 1007 -791 -728 1582 -953 -40 1550 -1172 263
1693B63R42k746K310m88j472J779j380J58J878k524J702J110k850K130M45k819
$$ 263 1205 -1541 769 281 -1191 588 -792 -634 1244 -1280 422 1532 -1318 812 1257 -1562
1709a562K612r31j253K097j299k15J582k170J477P63k616K316J5k232K469r04
$$ -1562 1050 119 -1134 963 -336 -551 1031 -1139 338 1101 -1515 801 816 -1416 1053 149
1725A49j475K255j162k74J818k057J030O79k218K174m23k085K607r85j238K331
$$ 149 -1326 929 -233 -507 1311 -746 284 963 -1255 919 496 -1589 1018 33 -1205 1126
1741A126j586l48J896j770Q98N59k011J871j91j806K523j366o65K190j755m9J990
$$ 1126 -460 -808 1088 -682 216 775 -1236 635 444 -1362 1161 -205 -870 1320 -435 -484 1506
1758A506k339Q76O15j765J631m46j296K193j448o12K368k057M02J774k254J048
$$ 1506 -833 43 658 -1107 524 78 -1218 975 -473 -1085 1283 -774 -372 1402 -852 196
1774A96P77k180J969o19j199K125j563k19J982j961N50J479k328J342M21k187
$$ 196 973 -1207 762 143 -1056 1069 -494 -713 1269 -692 -142 1337 -991 351 772 -1415
1790a415K161m80j402K127j179n35J719j829Q88J016k230J625J72j991K245o24
$$ -1415 746 266 -1136 991 -188 -723 996 -833 55 1071 -1159 466 638 -1353 892 268
1806B68j426J950j311l89J843k049J016Q54j897J826K2j869K180p87j320K205
$$ 268 -1158 792 -519 -908 935 -1114 -98 756 -1141 685 707 -1162 1018 231 -1089 1116
1822A116j496l89J713j595N95R09j771J590j42j928K506j059j108K096j580j45
$$ 1116 -380 -769 944 -651 -56 853 -918 672 530 -1398 1108 49 -1059 1037 -543 -688
1838f88J734j886Q37J029j972J511K3j484K052j149j025K194j795k25J808j722
$$ -688 1046 -840 -3 1026 -946 565 588 -896 1156 7 -1018 1176 -619 -844 964 -758
1854g58L08J212j853J596j66j295J947q64q85K039j803R6J880k322Q42J043k165
$$ -758 -450 762 -1091 505 339 -956 991 127 -758 1281 -522 -426 1454 -868 -26 1017 -1148
1871a148J559p1j264J666j012o73J903j840N90J374k175J192Q37j828J573k45
$$ -1148 411 340 -924 742 -270 -943 960 -880 -290 1084 -1091 101 938 -890 683 438
1887D38j500J890r39o21J710j637M89J088j943J222O72k003J865l23j500J888
$$ 438 -1062 828 -111 -732 978 -659 -170 918 -1025 197 869 -1134 731 408 -1092 796
1903G96j216l05J510j311N29R68k021J473K18j761K063o14j400J976j083n50J561
$$ 796 -420 -725 785 -526 3 971 -1050 423 641 -1120 943 329 -1071 905 -178 -728 833
1920H33j412K09J165j728J142J35j330J779o33j005K006j325m90J695j495K49
$$ 833 -579 -370 795 -933 209 344 -986 793 160 -845 1161 -164 -654 1041 -454 -205
1936b05J022j655J000J74j243J673p32r68J760j265q9J237j374N30R25j642J378
$$ -205 817 -838 162 336 -907 766 34 -934 826 -439 -528 709 -665 -135 790 -852 526
1953E26K7j222J568q11n91J208j227j48J600j667L70R87j535J180J36j148J623
$$ 526 553 -669 899 88 -503 705 -522 -670 930 -737 -367 620 -915 265 401 -747 876
1970H76q51o08J507j278K05J434k119R08O11j496R95K14j302J630q12p28J768
$$ 876 25 -583 924 -354 -149 1285 -834 74 685 -811 184 398 -904 726 -86 -814 954
1987I54j330J68J204j887R32N83j509J267l0j343J696p60n29J582j377J24J416
$$ 954 -376 -208 996 -891 41 624 -885 382 352 -991 705 -55 -584 998 -379 -255 1161
2004A161j801Q64K93j576J563n30q84J509r69n35J759j289L74J037j600P20O65
$$ 1161 -640 224 517 -1059 504 -26 -910 599 -370 -905 854 -435 -61 976 -624 96 761
2021G61j460J288m52j028J709r25o57J644j796M54J196j571J147L87j579J327
$$ 761 -699 589 137 -891 818 -107 -764 880 -916 -462 734 -837 310 697 -882 445
2037D45p8j146J749j246R2J040j279J09J282j732R44M49j505J439m73p58J367
$$ 445 367 -779 970 -276 -184 856 -423 -314 968 -764 180 629 -876 563 90 -668 699
2054F99j028j72J389j797Q26R26j782J101L50j261J301m07r50J560j007K1J146
$$ 699 -329 -501 888 -909 -83 843 -939 162 512 -749 552 145 -805 755 -252 -231 915
2071I15j631P32Q60j824R87L21j309J480n48n52J313j105P9J050j189N22P02j614
$$ 915 -716 16 876 -948 39 360 -949 531 -17 -569 744 -361 -282 768 -421 101 803 -811
2089h11J208K58j474J373m90n46J232j030P1J130j585Q28L19j376J138p3r76J528
$$ -811 397 655 -819 554 64 -482 750 -280 -209 921 -664 164 483 -893 245 172 -804 724
2107G24o89k82J182j101K49P86j378O46O02j593J026R7j217J390m84m36J170r12
$$ 724 35 -247 935 -166 83 869 -509 137 739 -854 172 269 -948 442 -42 -478 692 -220
2125b20M8R79j544J167K16j418J433l20j268J676r85m73J572j263K09R47j413
$$ -220 -172 807 -737 430 646 -772 661 341 -927 749 -236 -709 863 -400 -191 756 -657
2142f57Q82L81j482J322k18j018J466q73l13J440j286N69M05r99P06Q3j326J503
$$ -657 225 606 -876 446 228 -790 676 -197 -510 930 -356 213 618 -381 325 408 -918 585
2160E85o37o32J526r91n05J374j120J76P90j369O87K86r93J337o59n65J632r43
$$ 585 -52 -684 842 -149 -654 720 -400 -224 566 -803 -116 170 -823 514 -145 -710 922 -21
2178b1k99J089j169M62N73j261Q26J22j207J219n76m64J565j345K16J248j452
$$ -21 -320 769 -400 62 635 -626 200 322 -885 334 -242 -706 859 -486 -270 978 -474
2195d74M46P67j249O96J14j127J260r59j4J244j065K26R20j352L94Q72j529J002
$$ -474 -28 739 -510 186 300 -827 433 -526 -540 704 -361 -135 785 -567 -173 699 -830 172
2213A72J99j108J053n83k59J218j000K88Q18j368O72M85j249P08Q5p30R70m17
$$ 172 371 -737 316 -267 -526 692 -308 -20 798 -570 102 587 -662 46 131 -599 371 -46
2231d6k23Q81r06L23P68j331O94M8r20R86j32o94R97o55j94J160r27J27Q78j649
$$ -46 -269 612 -294 29 797 -534 160 208 -712 274 142 -552 445 -210 -404 756 -171 -44 834 -815
2251h15J031M79j404J095k92r38J347n25m33R43r29M55M67r65P97K20j109J003
$$ -815 216 695 -709 386 94 -844 503 -22 -455 488 -441 14 481 -484 313 533 -576 427
2269D27m34o06J136q17r2J152j374N97O40j259O50M65j137J150n07l93J130r95
$$ 427 -7 -613 523 -294 -386 766 -608 -11 629 -630 20 485 -652 498 -9 -402 728 -267
2287b67LQ40r14M76N24j365J012J65j236J300m79p83J346r01k34R35j058P50L04
$$ -267 -264 576 -338 138 662 -703 309 474 -762 538 59 -724 622 -279 -513 422 -636 114 418
2306D18j157R23K89r91J139m82q59J281p69o5Q73r33K08O33j237R02J67j000J264
$$ 418 -739 184 473 -518 621 139 -720 561 -208 -273 600 -333 -125 508 -729 173 340 -660 604
2325F04n12n28Q16n58J0P33q67N36M21j200Q07P2j096J308n55n11J112j071K10
$$ 604 92 -436 380 -178 -168 565 -302 234 655 -545 262 334 -762 546 -9 -520 592 -479 -269
2344b69O79r76P54J99j123J011j38n48J026o68l49J006r29K20P77q79M18J68r29
$$ -269 410 -566 188 387 -736 275 137 -411 615 -53 -402 604 -325 -105 672 -207 211 379 -550
2363e50Q61k29n50Q89o06l93J105r15K43O87j064O17J01p19Q01Pp22R30r07K28
$$ -550 311 82 -468 421 -185 -578 527 -388 -145 542 -522 95 196 -523 278 285 -437 493 -414 -186
2383a86Q60r67J40O87j046O48M15j537J313k70n46R55o40k27R43p24J89N13q75
$$ -186 674 -293 -153 534 -512 136 551 -986 327 57 -489 466 -174 -401 542 -182 7 520 -355
2402c55M48K84p68R04m78n47J089p13qN45q73N05M01j100O54N71j119R24k13n80
$$ -355 93 377 -391 513 35 -512 577 -136 -144 401 -472 33 434 -666 -12 559 -560 364 151 -429
2422d29Q77n99m07R98o85L46M32j162Q48Qo57P97k86p78J282r14n5P94n86J77
$$ -429 448 -151 -558 440 -245 101 533 -629 219 227 -430 367 81 -697 585 -329 -384 410 -176 1
2442AL99p72Q08j01q36R91n57m61R31p49j12J116j046M32J45p58O21lm73P97l14
$$ 1 400 -372 436 335 -501 490 -67 -528 403 -346 -458 658 -388 44 189 -569 52 49 -424 373 59
2463E9k69P55p67L6R26j181N51J83q22Q21%o89Q33l97n61J113o89k57O83o31K94
$$ 59 -210 545 -222 -186 740 -441 110 293 -529 292 292 -397 436 39 -522 591 -98 -355 328 -303 -9
2484iN50r98Q10k67k84N94j89l60L80m85P6O62r47N63K30p44N89j39m96R68m63
$$ -9 541 -457 353 86 -198 396 207 -153 227 -258 -182 480 -467 96 326 -418 171 32 -464 504 41
2505D1m20P54n43P9L96p66P94Kq14P17l00k83P37n62k64P22m77j14N91p93N94
$$ 41 -379 375 -168 -89 307 -459 335 337 -477 240 -60 -343 394 -168 -432 290 -187 -301 290 -503 91
2526I1K5p39R87k39m83J019p14j74N74p59N06J85n56M59M4l90O84n04k64P46r43
$$ 91 116 -623 364 125 -358 661 -53 -227 347 -412 94 279 -277 182 226 -164 520 16 -248 498 -445
2547d45K71N47n72P5L81n92N72l3n81Q83n26l53R47q51P7O42p50L14N07p85L28
$$ -445 -174 373 -199 -124 257 -335 237 204 -377 506 -20 -373 574 -277 -200 442 -308 6 513 -272 56
2568E6M8n52P95m49l35O31l08K3N82o54J69K09l71K77P4m08M47j99l77Q53p37
$$ 56 104 -448 347 -102 -437 194 -114 -91 491 -163 6 215 -156 121 195 -213 234 35 -342 511 -226
2589b26J27L52o01L33K55n54N22k13n68J009m02k22M38n16J34M42o43M00K60o58
$$ -226 -99 253 -348 -15 240 -314 208 -5 -573 436 34 -188 250 -266 -132 310 -333 67 327 -331
2609c31N02k38k35P33o34k14J027p40J92J22m22L8O87r11N25M8o18P48l09j71
$$ -331 171 -67 -302 431 -203 -417 610 -130 62 184 -238 -200 487 -424 101 149 -469 279 -30 -201
2629b01N40m17%L77q74N79o8m21O77j95l63O53j32l98R47r81L66K95o91M05J13
$$ -201 339 -78 -78 299 -575 4 -64 -485 192 -3 -366 287 155 -243 704 -277 89 384 -307 98 211
2650B11l39K68j1m01P11m56j3M15o16K11L86p68O37r1m83O55m10j84O98m49j61
$$ 211 -128 140 129 -272 439 -17 -30 385 -231 -20 366 -402 235 144 -339 316 -94 -278 420 -29 -190
2671a90N28o07J99J92m80M64j24j90L97k17l61P52j11m12M39n65J94L27l20L04
$$ -190 338 -269 -70 122 -358 106 -18 -208 189 -28 -389 363 252 -160 279 -286 -92 235 -85 219
2691B19j23m06O10k65k27M50m66n8Q24p66l6M06o14L41K13o34Q27l75k77P00k98
$$ 219 96 -310 300 35 -192 258 -208 -266 558 -208 -244 162 -452 -111 102 -532 295 -80 -357 343 45
2712D5k52P26q32L66K40o89M72N4n41Q23l86k52O42m38n1M57o66P8K87l56N79
$$ 45 -207 519 -313 53 293 -396 76 130 -411 412 26 -226 416 -22 -73 384 -282 -204 83 -273 306
2733C06l34j29M98m71P9M49l80j22L79n88L82Pl05L78O0n73O20l43l3M44m91J51
$$ 306 -28 -157 341 -130 -51 398 18 -104 275 -313 69 76 -229 149 209 -364 256 -87 -120 324 -167 -16
2755a6L33n82K25J70n02P02l02l56P08n98r8P85n90R6K06m70K66Q6l93O74k09
$$ -16 317 -265 -40 130 -372 330 28 -328 380 -218 -316 469 -121 -25 181 -289 -23 63 -330 344 135
2776A35n42Q20m69RL48l19j43N54n11J4K18k27L25k29m19P15l68q9N20n90L32
$$ 135 -407 413 -56 -47 301 -18 -161 393 -118 -104 114 -113 212 -17 -436 279 -89 -178 342 -248 84
2797H4K39n90M28n1m87O69k72k81N60l77J65J54n75L45L88m95K77m3l03M71k56
$$ 84 323 -267 161 110 -377 292 20 -261 299 -78 87 241 -334 11 399 -96 181 138 -165 306 50
2818E0l68N20l94R7M00m51J4L67n76N98k37k69L13j59j00O02o82J88N63q12K93
$$ 50 -318 202 -192 -95 305 -146 -132 235 -341 257 20 -249 64 -95 -195 407 -275 -87 476 -336 -43
2839d3J71m46K64K66n23M32k13j54M97l62nJ69j60J60K14o20M79k67j40N34l84
$$ -43 128 -318 -54 212 -311 121 -92 -246 251 -111 -116 53 -107 53 267 -353 126 -141 -281 253 -131
2860a31k31M26k82K81L71o27L14J59m96M06qm13L55o2k30L74k74lN89p81L22K00
$$ -131 -362 64 -218 63 434 -193 121 280 -216 190 182 -231 124 62 -168 206 -68 -71 518 -263 59 259
2882B59n34N40k36l26L43k10J6M60n03L67K17o64M05N7l47K95o1k90N31m29j66
$$ 259 -275 265 29 -297 46 -164 -148 312 -191 176 393 -271 134 191 -156 139 78 -212 319 -110 -276
2903b76N13m88Q9L64m57K94P6k85K38N1m62O67m30l62O14l56K54K99p51O15q4
$$ -276 237 -251 -162 202 -255 39 115 -170 68 119 -343 324 -106 -468 146 -210 44 343 -408 207 123
2924A23n96O36j86n10O88j98n7M67o26L36J80n87N76r3l06L79Jm82N50m45L2M38
$$ 123 -473 163 -23 -533 155 -43 -100 367 -259 77 257 -330 246 153 -153 226 227 -255 295 -150 -118 320
2946C20m12L7J85o62N47N2k91N61n26P7L13j15P0K12n92L80k01l05L90L6j69J39
$$ 320 -92 -55 130 -532 15 67 -224 337 -189 -112 201 86 156 368 -224 156 -45 -350 40 76 -93 46
2968D6j4j46M31l24j15K0q6J43L11o71P28k68j32M42l36k76N85n01J49Q9k58Q8
$$ 46 32 -114 317 -7 -122 -102 -188 -45 266 -405 323 55 -77 365 29 -247 338 -163 -14 75 -183 -95
2990i5Q5k60L34J51l01K84m20J80J37m50K50L72n77N09j72j82K61k47j51N03q4
$$ -95 -10 -270 64 215 -86 198 -222 -42 95 -355 -105 267 -310 199 27 -155 106 -141 -292 211 127
3011A27j48N01n93P1J56n79O11J81m79J60J13j54M16l81j42M25n55K09K85m97
$$ 127 -21 480 -113 -42 114 -465 146 327 -152 8 121 -33 383 2 -140 285 -270 -61 224 -273
3031b73N46n7n76N60k84q1K20m1j90K06m6j18K80k38J00m7k92N03j6m64O73l71
$$ -273 273 216 -360 200 -84 -165 55 14 -176 30 -16 -134 146 -92 8 -39 -331 172 156 -308 365 -6
3053fj46L60l80J05K43n09L73J64n34M76K6k89N05l33k11M56m49J19J2l40L83
$$ -6 -152 208 -172 -67 176 -333 40 204 -330 146 172 -117 388 55 -156 300 -149 -30 -18 -358 25
3074B5J10k42J37j07O0P1q6J18O4m62M15R5k98K64j01j23K47m32L09L10m89J34
$$ 25 135 -107 30 -77 -17 54 -32 86 150 -312 103 198 -100 164 63 -60 187 -245 64 374 -115 19
3096A9J77k28O1L0r4J66l07j24K39K34l70L63l02K04O4l13K3J90k03K67j79j46
$$ 19 196 -32 29 59 -35 131 -176 -300 -61 173 -197 166 -136 68 132 -181 -158 32 -171 96 -83 -229
3118b29M47l67j00M07m84M38j84k29L09L85o14J36J69j69K24l08O3M10l46R0J04
$$ -229 218 -149 -249 158 -326 112 -72 -301 8 393 -221 -85 84 -85 139 -169 -106 304 -42 48 152
3139A52l95J8N85m75M30j72k28L85l57J20J36m27P8L78l40L0L0q7J50K3k96L42
$$ 152 -243 -225 360 -115 315 143 -85 300 -57 63 199 -228 -150 228 -112 -82 -52 -139 11 34 -262 80
3161H0k40K09J74l95J91P1l24L73k02q7L47l10j03N02m86RM12m00L32j72j6R0
$$ 80 -160 49 223 -172 19 90 -234 139 -63 -150 197 -113 -216 286 -200 -191 221 -179 153 -19 -35 55
3183E5k88J57N0j44R4J64k89J92J85j83l3J04j76M2J42l03L60k77k7K36k21L3
$$ 55 -233 -76 -26 -170 -76 88 -201 -9 176 -7 -40 64 -112 -70 72 -231 129 -148 -175 61 -160 -127
3205a27J55j43K79P9k27K40j60k74K70k2k03J22J2l5J32m75L95J22m33J53J41
$$ -127 28 -115 164 243 16 256 96 -178 92 70 -133 -11 1 -34 98 -377 18 140 -293 -140 1
3226Ar7L21k16j61K11o0OL20l05p7J95m97M50j13J18m5j99P3L45k80Q9N3m34L39
$$ 1 -96 225 9 -152 59 -1 5 325 20 -57 138 -359 91 -22 96 51 -148 -75 270 -10 79 132 -302 37
3250C7L9k82L92l5m64L53k27K13J62k71J09L31n89L74j61m13L94J29j61R3Kj48
$$ 37 76 -206 186 151 -313 40 -187 26 188 -83 26 357 -232 142 -19 -432 -38 91 -70 23 25 -123
3272a23K37j68K6Q4j2J53R7m52P4L64m44L81o1k68J85j72K5j61P8Q2M0P5O9O4
$$ -123 114 -54 -28 56 44 197 294 -158 -84 280 -164 217 156 -112 73 -99 -74 -235 -157 -75 -35 40 109 173
3296A73k56N34l81k35K20j27JJ25l07K69K44l58K08J7m31J73n0K03Q1l73K76J67
$$ 173 -83 451 70 -165 55 -72 -71 54 -253 16 260 -98 110 127 -304 -131 -181 22 103 -270 6 173
3318A73l67J89nj45L8MJ8K40l59J25P5k19M61l08j8Q0J09k12J08P6l14K03lO4
$$ 173 -194 -5 -10 -155 -117 -113 -95 145 -214 -89 -14 -233 228 -80 -98 -18 91 -121 -13 63 -251 -48 -51 13
3342A3k5j11r6M30k63Q9k9k31L07j46q5K34j83L4l5J81j87R8j14q6L09ML1j92
$$ 13 -12 -123 -219 211 -52 37 8 -223 84 -62 -147 87 -96 -62 -97 84 -103 -5 -119 -205 104 108 139 -53
3366e3J19R1k95L9O7j25P0J70n3j87J24j44O0J41j63L50l69L16k13j9L82k44l13
$$ -53 66 157 -138 -99 -32 -157 -87 83 30 -157 -33 -177 -117 24 -139 211 -158 158 -55 -74 308 64 -249
3389b49L96l44J69J03j07m8j1K48n7j11J0J65k68J2L36l78Q3K68k59q1PP8l0J62
$$ -249 147 -197 -28 75 -32 -80 -91 157 100 -11 -1 164 -104 -92 244 -134 -51 217 -42 -123 -116 -38 -68 94
3413I4j57J91k93p5J59J63n0r1O6J14m0l42L06R9m67K89L21m01K47j04k56L99
$$ 94 -63 128 -165 -240 -81 82 32 -59 7 121 81 -261 45 144 -323 -34 287 -114 133 29 -227 172
3435A72l37M9j5J00J05J3k50K9O1p7K84j84O8J0k32p0K85j23J33K32n55M25m8
$$ 172 -165 -116 -131 -31 74 87 -163 -134 -73 -150 134 -50 18 28 -204 -274 11 -112 21 253 -302 123 75
3458G5k20L41k25j17L41m3j17K11k99L1k02K11J47j46q5J42Nj84N32l38K6q4l8
$$ 75 -145 196 -29 -146 195 152 35 246 -53 -22 -224 -13 134 -12 -97 45 50 -134 398 60 86 2 -36
3481c6j25O0j79L49Ll06J80l7J84r4M1m2N6k09L28j53j75J89L2J96j67k79J69
$$ -36 -161 -101 -280 69 72 -234 -54 -91 93 -1 40 -2 54 -155 173 20 -155 34 66 262 95 -184 -15
3504a5J52k26nP3j88L55j8l77K59p3J86p3n7k54L90k26M6K48j65m8r1j65L65P4
$$ -15 137 -89 -94 -21 -209 146 128 -249 10 -63 123 50 -7 -261 129 -97 -51 197 32 -16 -107 -272 93 167
3528A67j93Ko5J34K8q4k12M56k98K39j94j01QJ26k49K52j21M0J64j45K00m7l88
$$ 167 -26 -24 -89 45 73 -11 -223 233 -65 174 -20 -121 -113 13 -236 16 -105 -65 99 -46 154 107 -281
3551b81K62K9J2J30j93L2P1q8J4N5j06J80j88j4J63q3j72K94m8k64K68j35K6P6
$$ -281 -19 10 22 152 -41 -9 62 -26 -12 43 -63 117 -71 -85 78 -5 -177 117 69 -195 73 -62 -36 40
3575D0k92K76J72m11K91j13n1L04k58o8J83k82K38K4j04m2K19k78J20Q6l28K42
$$ 40 -252 24 196 -215 76 -37 -88 216 -42 -110 73 -209 29 53 -51 -93 126 -152 -32 54 -274 -32
3597c2J03Q0M2j75M1P7j77m9K45r5J28m7k01J81j46J55J46m00m2K37j73M1p6J
$$ -32 71 151 193 18 59 136 -41 -90 155 60 188 141 -60 121 -25 130 276 -124 -166 71 -102 -61 -137 -136
3621a36K43j98R5o0R7j6p8o2l0L47l71J94J88k71Q8Lj82J65J37j62J53j28P2M0
$$ -136 107 -91 4 -56 41 25 -53 -115 -145 202 -169 25 213 -58 30 33 -149 16 153 -9 144 16 88 128
3645A28j90J12j02J59L0q1R7O0l07m7M3P6j26R3j38K77J09j09jOn4K24q7j72J87
$$ 128 -62 50 -52 107 137 56 153 213 -94 -141 -98 -22 -148 -55 -193 84 193 84 83 89 35 259 172 0 187
3670A87l41K43j9k00L45j05j07J66k83J29k9j72M7R3j61L94k90L32l60J09m6J34
$$ 187 -154 89 70 -130 215 110 3 169 -114 15 -14 -186 -139 -46 -207 187 -103 229 -131 -22 -68 66
3692F6O5P5n3j97J78l44J55K39j67j89J49k0J32P6k66N7Q2L9j83J49j54j78J91
$$ 66 131 206 153 -44 134 -210 -55 184 17 -172 -23 -43 89 165 -101 -44 38 77 -106 43 -111 -289 -98
3715i8j25L09k05M8r5M4M1R1N3J4j99k36M41oJ2o7o7k0J2K09r7J43k10N3N2j34
$$ -98 -223 86 -119 -71 -166 -122 -81 10 63 77 -122 -358 83 77 89 22 -45 -65 -53 156 59 202 -8 45 97 -37
3741c7J71l8k85K52Q0j63N8L3k77J22J13J39k35J8M8K11m75L59J77l65O4j2L13
$$ -37 134 96 -189 63 143 -20 38 71 -206 -84 29 168 -67 -49 -1 210 -265 94 271 -94 -30 -42 271
3764B71Nk95l9P8q9K21j90qK07k37j39J05K20JJ7k10K59j47q6J70m3p1m6Q7K3
$$ 271 276 -19 -58 20 -69 152 -38 -46 161 -76 -215 -110 110 111 128 -82 177 30 -56 114 71 0 -46 41 64
3789F4J98l32L05m19L8K73j11O7m6LP9p1j5k22K24m7o2jJ81O4n8j51R8j02K4J69
$$ 64 262 -70 235 -184 -146 127 16 83 37 40 119 48 33 -189 35 -12 -74 -75 106 170 112 -39 59 -43 -19 150
3815A50l45K23K00k43M3N3p6j9RN3O2p2L0o0j49N9J24K92k90O7j67J37k65K14
$$ 150 -195 28 228 -15 28 81 5 -14 -5 48 110 38 68 8 -141 -82 42 334 44 111 -56 81 -184 30
3839C0J68k36q7J96q7nn8M9N9j78L3Q8K48l59L74k93r0L29k65K06j40J6J84o4
$$ 30 198 -38 -125 71 -16 -21 -79 -30 29 -149 -116 -28 220 -139 235 -58 -148 181 -84 122 -18 -2 182 118
3863A18m3R7j25nk35J05rL14j45j23n1nK41j32j04J62k08K89ln7k61L14k43K23
$$ 118 75 172 47 42 -193 -88 -97 217 72 -51 -102 -107 134 2 -102 60 -148 141 138 81 -180 134 -109 114
3887A14q4j37J81m9k13J43L3m5M3j21pJ95j19J43m7j69K71k38R9P2j68j06K42
$$ 114 30 -107 74 25 -188 -45 -12 -57 -14 -135 -142 53 -66 77 30 -139 132 -106 -7 65 -103 -209 33
3910C3p5K23r9l8mj24J87k09J81Lk47P4K14k18J12l0O6l75L56k0P6Q2j14J02l5
$$ 33 -42 181 82 44 40 -84 103 -106 75 78 -169 -95 119 -99 13 -17 49 -326 30 10 86 168 54 156 121
3935A21j35J6J39j29j68K87j32J39l37K05K11k24J9N1J64k78K46m30L98p0j1J77
$$ 121 -14 2 141 12 -156 131 -1 138 -199 6 217 -7 12 63 227 -51 195 -235 163 93 82 259
3957B59k06o7J86l61L19j19j62J2K32k4r7J91j48J21k65J0J84j81J22Qp8O1M8
$$ 259 53 -14 172 -189 130 11 -151 -139 93 69 -28 163 15 136 -129 -119 65 -116 6 14 -64 -3 45
3980D5k43J33J01q2j7J75p9j30Pl5M17m67J81J46r7oK76k29m2J9j91L87k85n2
$$ 45 -198 -65 36 -46 -63 112 33 -97 -90 -125 292 -175 6 152 55 49 325 96 54 73 -118 269 -16 -68
4004f8J23L9j87J41j57L68k62k63J34J82pK9Rk39J35J6r0J29m7r3L62n33L24J30
$$ -68 55 94 -93 48 -109 259 -3 -266 -132 50 43 72 81 -158 -23 -7 -97 32 -15 -108 254 -279 45 175
4028A75k31J54l26K88m6O1j18J59L7J7o4p2Nj48k64M78l29K78Q8j37O0j55O2R5
$$ 175 -56 98 -228 60 14 75 -43 116 153 170 106 34 39 -109 -373 105 -224 54 142 5 65 -90 -28 67
4052F7o3j39K33P6l23L1J31m4O5k24N2K54l5p1J65k89K04j20K03k08J02J33j64
$$ 67 4 -135 98 174 -149 -118 13 -31 34 -190 -138 116 81 10 175 -114 90 -30 173 -35 67 200 36
4075C6j13K32j58J0L3j62R0K9Pp7K95l09j8K14k88K48J55k37N3j13K5J05j26J81
$$ 36 -77 155 -3 7 40 -122 -32 -3 4 -73 222 -87 -105 109 -179 69 224 -13 40 -73 -48 57 -69 112
4099A12j20P9J70l66K78m8j64oJ28j51k3j76L14J9j9o8J37r4n3J83j83J42p1J07
$$ 112 -8 71 241 -125 153 105 -59 -65 63 -88 -111 -287 27 46 27 -41 96 2 -51 132 -51 91 20 127
4123A27r6K78k87j39K05p3n2J03j76K72j18k14L75j66q8j3k53J81J10j58M0O3
$$ 127 31 309 22 -117 88 15 -37 66 -110 162 44 -170 205 39 -49 -62 -315 -134 -24 -182 -142 -79
4145g9J0LK32j58J47k80K44j0j19j51K45j58R2J34R4l7l2n7k63J85m0j9J21l37
$$ -79 -69 -66 166 8 155 -125 119 109 -10 -161 84 -74 18 152 246 209 177 120 -143 42 2 -17 104 -233
4169b33J45J23Q1o5k66L03j57P2Mj4p7J31l9Q2j73L3M9J38k80J81q7j00J85l8
$$ -233 -88 35 116 51 -215 88 -69 3 7 -7 -84 47 8 90 -83 -50 -1 137 -143 38 -49 -149 36 -2
4193bl0J06mk61K30j14P2k54M03r8ok22L24k52O2K57k60pJ13j87R4J16j36Pk99
$$ -2 -32 74 70 -191 39 -75 -3 -257 146 48 42 -180 144 -108 -46 211 -49 -56 57 -130 -36 80 -56 -49 -348
4218c48K22M46l83Q7K22k92L2Q5j37j02k1K24J0P3j54J61m0n5J46r8j52K69j52
$$ -348 -126 320 -63 24 246 -46 -14 71 -66 -168 -189 35 45 118 -36 125 85 30 176 78 -74 195 43
4241D3n4J27N8O2j52j54J1j2K98k30j61J11n1pP5M3j18L4O7N4J41k13o0J89l10
$$ 43 -11 116 174 236 84 -70 -59 -71 227 -3 -164 -53 -104 -111 -36 7 -111 -77 -10 44 185 -28 -88 101 -209
4266b09J74j49K36n2O9k9n3j12P8j27P3Q1J27n7k23J81l1J23j13l4J54M2j20M0
$$ -209 -35 -184 52 0 69 40 -13 -125 -47 -174 -101 -20 107 50 -173 8 -23 100 -13 -47 107 149 29 69
4290F9k44M0Q3m1J53j48pJ06o1l4J79j99J4J57k34J86K00j06j49j4j37P0J99R2
$$ 69 -175 -135 -52 -93 60 -88 -95 11 -50 -84 95 -104 -90 67 -167 19 219 113 -36 -50 -187 -117 82 174
4314A74j42o1KP0p2L9J7j07J26o6j80L96m2q4j56J5j92K93q2kM8O3k21J06j06
$$ 174 32 -29 -27 43 -29 10 27 -80 46 -20 -200 196 154 70 -86 -71 -263 30 -52 -54 -6 57 -164 -58 -164
4339a64N8K52k60J29k9J70r0j63K2J43l9r7K25j95J61j50N6P3j53k5P3k01p0L63
$$ -164 -106 146 -114 15 -14 156 66 -97 -75 68 29 -68 157 -38 123 -27 29 102 -51 -76 -3 -204 -274 89
4363H9k35O7O2%k7N2l4J3j34K10n3p9r6J58j87J5L23L2j18RO0j98J12o3J02r7
$$ 89 -146 -79 -17 -17 -44 8 -26 -13 -147 63 10 -69 -165 -7 -194 -179 144 176 58 67 127 -71 41 -22 80 -17
4389a7J54r3j04j7pJ75j00j81K80J61l22J5M35m24J13k04R0P0P9k47J39J2j1J23
$$ -17 137 44 -60 -77 -84 91 -9 -190 90 251 -71 -56 379 -45 68 -136 -46 24 103 -144 -5 7 -4 119
4413A19n1k73J01j0K14No6o2k58k4J75K22m4k55R7J60K3j49J04J34m12K54J28
$$ 119 68 -205 -104 -114 100 105 39 -23 -281 -305 -130 92 48 -207 -110 50 73 -76 28 162 -250 4 132
4436A32j98M3K28p6k05k05J07K66j37O1j44n7K80L4J8j63l0K53m14J27j4L2L9
$$ 132 -66 -23 205 129 -76 -281 -174 92 -45 16 -128 -185 95 129 147 -16 -46 207 -207 -80 -94 -62 -23
4459b3n7O2m6p0L33k27N6k02J24O0k01J89l27L28J77k30L8j35K67k36K94k54M1
$$ -23 -80 -18 -64 -134 199 -28 28 -174 -50 10 -191 -2 -329 -1 176 -54 -16 -151 116 -120 174 -80 -39
4482c9l4J06K6j23K3M2p6N4K40m20Q5J02N0p3J95k08K35n1r2k19J97n4P1J24k39
$$ -39 -73 33 59 -64 -41 1 -75 -21 219 -201 -116 -14 36 -37 158 -50 185 134 42 -177 20 -34 37 161 -78
4507g8oP5k27Q2Q3J09P6j22J34j13j69J30J23k8l7k59N9Q1m9J14J6l0n1Q7j81
$$ -78 -84 -9 -236 -154 -71 38 114 -8 126 13 -156 -26 97 69 32 -227 -168 -87 -136 -22 -6 -36 -87 0 -181
4532a81J0j8J94O1k8J26j44N3j80J5M5j22J07K02k64J8m9J43J1J93j51O7j11O3
$$ -181 -171 -189 5 66 38 164 20 73 -107 -92 -47 -169 -62 140 -124 -106 -155 -12 -1 192 41 108 -3 60
4556F0o5L2o6Q0j02K84n6m42J94K12M7j61K9J56l95J84J19j83L0J89j54j07J39
$$ 60 -5 27 -39 41 -61 223 167 -275 -81 131 178 17 46 202 -193 -9 110 -73 -43 146 -8 -115 24
4579B4j12R5J9r3J37Oj29J57m3j87L87m06J43j02J17j45J02j13J29K11k04j35
$$ 24 -88 7 26 -67 70 76 -53 104 61 -126 261 -145 -2 -104 13 -132 -30 -143 -14 197 -7 -142
4601a42J39L2j22rL20q6k0j72j03R0j00K99j37J37j45K74m69K40n7k8P8o6j6n3
$$ -142 -3 29 -93 -102 218 132 112 -60 -163 -73 -173 126 -11 126 -19 255 -214 26 -31 -59 19 -47 -63 -116
4625a16Q7o3P9m3J23N2k98J23K9r5j7K5J95j28p5Q8J11k57J37J20j39n5K67l98
$$ -116 -29 -92 -13 -56 67 119 -179 -56 -27 -122 -139 -114 81 -47 -122 -34 77 -180 -43 77 -62 -117 150 -248
4649b48K12Q3l6j05L70l06k24K94j06J1j3L9j25K09O9j47j58L66j60Rk28K40O8
$$ -248 -36 47 11 -94 276 -30 -254 40 -66 -55 -68 -29 -154 55 124 -23 -181 185 25 34 -194 46 114
4672A14j31j11QM87m22J05j21Q9j22J83NP2k63J75k87M21j81NL5M0pJ1J31k97
$$ 114 -17 -128 -120 367 -55 50 -71 18 -104 79 84 156 -107 68 -219 202 21 26 61 101 94 105 236 -61
4696f1l3K21k58L25k75Q1o2J46j66J25j12K33J09j60k09O8J4N7j05J6K5J01l1
$$ -61 -94 127 -131 194 -81 0 -62 84 -82 43 -69 164 273 113 -96 -28 -14 43 -62 -46 -21 80 49
4719D9K33rm02k3M6L28k55J06p0J24j25O3n6k05K31k87L35j82K49k39J01k6ok41
$$ 49 282 273 -129 -152 -106 222 -33 73 3 127 2 65 9 -196 35 -252 83 -99 150 -89 12 -14 -20 -261
4743b61K06Jj1q5J73L2o5J70j3O3q8j56j4j21J83P0K9M1j45n5k9j4j74O0K50p8
$$ -261 -55 -54 -65 -150 23 55 -10 160 147 210 122 -34 -48 -169 14 84 113 154 9 -46 -75 -89 -263 -203 47 -31
4769c1l9J16Q0j56P2P9l60L53j94r7J88J02n5JJ33l75J80R3j59K05q7j05J00j09
$$ -31 -70 46 126 -30 42 121 -239 114 -80 -177 11 113 58 59 192 -183 -3 90 -69 136 49 -56 44 -65
4793f5k47L29j96K32j02k6L7J53p5p1R7Q1k97K35q4p3n6n8K18p7kJ02Jj28J20
$$ -65 -312 17 -179 53 -49 -75 -38 115 40 -31 66 147 -150 85 1 -72 -128 -186 32 -45 -47 55 56 -72 48
4818D8J00k14P4p5J86j11j46J84j58N2j23M05k05j10K55p5j32K0j10J61m0M7j29
$$ 48 148 -66 8 -67 119 8 -138 46 -112 -60 -183 222 17 -93 162 87 -45 -25 -135 26 -14 33 -96
4841i6M2K61k57J16j64L8K92j19o6k71K51k08K94l05K38j23M4M7j83n5K86n8M0
$$ -96 -54 207 -50 66 -98 -60 232 113 47 -224 27 -181 113 -192 46 -77 -33 14 -169 -224 62 4 44
4864D4N7j82J63lQ5k48n9J19pQ5J45l07K81k3j71j42K46n0r5l0L21k35j43M5O2
$$ 44 101 -81 82 79 164 -84 -143 -24 -31 54 199 -108 173 150 -21 -163 83 33 -62 -92 229 -6 -149 -104 -42
4889d2o8L50o1k90J89j97M60j87l71N02m05R4j01J85j20J2R3N4j96J58J17k21
$$ -42 -110 240 179 -111 78 -119 341 154 -217 285 -120 -26 -127 58 -62 -50 43 97 -99 59 176 -45
4911d5J22l2m4l9J89J4L9j78K4j5K47m39J63O6mj92j4Q5O4j56J88J5J05n6j72
$$ -45 77 45 1 -38 151 165 204 26 50 35 282 -157 6 72 68 -124 -138 -53 11 -145 43 58 163 107 -65
4936f5J37o6J6J5LM4O6j04j58K94k16J03j47r5K6K93j62lL6ol5K15k45KJ81p0
$$ -65 72 6 22 37 40 84 150 46 -112 182 -34 69 -78 -173 -147 146 -16 -19 17 11 -24 191 -54 -52 129 59
4962E9o7J44o2L0l87L00Q6j61J07o6KJ64k62K12k45R9P5n6M7l0J5J4r1m3k8K29
$$ 59 -8 136 74 104 -283 17 103 -58 49 -17 -15 149 -113 99 -146 -47 28 -28 19 -11 4 18 -73 -116 -144 85
4988H5j62J86j35r5N7R3K3p7r6K73k03j21N1k0J33J45j93qO0k21K33j9P9l2P5
$$ 85 -77 109 -26 -121 -64 29 52 -25 -121 152 -51 -172 -121 -141 -8 137 -56 -64 -4 -225 8 -11 68 36 111
5013A11j84L22j15k03J48o5k08N9J04R6M1J2q1j43j28L74j08jJ05k5p0q8J00r7
$$ 111 -73 249 134 -69 79 14 -194 -135 -31 65 106 118 37 -106 -234 140 32 31 136 111 41 -47 53 -44
5037d4n8O2P5M6j42M5N7J95l60J34r9j4l0J44L2q1m6M0n3J17j7n6J38k80L32k02
$$ -44 -102 -40 35 81 -61 -16 41 236 -124 10 -89 -103 -133 11 43 -38 -84 -44 -97 20 3 -53 85 -195 137 -65
5063f5J1J62k3j43N5pOL9o1J43m16L98j18L3j07p6O3K29r1m2jj60K75J28k06j51
$$ -65 -54 108 85 -58 -3 -10 -4 35 -26 117 -299 99 -19 14 -93 -169 -106 123 32 -10 -11 -171 104 232 26 -125
5089a25J29J50k52L20k75J45Lm8k5j51K48j08J02q9O0q6M0p0j4K11j08j44m6j38
$$ -125 4 154 -98 222 -53 92 95 47 22 -129 119 11 113 24 84 -2 38 -32 -46 165 57 -87 -133 -271
5113b71L68q0K0k10L15k64P1K11j8K6j87j42J54j11L35q2l5%O7j84MJ90k41R1
$$ -271 97 17 37 -173 142 -122 -51 160 142 168 -19 -161 -7 -118 217 135 100 100 167 -17 -13 177 -64 27
5137B7m6K96k93q4K13l35K23o0K20l64K07K1j52k8j00M94k67m8K42j62k6J90k13
$$ 27 -19 277 -16 -100 113 -222 1 -59 161 -203 4 25 -127 -155 -255 239 -28 -76 166 4 -22 168 -45
5160d5K5k05K59j73J71N7o0K2o3p6j25J00R9l8J17j73R4o7l2J05J25j40L1l9K41
$$ -45 -20 -225 34 -139 32 89 29 51 -12 -88 -213 -113 -14 -52 65 -108 -14 -81 -113 -8 117 -23 8 -31 210
5185B10j75j38K20R2j00l04J67P6J03k21J33k9Q7j14RJ63j34j39K76j35J3O2r5
$$ 210 35 -103 117 209 109 -195 -28 48 151 -70 63 34 121 7 16 179 45 -94 182 47 60 122 27
5208B7j05r7J03j13J96k7J08k15K83o8J20k55K61k41K01k51k37M70j62N6o9l3
$$ 27 -78 -175 -72 -185 11 -16 92 -123 160 92 212 -43 218 -23 178 -73 -310 160 -2 54 -15 -48
5230d8J87P0n3k43o1K44j22M5q0P7k66L08J95k98N1K6k38K89o4j09K25n1l7k97
$$ -48 139 209 156 -87 -148 96 -26 19 -61 16 -250 58 253 -45 6 32 -206 83 19 -90 135 84 47 -250
5254b50l1K37J53j77J91k50O1q9K39j06l8L9PP4J71oj93J39r9k15J62L3n3J60
$$ -250 -281 -44 109 -68 123 -127 -66 -155 84 -22 -60 -21 -14 60 231 225 32 171 72 -143 19 52 -1 159
5278A59l16J26j99J90p4K0J1j15J67Nk5oJ1O4M7J36lj18l63L40j1m6j54K22j76
$$ 159 -157 -31 -230 -40 -114 -94 -83 -198 -31 -26 -51 -57 -46 18 65 201 198 80 -283 57 46 0 -154 68 -108
5303a08Q2j22J77j34n3J20K65m04M1Q5m2Ko9K06N4J99l58K46j90kJ0l1K8J86k27
$$ -108 -26 -148 29 -105 -158 -38 227 -177 -136 -51 -93 -91 -160 46 100 299 -59 187 -3 -5 5 -26 2 188 -39
5328c9MqP4j13L34l64j60J97R2k4Oj35J73J05k5k62r7L30k77K26j16j42L33o9
$$ -39 -35 -43 31 -82 252 -112 -272 -75 17 -7 -1 -136 37 142 117 -145 -242 88 -189 37 -79 -221 112 43
5352D3q0N6kK11j28j6n4j8q6j95J88MJ23jj6R2qL3l00J57O6Q4j2j52k9r9r1K88
$$ 43 -37 19 17 228 100 84 30 12 -74 -269 -81 -77 46 45 29 121 113 146 -154 3 69 153 141 -11 -40 -139 -230 58
5380E8J00l35K4L00j09O6J7Ok40J92j59J15j04m0L9q8K26j55PJ39J45l39m5Q8
$$ 58 158 -177 -153 147 38 104 121 127 -113 79 -80 35 -69 -109 -70 -158 68 -87 -80 59 204 -135 -180 -92
5404i2O4N7N3pp1L6J52k11J71j75j3q5RM3J50m7p9J33j77J99m9j96K2J83j60J31
$$ -92 -28 29 82 75 4 40 192 -19 152 -23 -36 -121 -112 -69 81 34 -45 88 -89 110 61 -135 -113 70 -90 41
5430D1j67P1P3p9J38K5j13J12j33k9J34j19M6j33K28p7j4j18J00lj70J23R0r8
$$ 41 -126 -55 18 -61 77 102 -11 101 -32 -61 73 -46 0 -133 95 18 4 -114 -14 -17 -187 -64 26 -72
5454g2j33L54k41%O9M3j08P7J20n0j55o4K34j02J10L9l00M13r4j42m4J22k7K7
$$ -72 -205 149 -92 -92 -23 20 -88 -11 109 59 -96 -160 74 -28 82 121 -179 234 140 -2 -46 76 49 76
5478G6n9rJ02q4j5k35J81J45j52J12j09q8J14M8l19K75L4M0J33j90j29J33n2m9
$$ 76 17 8 110 26 11 -224 -43 102 -50 62 -47 -135 -21 27 -292 -17 17 57 190 0 -129 4 -48 -97
5502i7j4j6mJ04j10p9J86J43k7k32J04n1R9q7L35k10J6P7j58J77k47K05L9k56
$$ -97 -111 -127 -131 -27 -137 -216 -30 113 86 -146 -42 -93 6 -81 254 44 60 137 -21 156 -91 114 153 -103
5526a03Q9l9j59K39m2L1M1J16j84R2j32r6J84j56O0Q3k79M08L1k37J18j81q6K52
$$ -103 -14 -53 -212 27 -15 16 57 173 -11 81 -51 -147 37 -119 -59 24 -255 153 184 -53 65 -116 -202 50
5550E0j20m9J79j23j04K22j16N9j4K15j79n0J44j43k6n0R5K12k97p4L9n9K99j13
$$ 50 -70 -119 60 -63 -167 55 -61 -2 -16 199 20 -30 114 -29 -55 -105 -10 202 -95 -169 -130 -189 110 -3
5574cp8J04o9J26l4K06j3l31j4J98q1k09L99j61r6O1n0o7P3MJ03p7o6o0O6PJ23
$$ -3 -81 23 -46 80 46 252 239 -92 -106 92 11 -198 201 40 -56 5 -45 -112 -39 -35 68 -9 -75 -135 -69 -62 61
5601F1j13j01r4K73q7L02j73m8o7K3J06J35l18K20k02R7Jj58N9J67k7N1r6l1j5
$$ 61 -52 -153 -247 26 -61 241 68 20 -47 -24 82 217 -101 119 -83 14 15 -143 -84 83 56 107 11 -20 -35
5626c5k9%L23k59n1J15Qp2k5q2J7J10k87L63k96K36j30J24r4k8K05j97J22j16
$$ -35 -64 -64 259 0 -51 64 72 0 -25 -107 -90 20 -267 96 -200 36 -94 30 -64 -92 113 -84 38 -78
5650g8J44j50J31j82m5J32j24J67R6r1j58J67K0QK2r6L01j31j98P1L9j23J67p5
$$ -78 66 -84 47 -135 -180 -48 -172 -5 91 0 -158 9 29 37 59 -37 264 133 -65 6 45 -78 89 14
5674A4j70L7J84q0O6J9q0r6K36rj50j13K07Lr5K1n8J5K63o3l51L77k13N2m4k18
$$ 14 -156 -119 65 -15 51 70 -10 -106 130 121 -29 -142 65 68 -27 -6 -64 -49 214 151 -200 177 -36 16 -28 -246
5700b46J87N4j11J08M8r1R3j36J90j4k14N9L59j69J7j54n7L16j13k39K09k08R7
$$ -246 -59 -5 -116 -8 40 -51 42 -94 96 82 -132 -73 286 117 134 -20 -77 239 126 -113 96 -112 -15
5723a5p8j20K24J23k7j01j08o0K18O2q8j84J25q3O7J26j16PJ65n4r3o2n9K71j43
$$ -15 -93 -213 11 134 107 6 -102 -162 56 118 30 -154 -29 -112 -45 81 -35 -28 137 83 -10 -72 -131 140 -3
5748cJ92j84qp2J10r1JO9k20J82Q4k57L25k7j05o0k03K87J99l02J1O5o2M4o0M7
$$ -3 189 5 -3 -75 35 -56 -55 14 -206 -24 60 -197 128 101 -4 -64 -267 20 219 -83 -72 -7 -69 -25 -85 -38
5774c8L49n37K64N3l8j1j57J97n7j21J87k16m7J79k37K71R3n6j2N7j09j14K34
$$ -38 311 -226 38 91 53 42 -115 82 25 -96 91 -125 -172 7 -230 41 134 78 66 123 14 -100 134
5797A34j68L6N1l75N14k76M0J57j13p0Q7Pj47R0M8q4Q4j16j8K65j90n6K48j15
$$ 134 -34 2 53 -322 192 -84 -44 113 0 -70 17 24 -123 -33 15 -69 15 -101 -119 146 -44 -100 148 33
5821C3r9K76k22J69k40j9J88k38M22k88p9K33j86j0n4J03J14L6r8j6r5K4r1QJ23
$$ 33 -66 210 -12 157 -83 -102 86 -152 270 -18 -97 136 -50 -60 -114 -11 103 139 41 25 -70 -46 -137 -129 -6
5846fl8O9LJ66M5m09J33J09k4j0j33J13m1J43j17j4J21p4J1k5K5k4j30P8j8K03
$$ -6 -44 25 28 194 239 -170 -37 72 48 38 -95 18 -23 120 3 -11 110 36 47 22 47 23 -107 -29 -47 156
5872A56l20PL42j23q9M5j46J51p0J26j51n5J24OQ6j31o6K36k34M54l07L6kj82
$$ 156 -164 -157 185 62 -27 18 -128 23 -47 79 -72 -127 -3 3 89 -42 -108 128 -106 348 41 77 75 -107
5896a07P8L7k14K60r2J08m4N3j49p8L47p6k2m5l3J14l3j56j09J18R9j23K5j33
$$ -107 -29 8 -206 54 -38 70 26 79 -70 -148 199 123 101 56 23 137 104 -52 -161 -43 56 -67 -42 -175
5920a75K85j01N0k1k11J40j37J30P3M2m6k2O7j5j49o2J22j6l5K7L1K6o2N3J32
$$ -175 110 9 59 38 -173 -33 -170 -40 33 75 29 7 74 59 -90 -152 -30 -46 -81 -54 -23 3 -59 -6 126
5945A26k00n4K3k5J8K15m8om9K31k42J99j83l1k6j4N1M41o02J17L7j46O9q2J12
$$ 126 -74 -128 -105 -130 -112 103 55 49 0 231 -11 188 5 -26 -52 -66 -15 426 -176 -59 -22 -168 -99 -181 -69
5970f9K90j91k2o8N2J5n5K07l41K02J62k24J0Q1j79j42K09M9L5j81K34J10k14
$$ -69 221 30 8 -60 -8 7 -48 159 -182 20 182 -42 -32 49 -130 -272 -63 -14 21 -160 74 184 -30
5993c0M6J2q0j61J70l2n9K46r6j90K56j5m7K08j87k04K15k3J18o6j96K63j40j50
$$ -30 16 28 -52 -213 -43 -75 -134 112 16 -174 82 67 20 228 41 -163 52 29 147 81 -115 148 8 -142
6017a42L21k94J14J20j1k33O3k1J84j66j5j9o1J73k73K61m7j46L43j25k33K39
$$ -142 179 -115 -1 119 108 -125 -62 -83 101 -65 -80 -99 -160 13 -260 1 -46 -192 151 26 -207 32
6039C2j21M15l79M9mm5J3J10l2l7j3j6L54m53J33N2k02L27n9n6J19o0j47p1J14
$$ 32 -89 326 -53 -4 -8 -53 -40 70 38 1 -12 -28 326 -127 6 58 -144 183 124 68 187 127 -20 -91 23
6064B3Q9j65N8l8O1j8J5o7Q2n6R5J32j69j2J44j81n3p0L15k27j67L68o2p6j97
$$ 23 112 -53 5 -33 28 10 25 -42 40 -16 79 211 42 30 174 -7 -60 -130 185 -42 -209 159 97 21 -176
6089a76j2J04Q4P9q4J42j85q9P0m4J04Qj18j1J89k3k22R9J26j29j8J65l4Q2j83
$$ -176 -188 -84 0 79 -5 137 -48 -137 -67 -111 -7 1 -117 -128 61 38 -184 -85 41 -88 -106 59 25 107 -76
6114g6Q4P4j93J91k00K20j18Q3k21J24K81j86k20P5J45J9o1k62Q6N3J08o9J12
$$ -76 8 82 -111 80 -120 100 -18 65 -156 -32 249 63 -157 -82 63 82 21 -241 -155 -102 6 -63 49
6137D9k30L50j57R9M6j26k36K60K09j60j18J16q5j85O6J66k77L02j53J59k15j46
$$ 49 -181 169 12 111 157 31 -205 55 264 104 -14 102 17 -168 -102 64 -213 89 -64 95 -120 -266
6159b66M19j6m9L0m0L7l5j3L8J9k27Q0J08J8m0Q6j58J20L5j61j26J57j8k90N02
$$ -266 153 137 88 118 78 115 80 67 105 124 -103 -23 85 103 63 149 -9 111 146 -15 -141 16 -2 -292 210
6184B10k44J46j17j16q9K04L0l6J01o7j71M0J98J49j54k46Q3Q0J22j20O1jK10
$$ 210 -34 112 -5 -121 -210 -6 24 -12 89 22 -149 -109 89 238 84 -162 -79 1 123 3 64 63 273
6207B73j23k3j52J83j07L5R3j82J20k9l12K77J4p9J45j95J3J65j88J10P2k99P4
$$ 273 150 127 -25 158 51 86 179 -3 117 88 -224 53 67 -12 133 -62 -49 116 -72 38 110 -189 -115
6230a15N5n2J98k4J61j43j31M4m8mj5O0J85k39L31j86n3lL29l10p0J40k40J43
$$ -115 -60 -112 86 62 223 80 -51 -7 -55 -59 -74 -14 171 -68 263 77 24 21 350 40 -30 110 -130 13
6254A3J1o5J10J10J2k35J42j52O1N4q0K15k18J43j72J52k93J21k3J39l22M47j50
$$ 13 24 -41 69 179 191 -44 98 -54 7 61 -19 196 -22 121 -51 101 -192 -71 -94 45 -277 170 20
6277B0r5J85j10k5O8%P5j84m7Q2L1n7p4J66N7m3L44m16J0J67k37R5J66q7o9j82
$$ 20 -75 110 0 -25 43 43 118 -66 -113 -31 0 -57 -131 35 92 49 393 -23 -13 154 -83 12 178 91 22 -160
6303a60M1qj6K33j40p4K91j51r3n2N1K7J68k38j8ll7K17j5L8M0j34K24j65N0J2
$$ -160 -119 -127 -143 90 -50 -124 167 16 -77 -129 -78 -51 117 -121 -139 -142 -179 38 23 61 101 -33 191 26 76 88
6329H8j02j49J77P9J2j09j9J61k76K33j25J23k87J67O2L2L18m16Q2k6j20p2O2
$$ 88 -14 -163 14 93 105 -4 -23 138 -138 95 -30 93 -194 -27 35 67 385 -31 51 25 -95 -167 -105
6352a05K99k68J83j53J36j88J30K78j96k39J09O5J3N9m7o8j8R7L1K4o9L4M5k34
$$ -105 194 -74 109 -44 92 -96 34 312 116 -123 -14 51 64 123 76 8 -10 87 118 142 73 107 152 -82
6376h2O5K00k14K58j71JJ49j50k6k2k09J04J37J90l44O5mK70j37j84Q1J05j99
$$ -82 -17 183 -31 227 56 57 206 56 30 8 -201 -97 40 230 -114 -49 -53 217 80 -104 -23 82 -117
6399a17o0J86M8n2j13j24M31j59r4J06J58k67j9J90o2J42k01M4p0J76j36J08j76
$$ -117 -177 9 57 5 -108 -232 199 40 -54 52 210 -57 -76 114 52 194 -7 37 -33 143 7 115 -61
6422f1L16k23o0J6p0j92M35j09j03J99l2k04J59n1J13j22l7Q8j30j11K41j44K60
$$ -61 255 32 -28 -12 -82 -274 161 52 -51 148 116 -88 71 20 133 11 -26 62 -68 -179 62 -82 178
6445A78o7l11M16j11n2k10J46j63K41j53J83j93l0J67j76J94k5J3m5j80L09L2
$$ 178 111 -200 216 105 53 -157 -11 -174 67 -86 97 -96 -126 41 -135 59 34 47 2 -178 131 163
6467A63l44J48M0Q8l74J98K63q8r5J7pJ9k9K1Ll3K6j04j32K91m4QK4k30J16j01
$$ 163 -181 -33 7 95 -279 -81 182 94 -1 16 9 28 -1 20 23 -10 16 -88 -220 71 27 35 59 -171 -55 -156
6493a56N3J73k10J53K11k89m9O4K49j01n9l5M0o6p2j21K26J37r8Qj62N5r5J54
$$ -156 -103 70 -140 13 224 -65 -114 -50 199 98 39 4 44 -22 -94 -215 11 148 50 58 -104 -49 -144 10
6517A0J42k53K66j74j15L62j29j35j70K01l6l8O1K4M4n5k1J06k19P3k4j0M6J50
$$ 10 152 -101 165 -9 -124 238 109 -26 -196 5 -31 -69 -8 16 60 5 -16 90 -129 -56 -80 -90 -44 106
6541A06k89K05m3l3J32k12J16J12k52QK54o5k4J44M2q2k07k9J35j51R7j04M16
$$ 106 -183 22 -21 -54 78 -134 -18 94 -158 -150 104 39 15 159 201 119 -88 -117 18 -133 -36 -140 276
6564B76m05L98j65o6Q8L2k00J98j64m8J89j19j72r6K77ol2O4N5m5o7O8O9m29O45
$$ 276 -129 269 104 38 126 158 -42 156 -8 -56 133 14 -158 -254 23 17 -15 49 104 59 -8 60 129 -300 345
6589C45m32K02l0j65J84lj50MQ4k43K02K9Oj02K2j10K66j20J57p1j11L0r0L20
$$ 345 -87 115 85 -80 104 101 -49 -45 39 -204 -2 27 33 -69 -47 -157 109 -11 146 75 -36 -6 -96 224
6613B24l75O9J70p6q6j68K7Q8J62p9K40j48j05J38%j43O7J18l70J93K86k66m3
$$ 224 -151 -82 88 12 -74 -242 -215 -127 35 -44 196 48 -57 81 81 -62 5 123 -247 -54 232 -34 -77
6636g7J86j24J44k29m2J48j06P2R3j61J02j03kK59Rl62M3J16J98Rr3J19l51J37
$$ -77 109 -15 129 -100 -142 6 -100 -28 65 -96 6 -97 -99 160 169 -193 -150 -34 164 173 80 199 -152 -15
6660a5m6m1M1j61K94j71J80l0M1j68K1L4j60M59j90o3J84n3k19j54L72j36J03
$$ -15 -61 -102 -61 -222 72 -99 81 51 92 -76 -55 -21 -181 278 88 25 209 156 -63 -217 155 19 122
6683A22k71K32j54J1O7k2o7N5J65Jl18Q9L25l58K24j78j17J31O8j12K98l40L62
$$ 122 -149 83 -71 -60 7 -15 -82 -27 138 139 -179 -90 235 -123 101 -77 -194 -63 5 -107 191 -149 213
6706B13j18k19J84Oj23P3j03J41k03MM46l02J56j07j84J45j19K38j90k11J52J38
$$ 213 95 -124 60 66 -57 16 -87 54 -149 -145 301 -1 155 48 -136 9 -110 128 -62 -273 -121 17
6728A7NJ18L6k34R2P6j94K23k27P4P5j37k0Ok3j02J36k66J93R3N6j32J87L18l05
$$ 17 22 140 176 -58 34 110 -84 139 -88 -14 61 -76 -96 -90 -113 -215 -79 -345 -152 -59 -3 -135 52 370 65
6753F5k45K35n7J28k29J73j23L5lk8OK55Q5l66r6J16j8J92k47j2J94m6mM6j17
$$ 65 -180 55 -2 126 -103 70 -53 -18 -21 -49 -43 212 297 -69 -165 -49 -67 125 -122 -134 60 14 10 56 -61
6778f1J66k12m6K57j30n4J01m9M9O2q1N0J63k01J2j45O0O4J15q4r5J7O0QJ74r3
$$ -61 105 -107 -153 104 -26 -80 21 -28 21 83 2 52 215 14 26 -119 -59 5 120 36 -59 -42 18 26 200 107
6804A07pk08K26k47K79J43n68M94p3j52J25j29M6j41J93o4L8j17O0M2k82J00J14
$$ 107 100 -108 118 -129 150 293 -275 219 146 -6 119 -10 36 -105 88 24 62 -55 5 47 -235 -135 -21
6827b1M1j03K02j34J10k31P7R0J10j92LJ6l2J83N7r0j30m1J79J6Pp0j19K04k30
$$ -21 20 -83 119 -15 95 -136 -59 31 141 -51 -48 -32 -64 119 176 86 -44 -85 94 110 117 47 -72 132 -98
6852i8Q3J25nj04O9k77M09k36j28K49j14M2n6O8p9P7k32K57J43l86K30j63R7j28
$$ -98 -15 110 105 1 70 -207 202 -34 -162 87 -27 15 -41 27 -52 25 -207 50 193 -193 37 -126 -29 -157
6876a57K65o9j05J80rn6j33J02J69O4p7l10J35k17J93L37l29k0n8R3j1p9J1l6
$$ -157 108 39 -66 114 105 49 -84 18 187 251 174 -136 -1 -218 -25 312 -17 -37 -95 -2 -13 -92 -81 -117
6900a17RR5q3on1J41o0J64Q4jk3k08J34J87k63n4J18J62k66J09l87L41j25J20
$$ -117 -108 -13 -96 -102 -153 -12 -72 92 176 175 152 -56 78 265 2 -52 66 228 -38 71 -316 25 -100 20
6924B0J36k86K0j3L07O4k12M9j8k19MK92o4q6J33m28L72j03j0q3J69J9j65j4J48
$$ 20 156 -130 -110 -123 184 248 36 85 67 -152 -148 144 80 -6 127 -301 71 -32 -42 -125 44 63 -102 -116 32
6949C2J08k92K79j70J37j12q4K78k38q5J52j73P1r3L02q1k9M4j26J29m0m5o4J31
$$ 32 140 -152 127 -43 94 -18 -102 176 -62 -147 5 -168 -97 -190 112 31 2 46 -80 49 9 -36 -100 31
6973C1j45N9J60m8o4j63L87k59j3J71k60j00J64M4j9k7M0j6q9L31j77M8J27k52
$$ 31 -114 -55 105 57 -7 -170 217 -42 -55 116 -144 -244 -80 -36 -55 -82 -42 -58 -147 184 7 55 182 -70
6997g0j00J39Q8j72K07j97j45J40K07J28k09K06o4m4j01k3l7J7R0l50J77n1K04
$$ -70 -170 -31 57 -115 92 -105 -250 -110 97 225 16 222 158 114 13 -10 -47 -30 60 -290 -113 -164 40
7020D0N6j05J08k37K37j22N2P4j72N6J74j74l8n8K9J69J3l50K52k29J72J02J1
$$ 40 96 -9 99 -138 99 -23 29 103 -69 -13 161 -13 -51 -109 -80 89 102 -248 4 -225 -53 49 60
7043F0j38J02j34K50Q4m2r1j74L4Q0j94J88L9O1j57Nj71J36J3N7L00m15N8J06
$$ 60 -78 24 -110 140 224 182 91 -83 -49 31 -163 25 64 125 -32 -27 -198 -62 -49 8 308 -107 -49 57
7067E7o8R0k39%J13J0j26n7K50J64k39j51N6K01j32J6L8q0P5R5j68J68K6p4j10
$$ 57 -11 79 -160 -160 -47 -37 -163 -220 30 194 -45 -196 -140 61 -71 -55 -17 -97 -22 73 -95 73 99 25 -85
7092h5J33kj22K02k28J16j58J02O0q0J8l8j18K5K89k75L14l21L20k34N1o3m8R5
$$ -85 48 46 -76 126 -102 14 -144 -42 18 -62 -44 -82 -200 -175 114 -161 153 -168 152 -82 -31 -94 -142 -47
7116d7Q6m4M4k02J36K26k92J80j68L4N8J07j50Q6qj22J75j22O7O9J6q5n9J59j31
$$ -47 39 -5 39 -163 -27 199 -93 87 -81 -47 11 118 -32 54 46 -76 99 -23 44 113 129 44 -15 144 13
7141A3M8j94Q5KK9q0p9R1j27J93k2J28j46J04R4j57r0K9J88j73J87l17K18k5m3
$$ 13 61 -133 -48 -46 -17 -97 -176 -85 -212 -19 -41 87 -59 45 139 -18 -108 -79 109 -64 123 -194 24 -1 -44
7166d4J57j47L9j16J96J1j08J91k07nJ29k6o8Lj32M9P3m1J04j70J03p2o3L68j58
$$ -44 113 -34 5 -111 85 96 -12 179 -28 -33 96 70 2 5 -127 -78 -5 -46 58 -112 -9 -81 -144 224 66
7191F6n3Q9j88l6N1pJ36j07O0k12Q1M3q6Q3Po9J62O4l30J78K44K8k51J87k30L10
$$ 66 13 102 -86 -122 -71 -78 58 -49 11 -201 -120 -77 -163 -80 -73 -142 20 84 -246 -68 176 204 -47 140 -90 220
7217B20r4j55j32MK0N2k00L74L4J91j89j81O0J05j45K8p8K0M9j62L22k18J22j60
$$ 220 126 -29 -161 -157 -137 -85 -285 89 123 314 125 -56 4 109 -36 -8 -86 -66 -17 -179 143 -75 47 -113
7241a13L22k34L09k79J42q7j99R7L5jM6rk7j00K31k8k34P5J36k5j17R7O5j73L6
$$ -113 209 -25 284 5 147 60 -139 -42 -7 -8 38 29 2 -98 133 105 -129 -54 82 57 -60 37 102 -71 -35
7266c5J57l65M01j36LK5p5L0j07J77j65K13j51K87k41J9k1k11J02KK79k49J93
$$ -35 122 -243 158 22 25 50 -25 5 -102 75 -90 123 -28 259 18 37 16 -195 -93 -91 188 -61 132
7289A32k38L5J51l07K03J26j91K85k62J80o4no6J01O6j77J9J11j27K35l72qL90
$$ 132 -106 -71 80 -227 -24 102 -89 196 -66 114 50 45 -21 80 146 -31 -12 99 -28 207 -165 -173 217
7312B17k61Q1N3j75J98N8r8l33K56J3m3J03j23M2Q0j40N2J9J07j90P6J43k21j1
$$ 217 -44 37 90 -85 113 171 73 -260 -4 9 -34 69 -54 -12 68 -72 -20 -1 106 -84 -8 135 -86 -97
7336i7R7q7J26o5k1K21m12L21j56K5J3J72K0k96K42m8J00J45m19L8k23K06M2K29
$$ -97 0 -87 39 -26 -47 174 -238 83 -73 -48 -35 137 157 -139 103 55 155 300 -119 -81 -304 -98 -56 173
7360A73k75k6J54l72K96J8r0K39j27j63R9n5M7N6J11j13PO9j06J35P2k6n9j36
$$ 173 -102 -128 26 -346 -50 -32 -122 117 -10 -173 -74 -129 -82 -26 85 -28 -21 48 -58 77 149 123 64 -72
7384g2J26q4j28M4J30l9J03j53Q1R0N1j54j62L87l30K09j08q4K09n1j92j06K49
$$ -72 54 -30 -158 -114 16 -23 80 -73 8 98 149 -5 -167 220 -110 99 -9 -93 116 65 -127 -233 16
7407A6J22J08m24K58j17qK04j65j19M4m4K5K52k7k46K25j07J51O5k55J8J63k35
$$ 16 138 246 -178 80 -37 -45 159 -6 -125 -81 -125 -100 152 125 -121 104 -3 148 213 -42 -24 139 -96
7430i6k05L90k73L27k36J00j8l8Q2o3R0k65K95k48K36k85K17r0j0K00o8J62j59
$$ -96 -301 89 -184 143 -93 7 -11 -49 33 -30 60 -205 90 -158 78 -207 10 -80 -90 110 42 204 45
7453D5j30R9j14K28m2R7k55R9k07K83k73J7N7j82J43J56m0j17K05kJ14k02ok04
$$ 45 -85 14 -100 128 86 183 -72 27 -180 103 -170 -153 -96 -278 -135 21 -19 -136 69 67 181 -21 -27 -231
7477b31L65k73o0Q3O8m25N52j36J16p6J91r0k07N07m48J42r3j29J39J32n3k38
$$ -231 134 -139 -199 -116 -48 -473 79 -57 59 -17 174 84 -123 384 -64 78 -15 -144 -5 127 74 -164
7499a64J42p7P6q9J66k9k23OJ14M10l87j13J52ml6m4K7K46Oj18L9o5K05m73K44
$$ -164 -22 -99 -23 -112 54 25 -198 -192 -78 332 -55 -168 -16 -20 -56 -100 -73 173 179 61 100 35 240 -233 11
7524A1L8J9j3l3k3j31K5j57J70K6J60j69JJ71j86q4L18k54J19j51J83Q5l95L32
$$ 11 49 68 55 22 -1 -132 -107 -264 -94 -68 92 -77 -76 95 -91 -175 143 -111 8 -143 40 125 -270 62
7548F2j74J86p8O7k30K76o2j55J26j80J05Q9J8j23j8L2P7O5j41P1l3M2j28kJ64
$$ 62 -112 74 -4 63 -167 109 47 -108 18 -162 -57 32 50 -73 -91 -59 18 83 -58 13 -20 22 -106 -108 56
7573E6o7q4J49j75J2J17l9Jj01J01O5K3K36j83O4l8J22l01O0J12j90n8K04l28
$$ 56 -11 -95 54 -121 -109 8 -31 -30 -131 -30 35 58 294 111 175 137 259 -42 18 130 -60 -118 86 -242
7597b42K37m9P3p4j78L22o8J43k82K63j27J12p2k51J74j17J65r8j64K12J03q0
$$ -242 -5 -54 19 -55 -233 89 21 164 -118 145 18 130 58 -193 -19 -136 29 -69 -233 -21 82 2
7619Bm1p8K83L1k47L25k98Q0k5J92k72L6j13k8J99j06J39k03K03j33K63j70Kq0
$$ 2 -39 -117 166 197 -50 275 -23 57 32 224 -48 -12 -125 -153 46 -60 79 -124 79 -54 209 39 41 -39
7643c9j05j59O6M63l18J27K7k07J84j46J94k5r6O1n5o9j58M72k44K23k60j3J63
$$ -39 -144 -303 -237 226 -92 35 62 -145 39 -107 87 62 -34 27 -28 -97 -255 217 -27 196 -64 -77 86
7666H6O9J48k31l6K2j19K31j78k2l1J62j32K8J81Mj27K8o6J36k26l3J04m6k24
$$ 86 155 303 72 36 58 -61 170 -8 -30 -61 101 -31 -3 178 182 55 83 17 153 -73 -106 -2 -48 -272
7690b72L74q5k65K41j61K01j22Q8K27j87J14j21Q8J1j93J38n2j75P0r9lL07j42
$$ -272 102 17 -248 -7 -168 33 -89 -1 226 39 153 32 120 131 -62 76 24 -151 -81 -180 -183 124 -18
7713a8j07j24J84J37k94K45m2K6J14j6j18O5o9R6Pj5k41J54k7L5J23k18K19k83
$$ -18 -125 -249 -65 72 -222 23 -19 7 121 105 -13 52 -17 79 86 71 -170 -16 -43 -8 115 -103 116 -167
7737a67J18M2J20j63j0K67m1j73J58j21K02o9j88Q5j43mK25k20J38P6j3j37K85
$$ -167 -49 -7 113 -50 -60 207 166 -7 151 30 232 163 -25 60 -83 -87 138 -82 56 132 119 -18 267
7760B67j56j35P8o1O6r5N0j62Q7rJ70K13m67O1j24P2J22J40j18r5Q5J20j71J06
$$ 267 111 -24 54 -7 59 -36 14 -148 -61 -70 100 313 -154 -93 -217 -145 -23 117 -1 -96 -11 109 -62 44
7784D4p3j52L97j91L9j20K8O2j38L08l53k5m6K44j59J04k2J27M2j49m2J54j01
$$ 44 -29 -181 216 25 64 -56 -28 34 -104 204 -149 -174 -220 24 -135 -31 -53 74 116 -33 -75 79 -22
7807b2n1J52k53K38n4l7R7r5Q8Q0q6q4j14O8K06j20j30K53j68J46k10P1n5J31
$$ -22 -73 79 -174 64 10 -27 70 -25 63 143 57 -27 -141 -73 133 13 -117 136 -32 114 -96 -25 -80 51
7831E1j06J03r1p6J54j33K9K4nj58K82L6k22J17p3m5R7k29K72L8j11J15k55K37
$$ 51 -55 48 -43 -119 35 -98 -69 -45 -50 -208 74 110 -112 5 -68 -113 -16 -245 27 65 -46 69 -186 51
7855E1j49M2O9j25J89m9P1j89K8Lj33J39O3M5n8p6k6RN3j82J74P5J37k87J11j62
$$ 51 -98 -56 13 -112 77 28 99 -90 -62 -59 -192 -53 10 55 -3 -79 -105 -96 -43 -225 -51 24 161 -126 -15 -177
7881a77L98l97K03N7J22lj40p4KK5k32L06k31L45n20K76K22m42J80l5J1m6J64
$$ -177 221 -176 27 84 206 203 63 -11 -9 16 -216 90 -141 204 -316 -40 182 -260 -80 -115 -104 -150 14
7904A4j33K0K05o2p1q4R7LJ35n5R2k40J01k6J87k46L8qr5K13k52J77O8l4L1l04
$$ 14 -119 -99 106 44 -27 -111 -14 -11 124 69 161 -79 22 -4 183 -63 -25 -33 -128 85 -167 10 78 44 75 -229
7930b29M01k40Q2kj31N4J64k00k9K15p1J00j31j08Q2j6q3R4%J72m4q1j58Q1K43
$$ -229 172 -68 14 12 -119 -65 99 -101 -130 85 14 114 -17 -125 -43 -59 -142 -48 -48 124 80 -1 -159 -78 165
7955A65k02J70o1p0k8L3P6j28l1J39k06K60l47K41J22q9j36J30N4k5r9O7J9M1
$$ 165 -37 133 72 2 -26 7 83 -45 -76 63 -143 117 -230 11 133 44 -92 38 92 67 -32 35 54 95
7979I5J9n1Oj33P9K7L2j33N3Q3k34J21o2q0J69J39r7q2k8MQ7Rl4pj86L20j63k6
$$ 95 114 63 69 -64 15 42 74 -59 -6 77 -157 -36 -98 -178 -9 130 33 -49 -77 -73 14 23 -11 -18 -204 116 -47 -73
8007g3J03j54L06l62N1J50p1M5n0OrJ67j88Q5L8j1LJ87m22J69l7j44L71j13J49
$$ -73 30 -124 182 -180 -129 21 -50 -5 -55 -49 -58 109 -79 6 44 33 36 223 -199 -30 -67 -211 160 47 196
8032A96j98m6L12k66J35k91J62O6j0k99J84p1J5K16k64K47K4j7l7k02L50j55l0
$$ 196 -2 -48 264 -2 133 -158 4 70 60 -239 -55 -126 -111 105 -159 88 112 95 58 -144 206 51 21
8055B1j19K30l6p9O1k12J73N7k60J66l2l1L48j58l01L42j52p5J09j53K22n4O6
$$ 21 -98 132 96 17 78 -134 39 96 -164 2 -30 -61 287 129 -172 170 18 -57 52 -101 121 67 133
8078A33j72K88m08J50j24R1J05k36J18J97j55Q8n5k19L88k11PJ12l12J18J87j73
$$ 133 -39 249 -159 -9 -133 -42 63 -173 -55 142 -13 75 20 -199 189 -22 -15 97 -215 -97 90 -83
8100h3K75k66L8J13J88k04j10K1J32n9O6l1o1o8J38o3nO1O8lj60J69m2p5j73L7
$$ -83 192 -74 -36 77 265 61 -49 -28 104 45 111 80 19 -49 89 26 21 82 150 147 -13 156 114 39 -134 -97
8126i7J2J9N3K08j79J22J14m07J73j98J00j2J91q3j3N2L3J9O9k38M0o4P1K95m06
$$ -97 -85 -66 -13 195 16 138 252 -155 18 -180 -80 -92 99 16 3 55 88 107 176 -62 -22 -86 -15 280 -126
8151a26L72k13P7j19P1Kk04J46j01M1J60J61j95Q7k13j8n6L97j78j03O7j12K2
$$ -126 246 33 110 -9 62 64 -140 6 -95 -54 106 267 72 159 -54 -72 -128 269 91 -12 55 -57 -35
8174c5K86p3q5J8n9L3m4j30J14J66k56m2J61J59l93J08J90
$$ -35 251 178 93 111 52 85 41 -89 25 191 -65 -107 54 213 -180 -72 118
8191A18
$$ Imaginary data points
##PAGE= N=2
##DATA TABLE= (X++(I..I)), XYDATA
0@%%%%%%%%%%%jRj6J6j6K4l2L3m1N3o1P2q8J04j20J37j61J87k13K44k81L20l62
$$ 0 0 0 0 0 0 0 0 0 0 0 0 -1 8 -8 8 -8 16 -16 17 -24 29 -32 40 -48 56 -64 73 -88 99 -114 130 -151 169 -193
34a93M11m64N22n86O55p31Q15r07J007j116J236j366J508j662J832k020K225k452
$$ -193 218 -246 276 -310 345 -386 429 -478 529 -587 649 -717 791 -871 961 -1059 1166 -1286
52a286K701k978L289l636M031m481M998n606O329p203Q289r680J1534j4145J8125
$$ -1286 1415 -1563 1726 -1910 2121 -2360 2638 -2968 3361 -3842 4447 -5233 6301 -7844 10281
67A0281k5019M0373j40649L946Q0270j07822J05609K9022N5853N2222k9587J6955
$$ 10281 -14738 25635 -115014 -111068 -30798 -138620 -33011 -3989 51864 104086 74499 91454
79I1454P823o6552J5609q9127l8039R5265p9654o3436J19758l582K837M4267k9428
$$ 91454 99277 32725 48334 -40793 -78832 16433 -63221 -126657 -6899 -10481 -7644 36623 7195
92G195M5847J3802o7737L5232k0186k9987L6483p8079J323J02919o9390k2303
$$ 7195 53042 66844 -893 34339 14153 -15834 20649 -57430 -56107 46812 -22578 -44881
104d4881O7539j6137K1678j3362m8546O3458j4853m4160L9665l8937J9641O1380
$$ -44881 22658 6521 28199 14837 -33709 29749 14896 -29264 10401 -28536 -8895 52485
116E2485q4083R281O6226n8076M335P751l0601N1807k4578l1725O2812j8752M780
$$ 52485 -31598 -22317 43909 -14167 -9832 -2081 -32682 19125 -5453 -37178 25634 6882 11662
129A1662L3003o2215L2264L1112q1898K7628J8463n3181L4794j0512j1469O2275
$$ 11662 44665 -17550 14714 45826 -36072 -8444 10019 -43162 -8368 -18880 -30349 31926
141C1926l3316r432M2359l4450K6683J0810o3224M4892N124n4556M4158j3175
$$ 31926 -1390 -10822 31537 -2913 23770 34580 -28644 16248 21372 -33184 10974 -2201
153b201k3462M7827l8724n318M6780l8083J1238J2776m0263M3486m989l9992N2247
$$ -2201 -25663 22164 -16560 -21878 24902 -13181 -1943 10833 -29430 14056 9067 -30925 21322
166B1322k1776k4694N1943l3768l853M0819m1266J4563J6921m0147L4565o878
$$ 21322 -454 -25148 26795 -6973 -10826 29993 -11273 3290 20211 -19936 14629 7751
178G751l3986M5397k5360j5744N0139m1631n85M3151m4825J2360K0528l4434L1716
$$ 7751 -26235 19162 -6198 -21942 28197 -13434 -14019 29132 -15693 -3333 17195 -17239 14477
191A4477q983l0416M3289k1988j0737L8995m4266J1753M1409n3718J4347K7322
$$ 14477 5494 -24922 18367 -3621 -14358 24637 -19629 -7876 33533 -20185 -5838 21484
203B1484l5643K1953q247k0371M1691k6981j3803L6019l2511J5735K6114n0275
$$ 21484 -14159 7794 -453 -20824 20867 -6114 -19917 16102 -16409 -674 25440 -24835
215b4835L1455K4662m7412K3019L474k0158K7196l1165n777L9043l5361L700J9558
$$ -24835 6620 31282 -16130 6889 10363 -9795 17401 -13764 -19541 19502 -15859 -12159 7399
228G399l3151L7697O450m9598M2125J0675l0358K1025j8588L874L0026m3897P898
$$ 7399 -25752 11945 18395 -31203 10922 21597 -8761 12264 -6324 -2450 27576 -16321 -8423
241h423K6791l2324K2515l351l2971M8616p987l7659L4896r136n974J8214l5380
$$ -8423 18368 -13956 8559 5208 -27763 20853 12866 -24793 10103 967 -5007 13207 -22173
254b2173J9061K2792m0444K0841Q266k2345L4883k0654k1205M8653k0760k0293
$$ -22173 -3112 19680 -20764 77 8343 -14002 20881 227 -20978 27675 6915 -13378
266a3378K3656k0658J4001N848m0518L0274J0727k9121K4813j1790m864M0473
$$ -13378 10278 -10380 3621 9469 -31049 -775 9952 -19169 5644 -6146 -11010 29463
278B9463l2930r376L7369k2872K101O154k7645L0227k525l4076L0406m584j0464
$$ 29463 -3467 -12843 24526 1654 3755 9909 -17736 12491 9966 -24110 6296 1712 -8752
291h752K4610k9612O548L3124l7433M352J8796k3995J9481o615k2632L6500j2339
$$ -8752 15858 -13754 -7206 25918 -11515 -7163 11633 -12362 7119 504 -22128 14372 2033
304B033j7821K7988j7415P230J8397l7920J7385J9909l3894J4834j078j6982K9939
$$ 2033 -15788 12200 -5215 2015 20412 -17508 -123 19786 -14108 726 -352 -17334 12605
317A2605j8710j3499L3202j7900N09J7739k5137K1913R261l4989K3586L382k1733
$$ 12605 -6105 -19604 13598 -4302 -3793 13946 -11191 10722 19983 -15006 8580 11962 -9771
330i771K1951j7077q093K8542k4604k47K0105k3315J5084N939k5741K7347k783
$$ -9771 12180 -4897 -12990 15552 -9052 -9299 10806 -12509 2575 8514 -17227 10120 7337
343G337k3519K5660j0950o893K2976k4572M704K0600k5357J3202O472k3705K3749
$$ 7337 -16182 9478 -1472 -8365 14611 -9961 -5257 15343 -10014 3188 9660 -14045 9704
356I704n974j9821K7263j4757q901K3277k1688O731J7806k5674J5768P423k2132
$$ 9704 3730 -16091 11172 -3585 -12486 10791 -10897 -4166 13640 -12034 3734 11157 -10975
369a0975K3719n974j7994K5204j4857o181K1123k3670O299J5295k6175J5493N343
$$ -10975 12744 6770 -11224 13980 -877 -7058 14065 -9605 -3306 11989 -14186 1307 6650
382F650k1374K2517p459j5281K6877j4104o631J9779j8871R907J1595k6253J7437
$$ 6650 -14724 7793 334 -14947 11930 -2174 -8805 10974 -7897 2010 13605 -12648 4789
395D789N620k1804J9354q442j2469K5151j7554o632K1487j6082N982P954k0195
$$ 4789 10409 -11395 7959 -483 -12952 12199 -5355 -11987 9500 -6582 -600 7354 -12841
408a2841K1852J678k3456K0856m080j0906J9859j9512j435K3117k0926J926J0820
$$ -12841 9011 10689 -12767 8089 4009 -6897 12962 -6550 -7985 15132 -5794 -3868 6952
421F952j5151J6571m994j9768K6582p019j5034J8998j4363L176J7673k5626P758
$$ 6952 -8199 8372 3378 -16390 10192 3173 -11861 7137 -7226 -4050 13623 -12003 -4245
434d245J6756j7967R734k972j0650K4134j5052j3517K4072j2720k330J2299j9922
$$ -4245 12511 -5456 4278 1306 -9344 14790 -262 -13779 10293 -2427 -4757 7542 -12380
447a2380J4601J0441k6012J3267N902j0703J4404j5360l572K5627j8665m380J5391
$$ -12380 2221 12662 -13350 -83 5819 -4884 9520 -5840 -9412 16215 -2450 -6830 8561
460H561j4846J1301J978k2528K1587L351k0166J2560n033O52J5930k2971K109
$$ 8561 -6285 5016 6994 -15534 6053 9404 -10762 1798 -3235 -2583 13347 -9624 -7515
473g515J9175j7381N987K916j4888K1451n779j9062K3769l294r353J1230j4094
$$ -7515 11660 -5721 266 3182 -11706 9745 3966 -15096 8673 5379 -3974 7256 -6838
486f838Q498J1826k3815P917P432j3904J5137q973j0867K7394j1901j3151J8942
$$ -6838 1660 13486 -10329 -2412 5020 -8884 6253 -2720 -13587 13807 1906 -11245 7697
499G697q257J389M756j8435J4874N347j8032J3546m305m353K1687j7365p083K4002
$$ 7697 -560 829 5585 -12850 2024 7371 -10661 2885 -1420 -5773 15914 -1451 -8534 15468
513A5468j3995m705Q322j3404R424n77j4562J7763l120o876J6978j4531J952K1226
$$ 15468 1473 -3232 5090 -8314 1110 533 -14029 3734 614 -6262 10716 -3815 -1863 19363
527A9363k2899k493J4878j5019L626J373q841J5374p425n966J8470j1829J427
$$ 19363 -3536 -6029 8849 -6170 -2544 -1171 -10012 5362 -2063 -8029 10441 -1388 39
540C9J3147k3803O171J6450k0887M548O505r164J2903n139l822J5181j3577J442
$$ 39 13186 -10617 -4446 12004 -8883 -4335 2170 -6994 5909 770 -3052 12129 -1448 -6
554fJ1522k0932R222R457k3187J0697P328j3272J1900j904m449J1624j1260L672
$$ -6 11516 -9416 -194 9263 -13924 -3227 4101 -9171 2729 825 -3624 8000 -3260 412
568D12R717j8689J0051O856k0396J4339M206j5931J4219j784p187J1091r694J111
$$ 412 10129 -8560 1491 8347 -12049 2290 6496 -9435 4784 3000 -4187 6904 -2790 -1679
582a679P422j5287R745L142j7702J8199J972j5231J5843l011p216J3083j0592
$$ -1679 5743 -9544 201 3343 -14359 3840 5812 -9419 6424 3413 -3803 9280 -1312
595a312j081Q090j2549P846R81j2864J8040k312j5083J7737l790p211J1834j2723
$$ -1312 -2393 5697 -6852 994 1975 -10889 7151 4839 -10244 7493 3703 -3508 8326 -4397
609d397N45J0774j3439N862L850j0029J3775n815j0586J9529q053r120J3108j0579
$$ -4397 -3852 6922 -6517 -655 3195 -6834 6941 1126 -9460 10069 2016 -7104 6004 -4575
623d575K682Q726j5627P850O258j1556R630l687m992J5846j3024n502J6289r722
$$ -4575 -1893 6833 -8794 -944 5314 -6242 3388 -299 -5291 10555 -2469 -7971 8318 -1404
637a404K61O598j3053J1106L895j5477J0886L59o675R345j0994J25J4708j4716
$$ -1404 -1143 5455 -7598 3508 7403 -8074 2812 3171 -3504 5841 -5153 -5028 9680 -5036
651e036L5R448j0488R448L33j3290J5468r50j1694J0380m961J022P804j5488N954
$$ -5036 -5001 4447 -6041 3407 3740 -9550 5918 4968 -6726 3654 -1307 -285 7519 -7969 -2015
666b015J0415j3946P073L79r668J5160o189j1272J5358m538l926O507r706Q397
$$ -2015 8400 -5546 1527 1906 -7762 7398 1209 -10063 5295 757 -3169 3338 -6368 2029
680B029N312j5093R865K287j0167J2247p177o937J6774r745o101J1196o339L191
$$ 2029 7341 -7752 2113 4400 -5767 6480 -697 -7634 9140 -605 -6706 4490 -1849 1342
694A342J310j0843J3053o72j1881J2343m739n025J3232j1863k538J4666j0329
$$ 1342 2652 -8191 4862 4190 -7691 4652 -87 -5112 8120 -3743 -6281 8385 -1944
707a944l34M499o629J0193m098r446J3928n450n758J1615j0920K69J2534j3702
$$ -1944 -2278 2221 -4408 5785 1687 -7759 6169 719 -5039 6576 -4344 -4075 8459 -5243
721e243K208Q080q744O159k358n263J2388q498l980J2987j0702N27R760j3691
$$ -5243 -3035 5045 -3699 2460 102 -5161 7227 -1271 -5251 7736 -2966 -2439 7321 -6370
735f370N177P239j1893O434Q53n460R282q117j119J2086j1724J200R164j2593
$$ -6370 -1193 6046 -5847 587 1440 -4020 5262 -2855 -3974 8112 -3612 -2412 6752 -5841
749e841O786M939j3041R061J436p566Q540n645j659R108j0806K997P336j2538
$$ -5841 945 5884 -7157 1904 3340 -4226 4314 -1331 -2990 6118 -4688 -1691 5645 -6893
763f893P944L648j2206J0279P9q433R853n087k523R044q793K886N868j1029P869
$$ -6893 1051 4699 -7507 2772 2851 -5582 4271 -816 -3339 5705 -3088 -202 5666 -5363 2506
778B506K167j1421J0688k079q269J0971n749l026R117r042K518O453r877P005
$$ 2506 4673 -6748 3940 1861 -6408 4563 -1186 -4212 4905 -4137 -1619 4834 -5043 1962
792A962J20q675J2069l912q001J2410n882l358R052r236L006N798j0704N983J828
$$ 1962 2082 -6593 5476 1564 -6437 5973 91 -3267 5785 -3451 -445 5353 -5351 632 2460
807B460p060R386n849n069J3152p913l358R324q546L126M901j0760P410K263q227
$$ 2460 -4600 4786 -1063 -6132 7020 -893 -4251 5073 -3473 -347 4554 -6206 1204 3467 -4760
822d760P612l520k495J0136j0239q10J0543r580J630M844q978Q076L62r085R387
$$ -4760 2852 -668 -3163 6973 -3266 -4076 6467 -3113 -1483 3361 -5617 2459 2821 -6264 3123
837C123j601l657P321q383K457Q832j2681K793O339r132O258j160p337J1158l739
$$ 3123 1522 -2135 5186 -3197 -740 8092 -4589 -1796 4543 -4589 1669 509 -6828 4330 591
852E91n500Q777n907K181N181j1696O659N644j1503O273Q97n836R301n310m025
$$ 591 -4909 3868 -2039 142 5323 -6373 286 5930 -5573 700 1597 -4239 5062 -248 -4273
867d273J0812o566j082N218q356O423J853j1865Q873J070p459P887m463j572R944
$$ -4273 6539 -27 -1109 4109 -4247 2176 4029 -7836 1037 2107 -5352 2535 -1928 -3500 6444
882F444q679m58Q082p486L744N34q015R805j537q721R359l311k295P296q598K421
$$ 6444 -2235 -2693 5389 -2097 1647 2181 -5834 3971 2434 -6287 3072 -239 -2534 4762 -3836 -1415
898a415P650r906L367L147o822P824l646n952J0676m739m031P640o727K701N371
$$ -1415 6235 -3671 -304 2843 -3979 3845 199 -5753 4923 184 -3847 3793 -2934 -233 5138
913E138j0599N665L703q233O452k269l906R536p122k631R367p379J721M433q743
$$ 5138 -5461 204 3907 -4326 2126 -143 -4049 5487 -1635 -4266 5101 -2278 -557 3876 -4867
928d867O849J574q545Q005j579m476P800o635l68Q123r061J346N241p831N437
$$ -4867 1982 3556 -4989 3016 1437 -3039 4761 -1874 -2242 5881 -3180 -1834 3407 -4424 1013
943A013M85p179Q370j944m948Q318n233k97P120q950L348M611q715N139J091o960
$$ 1013 1498 -5681 2689 745 -4203 4115 -1118 -1415 5705 -3245 103 4714 -4001 1138 2229 -4731
959d731P827l061m193Q398n845n78O825q429L563M002q374N650R18o627P524k729
$$ -4731 3096 35 -4158 4240 -1605 -2183 4642 -3787 -224 3778 -4596 1054 1972 -4655 2869 140
975A40l582P875o256L49O537q658L880L816r104O403K70o327P900l412l607P598
$$ 140 -3442 4433 -1823 -1474 5063 -3595 285 4101 -5003 1400 1670 -4657 3243 -169 -3776 3822
991C822n545P91N278q215M974L118r111O738N50o337O955l781k414P323n835J98
$$ 3822 -1723 -932 4346 -3869 1105 4223 -4888 1850 2400 -3937 3018 -763 -3177 4146 -1689 -1491
1007a491M867o992N122J131p874P793j20p660P887k773k498O524o208Q32N513
$$ -1491 3376 -3616 1506 2637 -5237 2556 2436 -5224 2663 -110 -2608 3916 -2292 -1460 4053
1022D053o625L911J100o414Q126k773o804R220l378m184O201n229J810M417p195
$$ 4053 -2572 1339 2439 -3975 4151 1378 -5426 3794 416 -3768 2433 -2796 -986 3431 -3764
1037c764M313K094n609O628l159m473R653n854m151Q035n152M81L503o606N234
$$ -3764 549 2643 -2966 3662 503 -3970 5683 -171 -4322 3713 -1439 -958 2545 -4061 1173
1052A173J440o579O180k241k790P522o581j691Q779o845l95M509n126M494p5n930
$$ 1173 2613 -3966 2214 -27 -2817 4705 -1876 -3567 5212 -1633 -2028 2481 -2645 1849 1774 -4156
1068d156O983j866l818O485n727M62O714q427J038N889o283L062K75m548P019
$$ -4156 2827 961 -2857 3628 -2099 -1637 5077 -3350 -2312 3577 -2706 356 631 -3917 3102
1083C102k785l732P170m693R7N056p406L334M631q279L515J650m647N653l453
$$ 3102 317 -3415 3755 -938 -841 4215 -3191 143 4774 -3505 10 1660 -2987 2666 -787
1098g87k932P665n187p02N271o090L706K490p863N923J042n794N374k773j937
$$ -787 -3719 3946 -1241 -1943 3328 -2762 944 3434 -4429 1494 2536 -3258 2116 -657 -2594
1113b594O455n727m4N624o071K482K105o240N965l67o007O702k305k596O020n383
$$ -2594 3861 -1866 -1910 3714 -2357 125 2230 -4010 1955 1588 -4419 2283 -22 -2618 3402 -1981
1129a981O67N444o704K322K971n133M643j287m423O848l504k717O225n282O46
$$ -1981 -1314 4130 -2574 -252 2719 -2414 2229 942 -3481 3367 -137 -2854 3371 -1911 -1265
1144a265M536o542L186K807n847M917r70l493O371m406j592O124n819P07M762
$$ -1265 3271 -3271 -85 2722 -3125 1792 822 -2671 3700 -706 -2298 3826 -1993 -1286 3476
1159C476o474K806K730o031M744l30l716N378l832j058N814o014J863M355p094
$$ 3476 -2998 -192 2538 -3493 1251 921 -2795 2583 -1249 -2307 3507 -2507 -644 3711 -3383
1174c383L917K622o343M628M5l935N093l579l70M723n858J947L441o774M179J877
$$ -3383 534 3156 -3187 1441 1486 -2449 2644 -935 -1305 3418 -2440 -493 2948 -3826 353 2230
1190B230o415N564k82l915N177k636p62M327n174J863L036o181M788L42n983O281
$$ 2230 -4185 1379 1097 -2818 2359 -277 -1039 3288 -1886 -23 3013 -3168 1620 1962 -4021 2260
1206B260q21m800N244k277j133L871m985K603K403n631M834k0m973O308k092m275
$$ 2260 1439 -3361 1883 -394 -1527 2344 -2641 -38 2365 -3266 1568 1548 -3425 2883 791 -3484
1222c484O357l105j771M315l972K117J950n160M407m26m450N735l109k770O774
$$ -3484 2873 -232 -2003 2312 -1660 457 2407 -2753 1654 1228 -3222 2513 -596 -3366 3408
1237C408m440j550N746m080J150J666m087L999m38m322N060k507k022N611n061
$$ 3408 -1032 -2582 3164 -916 234 1900 -2187 1812 1374 -2948 2112 -395 -2417 3194 -1867
1252a867p0N556n540Q15K869l771L339n37l439N128k184k166M856m547O78M489
$$ -1867 -1937 3619 -1921 -1106 1763 -2008 1331 794 -2645 2483 299 -1867 2989 -1558 -880 3609
1268C609o323J955L586m972K919k23l007M834k891j990N099m191O39L215n323
$$ 3609 -2714 -759 2827 -2145 774 551 -2456 2378 -513 -2503 2596 -1595 -956 2259 -3064
1283c064L598K284n737L725P50l528M276k714j230M690m344N08L303m672L149
$$ -3064 534 2818 -2919 806 1556 -1972 2304 -410 -1640 3050 -1294 -786 2517 -2155 994
1298I94J111n646N071n40m133M403j847j315M261m056R23L247m311K486J005m311
$$ 994 2105 -3541 1530 990 -3143 1260 -587 -1902 2359 -1697 -774 2473 -1838 648 1653 -2658
1314b658M626j171m066N485k234j702L929l484Q74K766m300K619Q67l498L854
$$ -2658 1968 797 -3269 2216 -18 -1720 2209 -1275 -401 2365 -1935 684 1551 -1947 1907
1329A907j672k634N089l268j670M612l948J033K439m175K871Q60l832L958j434
$$ 1907 235 -2399 2690 -578 -2248 2364 -1584 -551 1888 -2287 584 1444 -2388 1570 136
1344A36k594M456l445p28M797m257Q49K772l896L029P41l722L844j634j894M227
$$ 136 -2458 1998 -1447 -2175 2622 -1635 -786 1986 -1910 1119 1860 -1862 1982 348 -1546 2681
1360B681l688j95L946m691J120K822m352K666J112l924M119j690j734L851l221
$$ 2681 -1007 -1202 2744 -1947 -827 1995 -2357 309 1421 -2503 1616 -74 -1808 2043 -1178
1375a178j8L712m275J713K330m496L190M35l518L386j116j939L810l256N7L170
$$ -1178 -1196 2516 -1759 -46 2284 -2212 978 1413 -2105 1281 165 -1774 2036 -1220 -1163 2007
1391B007m133K144J735m234L551l1l365M109j409k122L707k849K19K457l814K257
$$ 2007 -2126 18 1753 -2481 1070 1039 -2326 1783 374 -1748 1959 -890 -671 1786 -2028 229
1407B29J558m182L516R4l140L870j960j934L979k966mK755l490K032J382l972
$$ 229 1787 -2395 1121 1215 -1925 1945 -15 -1949 2030 -936 -940 1815 -1675 357 1739 -2233
1423b233L463k46k885L810j902j699L893l577J07L045l772J922Q68l214L781o74
$$ -2233 1230 984 -1901 1909 7 -1692 2201 -1376 -1269 1776 -1996 -74 794 -2420 1361 687
1439F87k535L828j946q95L284l289L77K690l508J428J093k890K942j075k353M068
$$ 687 -1848 1980 34 -861 2423 -866 -489 2201 -1307 121 1214 -1676 1266 191 -2162 1906
1455A906k107j502L552k932O38K388l971K111J229l411L108q40j975L843k615
$$ 1906 -201 -1703 1849 -1083 -445 1943 -2028 83 1312 -2099 1009 169 -1806 2037 -578
1470e78r96L767l055P20J879l614K301P59l386L246p60j811L259k785k37L665
$$ -578 -1574 2193 -862 -142 1737 -1877 424 1183 -2203 1043 283 -1528 1731 -1054 -1291 2374
1486B374l432N96K244l282K330N9k778L294q66k544L486k350l39K923l466J265
$$ 2374 -1058 -462 1782 -1500 830 889 -1889 1405 539 -2005 1481 -869 -1208 1715 -1751 -486
1502d86K342l306J906M52k608L086j507j463L491k532m05K974l390J427J899l471
$$ -486 1856 -1450 456 908 -1700 1386 -121 -1584 1907 -625 -1030 1944 -1446 -19 1880 -1591
1518a591K132L78k571K802j423j203L157k505j86L012l329J364J465l370K684
$$ -1591 541 919 -1652 1150 -273 -1476 1681 -824 -1010 2002 -1327 37 1502 -1868 816
1533H16L63k658K842j168j507K927k859O19K305l346J590J437l263K416J56k507
$$ 816 1179 -1479 1363 195 -1312 1615 -1244 -625 1680 -1666 -76 1361 -1902 514 670 -1837
1549a837K980j021j382K833k479N51K076l360J765J503l275K422m0k285K888j461
$$ -1837 1143 122 -1260 1573 -906 -355 1721 -1639 126 1629 -1646 776 736 -1549 1339 -122
1565a22j277K867k437L29K056k736J462R67l008K838j27k387L078j594j156K948
$$ -122 -1399 1468 -969 -640 1416 -1320 142 1109 -1899 939 812 -1575 1503 -91 -1247 1701
1581A701k561L42J885l037K047Q23k777K529o63k090L152j769p24K340k065N34
$$ 1701 -860 -518 1367 -1670 377 1200 -1577 952 289 -1801 1351 -418 -1142 1198 -867 -333
1597c33J582k838K262M73k405K527q73j879L157k399k49K488k618N81J798k578
$$ -333 1249 -1589 673 1146 -1259 1268 395 -1484 1673 -726 -975 1513 -1105 -524 1274 -1304
1613a304J985L27k791K783n40k189K775j761l21K477k699J040J624k786K078J47
$$ -1304 681 1008 -1783 1000 460 -1729 1046 -715 -1036 1441 -1258 -218 1406 -1380 698 845
1629H45k495L081j382j639K882j606o46K149k474J351J184k756K109N1k039K770
$$ 845 -1650 1431 49 -1590 1292 -314 -960 1189 -1285 66 1250 -1506 603 654 -1385 1385
1645A385j419j139K844k167l73K121k297J231J024k653K291k21k244K649j467
$$ 1385 -34 -1173 1671 -496 -869 1252 -1045 186 1210 -1443 848 627 -1617 1032 -435
1660d35j094K996k160k86K510k090N23R80j933K199n69k006K611j454r90K761
$$ -435 -1529 1467 -693 -979 1531 -559 -36 944 -989 1210 641 -1365 1246 -208 -1198 1563
1676A563k389j2K454k500Q01J120k036J709n62j549K708j700p84K764k403L05
$$ 1563 -826 -838 1616 -884 -83 1037 -999 710 148 -1401 1307 -393 -1177 1587 -816 -511
1692e11K419l078J304J354k413J382j59j507K349j963m09K673k680P89K166k874
$$ -511 1908 -1170 134 1488 -925 457 298 -1209 1140 -823 -1232 1441 -1239 -450 1716 -1158
1708a158J294J192k568J950l94j082J772j474j98K042k446J022J438k681J466
$$ -1158 136 1328 -1240 710 316 -766 1006 -468 -666 1376 -1070 -48 1390 -1291 175
1723A75Q86k506J850j94j550K209j366k14J794k144J080J193k459J728M57k473
$$ 175 1061 -1445 405 211 -1339 870 -496 -710 1084 -1060 20 1213 -1246 482 939 -1534
1739a534K457l99j915K373j269m15J728j717Q55P76k191J762J46k083K374p84
$$ -1534 923 524 -1391 982 -287 -702 1026 -691 164 940 -1251 511 657 -1426 948 164
1755A64j491K554j349n72J934j669M43J208k409J753j75j912K305r87r64K466
$$ 164 -1327 1227 -122 -694 1240 -429 14 1222 -1187 566 391 -1521 784 -203 -1167 1299
1771A299j893j27K093k062O52J013k053J690k58j415K191j257q06K269j877R5
$$ 1299 -594 -721 1372 -690 -38 975 -1078 612 354 -1061 1130 -127 -933 1336 -541 -446
1787d46J737k218Q77R49k124J410L12j765J840q74n38K046j970L20J693j929P32
$$ -446 1291 -927 -50 899 -1225 185 497 -1268 572 -302 -840 1206 -764 -444 1249 -680 52
1804E2J051k390J840K57j786J923j136p51J887j882M28J380k330J685Q04k138
$$ 52 1103 -1287 553 810 -976 947 -189 -940 947 -935 -507 873 -1457 228 1032 -1106
1820a106J671l1j623K160j182o98J761j723M80J147k073J801L39k442K158k63
$$ -1106 565 534 -1089 1071 -111 -809 952 -771 -291 856 -1217 584 923 -1519 639 376
1836C76j618K263j183p39K080j754K79J267j906J365L33j712J895q25j294K540
$$ 376 -1242 1021 -162 -901 1179 -575 -296 971 -935 430 763 -949 946 121 -1173 1367
1852A367j607n40J826j885L38J392j796J020M10j528J739q23r08K079j418m59
$$ 1367 -240 -780 1046 -839 -501 891 -905 115 525 -1003 736 -87 -995 1084 -334 -793
1868g93K011j747M88J341k007R84L96j615J576o20q81K097j732P9J567k084Q30
$$ -793 1218 -529 -41 1300 -707 277 673 -942 634 14 -867 1230 -502 -423 1144 -940 -110
1885a10J044j784J219L16j563J542n54j034K020j557P4J546j738M81R29j828J306
$$ -110 934 -850 369 685 -878 664 110 -924 1096 -461 -387 1159 -579 -98 831 -997 309
1902C09K61j410J280m63p69J796j498J56J486k107J150Q81j923J449m4j437J382
$$ 309 570 -840 440 -23 -792 1004 -494 -338 1148 -959 191 1072 -851 598 554 -883 499
1919D99l29r74J597j456M37J132j885J228O01j866J578J04j641J744q36p38J811
$$ 499 170 -804 793 -663 -226 906 -979 249 850 -1016 562 666 -975 769 -67 -805 1006
1936A006j224l6J403j932J130L92j680J499k90j280J862j110n20J751j652K32
$$ 1006 -218 -254 1149 -783 347 739 -941 558 268 -1012 850 -260 -780 971 -681 -449
1952d49J081j623J078O61j387J552l80j404J961j181o07J614j494L41J055j592
$$ -449 632 -991 87 748 -639 913 533 -871 1090 -91 -698 916 -578 -237 818 -774
1968g74Q83M11j471J454k10j050J641j143j62J471j536K33Q66j539J260J32j696
$$ -774 109 520 -951 503 293 -757 884 -259 -421 1050 -486 -253 613 -926 334 466 -1230
1985a230J788p82o32J747j206k10J524j504M70Q45j808J108J96j527J766m79r32
$$ -1230 558 -224 -856 891 -315 -525 999 -505 -35 810 -998 110 306 -1221 545 66 -866
2002h66J758j096m42J783j615K95J157j784J059K62j663J755p48o64J473j074
$$ -866 892 -204 -646 1137 -478 -183 974 -810 249 511 -1152 603 -145 -809 664 -410
2018d10j50J363j461P92O61j384J232j37j282J558n67j043J599j396pJ507j725
$$ -410 -560 803 -658 134 795 -589 643 506 -776 782 215 -828 771 -625 -632 875 -850
2035h50O18O72j159J395m86p35J595r55q88J925j585j4J198j388O29P90j651J265
$$ -850 -232 440 -719 676 190 -545 1050 95 -793 1132 -453 -467 731 -657 -28 762 -889 376
2053C76j37r54J522j043m95J632j401L3J363j705Q34P07j458J147l32p90J446
$$ 376 239 -715 807 -236 -731 901 -500 -467 896 -809 25 732 -726 421 89 -701 745
2070G45q40m49J451j279K89J001j721O85P13j513J383j35j147J515r61k23J289
$$ 745 -95 -544 907 -372 -83 918 -803 -118 595 -918 465 330 -817 698 -263 -486 803
2087H03j184K33R32j710J196K21j310J420m17q49J558j068j45J170j456N41R06
$$ 803 -381 -148 784 -926 270 491 -819 601 184 -665 893 -175 -320 850 -606 -65 841
2104H41j568Q21K55j018J095k74r97J467q53j81J409j533P65P33j832J061L64
$$ 841 -727 94 349 -669 426 152 -845 622 -231 -412 997 -536 229 962 -870 191 555
2121E55j452J192l25r73J705j059O1J173j390P55M50j474J134N8j173J172k81
$$ 555 -897 295 -30 -1003 702 -357 -296 877 -513 242 692 -782 352 410 -763 409 128
2138A28q98J574j141J08J413j886P89O13j357J200l42j021J171n04o39J318q60
$$ 128 -770 804 -337 -229 1184 -702 87 700 -657 543 201 -820 351 -153 -792 526 -334
2155c34K16J131j652Q53L22j361J182R3j409J481m83o62J219n66m41J159j304
$$ -334 -118 1013 -639 214 536 -825 357 450 -959 522 39 -623 596 30 -411 748 -556
2172e56P50K27j300J393m98j152J567l03o45J425j048J15R87j206N17L71j370
$$ -556 194 421 -879 514 16 -1136 431 128 -517 908 -140 -25 962 -244 273 644 -726
2189g26J262n30r65J526p36o39J581j128J79R24j356O88N29j232J179m87q93J657
$$ -726 536 6 -959 567 -169 -808 773 -355 -176 748 -608 80 609 -623 556 69 -824 833
2207H33j132j86J330j176K57J077j367M77J71q93R98l52o76J265q72j55J275j498
$$ 833 -299 -485 845 -331 -74 1003 -364 113 284 -609 389 37 -639 626 -246 -401 874 -624
2225f24N78P52j481J027L33j308J170m81o05J319r92J7J133j444N46N97j201P51
$$ -624 -46 706 -775 252 585 -723 447 -34 -639 680 -312 -295 838 -606 -60 537 -664 87
2243H7K86j225J006m5n83J044p37L1J097j192L21N81j448R36N5j302J400o20j93
$$ 87 373 -852 154 109 -474 570 -167 -136 961 -231 90 671 -777 159 214 -1088 312 -308 -501
2262e01J059j015J58J172j283M76N47j077Q87p4j183J296o64l49J021n26k81R90
$$ -501 558 -457 -299 873 -410 66 613 -464 423 349 -834 462 -202 -551 470 -56 -337 653
2280F53j160Q14J49j303J414k09j176J462p18m01R55q60jJ124j180M84M27p29
$$ 653 -507 307 456 -847 567 358 -818 644 -74 -475 480 -380 -381 743 -437 47 474 -255
2298b55N31l08o44J300p68k51J027j133L89O48r63L63N95j093Q85n5o70Q80o47
$$ -255 276 -32 -676 624 -144 -395 632 -501 -112 536 -427 -64 531 -562 323 268 -402 478 -169
2317a69k37J103q96P0R65j379O21K62j092J019j45n96J072q16j38R51j079K49
$$ -169 -406 697 -199 -129 836 -543 78 340 -752 267 122 -474 598 -218 -356 595 -484 -235
2335b35O60q68N29N04j160R75j80q20J141p02j19Q03j010N97L22q80O06J23r06
$$ -235 425 -443 86 590 -570 405 225 -595 546 -156 -275 528 -482 115 437 -443 163 286 -620
2354f20J249o14n28J071p30k38R05p84L44L46q05Q29l35o59Q83l89o54J169m42
$$ -620 629 15 -513 558 -172 -410 495 -289 55 401 -404 425 90 -569 314 -75 -729 440 -2
2373bl41Q64p02J37M41j016Q27q1o60R98m93m86J084q33kQ60r53N82L80j097P40
$$ -2 -343 521 -181 -44 397 -619 208 127 -533 465 -28 -514 570 -263 -265 595 -358 224 604 -493 247
2394B47j75q44J280m42n89R91p77j10J184j210O05L75q09M92m4p00Q60m65j97
$$ 247 72 -772 508 66 -523 468 -309 -419 765 -445 160 535 -274 218 174 -526 334 -131 -328
2413c28R26r52J08P58r07N37K33r18O89j42m66P38m09j19P58q73L26L71j026O28
$$ -328 598 -354 -246 512 -395 142 375 -543 146 4 -462 276 -133 -252 506 -367 -41 330 -696 -68
2433f8N81j261J100l04l35Q33p09l10J094r53J52P18j057N34K53r13R53L9p69
$$ -68 513 -748 352 48 -287 546 -163 -473 621 -332 -180 538 -519 15 268 -645 308 347 -422
2452d22J176n51o00Q94q17RP30r41O75Q3o11Q77m17n76O86l08l70J060q30L53
$$ -422 754 203 -397 497 -320 -311 419 -522 153 236 -375 502 85 -491 195 -113 -483 577 -253 100
2472A00K00p42P07o4m81O24l05o34J212r16J67Q60j171K51O51j074O50J78o70
$$ 100 300 -442 265 201 -280 344 39 -595 617 -299 -132 728 -443 -192 459 -615 35 213 -457
2491d57P33l53l52Q34o42K13L93m76J74K99o61M28K49r98Q41m62j7O43o38J1P84
$$ -457 276 -77 -429 405 -237 -24 369 -107 67 366 -295 133 382 -616 225 -237 -254 389 -249 -238 546
2512E46q79K96L88p92O44Lp06P82l24k24P24n96k15Q62j040P23K45r86Q96j24
$$ 546 -333 -37 351 -441 203 206 -500 282 -42 -266 458 -138 -353 509 -531 192 437 -549 347 223
2532B23n82R48m38n06P08o00N5N21m38L05L10q38O84j50l29N45m89k77O83m02
$$ 223 -359 589 151 -355 353 -247 -192 329 -109 196 506 -332 352 202 -127 418 -71 -348 335 -67
2552f7m66O75n80L83L38r22Q19J7p35J082o22r1N94o26J16N80o03L87O4p43O72
$$ -67 -533 142 -438 -55 283 -639 180 197 -538 544 -78 -169 425 -201 -85 495 -108 279 343 -400 272
2573B72k88m23R58p39j03O92l83j08K40n29O02l6n55J077o64l72Q83n38N6L18
$$ 272 -16 -439 519 -220 -323 369 -14 -122 118 -411 191 155 -400 677 13 -359 524 -14 42 360
2593C60o15K25P31j020N50j06l85M80l42l34Q12m89j57Q33r61N01L30q62P28R6
$$ 360 -255 -30 701 -319 231 125 -260 220 -122 -456 356 -133 -290 543 -418 83 413 -449 279 375
2613C75o62O96m84l20R06n94l07Q58p18K24M19p82O08j18n86P98k88l89O96m39
$$ 375 -287 409 -75 -395 511 -83 -390 468 -250 -26 393 -389 219 101 -485 313 25 -364 332 -107
2633a07j24N71o88L48K10o26N92r9l21N43l57l31R26o95L78L6o82L71J84l09L27
$$ -107 -231 340 -348 0 210 -416 176 77 -244 299 -58 -389 537 -158 220 256 -426 -55 129 -180 147
2654A47j16o78J028l82k62N66n90J47N80q36L63L53p69M70m4m04Q01l51k74N41
$$ 147 31 -647 381 -1 -263 303 -287 -140 440 -396 -33 320 -449 21 -23 -427 374 23 -251 290
2674B90n10L22L33r57P02J05o52O17Jo60O62m19j01P82p57K83K85o96K86M90r00
$$ 290 -220 102 435 -522 180 285 -367 250 251 -409 253 -166 -267 515 -242 41 326 -370 -84 406 -494
2695d94O85J6n43O68k72m34P71n88J31L68o21K07L11o66N58p4j57M38k10k43M45
$$ -494 191 207 -336 332 60 -374 397 -191 -60 308 -313 -106 205 -461 97 23 -134 304 94 -149 296
2716B96n41J21N46p94N01j44j20M00k14k02O43o25J30M81o83J37K83m29L28J17
$$ 296 -245 -124 422 -372 129 -15 -135 265 51 -151 492 -133 -3 478 -205 -68 215 -214 114 231
2736B31o05O00L9l76L97l40p3M31n02K19J63n11M16j11n0J58M5m89M82j94O7L52
$$ 231 -374 226 265 -111 286 -54 -127 304 -198 21 184 -327 89 -22 -72 86 131 -358 124 -70 -3 349
2758C49p98M92K31l22J75q6l67Q17l30m75O89m14l35N05l12J99J60m05L22l0k85
$$ 349 -449 43 274 -48 127 41 -326 491 161 -314 375 -39 -374 131 -181 18 178 -227 95 65 -220
2779b20K35M2j41M36m04j23M92o33N22j40l17M09R0l88L04j78j78M93m94K04L56
$$ -220 15 57 -84 352 -52 -175 317 -316 206 66 -251 158 248 -140 164 -14 -192 301 -193 11 367
$$ [...]
8191C8
##END NTUPLES=NMR FID
##END=
