##TITLE=1H_85-2023
 CDCl3
 8 sc, 
 25.9.2023
##JCAMPDX= 6.0         $$ Bruker NMR JCAMP-DX V2.0
##DATA TYPE= NMR FID
##DATA CLASS= NTUPLES
##ORIGIN= UXNMR, Bruker Analytische Messtechnik GmbH
##OWNER= root
$$ XWIN-NMR		Version 3.5
$$ Mon Sep 25 14:32:39 2023 Russian Standard Time (UT+4h)  she@DPX200
##.OBSERVE FREQUENCY= 200.13135
##.OBSERVE NUCLEUS= ^1H
##.DELAY= (6, 6)
##.ACQUISITION MODE= SIMULTANEOUS
##.ACQUISITION SCHEME= undefined
##.AVERAGES= 8
##.DIGITISER RES= 18
##SPECTROMETER/DATA SYSTEM= spect
##.PULSE SEQUENCE= zg30
##.SOLVENT NAME= CDCl3
##.SHIFT REFERENCE= (INTERNAL, CDCl3, 0, 15.7039)
##AUDIT TRAIL= $$ (NUMBER, WHEN, WHO, WHERE, WHAT)
$$ ##TITLE= Audit trail, XWIN-NMR		Version 3.5
$$ ##JCAMPDX= 5.01
$$ ##ORIGIN= Bruker BioSpin GmbH
$$ ##OWNER= she
$$ F:/spectra/data/she/nmr/H-F/1/audita.txt
$$ ##AUDIT TRAIL=  $$ (NUMBER, WHEN, WHO, WHERE, WHAT)
(   1,<2023-09-25 14:31:43.54 +0400>,<she>,<DPX200>,
      <created by zg, POWCHK disabled, PULCHK disabled
       configuration hash MD5:
       00 E9 B6 7A A2 85 ED C7 34 08 36 98 17 FE 4E 26
       data hash MD5: 16K
       46 05 E9 06 36 71 66 A0 C7 53 5B 8D 09 8E DB 44>)
$$ ##END=
$$ 
$$ hash MD5
$$ DC 52 44 B9 23 9A 90 1A A8 1C F6 F0 91 2F 6B 91
##$RELAX= 
##$RELAX= 
##$RELAX= 
##$RELAX= 
##$RELAX= 
##$RELAX= 
$$ Bruker specific parameters
$$ --------------------------
##$DU= <F:/spectra>
##$EXPNO= 1
##$NAME= <H-F>
##$PROCNO= 1
##$TYPE= <nmr>
##$USER= <she>
##$AMP= (0..31)
100 100 100 100 100 100 100 100 100 100 100 100 100 100 100 100 100 100 
100 100 100 100 100 100 100 100 100 100 100 100 100 100 
##$AQSEQ= 0
##$AQ_mod= 1
##$AUNM= <au_zg>
##$AUTOPOS= <>
##$BF1= 200.13
##$BF2= 200.13
##$BF3= 200.13
##$BF4= 200.13
##$BF5= 200.13
##$BF6= 200.13
##$BF7= 200.13
##$BF8= 200.13
##$BYTORDA= 1
##$CFDGTYP= 0
##$CFRGTYP= 5
##$CHEMSTR= <none>
##$CNST= (0..31)
1 1 145 1 1 1 1 1 1 1 1 1 1 1 1 1 1 1 1 1 1 1 1 1 1 1 1 1 1 1 1 1 
##$CPDPRG= <>
##$CPDPRG1= <>
##$CPDPRG2= <>
##$CPDPRG3= <>
##$CPDPRG4= <mlev>
##$CPDPRG5= <mlev>
##$CPDPRG6= <mlev>
##$CPDPRG7= <mlev>
##$CPDPRG8= <mlev>
##$CPDPRGB= <>
##$CPDPRGT= <>
##$D= (0..31)
0 1.2 0 0 0 0 0 0 0 0.06 0 0.03 0 0 0 0 0.0002 0 0 0 0 0 0 0 0 0 0 0 0 
0 0 0 
##$DATE= 1695637903
##$DBL= (0..7)
120 120 120 120 120 120 120 120 
##$DBP= (0..7)
150 150 150 150 150 150 150 150 
##$DBP07= 0
##$DBPNAM0= <>
##$DBPNAM1= <>
##$DBPNAM2= <>
##$DBPNAM3= <>
##$DBPNAM4= <>
##$DBPNAM5= <>
##$DBPNAM6= <>
##$DBPNAM7= <>
##$DBPOAL= (0..7)
0.5 0.5 0.5 0.5 0.5 0.5 0.5 0.5 
##$DBPOFFS= (0..7)
0 0 0 0 0 0 0 0 
##$DE= 6
##$DECBNUC= <off>
##$DECIM= 32
##$DECNUC= <off>
##$DECSTAT= 4
##$DIGMOD= 1
##$DIGTYP= 9
##$DL= (0..7)
0 120 120 120 120 120 120 120 
##$DP= (0..7)
150 150 150 150 150 150 150 150 
##$DP07= 0
##$DPNAME0= <>
##$DPNAME1= <>
##$DPNAME2= <>
##$DPNAME3= <>
##$DPNAME4= <>
##$DPNAME5= <>
##$DPNAME6= <>
##$DPNAME7= <>
##$DPOAL= (0..7)
0.5 0.5 0.5 0.5 0.5 0.5 0.5 0.5 
##$DPOFFS= (0..7)
0 0 0 0 0 0 0 0 
##$DQDMODE= 0
##$DR= 18
##$DS= 0
##$DSLIST= <SSSSSSSSSSSSSSS>
$$ [...]
##$SUBNAM2= <"">
##$SUBNAM3= <"">
##$SUBNAM4= <"">
##$SUBNAM5= <"">
##$SUBNAM6= <"">
##$SUBNAM7= <"">
##$SUBNAM8= <"">
##$SUBNAM9= <"">
##$SW= 18.05172834244
##$SWIBOX= (0..15)
0 0 2 0 0 0 0 0 0 0 0 0 0 0 0 0 
##$SW_h= 3612.71676300578
##$TD= 16384
##$TD0= 1
##$TE= 0
##$TE2= 300
##$TE3= 300
##$TEG= 300
##$TL= (0..7)
0 120 120 120 120 120 120 120 
##$TP= (0..7)
150 150 150 150 150 150 150 150 
##$TP07= 0
##$TPNAME0= <>
##$TPNAME1= <>
##$TPNAME2= <>
##$TPNAME3= <>
##$TPNAME4= <>
##$TPNAME5= <>
##$TPNAME6= <>
##$TPNAME7= <>
##$TPOAL= (0..7)
0.5 0.5 0.5 0.5 0.5 0.5 0.5 0.5 
##$TPOFFS= (0..7)
0 0 0 0 0 0 0 0 
##$TUNHIN= 0
##$TUNHOUT= 0
##$TUNXOUT= 0
##$USERA1= <user>
##$USERA2= <user>
##$USERA3= <user>
##$USERA4= <user>
##$USERA5= <user>
##$V9= 5
##$VALIST= <valist>
##$VCLIST= <CCCCCCCCCCCCCCC>
##$VD= 0
##$VDLIST= <DDDDDDDDDDDDDDD>
##$VPLIST= <PPPPPPPPPPPPPPP>
##$VTLIST= <TTTTTTTTTTTTTTT>
##$WBST= 1024
##$WBSW= 4
##$XGAIN= (0..3)
0 0 0 0 
##$XL= 0
##$YL= 0
##$YMAX_a= 398916
##$YMIN_a= -344040
##$ZGOPTNS= <>
##$ZL1= 120
##$ZL2= 120
##$ZL3= 120
##$ZL4= 120
##$ABSF1= 10
##$ABSF2= 0
##$ABSG= 5
##$ABSL= 3
##$ALPHA= 0
##$AQORDER= 0
##$ASSFAC= 0
##$ASSFACI= 0
##$ASSFACX= 0
##$ASSWID= 0
##$AUNMP= <proc_1d>
##$AZFE= 0.1
##$AZFW= 0.1
##$BCFW= 1
##$BC_mod= 2
##$BYTORDP= 1
##$COROFFS= 0
##$CY= 11.3945322036743
##$DATMOD= 1
##$DC= 2
##$DFILT= <>
##$DTYPP= 0
##$F1P= 15.7292609196834
##$F2P= 12.9074282941183
##$FCOR= 0.5
##$FTSIZE= 0
##$FT_mod= 4
##$GAMMA= 1
##$GB= 0.15
##$INTBC= 1
##$INTSCL= 1
##$ISEN= 128
##$LB= 0.24
##$LEV0= 0
##$LPBIN= 0
##$MAXI= 10000
##$MC2= 0
##$MEAN= 0
##$ME_mod= 0
##$MI= 1.114404
##$NCOEF= 0
##$NC_proc= 0
##$NLEV= 6
##$NOISF1= 3.799351
##$NOISF2= 2.8
##$NSP= 1
##$NTH_PI= 0
##$NZP= 0
##$OFFSET= 15.70392
##$PC= 1
##$PHC0= -21710.61
##$PHC1= 10.25271
##$PH_mod= 1
##$PKNL= yes
##$PPARMOD= 0
##$PSCAL= 0
##$PSIGN= 0
##$REVERSE= no
##$SF= 200.130013532006
##$SI= 16384
##$SIGF1= 3
##$SIGF2= 2
##$SINO= 400
##$SIOLD= 16384
##$SREGLST= <1H.CDCl3>
##$SSB= 0
##$STSI= 0
##$STSR= 0
##$SW_p= 3612.71676300578
##$SYMM= 0
##$S_DEV= 0
##$TDeff= 0
##$TDoff= 0
##$TI= <>
##$TILT= no
##$TM1= 0
##$TM2= 0
##$TOPLEV= 0
##$USERP1= <user>
##$USERP2= <user>
##$USERP3= <user>
##$USERP4= <user>
##$USERP5= <user>
##$WDW= 1
##$XDIM= 8192
##$YMAX_p= 0
##$YMIN_p= 0
$$ End of Bruker specific parameters
$$ ---------------------------------
##NTUPLES= NMR FID
##VAR_NAME=  TIME,          FID/REAL,        FID/IMAG
##SYMBOL=    X,             R,               I
##VAR_TYPE=  INDEPENDENT,   DEPENDENT,       DEPENDENT
##VAR_FORM=  AFFN,          ASDF,            ASDF
##VAR_DIM=   8192,          8192,            8192
##UNITS=     SECONDS,       ARBITRARY UNITS, ARBITRARY UNITS
##FACTOR=    0.0002768,     1,               1
##FIRST=     0,             0,               0
##LAST=      2.2672688,     0,               0
##MIN=       0,             -344040,         0
##MAX=       2.2672688,     398916,          0
$$ Real data points
##PAGE= N=1
##DATA TABLE= (X++(R..R)), XYDATA
$$ [...]
2019A808k127j723L773j477j463L060j067j556J384j15r69J55J437j087j663K397
2035G67j287j808L343j180j744K543r71m47J799J42r18n59Q95j76n62K508q70
2052A475k679K598j212j005K453j215j710O59l29J6P49P95j023j603K199L25j186
2069f93L028j003k761K216n53o35J825o67j360l96Q42L25p55J650r59k443K694
2086C55J88j829K710p37k305J552J60l3P11M30q57j812J665K07j820K380l29l513
2104b877K291J7j285K401j2j447L60Q50M24m34J859l41k854J877M96k294L048
2121B079n29l121J412l2q57O52P89p70j799J619Q12j851K968K51l760K297J043
2138A203j934K468O13k207m55R26J82j234J740J89l818J902J368k814K186J197
$$ plain form
2019 1808 -319 -2042 1731 254 -1209 1851 784 -772 612 497 -472 -317 1120 33 -1630 767
2035 767 -520 -2328 1015 -165 -1909 634 -337 -784 1015 1157 239 -320 575 399 -163 2345 1475
2052 1475 -1204 1394 182 -823 1630 415 -1295 -636 -965 -949 -200 595 -428 -2031 168 493 -693
2069 -693 2335 1332 -1429 787 234 -401 1424 757 -603 -999 -157 168 -587 1063 104 -2339 355
2086 355 543 -1286 1424 687 -1618 -66 94 61 772 1202 345 -1467 198 405 -1415 965 636 -2877
2104 -2877 -586 -569 -1854 547 535 -912 -552 298 722 288 2147 1806 -1048 829 1325 -969 2079
2121 2079 1550 -1571 -159 -191 -1048 -396 393 -377 -2176 -557 255 -1596 1372 1623 -2137 160 1203
2138 1203 -731 1737 2350 143 -312 614 796 -438 1302 1491 -2327 -425 943 -1871 315 1512
2154A512l502P84J676n10l19J531M3k459J457J688l253J377J793l899J192J807
2170I18k339L06J633j049o25J238R85j878P98K211l212M71K593l083K34K555j883
2187a27j53J450j007j107O42J172j971k30K287k492k11L211k621P9K356j829K34
2204c17J513j93n14j35J157j626q38K813k209q94K888j939l63K296j567q03Q48
2221A17L2l47j75J201j015j279K615j556j089K997j216j129K214r14p65N81m06
2238a34l64q84J550jj586K685q27j710K758o53j528J878o02n97N60n10k49j167
2256a381J096L7j855K293L8j938K437j83j371J194n84n12M65M80L97p94P33L61
2274I13j825J860O39k251J447M9j798J323l52n35l15m02J116p49P04J358k060
$$ plain form
2154 1512 -1990 -1206 470 -40 -359 1172 1215 -1244 213 1901 -1352 25 1818 -2081 -889 918
2170 918 -1421 -1115 518 -531 -1156 82 1067 -811 -13 2198 -1014 -543 2050 -1033 -799 1756 -127
2187 -127 -280 1170 163 -944 -302 870 -1101 -1331 956 -1536 -1747 1464 -1157 -1078 1278 -551 -317
2204 -317 1196 1003 489 354 1511 -115 -953 1860 -349 -1243 1645 -294 -657 1639 72 -731 117
2221 117 149 -198 -373 828 -187 -1466 1149 -407 -1496 1501 285 -844 1370 456 -309 272 -134
2238 -134 -498 -1382 168 167 -1419 1266 439 -1271 1487 834 -694 1184 582 -15 545 35 -214 -1381
2256 -1381 -285 -248 -2103 190 228 -1710 727 544 -827 367 -217 -729 -264 216 613 -181 552 913
2274 913 -912 948 1587 -664 783 832 -966 357 5 -530 -845 -1247 -131 -880 -176 1182 -878
2291h78P83J286k140J094O76j388P63n5M49l99k55N07j248m3J837j589K07J623
2309A230j842N63P30r26L30k7M37P1o55J516j173r73J669j502m42J385j341J20
2327h30P06o41O40o31N16J32r48J999jj414K051q76j171J763r35N2J88n62L15
2346C53q44N16M2j583J234J49j688J998L00j249J229l10k19o9lP95r98L38J444
2365A435j798N49R15k286J502O09j637P43o3o4m51l60J454j252R7J689j462Q14
2383D34J552j948N86P0j042K40j62J91m19q95J406p11n51J994j464j56J811r40
2401dL41O82p99j3l54P77l4j323J881m65j376K095p75j792J381p75m44M66j57
2420f88M30r82P37J093j565J760L82k034J963Q1j346Q64n11m46j44j59J308j220
$$ plain form
2291 -878 -95 1191 -949 145 821 -567 196 141 590 191 -64 443 -805 -848 989 -600 -393 1230
2309 1230 -612 -49 681 -245 85 58 495 566 -89 1427 254 -719 950 -552 -994 391 -950 -830
2327 -830 -124 -765 -125 -756 -240 -108 -1056 943 942 -472 1579 703 -468 1295 360 412 600 38 353
2346 353 -491 25 67 -1516 -282 -133 -1821 177 477 -772 457 147 -72 -141 -144 651 -347 -9 1435
2365 1435 -363 186 1101 -1185 317 926 -711 32 -31 -95 -546 -906 548 -704 -607 1082 -380 434
2383 434 1986 38 624 694 -348 -108 -270 -79 -498 -1393 13 -698 -1249 745 -719 -875 936 -4
2401 -4 337 1019 220 207 -147 630 596 -727 1154 689 -687 1408 633 -1159 222 -553 -997 -531 -688
2420 -688 -258 -1240 -503 590 -975 785 1167 -867 1096 1177 -169 695 184 -262 -406 -565 743 -477
2438d77Q2J381j623N80J233j792M79N47j241O40J03N53o78m81J730j231k77K110
2456A638j634n57J485j453pP04q07O0j50R97Q9r92K210r48j335K387j278j054
2474f45J659o99o26N47j10j41o32J352j74j683K042n11k045K123p5j739J237j87
2492c07n71M28J043M97j775J225N83k320K317P55k994J295O29j901J154P92o34
2509B16j232M38P62j203J534J196l331N72J701k287J503J751k179n36J212J80
2525B97m53R97J089k967j76K699k561O76K447l202l40K110q08l5J420j95k117
2542a119m5K638j760L0K780l097j322L201j511k55K056j229j534K95J520j153
2558e05rK240k200j750L271j027q83L098j630j791J675N8n13M49J179j861j721
$$ plain form
2438 -477 -395 986 -637 -57 1176 -616 -137 410 -831 -191 -88 465 -213 -694 1036 -195 -472 1638
2456 1638 4 -553 932 -521 -528 176 -631 -571 -721 276 365 -627 1583 635 -700 1687 409 -645
2474 -645 1014 315 -311 236 126 -15 -647 705 531 -1152 890 379 -1666 457 382 -1357 -120 -307
2492 -307 -878 -450 593 1090 -685 540 1123 -1197 1120 1875 -1119 176 805 -1096 58 850 216
2509 216 -1016 -578 184 -1019 515 1711 -1620 -1048 653 -1634 -131 1620 -559 -1095 117 297
2525 297 -156 841 1930 -1037 -1213 1486 -1075 -399 2048 -1154 -1494 616 -192 -227 1193 998 -1119
2542 -1119 -1164 1474 -286 -256 2524 -573 -1895 1306 -205 -460 1596 367 -1167 -872 648 -505
2558 -505 -514 1726 -474 -2224 1047 20 -863 2235 605 -1186 489 547 34 483 1662 -199 -1920
2575a920K858p09j590L134j439k926K619j42p51J513l63j198p91J847L50j033
2591e41K246j021k790K717M93j872K375p34k147N90J074p9n78J125r69k237K284
2608f4J181k279K409k96l005K011P76j006O51K71r91n14J270M69j542J456J49
2625I46l016K067R68j940J793J84j766M74N77L09n83N57N09k351J097J530k182
2642h27J150R45k696J254N71j148P48N44n29r91K10J437j491P93J435k399O94
2659c00J506j880J024Q28j512k20N53M99l25q0R19j794K8J740j900J101J083k051
2677g81L91L25r23P56O1J30n20K47J357r76j46J331j907J44J374j606O39O56r47
2696c95J88K63K10j51l02J147j019l23J862j756l45J405j698J97J033o26K45L84
$$ plain form
2575 -1920 938 229 -1361 1773 334 -2592 27 -115 -866 647 284 -914 -1705 142 492 -541
2591 -541 1705 684 -2106 611 1104 -768 1607 873 -1274 -684 390 311 -267 858 -111 -2348 -64
2608 -64 1117 -1162 1247 951 -2054 -43 733 -273 378 649 -342 -856 414 883 -659 797 946
2625 946 -2070 -3 965 -975 818 1002 -764 -290 287 596 13 570 1079 -1272 -175 1355 -827
2642 -827 323 1268 -1428 -174 397 -751 -3 541 12 -979 -769 668 -823 -30 1405 -994 -300
2659 -300 1206 -674 350 1178 -334 -554 -1 498 173 93 1012 -782 -754 986 -914 187 1270 -781
2677 -781 -390 -65 -988 -232 -171 -41 -561 -314 1043 67 -79 1252 -655 -511 863 -743 -104 552 -395
2696 -395 -207 56 266 115 -187 960 -59 -382 1480 -276 -621 784 -914 -717 316 -310 -65 319
2714C19j24r7l25Q56q69m96J455j273k91J628j328J79J207p39L1R7J11L58l99
2733C00O27p61j219J175o25l54J611j208l4R40p71P11Q6o68k0o98P59p2p17J663
2753G25r39r15K091j156M25J210j136J29K20o73K31m36J21M6j160J568k00p35
2771e84J775j311k15R19j078L39L36n12K70l52M80k5p65J250j94j149J979r06
2789B57p03J161q55l09L96n22M29j25O75J21q39J036k75j235J530l30j030J083
2807D65p08l24N70n29N05m43M09O44j335J310J82j702J383m14j232J467k71k90
2825c13N24P2L96o77M33M06j386J042L46j709J108M1j454R86l7l18M42j34M19
2844A87n91K64R41j343K52J170j703P01J374j502N70L19n29J99l11P62q50m55
$$ plain form
2714 319 195 98 -227 629 -240 -736 719 -554 -845 783 -545 -366 841 102 133 230 341 699 300
2733 300 927 166 -1053 122 -503 -857 754 -454 -488 452 -319 392 478 -190 -210 -908 -149 -221 -938 725
2753 725 -214 -1129 962 -194 231 1441 305 434 654 -19 212 -224 -103 -57 -1217 351 151 -584
2771 -584 1191 -120 -335 584 -494 -155 181 -331 -61 -413 67 42 -723 527 333 -816 1163 257
2789 257 -446 715 -140 -449 -53 -575 -146 -271 404 525 -314 722 447 -788 742 412 -618 465
2807 465 -243 -567 3 -526 -21 -464 -55 589 -746 564 746 -956 427 13 -1219 248 -23 -313
2825 -313 211 283 679 2 435 841 -545 497 843 -866 242 283 -1171 -185 -222 -540 -98 -232 187
2844 187 -404 -140 801 -542 -290 880 -823 -122 1252 -250 320 639 110 309 -2 760 -90 -545
2862e45J378j338k12J491j819M11J047q00L15R3N00m67k89J064j062n80J751j180
2880b42m51J385r56l42R50o68J14J02K09Q1q04J144j39j266J861o08j383J829
2898H16n15m40P59n77j51k96K29K53j185J216J80j456J542m1j115J101j13r01
2916f94J050l19L37n09L78L78j307Q55J022j862R44N04j493Q51Q5m68k3O0M02
2935A91o07j53J438j495N12J173j695O99P75j359N59L58m29J24l51N40m60l39
2953e19J348j215j0J365j076N0P26j070M12K42j30N1l26M48k00q06J322o90n05
2972e83J032q84l05J044o48L92K25n77N16o38P94L05j078R24m90m17J376r21j88
2991a21O09r52M04R4k57Q39j244L42M30q36R64m3o73Q65p29L7Q96q26M44r9r59
$$ plain form
2862 -545 833 -505 -717 774 -1045 -634 413 -387 -72 21 521 54 -235 829 -233 -813 938 -242
2880 -242 -693 692 -264 -606 344 -324 -210 -108 101 182 -622 522 383 -883 978 370 -1013 816
2898 816 301 -139 620 43 -108 -404 -175 78 -1107 109 289 -1167 375 334 -781 320 207 -694
2916 -694 356 37 374 -135 243 621 -686 169 1191 -671 273 777 -716 135 220 -248 -271 -211 191
2935 191 -416 -569 869 -626 -114 1059 -636 63 838 -521 38 396 -33 91 -260 280 -180 -519
2953 -519 829 -386 -396 969 -107 -57 669 -401 11 253 123 174 -152 296 96 -710 612 -78 -583
2972 -583 449 -435 -740 304 -344 48 273 -304 212 -426 368 673 -405 519 29 -388 988 67 -121
2991 -121 488 -464 -60 34 -223 616 -628 -286 144 -692 272 229 -444 421 -308 -271 625 -201 243 144 -815
3012h15R61l90M6R14j059N25n0m32J062p56j54O67j122L22P03r30R63k53n22O99
3032C79n42J80O52q18N05r61kR45q36Q13J87j370R29K71l81P53m75j66k23k57
3052d17J205p79k04J079j502J64J311q90M38M55j271j8K57M97m37l48N98p10l74
3071i46J924r67K3R14j299J95O83m37J03j62k4k22m93J299m14p57J534j127m34
3090f07J483p04l04O43q79k12J82O67l43o97J260m36r77K273j123r09J213q14
3108b84m59J101k29Q7n66M75N5r31J564r2j467J635m32j563J615m54o14O49l81
3127b91K09k01N18N92j667J094L87j878J557K18j408J024k25q26Q89J24L3l61
3145b12O03O03j286J050L29j993J048L12j653J272L38q31L65J81L6n16J51Q29
$$ plain form
3012 -815 146 -244 -198 716 -343 182 132 -300 762 6 -148 519 -603 -281 422 -508 455 202 -320 379
3032 379 -163 17 669 -149 356 -605 -607 338 -498 315 502 -868 61 332 -49 704 229 63 -160 -417
3052 -417 788 9 -195 884 -618 -454 857 -33 405 860 -411 -429 -172 325 -112 -460 138 -572 -946
3071 -946 978 11 34 948 -351 -156 527 90 193 31 7 -215 -708 591 177 -580 954 -173 -607
3090 -607 876 172 -132 511 -368 -580 -398 269 -74 -771 489 53 -924 1349 226 -683 530 -284
3108 -284 -743 358 129 216 -350 125 180 -751 813 721 -746 889 457 -1106 509 55 -559 90 -291
3127 -291 -82 -283 235 827 -840 254 641 -1237 320 538 -870 154 -71 -897 -8 116 149 -212
3145 -212 391 994 -292 758 1087 -906 142 454 -1199 73 411 -420 -55 126 162 -354 -203 626
3163F26j494P39J059j909R05N37j501R02M05m69M18N1L38q43K4R53j113j67J342
3182H03j787P93J144j145J85L97q04N67kJ75o79q7J076j045l22J581j308j15J172
3201E99j257P06P62q98O8l43K00N3m08J261o84o87J410p88K3R77j264R3L28l40
3221a89M67q1K31l12r36R03k77l97J520r72n41Q29m10J97J01k04J54n82M06N86
3241D93o45R57m18j200J305m05m51J027o77j38J74n61Q20m98J79L80j289R19M48
3260D20o11Q06o25n73Q19l76J25N57l50J86o51p0J063j093N33L62j368R99k39
3279h6k57R34p57O4K87o31Q81j52n32Q45r89M47L45o89K67o8k52M65m29l9N66
3300B20r66Q01k07n28J230n62K7N72o73K76l6k32M71m71K18L99p68L33Nq28P57
$$ plain form
3163 626 -868 -129 930 -979 -74 463 -1038 -136 269 -200 218 269 607 -236 -212 741 -372 -539 803
3182 803 -984 -191 953 -192 -7 390 -414 153 151 326 -353 -440 636 -409 -731 850 -458 -573 599
3201 599 -658 48 810 -88 -20 -363 -163 -110 -518 743 59 -628 782 -6 17 994 -270 -177 151 -189
3221 -189 278 197 428 116 -820 83 -194 -591 929 -43 -584 245 -165 32 133 -71 83 -499 -93 493
3241 493 -152 805 387 -813 492 87 -364 663 -14 -152 22 -539 281 -217 -38 342 -947 -28 420
3260 420 -191 615 -10 -583 236 -140 -15 542 192 378 -273 -343 720 -373 160 522 -846 153 -86
3279 -86 -343 591 -166 -102 185 -446 435 283 -249 596 -393 54 399 -290 -23 -91 -343 122 -307 -346 220
3300 220 -746 55 -152 -680 550 -12 15 587 -86 190 154 -78 393 -78 140 539 -229 104 109 -719 38
3321C8k2l31N50p18L68K18l47N22o90M4P05p23L17O35r86R42j83m44N89n81L71
3342B74j02p35J084n54m52R92r76K48O66q32M67N5n07M94k86K36K1p18Q23J0o34
3363d26J046p72j05Q44j049O02Q3m22O32q70M25R8o27Q88J54r39J081l14n48Q16
3383E97o85j15K73m45N43l77J35O33j262O16N67j201J060l71m60N31l30J96o9
3402a64j86P42n41J43Q80j176N91L39j089O42K5r14Q28n03L25Q6l79O97o05Q4
3422a75P52q31J61N05r72N56K60n20M42k70R6J27n98R90l79m68J004j007J60N42
3442C75p18J1N33m44M88m09M34Pq73R68j15q21J023m15m34O26m91Q0L3o1O06m83
3464h0K59K62p21O51k06q23J133l05n90Q75l63j17K11k46L08l81K9N18r16N83
$$ plain form
3321 38 16 -315 235 -483 -115 103 -244 278 -412 -368 337 -386 -69 566 -420 522 339 -105 484 -97 274
3342 274 172 -563 521 -33 -485 507 -469 -221 445 -387 80 135 -372 122 -164 72 93 -625 198 208 -426
3363 -426 620 -152 -257 587 -462 140 223 -199 433 -437 -12 86 -541 347 501 -438 643 329 -219 597
3383 597 -88 -203 70 -375 168 -209 -74 559 -703 -87 480 -721 339 -32 -492 39 -291 -95 -164
3402 -164 -350 392 -149 -6 874 -302 289 628 -461 181 206 -708 120 -383 -58 28 -351 346 -259 -175
3422 -175 577 -254 -93 412 -560 -4 256 -264 178 -92 4 131 -467 523 144 -324 680 -327 -167 375
3442 375 -343 -332 201 -243 245 -164 270 277 -596 372 257 -564 459 44 -390 236 -255 -175 -142 -203 403 -80
3464 -80 179 441 -280 371 165 -658 475 170 -420 455 92 -25 186 -60 248 -133 -104 414 -502 81
3484H1L04r64O46j39n21O50j11Q3P5m98P11k05j9O92j190K95L80p57N72K58o61
3505c18L74l7j05K91l09M59n25l23Q03q14L28Q36j095L07K70o03M22J71l4K12
3525C10o99P82n11j33P37o88k05R32p70K24N45o69J62j53j25N57m46M46j62p14
3545e80R16m03MQ38q29j3J06l02M87j97J3J0p39N70M43m39O44n27l23Q04n32k8
3567g7N76n62J48m4p1L90m89K35l4p35O54Nk13O90o99o1M20l90M34J43m63K58
3589A15n81K63M84n27O60l99o76Q44k62J36M41n45m3J05m6N59m22m63O60p24J77
3610b44L15l99N42n89o5N55j39K19J31l26N8l98L67K15l27lL8m03P21j00l99O66
3632D35o16M3K45m0L29j53o75M67m55N41K67o83M31O1l76N34j87O0j40o79L25
$$ plain form
3484 81 385 -579 67 -72 -593 57 -54 29 104 -394 317 112 93 785 -405 -110 270 -487 85 343 -318
3505 -318 56 19 -86 205 -104 355 -170 -493 310 -504 -176 660 -435 -128 142 -461 -39 132 98 310
3525 310 -389 393 -118 -251 486 -202 -407 525 -245 -21 524 -145 17 -136 -261 296 -150 296 134 -580
3545 -580 336 -67 -63 775 -54 -67 39 -263 224 27 40 50 -689 -119 324 -115 529 2 -321 483 -49 -77
3567 -77 499 -63 85 41 -30 360 -129 106 72 -663 -9 -4 -217 473 -226 -287 133 -257 177 320 -143 115
3589 115 -466 -203 281 -246 414 15 -661 183 -79 57 498 -47 -90 15 -31 528 106 -357 303 -421 -244
3610 -244 71 -328 214 -375 -440 115 -24 195 326 0 58 -340 27 242 -85 -88 -50 -453 268 168 -231 435
3632 435 -181 -138 107 67 396 243 -432 35 -420 121 388 -295 136 197 -179 355 168 228 88 -591 -266
3653b66J72M3M28o57J19M8m41P96L43n95L70o79Q0P00l02L28l10m91M70j54K78
3674B80L16q06K23k68l52P09L0k66r9l02M75J3n8P43p02j77O50o98O21J81o72
3695a59K52m32R2K33N5K1p5l06N79j92P7K94n32mJ85n14M89J30j24O4m76N9N05
3718B21n33P00l82k47N39p92L91N14p46J06L01n05O48k54K37J37n84L79J10k40
3738@M40o64j11N79o38L69J34m64L90m35L17K62j07M93m37q11P50j63l5Q12p68
3759h7kK61m67L98r3O2J08m88K40L87o80O19l36k38N61k94rL79n64K52o6r5M46
3782B94n97L86p1l56N79k34k46L76j06%K86m15K40J1j37M91p40K38K65m37L62
3803A89Q0o90L92l7r6L98n49R2J09l23P65m34M3L33n31K35J76l47L82j51j91L91
$$ plain form
3653 -266 -94 -51 377 -280 -161 -113 -554 242 585 -10 360 -319 -239 461 159 487 177 -314 156 2 280
3674 280 596 -210 13 -255 -607 102 132 -134 -233 -535 -60 -47 -105 638 -64 -241 409 -289 332 513 -159
3695 -159 93 -339 -247 -14 41 62 -13 -319 260 68 145 439 -93 -97 88 -426 63 193 69 133 -343 -284 221
3718 221 -312 388 6 -241 298 -494 -103 411 -335 -229 72 -433 215 -39 198 335 -249 130 240 0
3738 0 440 -224 -335 244 -394 -25 109 -355 35 -400 -83 179 72 565 128 -683 67 -96 -131 681 -87
3759 -87 -89 172 -295 103 10 72 180 -308 -68 319 -361 258 -78 -316 245 -49 -58 321 -243 9 -57 -152 294
3782 294 -303 83 12 -344 235 1 -245 131 25 25 311 -104 136 147 10 501 -239 -1 264 -173 189
3803 189 269 -421 -29 -66 -162 236 -313 -221 -112 -435 330 -104 -61 272 -259 -24 152 -195 187 36 -155 236
3825B36j08O6j15k28L87k34p4M26o06J5J67l20L22Q6r4M20m22J09K76o08N28k81
3847e2j68L30l51K36O7k09P4j21K4M58k07Q3L41p39N24k16l40M47k76J02N9k81
3869b15L13o4k05O09m63j87L39n86O53k12l55M50j59p4K61j86J79J26k87L22k09
3890E0r9K64l26J38m5l71L03j14J87k9%o7K30l51M40k02q2J64m07J64L11m72M33
3913A19k17J83Pk98L87L1l41L96j79k22L13l05J48L90n86L00l4j5J50k58O2L6
3935F7k69J60J95l58N43n19r2M79m41K50J11k58L29r9j28K49m08K17K8m9K55m12
3957a50L17O8j97N7K48k61M8k33J6J98m11J28J81l26L26m1J10J71k43K1K02l18
3979h9N09k02m15L51l60J64K77k62L46l34p5K55j42N2Kk34M18l80J5J32n6j07
$$ plain form
3825 236 128 194 79 -149 238 4 -70 356 -250 -235 -68 -388 -66 20 -74 346 -76 33 309 -299 229 -52
3847 -52 -220 110 -241 -5 62 -147 -73 -194 -170 288 81 164 505 -234 290 74 -266 181 -95 7 66 -215
3869 -215 98 34 -171 438 -25 -212 127 -459 194 -18 -373 77 -82 -156 105 -81 98 224 -63 259 50
3890 50 -49 215 -111 27 -18 -389 -86 -200 -13 -42 -42 -109 121 -230 210 8 -74 90 -317 -153 158 -314 119
3913 119 -98 85 92 -206 181 212 -129 267 88 -134 179 -126 22 412 -174 126 92 77 227 -31 31 67
3935 67 -202 -42 153 -205 338 -181 -273 206 -235 15 126 -132 197 98 -30 219 -189 28 56 7 262 -150
3957 -150 167 235 38 95 343 82 130 -103 -87 111 -300 -172 9 -317 9 -32 78 249 6 27 229 -89
3979 -89 420 218 -197 154 -206 -42 235 -27 319 -15 -90 165 23 75 77 -157 261 -119 -104 28 -28 -135
4001a35J88j41R0J57k9N5m54J47K17k95K48j51k05K27p9J34K41k39J48j41K3L54
4023C60k26j61L18n68L15l7k00K15Rr0K63m07M60k30j16J05j91R1K91l10L9P1
4045Aj92M52j57o7K08j45p3N4k60L52q8j48J05l02L14l4l24L34J77m32L96l06
4067a35J52J94l79M7j22J33K73l05J34K35n15L52l5j7K53n02J35O2r5Q0J11k03
4089a47L14j15r3M72l68J9J95l65P7j29P9J80l17L87k25l31O12k86K20l4k97L27
4111A75j66j97P9L7j8J34j55K82Q7k94K33j59n8J31k74K82p9l77L39J69k68J81
4133H4N9j83K72k38M9R3k40L41o34M32K45p15O25k24J05r4j16R7Q9q5L4K07k76
4156g3L35k65N4J72l41K05p6j74J31R1k34K45j41J92m7k17L99m45K45J39k03p7
$$ plain form
4001 -135 53 -88 2 159 130 185 -269 -122 95 -200 48 -103 -308 -81 -160 -26 215 -24 124 -17 6 360
4023 360 134 -27 291 -277 38 1 -199 16 25 -65 198 -209 251 21 -95 10 -181 -90 201 -109 -70 1
4045 1 -191 261 104 37 245 100 27 81 -179 173 85 -63 42 -260 54 20 -304 30 207 -225 171 -135
4067 -135 17 211 -168 -121 -243 -110 163 -142 -8 227 -288 64 29 12 265 -237 -102 -40 -135 -55 56 -147
4089 -147 167 52 -41 431 63 82 277 -88 -11 -140 -61 119 -198 189 -36 -367 245 -41 179 145 -152 175
4111 175 9 -188 -109 -72 -90 44 -111 171 258 -36 197 38 -20 111 -163 119 40 -337 2 171 -97 84
4133 84 143 -40 232 -6 43 136 -104 237 -397 35 280 -435 190 -34 71 -23 -139 -42 47 -38 -4 203 -73
4156 -73 262 -3 51 223 -118 87 11 -163 -32 59 -175 70 -71 121 74 -143 256 -189 56 195 -8 -85
4178h5R5j03K00j92K25k5j65L3O7j87K89q7k04K62l59m1M89m20K98p3n2K98j98
4201F5K04j93J47j04k97j05N42k53j9J42l85L10M3k43M39l82K12m5j96M50j74
4222A58r6R8l13L2L35o4r8J87n63K78p8K7L39j68k7j50KL25k67Q5K57k91o8K60
4246B00j23L46n84m8L62k49L90l07k89N49k10j11K69r4lk02n2J89M7j13K10m47
4268b70L81N6m46M21%k63J99j80J24J15k21L63k23j20J93l52M11J07n13M05j81
4289FJ7O7q3j42K34l14K10r8j20L87n49K45J31k84K79J41q9J9m6ql3j47L36j3
4313A46l55L94j27k26L79l39K58j50p0K94l39o8L81k73K26j21l00M54o5k40M17
4334B76q6n1n2j36L33k87J1K62l05M2N6j65J72P5k25K60m37J64J23l33N71l19
$$ plain form
4178 -85 10 -93 107 -85 140 115 -50 -17 50 -137 152 65 -139 123 -236 -277 212 -208 90 17 -35 263 65
4201 65 269 76 223 119 -178 -283 259 6 -13 129 -256 54 97 -146 293 -89 123 78 -118 332 158
4222 158 62 160 -153 -121 214 150 52 239 -324 -46 -124 -97 242 74 47 -103 -101 224 -43 42 299 8 -60 200
4246 200 77 423 -161 -209 153 -96 294 -13 -302 247 37 -74 195 101 98 -104 -156 33 80 -33 177 -270
4268 -270 111 167 -279 142 142 -121 78 -102 22 137 -84 279 56 -64 129 -223 188 295 -218 187 6
4289 6 23 90 7 -135 99 -215 -5 -103 -223 164 -385 -140 -9 -293 -14 127 38 57 11 3 -30 -177 159 146
4313 146 -209 185 58 -168 211 -128 130 -20 -90 204 -135 -203 178 -95 131 10 -290 164 99 -141 276
4334 276 190 139 87 -49 284 -3 8 270 -35 7 63 -102 70 145 -80 180 -257 -93 30 -303 268 -51
4356e1oJ38l16M0M35m57K50J25l38K16J20k27J84k26K00j09qJ99j18N0J49m32
4378a82J67O3m7K01j14J41j79m8k7J32j82K19j94j82M00j62J69k07p8K53k80p9
4400b16L27J08k32J51l94M36K0m90L10O1k89M01k64o7l0J05oj20L54o8j23l1J83
4423A26k88K40k70J07K80k21J82k63j07L98l76J72K10j67k6K26l95M68m33J2K31
4444A06l21L04j48j65K72j03l87O25k58P3J87q4J3p8j60L32l83L18j29j04J61
4465G1k9j57K98k35Rj39L28r3N0q0K85m62J89m9k22M45q2l10J99k5n5N1p1L56
4489B72k02nK26k46k99M00k43J81R1j63j08n6K26j74J44R2l02K31O3l86K03K65
4511B10k32J03j24l1L18j40%l8r5J18l2j07mr6QJ39j55J77K71m73J84N5j49J98
$$ plain form
4356 -51 -57 81 -235 -195 240 -217 33 158 -180 36 156 -71 113 -113 87 -22 -30 169 51 101 250 -182
4378 -182 -15 48 1 202 88 229 50 2 -25 107 -75 144 -50 -232 168 6 175 -32 -110 143 -137 -216
4400 -216 111 219 -13 138 -256 180 200 -290 20 81 -208 193 -71 -138 -168 -63 -69 -189 165 97 -26 -57 126
4423 126 -162 78 -192 -85 195 -26 156 -107 -214 184 -192 -20 190 23 -3 223 -172 296 -137 -125 106
4444 106 -215 89 -59 -224 48 -55 -442 183 -75 -2 185 101 114 36 -124 208 -175 143 14 -90 71
4465 71 42 -115 183 -52 -43 -182 146 53 103 23 308 -154 35 -14 -236 209 127 -183 16 -9 -64 -13 -84 272
4489 272 70 65 291 45 -254 146 -97 84 175 12 -96 -152 74 -100 44 136 -166 65 128 -258 -55 210
4511 210 -22 81 -43 -74 244 104 104 66 -29 89 57 -50 -54 -150 -142 -3 -158 19 290 -183 1 56 -93 105
4535A05j86o0L67k79L10j82k2J56r0j57M9o1m4J17k62J30j49J67K5j54K95r2k2
4558c9K16j55O5J55l88K05p5M7j98J18O9J09k22K22Rm40M36j49L5J79j90k2k4
4581c7j13K77k02K00J24l40J67J2j75L89j60j93m4j33O9J35j08K72l43P8K25l2
4603F8j44K59j65J90k59j20Q7J14j46K69k34RO9N8J10l47J78J63m41K03o3J80
4625C8Q1l8q9m2K02J70l34J62J53m36J30J82j58O8J8l90K78j16J42n8k12K76k57
4648b30O7L44l12L4K78m66J75J3J98j19j27J58LmJ09m4r7N9j44O4J97k99O3K73
4672A93l20J03m2M4M29k97q3m7k46L70k49L0L00k50j3K55k58J81K4j80J22k73
4694b07K39l2k02K17k6j56K03j45M7n5O8J00j15l8J32K9o7l5j62J89Lj11L11l64
$$ plain form
4535 105 -81 -141 226 -53 257 75 53 209 119 -38 11 -50 -94 23 -239 -109 -258 -91 -66 -220 75 -17 -39
4558 -39 177 22 87 242 -146 59 -16 31 -167 -49 20 129 -93 129 138 -302 134 -15 20 199 9 -13 -37
4581 -37 -150 127 -75 125 249 -91 76 88 -87 302 142 -51 -95 -228 -159 -24 -132 140 -203 -125 100 68
4603 68 -76 183 18 208 -51 -171 -84 30 -116 153 -81 -72 -3 55 165 -182 -4 159 -282 -79 -142 38
4625 38 119 81 -8 -50 152 322 -12 150 303 -133 -3 179 21 89 107 -283 -5 -121 21 -37 -249 27 -230
4648 -230 -163 181 -131 -97 181 -285 -110 -97 101 -18 -145 13 16 12 121 77 -20 39 -105 -41 156 -143 -80 193
4672 193 -127 -24 -66 -22 407 110 27 -20 -266 104 -145 -115 185 -65 -78 177 -81 100 124 -56 66 -207
4694 -207 32 0 -202 15 -11 -167 36 -109 -62 -117 -49 51 -64 -102 30 59 -8 -43 -205 -16 -13 -124 187 -177
4718a77J92K31k33K88j31l27L15j81j4Q8K6J4K3k83K28q3L2M4l36M3L23N5Q9l81
4742a55N6K82l90J61J27k24K89l54K68jJ93k73K24r6j89J18r0K23k8kp7l27L90
4765A25Lk71L26l40J48J11l25L18Qj78R3l02K31O4o5R2l39K27J74k72QK47o1j63
4789a41N0J20j9k24L22j90J31L6NpK5%j41K27k51J84k94J93n8JQ1J43m95M04p7
4814B5l50M62j88K5N6N4oj6n2J23j09j83J42j72J88L38m06K39j60o0J60r0j6j4
4838a0j46K26j6k80M20k55oK31j46p5N4o3J25l4K8j22l8J78M0l07K44L1j55L41
4862B65l58R4Q3r7J50p1k66Q6J12J71r3j49O9j20K25r5m9J14l4q2l7K1J19l27
4886b69J03K82q7k5L06j05l04L60l09k18L43m24M60k12J00K02l55K69o6k45J68
$$ plain form
4718 -177 15 246 13 301 170 -157 158 -23 -37 51 77 91 114 -169 59 -24 8 52 -284 -241 82 137 226 -155
4742 -155 -99 183 -207 -46 81 -143 146 -208 60 59 252 -21 203 107 -82 36 -54 169 141 139 62 -265 125
4765 125 128 -143 183 -157 -9 102 -223 95 103 -75 18 -284 -53 11 -54 38 -301 -74 100 -172 -164 83 22 -141
4789 -141 -91 29 10 -214 108 -82 49 85 90 83 108 108 -33 194 -57 127 -167 26 -32 -31 50 193 -302 102 25
4814 25 -325 137 -51 -26 30 84 78 62 10 133 24 -159 -17 -189 -1 337 -69 170 10 -50 110 20 4 -10
4838 -10 -156 70 54 -226 194 -61 -67 164 18 -57 -3 -66 59 25 53 -69 -107 71 111 -196 48 79 -76 265
4862 265 -93 1 84 -13 137 66 -200 -114 -2 169 76 -73 -4 -124 101 6 -43 71 37 -45 -82 -61 58 -269
4886 -269 -166 116 29 4 310 205 -99 261 -48 -266 77 -347 113 -99 1 203 -152 117 51 -194 -26
4907b6J30k15K25l12J19J03j28P2J05j29K29j96N8L5l56M52j9k31J58o2j73N1
4929a10M7K08l15J51L55k36n6M9k45K59o8j60L26l17J08P3l06K96J15l38M42l50
4951g2n9N2m3R5L20m05R4K23k60J16J0l1J67k35J87l29J52Pj47L4J64o4K66j05
4975A37n0J91m39J86J21k05R5qj39J97j55K48m8l28K17nJ31K83l91l5N1k65J06
4998a05N6km6m2J29R8k67L60j82J50j25K9q7Q8j43K42k39j47K60K47m39K28rj39
5022h5K47k26N5o9l95M93j07n4N9j46M86m67K61M4k17J58l8RJ26j13jq6O4k6L7
5047Ij36J36r7O3J49j28m3K4N9L7p0j40L00l62M82p4j47Qj34Q9J6j07P0P5j81
5072a02L0l6NJ55j38K12p9k57L91j33q4n7jQ5K7p0M1k8Q8m0j09K30J11m98J03
$$ plain form
4907 -26 104 -111 114 -198 -79 24 -104 -32 73 -56 173 -23 35 70 -286 166 147 -84 74 12 -161 -110
4929 -110 -63 145 -170 -19 336 100 44 93 -152 107 39 -121 205 -112 -4 69 -237 59 174 -164 278 -72
4951 -72 -131 -79 -122 -27 293 -112 -18 205 -55 61 71 40 207 -28 159 -170 -18 -11 -158 -124 40 -24 242 137
4975 137 87 278 -161 25 146 -59 36 28 -111 86 -69 179 131 -197 20 15 146 429 38 3 54 -211 -105
4998 -105 -49 -51 -97 -139 -10 88 -179 181 -1 149 24 53 -34 54 -89 153 -86 -233 27 274 -165 63 54 -85
5022 -85 162 -64 -9 -78 -473 20 -87 -141 -82 -228 258 -209 52 96 -121 37 -1 8 134 21 20 -66 -2 -28 9
5047 9 -127 9 -88 -25 124 -4 -47 -23 36 73 3 -137 163 -199 283 209 62 70 -64 25 41 -66 4 79 -102
5072 -102 -72 -108 -103 52 -86 126 47 -210 181 48 -36 -93 -94 -9 18 -52 -11 -39 49 9 -100 130 241 -257 -154
5097a54J27k49L05J82m82K49j52P3J34m8K37k80J58J3l31L52O1k72Q4l1qo7J84
5120H5L0k43K26k5j87N6M8k3K79p8m72M69j07j52J96Q9k29r9K43j50K9j56L88
5143B17l97J19L54m81K17J07l85K12j43K42L1k66K32j75L3K53k02j73K61k99L2
5164b11L05j80J36o6R4j39j29L45r9j65L03m13J12M35m22K42j54L3n5N9k30K38
5186C9j14J79n1l41N17k31l0L22l31j35J84K2Mj86L15j60j51J68O6O0Q6k45k80
5209b93N28j11j93L29j98l5k35K24J13k09M8l7k09L80j30q3K36n1j47R9Q7R3j52
5232E4l0l2j24K85j25L6m7J42m56L98k40m1L62j33k09J56k4J27p5j40K51k90K41
5255H6J06l03J94M3l21K12L0mro4J11j20J05O6k97Q6Q8l90N62Ml32K82k07p2K58
$$ plain form
5097 -154 -27 -276 29 211 -271 -22 -174 -101 33 -15 222 -58 100 113 -218 134 195 -77 7 -24 -32 -99 85
5120 85 115 -128 98 73 -114 -58 -10 -33 246 168 -304 165 58 -94 102 191 -38 -137 106 -44 -15 -171 217
5143 217 -180 -61 293 -188 29 136 -249 -37 -180 62 93 -173 59 -116 -83 170 -32 -205 56 -243 -211
5164 -211 94 -86 50 -16 78 -61 -190 155 56 -109 194 -219 -107 328 -94 148 -6 27 -28 31 -199 39
5186 39 -75 104 53 -288 229 -2 -32 290 -41 -176 8 30 34 -152 163 3 -148 20 86 146 232 -13 -293
5209 -293 235 124 -69 260 62 27 -208 16 129 -80 -32 -69 -278 102 -28 -111 125 74 -73 26 113 206 54
5232 54 24 -8 -132 153 28 64 17 159 -297 101 -139 -180 182 49 -160 -4 -28 99 24 -116 135 -155 86
5255 86 192 -111 83 126 -195 17 47 43 34 -30 81 -39 66 132 -165 -79 9 -381 181 185 -147 135 -72 -144 114
5280A14j14J69l93K04n5k14K13P7j22Q5K1o9r5P9J96M7J3k83J6o4L99l32J28k8
5304hj90K33J89l26J92k9l9m9rJ61k07k3J59j46M7K28m06K32R8j60J72j35K11
5327A95k58n3K54n8j15J45k12n8K70R7j37J22j31q7j55Q4L14o5j02jl13M41j46
5350C1j17lJ8M5J34j81J46j7m5q4J36q1j7j16K19m1j50L12j22Mj14o8L38jl48
5375a22J55j16L8pJ07m6j2k09J80j8J09L1N9k6k15Q3j1j07K67k89N3k3j4p3L84
5400A78j43j42K39k43J40j30j93L50J01k63J91k20J40J74l10K86q2o7l8j60K24
5421C2j15Rq6O8K01pj91L29n9k00K16l40J78j4j5J12k57L38L8l03J63q2l2K44
5445B27q9k77L45n9k99J25j55j8L23m04M55k01j24J98O4k17K25j33qN6k9J27r6
$$ plain form
5280 114 0 169 -224 -20 -75 -289 -76 1 -121 -36 -15 -84 -179 -100 96 143 156 -127 -111 -175 224 -108 20 -8
5304 -8 -198 35 224 -102 90 61 22 -27 -36 125 -82 -105 54 -92 -45 183 -223 9 107 -53 119 -16 195
5327 195 -63 -116 138 80 -35 110 -102 -160 110 207 70 192 61 -26 -181 -97 217 152 50 49 -264 177 31
5350 31 -86 -89 -71 -26 108 -73 73 56 11 -73 63 -18 -35 -151 68 27 -123 189 67 71 -43 -111 227 226 -122
5375 -122 33 -83 -45 -52 55 9 -3 -212 -32 -50 59 90 149 123 -92 -9 -20 -127 140 -149 -96 -119 -133 -206 178
5400 178 35 -107 132 -111 29 -101 -294 56 157 -106 85 -135 5 179 -131 155 73 6 -32 -192 32
5421 32 -83 -74 -160 -92 109 102 -89 240 181 -19 197 -143 35 21 6 118 -139 199 237 -66 97 15 -17 227
5445 227 138 -139 206 147 -152 -27 -182 -200 123 -281 174 -27 -151 47 111 -106 119 -14 -22 34 5 132 36
5468C6LK38l04l2J66k01R0J31j13J70m12L46l52J2K26K45j66Oj29L29k03k47L78
5491B17j71j08J84k70K57O2l26K32l59L54J02k36J73k13j24K68k2j69J46j01k4
5512a28J87k7j19J37j56pnJ64J56l14J29M4j81P8L5m7K15j99J2l0m8K30j70J73
5536A29j45j32M25k36k85K05K35j95nJ0L9j05k29K00L02j91j45M9lP0l14M57j10
5559B6j32J04n6M22k20k20K90k20j8J03k28M15l35j71L45j90k7J81Q5j50k04M
5581a96J62K1J08K9l62L55m4k03J20jm1J98l0r3L4Q8K2J9l24K83k22Q7K8k74L83
5606A47N1k36J37o3q5r9o0J78j53K88r8O8j1j30l2J15j57RK14Pj29p9J23q3j0
5631h8j7L32l25K2j9M5j94M95l14Q8P7m4j94J49R2j50%K23k64m4L02k65J00N7
$$ plain form
5468 36 39 277 -27 -59 107 -94 -4 127 14 184 -228 118 -234 -222 4 249 83 89 -40 289 86 -161 217
5491 217 46 -62 122 -148 109 171 -155 77 -282 72 174 -62 111 -102 -226 42 20 -149 -3 -104 -128
5512 -128 59 32 -87 50 -106 -113 -118 46 202 -112 17 61 -120 -42 -7 -54 161 -38 -26 -56 -104 126 -44 129
5536 129 -16 -148 277 41 -244 -39 196 1 -4 6 45 -60 -289 -89 213 22 -123 -74 -77 -7 -321 136 26
5559 26 -106 -2 -58 364 144 -76 214 -6 -24 79 -149 266 -69 -240 105 -85 -112 69 154 4 -200 -196
5581 -196 -34 -13 95 124 -238 117 73 -130 -10 -11 -52 146 116 23 57 145 167 186 -138 145 -77 10 38 -236 147
5606 147 198 -38 99 36 -49 -148 -208 -30 -183 105 7 75 64 -66 -98 17 -140 -131 83 90 -39 -118 5 -78 -88
5631 -88 -105 227 -98 -76 -95 -50 -244 251 -63 25 102 58 -136 13 105 -45 -45 178 -86 -130 172 -93 7 64
5655F4p7J7P6j29J05J06qr5l7J03N0k39K40j73r2J39k19K16j43pJ38M5J19j26
5679G3k90L01p1j62K07k76K9L79k37K53k23o1J33j44P9L6L2K0k39j19M89k44k5
5702f0J11j99m6K74n9J4j49K21k81J94J28k07Q4L48l06k32L84r7n1J19k89l2J08
5725b3J18J3m31K64q0J02k7K75l66J72kJ22j77J38p0l56K93j47J80K53n4n71M22
5748D8k31q5K69L9l8O5n1k9j92L28l8k64j3K45k05O7M27l59R4j74k1J15L3Qql43
5774c13K05R6P7p1j09R6k4nK2J33k90K31j69K12j17Q7K42m11j1J09k23L09L54
5797D30m71pP4j32R7o4J81Rq8Q4l40J83O8QJ32j64j65R9J66j61O3j3J54j15J13
5822A41M6j90j46L46l18J67J31m38J61J85P2l73L35l0j57oK04k20N4J19j53q1
$$ plain form
5655 64 -13 4 80 -49 56 162 154 59 22 125 175 -64 176 3 -89 50 -169 47 -96 -103 35 80 199 73
5679 73 -217 84 13 -149 58 -218 -189 190 -47 206 -17 -78 55 -89 -10 26 58 78 -161 -280 209 -35 -60
5702 -60 51 -148 -194 80 21 35 -114 107 -174 20 148 -59 25 373 67 -165 219 122 71 190 -99 -131 -23
5725 -23 95 108 -323 -59 -139 -37 -64 211 -155 17 15 137 -40 98 28 -328 -35 -182 -2 251 197 -374 48
5748 48 -183 -268 1 40 2 67 16 -13 -205 123 85 -179 -192 53 -152 -85 342 -17 77 -97 -118 -3 30 38 30 -313
5774 -313 -108 -12 65 -6 -115 -19 -43 -48 -26 107 -183 48 -121 91 -26 61 303 -108 -119 -10 -233 76 430
5797 430 -41 -48 26 -106 -9 -73 108 117 29 113 -227 -44 24 32 164 0 -165 -66 100 -61 2 -11 143 28 141
5822 141 187 -3 -149 197 -121 46 177 -261 -100 85 157 -216 119 89 -68 -74 130 -90 -36 83 -70 -151
5844a51L13j02O6J39k05N3j22J73k75J9J34n9L1Q2q5j04K57k18K5J37O0n9j46
5867c7M9r3J15K2j18k4K48k63K26p0J32j63M1L6q7k2J10j06Kq0O3r2L07j44K8
5892H0L74n34l5J64k91L42j52J99r6j19J66j19j26Mp5J82K45l70J22K01l0k09
5914g7j01J78j0m1M6J36k51L79j24l46J68Q0q8N7p4j8O0j25K78p7L1m4j93J66
5938A0K8k69K34j3J67k64J04P1p2k04L17k00J39j6o8J31pj29J06k03K14k54J89
5961A1P1m4J18m1j02L0K26n06J66J94j75j53J15J6j9L2L0Q3L6J0q2q4K41j79O4
5986E8P0j93J37R5j84J4k2nL7j75J88m8j15K04k21J25J51q8o3k0J4n4R4n3j62
6011b16K23R2j16L7j39J22j75K29k84J71K50k50J06j25J9j1R2j11L7j75K39J6
$$ plain form
5844 -151 162 60 126 265 60 113 -9 164 -111 -92 42 -17 14 96 11 -93 164 -54 -29 108 168 109 -37
5867 -37 12 -81 34 56 -62 -86 162 -101 125 55 187 24 65 101 14 -8 102 -4 -2 -82 -19 -111 196 52 80
5892 80 454 -80 -115 49 -242 100 -52 147 51 -68 98 -21 -147 -143 -218 -36 209 -161 -39 162 132 -77
5914 -77 -178 0 -10 -51 -5 131 -120 259 135 -211 -43 37 -51 6 -68 -86 -26 -151 127 50 81 37 -156 10
5938 10 38 -231 3 -10 157 -107 -3 68 -4 -208 109 -91 48 32 -36 95 88 -41 65 -138 76 -178 11
5961 11 82 38 156 115 13 43 269 -237 -71 123 -52 -205 -90 -74 -93 -61 -31 52 88 98 16 -68 173 -6 58
5986 58 128 -65 72 167 -17 -3 -25 -30 7 -168 20 -28 -143 61 -160 -35 116 28 -35 -55 -41 -95 -1 -54 -216
6011 -216 7 99 -17 20 -119 3 -172 57 -227 -56 194 -56 50 -75 -56 -67 25 -86 -49 -224 15 31
6033C1j14J33j20j17K9J08K9lJ11j04J6P1k7j69K59p6Q7Q0j60j86L4J26j09O8
6057cK2j4n6R0Nl1K28k88j07J66k0J15L7k12M4J79k28P0O6k1J07l42K50j93R1
6082d5J19k41K67j01N5L0j40O1l6O3kj06r2J76q3m3K79j87j39K99j01n9Q9j49
6106h6K58k15j9j2M6J73k5l16J06J56j50m3P8K23k34P6Nl0%P6k50J69K24l91K0
6131a61J60m1l4J80k02n7J07P0P5j4J75m59K15J11j83L6J22j39j25M67j20j59
6153B4n8K12j30k85K65k21K90Q7j92j4L33l33N5L3nP2j04O3p3M3O6j41N0J4k44
6178a93K13Q5j41J32k07P5M8R7k73K29N3J47m79K34J5k09j2L67j97Q2p9j7j4j18
6202a62L06k86J19K79k65j26mL29k68J05l5j8Q8k2o1n9J71j96l3L53j45l53M19
$$ plain form
6033 31 -83 50 -70 -187 -158 -50 -21 -24 87 -17 -1 70 43 -126 133 57 144 224 64 -122 -88 38 -71 -3
6057 -3 19 5 -51 39 44 13 241 -47 -154 12 -8 107 144 -68 -24 155 -73 -3 63 42 149 -193 57 -136 -45
6082 -45 74 -167 100 -1 54 84 -56 5 -31 32 30 -76 -168 8 -75 -118 161 -26 -165 134 33 -26 63 -86
6106 -86 172 -43 -62 -74 -28 145 120 -196 -90 66 -84 -127 -49 174 -60 16 21 -9 -9 67 -183 -14 210 -181 -161
6131 -161 -1 -42 -76 104 -98 -155 -48 22 97 83 258 -201 14 125 -58 -22 100 -39 -164 303 183 24
6153 24 -34 178 48 -237 28 -193 97 184 -8 -22 311 -22 33 66 61 133 29 92 19 62 128 -13 37 51 -193
6178 -193 20 105 -36 96 -111 -36 12 109 -164 65 118 265 -214 20 35 -174 -186 181 -16 66 -13 -30 -44 -162
6202 -162 144 -142 -23 256 -9 -135 -139 190 -78 27 -8 -26 62 40 -21 -80 91 -105 -138 215 70 -283 136
6225A36k70j03L47J5Oo7K2Ok33N9K10j60m0L10m85L86P9j27j74L3Q1m3K3N5j49
6250h3J38mk12K57M7k13J49J8k73K92P9o8j80m4J93k31K02L6k39K99j47j61R7
6273d8K8j66L18ll1k3k3%r6K47k41j00J79O1m1M6P3l25N7n7N7K45p4k22L7J01
6299an1J2J38n9j02j28K42j7P1l4k49J45L2n0q0L03k46J07L7p1m0r4J97mJ18j37
6325C9j8p2M4J9lj23L02l9j47R7j52k2J37j06j63J80k0J43j62J22j78L7J40k96
6349b41J10J29j41lJ74r4N3j4k6K11j51J77j08r4N2k23K10J44m3k67J25n1K33
6372A62j33J10J8k83N2n0j50K64l6J15j16j32n9L12P6k31J33o4M8m9O7O3q6J15
6396A46q6k1PJ24k99J69l9k16K67qL1J0OK10k61j26K74k54N2J23j67nk1Q4P8k70
$$ plain form
6225 136 -134 -237 110 125 131 64 86 92 -141 -82 128 -32 -72 238 -247 139 218 91 -83 -50 31 -12 11 66 -83
6250 -83 55 51 -161 96 143 -70 79 97 -176 116 195 127 -53 -97 96 -135 67 103 -136 163 16 -145 -48
6273 -48 -20 -186 132 129 98 75 52 52 -44 203 -38 -138 41 102 61 107 180 -145 -88 -145 -88 157 83 -139 -102 -1
6299 -1 -52 -40 98 39 -63 -191 51 34 105 71 -178 -33 -1 -51 -131 172 -74 33 70 -1 -41 -135 62 58 176 39
6325 39 21 -51 -7 12 9 -114 188 149 2 99 -53 -75 62 -44 -207 -27 -47 96 -66 56 -122 -85 55 -241
6349 -241 -131 -2 -143 -146 28 -66 -13 -27 -53 158 7 184 76 -18 34 -189 21 165 122 -145 -20 -71 162
6372 162 29 139 157 -126 -74 -124 -274 -10 -46 69 -47 -179 -238 74 150 -81 52 -12 36 -13 54 117 31 146
6396 146 60 39 46 170 -129 40 1 -215 52 44 75 85 91 301 40 -86 188 -66 -14 109 -58 -63 -84 0 78 -192
6422a92N5J30N8j91P3j32K23J95j38j09K5p6L9L2p9P4J64o4J28j87M7p9r3N2m2
6447h7L7p3R3j20J65ll7J13L5j80P1p1P8O6p1O5n3R2N1j9k64O0Q7J13l4j21r4
6474a01J82k90L04l44K44J62j77J36j23K0Q1l47K37j90J26J56o9n6N4J2P7J2m5
6497F1r8j8J50m2pn8Qk6K8R9k6N9j50J0L4j33L80j53j51K1k67L04o0n6J65j65
6523i1m2K59k10PJ08k25K01K4k11J70O2n9Q5n7j0r0o3J82O7q2J04k76K38q6j69
6548a64J40j27P4J37l02J41K54k28QK13j87j5J46q5L8j73K55r7n0K42l83L92k57
6571b8NJ10j46J3J7m4J19m1j15J85k28K41r6r6K36k02J7J30l27J61K73q6l86M26
6595A38j25j47K43m9l9k18K63J4j52N5q6R9J45j04P5o3j08J71o0M7k24R0O7oj48
$$ plain form
6422 -192 -137 -7 51 -140 -67 -199 24 219 81 -28 -3 -79 -40 -8 -87 -13 151 87 215 28 75 -4 -97 -45 -87
6447 -87 -50 -123 -30 -150 15 12 -25 88 123 -57 14 -57 21 87 16 81 28 120 171 152 -112 -52 35 148 114 -7 -101
6474 -101 81 -209 95 -249 -5 157 -20 116 -7 13 94 -253 -16 -206 -80 76 7 -49 5 17 94 106 61
6497 61 -37 -55 95 53 46 -12 -4 -30 -2 97 71 130 -20 -10 24 -109 271 118 -33 -12 -279 25 -35 -91 74 -91
6523 -91 -133 126 -84 -77 31 -194 7 31 -180 -10 52 -7 78 21 11 -79 -142 40 107 25 129 -147 91 5 -164
6548 -164 -24 -151 -77 60 -242 -101 153 -75 -67 146 -41 -56 90 5 43 -130 125 28 -22 220 -163 229 -28
6571 -28 -23 87 -59 -46 -29 -73 46 5 -110 75 -153 88 -8 -104 132 -70 -53 77 -250 -89 184 98 -288 138
6595 138 13 -134 109 60 21 -197 66 80 -72 -17 -103 -4 141 37 112 49 -59 112 52 99 -125 -35 32 26 -122
6620a22R8l4M9K11j02k4j01L5J01j15J23L7j52K00j16o4j04K63k65J29j02J18
6642F3n9p4R8k2j97N43m67L4K75m17N29l58K04j42J80k07J90k14L5j14K40mk22
6665a06K3n4N1J10o0L3j4j45J14p7K88k39l6J36q1n4q5K04n6Rq6J09K0L1j39J71
6691F7M1k32J36Q0k9j91J93K4o3J6N9j90J83j4k04l7J03L08m27K33j14%J4j35
6715a79L2K86K5j80J47Ok36K52r4j15J27j82J14j06n6J94J6L1Q7l01J44J04K6
6738A42j76j06K69k50mL5K14j53o5J91ok26J13L6N9M1j56L25n7k91k5R5J29k62
6762a28J67M8j56K01j28M9P3l85L34j46M3j59K46j35l4j6P5K38j54O4j04j45M21
6785B69k16O8n5P3k59r2K14p5J02J8m8NM4O9j90Qn7J1J24J24j67q2N2O9R0k11
$$ plain form
6620 -122 -24 -58 -9 202 100 76 -25 10 111 -4 119 156 4 204 88 24 -80 183 -82 47 -55 63
6642 63 4 -70 28 6 -191 352 -115 -81 194 -223 306 -52 152 10 190 -17 173 -41 -6 -120 120 116 -106
6665 -106 -83 -137 -86 24 -36 -3 -17 -162 -48 -125 163 -76 -112 24 -57 -111 -196 8 -48 -39 -125 -16 4 35 -104 67
6691 67 108 -124 12 92 63 -128 65 89 26 42 101 -89 94 80 -124 -161 -58 250 -177 56 -58 -58 -44 -179
6715 -179 -147 139 164 -16 131 137 -99 153 59 -56 71 -111 3 -103 -159 35 51 82 169 -132 12 116 142
6738 142 -34 -140 129 -121 -125 -90 124 -29 -94 97 91 -135 -22 14 73 114 -42 283 226 -65 -90 5 134 -128
6762 -128 39 87 -69 132 4 53 126 -259 75 -71 -28 -187 59 -76 -110 -126 -51 187 33 97 -7 -152 269
6785 269 53 121 66 139 -120 -212 2 -73 29 47 -1 4 48 117 -73 -65 -122 -111 13 137 -30 -112 -60 9 99 -112
6811a12K77l10K84l8r3l6K37r4o2q9J32p5nj66L5%K5P4k2J44j23n4J50o7L7k88
6837b39L49k3k6p0J32j79N9n8J34pm1j40J08R6j07L2K33j67k44L23j74k3n0J87
6861A05j75rj57J74L7pO4j07k9n0J72LJ11k76K88j24r5l9p1J32Q8K27k00on9k8
6887c1j6K12j95k12J44n3L12o4k3j59J54r9K10l40K41n1K0J11l05J44l1p0J06
6910ER3l7M3j51j01J42Q1j5R6j70P1k22j35M06k08n4J81Q5m6p6o8r4K12j31J97
6935A04p6P8J05j81Jo7J77l27J53j97K17N3O7j32R3L7n3J8K3j66J37O0k33J88
6959G9k09K48j96kj55M2j08J22K01j37J06m6K2m6lJ26j47J8M8J59j78m7K88k94
6983a09K27m6L1j50J73q6O9j54K89j86o6J41Q3j44j0j65P0r9k8%J36O4K0j51k8
$$ plain form
6811 -112 165 -145 139 101 8 -28 209 115 53 -36 96 21 16 -150 -115 -115 -90 -16 -38 106 -17 -71 79 12 49 -239
6837 -239 110 87 61 -9 123 -56 3 -55 79 72 31 -109 -1 95 -12 20 253 86 -158 165 -9 -32 -82 105
6861 105 -70 -79 -236 -62 -25 -32 32 -75 -104 -154 18 21 132 -144 144 20 -75 -114 -185 -53 35 262 62 56 -3 -31
6887 -31 -47 165 -30 -242 -98 -151 161 97 74 -85 69 -30 180 -160 81 30 50 161 -144 0 -31 -101 5
6910 5 98 61 104 -47 -148 -6 75 60 156 -14 57 -165 -300 106 -102 -156 25 110 64 -12 -80 -174 38 -93 104
6935 104 28 106 211 30 31 -36 141 -186 -33 -230 -13 40 107 -25 68 105 52 70 93 -73 64 124 -109 79
6959 79 -130 118 -78 -80 -235 -193 -301 -179 22 -115 -9 -55 -33 -79 -82 44 -103 -85 -37 122 -56 -103 185 -109
6983 -109 118 72 103 -47 126 40 109 -45 244 58 -8 133 216 72 62 -103 -33 -132 -160 -160 -24 40 60 -91 -119
7008a19L1K90k33q5R5J96JP1k72J67k02O9R8j53M8j78N2J16M3n2n1J37Rj59rM9
7034d1n1K07m3j7J02o6K8j14K1K5n5k4l6J55rj67J41j30L3m9J14P0J07k73J16
7059D4N6l7o2m5R3j47J92j1l26J20j9L74k57K09k18P6K6j35K61o7k32k25M55m4
7083H1j80J08p4j66K85O7j72J77o1j49K8J38p7p2P1m0j50J44k3o4J05m2L5Q8L0
7108H7j04K4OJ20j21J75j40o4j06J84k0mj50J50o6M7J18k36m5R6J28k48J46n0
7132g3J11l08K33R3o9k23J74j90P4J60J08j67nn4K70j96J30j5k23N4J60l3m3J38
7156A06k4k3j25L2J24q4O7k72J95L4K9j54K70k31n7K2J45K2r6J09l4p1J60q5k9
7181C0j20Q9o3K5Q2kR7m4n7j51J70k13J66j6j70P5J31j09j26M05m6k10l8k0K16
$$ plain form
7008 -119 -88 202 -31 -116 -21 175 176 247 -25 142 -60 9 107 -46 2 -176 -124 -8 35 -17 -68 69 78 -81 -90 -41
7034 -41 -92 115 72 55 157 91 119 5 26 51 -4 -28 -64 91 82 -85 56 -74 -41 -90 24 94 201 -72 44
7059 44 100 63 1 -44 49 -98 94 83 -243 -123 -142 232 -25 184 -34 42 68 -67 194 127 -105 -330 125 81
7083 81 -99 9 -65 -231 54 121 -51 126 65 -84 -56 82 5 -67 4 -36 -186 -42 -65 -129 -24 -66 -31 57 87
7108 87 -17 7 13 133 12 187 47 -17 -123 61 41 37 -113 37 -29 18 136 -100 -145 -49 79 -169 -23 -73
7132 -73 38 -270 -37 56 -13 -236 -62 -252 -178 -18 90 -77 -82 -136 134 -62 68 53 -170 -116 44 11 -32 106
7156 106 82 59 -66 -34 90 6 73 -199 -4 30 59 -95 175 -56 -113 -91 54 76 -20 89 55 -16 144 59 30
7181 30 -90 -1 -64 -39 43 41 138 94 37 -114 56 -157 9 -7 -177 -102 29 -80 -206 199 153 -57 -95 -115 101
7206A01n9j22K86j39j07J70j91K5r2J42J59k84J25J08o0j96K20O4j21L8M3k81
7228a71jK34J0j91j13K65n0J14j76M7n0m2M2n6R4j01J20j55J48N6OR5l2j08K7
7253A2m3M9r4K17k11K9j02m1J85J28Ln5j23R0r4J24p1j12K7J78j92J17P0k2J85
7278B54j83p8K7N4j99J31K5j04JNr7l6L39J21l09J4K51k15Q1l44J35K01r5K16
7302A95k48lP5J09j99K92j03n1k56J62J42l20L56j80k8m0P9k39L41j41J4J5Q0
7325E2q6Q1q8k0J29Jm2j10R4q1j54M14k64l1R4K15k89J49R1l2q9kl07K84P0l7
7351D2j06j7M9Q6j04j9J57k44J15j67J85L07l77J9Q2J58m19M86l20L1%q3L8K20
7375A19n8J6o0j86J03Q1n8j81J24J06%kO3l0k11R9j22K47j19n3N3O8K64l31M5
$$ plain form
7206 101 42 -80 206 67 -40 130 -61 -36 -128 14 173 -111 14 122 62 -134 86 150 29 67 110 -171
7228 -171 -172 62 72 -119 -232 33 -17 97 -79 -32 -82 -124 -82 -138 -44 -145 -25 -180 -32 24 30 125 93 -15 12
7253 12 -31 18 -76 141 -70 -41 -143 -184 1 129 132 77 -46 44 -50 74 3 -109 -82 96 -96 21 91 69 254
7278 254 71 -7 20 74 -125 6 31 -73 -72 -67 -164 -200 139 260 -49 -35 216 1 82 -262 -127 74 -21 195
7302 195 -53 -56 19 128 -71 221 118 67 -189 -27 115 -205 151 -29 -57 -97 -18 -257 84 -57 -43 -28 52
7325 52 -34 47 -41 -61 68 69 27 -83 11 -70 -224 190 -74 -105 -11 204 -85 64 155 123 34 32 -275 9 79 42
7351 42 -64 -81 -32 54 -50 -69 88 -156 -41 -208 -23 284 -93 -74 8 166 -253 233 -87 -56 -56 -139 -101 119
7375 119 61 77 17 -169 -66 15 -43 -224 -100 6 6 4 67 37 -174 -75 -197 50 -69 -122 -69 -1 263 -68 -23
7400b3l5J00jkm7j13R0k4O7k1R8j75j56K03j20J77p4Q4o9k66K57J9J34J13k62
7425d6n1M1K1m4N1J42j44M0J56j36n7M6r0J82j58P1JOj22M7M8r6J95l71K25p9
7451a22K42k28K30k6l13K53k6N4mj51r3L35r9j73M27j08Rn05L71l1k07M2O8J90
7475A35j05r5R3m4l3J0O9k19Q0Qk05L93O0p2J85j69j33P8m2J66k60J44J21k17
7499e2q5J70M8j29J7J45j35j9O6k8J38k3j20o5J3L2m1K46k59J52M9m6qjo1N0Q6
7526A40j35RL6N0k05K8L8K59k44l1J00kk1k9j55O4m7K09r1j12N8J53j88J7K15
7551A16k05j21J68l6M6L7P1o1j8j3m1Q1J3M3j22n8J02M4M5j91J75K0k72J12J32
7576F7k11L60m66%L12j02L6o6N3M3j04M1r6J31K0p5R1j40L54j61L4j34K9J09j90
$$ plain form
7400 -23 -58 42 41 39 -8 -121 -31 -55 12 -9 89 -86 -242 -39 -159 18 -56 28 -41 -307 -50 -31 103 216 -46
7425 -46 -97 -56 -35 -79 -28 114 -30 10 166 30 -27 19 -71 111 -47 24 25 31 -91 -44 4 -92 103 -268 -43 -122
7451 -122 120 -108 122 96 -217 36 10 64 60 -91 -184 151 52 -121 306 198 207 -298 73 42 -165 -123 -55 135
7475 135 30 -65 28 -16 -49 -39 30 -189 -109 -101 -306 87 147 75 260 91 -42 36 -6 160 -100 44 165 -52
7499 -52 -137 33 81 -48 -31 114 -21 -40 26 -2 136 113 -7 -72 -59 -27 -68 178 -81 71 120 74 66 65 4 54 140
7526 140 5 14 50 100 -105 -77 -39 220 -24 -55 45 43 22 -7 -162 -98 -145 64 -27 -139 -81 72 -116 -99 116
7551 116 -89 -210 -42 -78 -32 5 76 15 -3 -16 -57 24 37 80 -42 -100 2 46 91 -100 75 95 -177 -65 67
7576 67 -144 216 -250 -250 62 -40 -4 -70 -17 26 -78 -37 -133 -2 18 -57 34 -106 248 87 121 -13 16 125 -65
7601f5R9N4j41Q0k9r8P4j31K06N5p0m8k26J13P0o0J17k21K40n7j09K34m4j14J79
7626A08j80k04J56J88J2L0KJ7l69K81J92k89l0j9J33j70K71J8k53J04J87l34p6
7649b25L31l24R5J08k44L26q3p4J63j30Q3oP8k45m0k1M37j10k09N8M8k0k2P3J09
7674A56n3k03J47J1j10K01j14j27Rm3L53l59N6J80j06o1J56j13J09p7r3K49j47
7697B1l5on1J19P1j73L41m19J45j75P4l6PJ58O6k52J79Q7j63J61l0k8j34J60j68
7722h1Q1m8J22o7M4k2j6j13K26n3J6k5n1jK7k13j49L60m5j00K26q8j59K33n9j16
7748g1N6J5J52k91J23j85L37j3J09k17j39M20l97J43J6l6j3M8j13k4j50J89K38
7771A97k25J82J02m19K38j5j93J08J99k90K17k48Q8j9J2p1O6J40k30J36J78q9
$$ plain form
7601 -65 34 88 -53 27 -2 -100 -26 -157 49 104 34 -14 -240 -127 -57 -117 0 -221 19 -38 -147 87 43 -71 108
7626 108 -72 -276 -120 68 80 110 112 129 -240 41 233 -56 -86 -105 28 -142 129 147 -106 -2 185 -149 -225
7649 -225 106 -218 -123 -15 -259 67 -16 -90 73 -57 26 20 98 -147 -187 -208 229 119 -90 -32 16 -4 -26 47 156
7674 156 103 -100 47 58 -52 149 35 -92 -83 -126 227 -132 -76 104 -2 -63 93 -20 89 12 -81 168 21
7697 21 -14 -20 -71 48 119 -54 287 -132 13 -162 -88 -124 -117 41 107 -145 34 121 -42 119 89 61 -73 87 -81
7722 -81 0 -48 74 7 51 29 13 -100 126 73 89 64 13 12 39 -174 -323 37 -8 -108 118 30 -129 104 45 -71
7748 -71 -15 0 152 -139 -16 -201 136 123 232 15 -124 296 -101 42 58 22 9 57 -56 -80 -230 -41 197
7771 197 -28 154 256 -163 75 60 -133 -25 174 -116 101 -147 -59 -78 -66 -137 -71 69 -161 -25 153 64
7793F4j38rJ85p8O1o3J16k44M0J15q4l3K08k29K38j42Q3p9o4N3J0QL9q4P3p1k6
7820e1K0J03p7J8j15m9J20K4q0J12l3j05J33j3r7kl1K28l7r7j29K15n7n0j8j02
7846a70r5K56r4J10n0J79j29M4M2j99P5j1L2j01J05J42l48M08j13j19J35p0j10
7869h1J13j52n4K25L4m2l07J56J40K2j12J47k25J14Q7j30P2J18l5k00n7J23J80
7892A36j27l2p9N7K2J60k64Q9J9P6Q5r4j62O6J64j47R5l3lJ11Q1l0l24J13J15
7917I4q1L2j66J37J94k60J29q0K22l61K33J7j88p2P6QJ75l20K07O2q3L20m00J00
7941ej40P5J29K56l81j5Q0N9P7j2j00J55nk62J43J13M7K0l68R6J02l6m6m6R4P5
7967A05k7k62j1K09n4J81k23J13L48k85k59L32n8k2k0j89J33j38Q3J62j15j14
$$ plain form
7793 64 -74 -83 102 24 85 22 138 -106 -66 49 -35 -68 140 -89 149 7 90 11 -53 0 10 18 57 -27 46 -25 -51
7820 -51 -31 72 -5 13 -102 -151 -31 -7 -87 25 -8 -113 20 7 -90 -92 -123 105 68 -29 -158 57 0 -50 -68 -170
7846 -170 -265 -9 -103 7 -43 136 7 51 93 -106 -31 -42 -10 -111 -6 136 -212 196 83 -36 99 29 -81
7869 -81 32 -120 -174 51 85 43 -264 -108 32 54 -58 89 -136 -22 65 -65 7 125 90 -110 -167 -44 136
7892 136 9 -23 -102 -45 -23 137 -127 -38 -19 57 142 48 -114 -48 116 -31 64 31 28 139 220 190 -134 -21 94
7917 94 13 45 -121 16 210 -50 79 -1 221 -140 93 110 -78 -150 -74 -66 109 -211 -4 58 -25 295 -105 -5
7941 -5 -145 -70 59 315 -66 -81 -1 58 135 123 23 178 173 -89 54 167 214 234 -134 -38 64 28 -18 -64 30 105
7967 105 78 -184 -195 14 -40 141 -82 31 379 94 -165 167 109 87 67 -122 11 -127 -44 118 3 -111
7989a11Q8k8J43j3j10l4K8J30J05Jk45j01J59jo0Ll8J35J13j42o9J62pj62j3K5
8015d2Q4J00o7J1J1j62J53k9n7l7N3R0j80K7P2k08M8K11q5J71k90P7j56k8J55
8040g8J14j60k4P1M6K39k86J13j42K57pj17p5J35m3o3O2j4pJ28o3J68l39J34j
8065D8m6k1J78j66K3J55n9j4k19O5J31o0j76J5J47%j72MK77k05j38K33Q9j01Q
8090do9N6j01K12j31l0k1L00k23M0q5q0K00j11R1N2j74o9J40j29J29Q0o7j56K15
8115F5J29o5r9j33K09j54R2m3m6J65j14Q2J3j12J23m6r8K86k09j75N9J21m7j2
8139iJ21l8n6j7j26R0K64k68K67j52J2j27L8J74p7n0M1K0r2P5j52p7K62j91k4
8164i2J71J3k25N4J82n0M9j82J00o9J97l07K8K35l5J0Q8p4j18M6R6j39j58J48
$$ plain form
7989 -111 -23 -51 92 79 -31 -65 -37 93 198 199 -46 -147 12 11 -49 -46 -84 51 164 22 -47 115 108 -54 -67 -42
8015 -42 42 142 75 86 97 -65 88 59 2 -35 18 108 -72 -45 27 -181 -133 78 -7 164 -126 -49 -205 -233 -78
8040 -78 36 -124 -148 -77 -31 208 -78 35 -107 150 143 26 -49 86 43 -20 42 28 21 149 86 254 -85 49 48
8065 48 2 -19 159 -7 16 171 112 98 -121 -56 75 15 -161 -146 1 1 -171 -167 110 -95 -233 0 89 -12 -4
8090 -4 -73 -17 -118 94 -37 -67 -88 212 -11 29 -56 -136 64 -47 44 96 -78 -147 -7 -136 -7 73 6 -150 65
8115 65 194 129 30 -103 106 -48 44 1 -45 120 6 88 101 -11 112 66 -32 254 45 -130 -71 50 3 -9
8139 -9 112 74 18 1 -125 -35 229 -39 228 76 88 -39 -1 173 96 46 87 107 15 90 -62 -139 123 -68 -92
8164 -92 79 92 -133 -79 103 53 102 -80 20 -49 148 -159 -131 104 69 79 167 93 -25 21 117 -22 -180 -32
8188c2q8K18Q
$$ plain form
8188 -32 -120 98 106
8191A06
$$ Imaginary data points
##PAGE= N=2
##DATA TABLE= (X++(I..I)), XYDATA
0@%%%%%%%%Qj6J6j6K4l2M0m8N6p2Q8j05J29j58J87k21K57k98L48m04M66n38O18
31C29p05Q02r09J029j162J305j464J641j833K042k270K519k792L091l417L774
47A980m162M587n055N569o135O762p457Q233r107J0094j1222J2528j4058J5876
61H433j8083K0828k4347K9054l5708M5904o3693J03672l59405l3960L14616k68481
73b81170K30401P5428j83039J09497L02682j25194k7506J93959j84858k66774
83a56574L34603P0266l25493N4528L8319k45741J46093J95023j53828k0689J51978
94H8485j86998j91190K41473R9986k07709J23210J09523j54948J56595J66728
104B45155j89451J2832J34355j70972j18417J86017L2498j92463J8776J7698j77991
$$ plain form
0 0 0 0 0 0 0 0 0 0 8 -8 8 -8 16 -16 24 -24 32 -40 48 -57 72 -86 101 -120 137 -161 187 -217 249 -289 329
31 329 -376 426 -483 546 -616 689 -775 866 -967 1075 -1195 1324 -1468 1623 -1794 1980
47 1980 -2182 2405 -2650 2919 -3216 3546 -3911 4322 -4785 5309 -5913 6615 -7443 8433
61 8433 -9650 11178 -13169 15885 -19823 26081 -37612 66060 -293345 -327305 -12689 -281170
73 -281170 -50769 24659 -158380 -48883 253799 128605 101099 295058 110200 -156574
83 -156574 178029 248295 -77198 -22670 15649 -230092 -83999 111024 -42804 -63493 88485
94 88485 -98513 -289703 -48230 51756 -155953 -32743 76780 -78168 78427 245155
104 245155 55704 68536 202891 31919 -86498 99519 132017 -60446 -41670 -23972 -201963
115b01963J07229J49306j54549P2615J81412j47373n0939J65739k1605j20457
125b0585M0984J0826r3600J09630J05927j65901J3345J14660j76023m2820J51688
136D8131n5665o4541N1545m8338o1925R1307N0663j07019M1576J33260q0764J1583
148I813J54090o2490n9761L9207r3010m5716Q4296p408q2204J9473N4910p3095
160f1895k0348R2871m8941l4226P9611m3525q019J01311l2202o6635L0285K3704
172A1991k2676J4145O5426j6478k8944M6966n2637m5886O7995m3009o0016N0822
184a2301M425j8650J8994R100j1193p968K7186j1722j4373O8789r824m7855M4675
197C9283j8064m1246K4639j2765n798K4226q85q798p201J7752r717l6473K9134
$$ plain form
115 -201963 -94734 54572 -99977 -27362 154050 6677 -44262 121477 99872 -20585
125 -20585 20399 31225 -62375 47255 153182 -12719 626 115286 -60737 -103557 48131
136 48131 -7534 -72075 -20530 -68868 -130793 -39486 11177 -95842 -54266 78994 -1770 9813
148 9813 163903 101413 41652 80859 -12151 -57867 26429 19021 -63183 -43710 11200 -61895
160 -61895 -82243 10628 -38313 -72539 7072 -36453 -44472 56839 24637 -41998 -11713 11991
172 11991 -10685 3460 68886 52408 23464 70430 17793 -28093 39902 -3107 -63123 -12301
184 -12301 -7876 -26526 -7532 1568 -9625 -17593 9593 -2129 -16502 52287 42463 -5392 39283
197 39283 21219 -20027 4612 -8153 -13951 10275 9390 592 -6609 11143 1426 -35047 -5913
210e913J38k1310M7163l657j6929L0486k4656j9054J8620K026O481m402K978m42
224A1529k2816J5759r847k9676L0900j1227k0543L7250o103r318J1161j2915N485
237a0361N748P979J2037j0802K1991K941k9457K1501j0681l0410J9782r215n725
250a4672J6076j1077J290k934O15J5076j2898J3595J2102k2228K0565J582k4291
263g199J4416j1422j0427J4671n800P999k250r521J2558j2903M864J3623k1241
276a2632J3003O324j5203K1776j444p002J1823j1633N840K197j2954R000j4265
289e170o111J0884j8481O884M046j6310J8722J068k587J8289j0155M613P469j0858
303B303J2490p839j0160R067j5517O366P954j5408J3946l888q852J7431r505J485
$$ plain form
210 -5913 -5775 -27085 20078 16421 -508 29978 5322 -13732 4888 6914 13395 8993 11971 11529
224 11529 -11287 4472 -5375 -35051 -4151 -15378 -35921 1329 -4774 -14092 -2931 -15846 -10361
237 -10361 -4613 3366 15403 4601 26592 29533 76 21577 10896 -19514 268 -8947 -14672
250 -14672 1404 -9673 -8383 -11317 -10702 4374 -8524 5071 17173 -5055 15510 17092 -7199
263 -7199 7217 -4205 -14632 39 -5761 2238 -12 -9533 3025 -9878 -5014 8609 -12632
276 -12632 371 6695 -8508 13268 11824 4822 16645 5012 10852 13049 95 9095 -5170
289 -5170 -11281 -397 -18878 -11994 -7948 -24258 -5536 -4468 -7055 11234 1079 5692 13161 2303
303 2303 14793 6954 -3206 5861 -9656 -3290 4664 -10744 3202 -686 -9538 7893 -1612 -127
317a27P977j2316J3244L38o974J0316j7153j462P045j4120J4876J158j2390J3361
331C773p845j694P728j2070Q855p41n564J7611r867j733Q149j8823R141P748r848
346e180J4039j209p62P223r671O581q012j4100J5035j0870p66J9589j7093k21
360e417P157j4081N836J050k75N362m979J4059n348j5081J8243j3227r450K8952
374A2801m002K302J5700j1028l075k719m717p437j4782J4594l069j7450K6630
387C748n567k0567K1882n154o076K3348K083n729j088N442p308k3817J2758j525
401g570k4285K9833O894j9188K9031p85k7109R767P793q440m185J5648N217j8467
415e846J8251j59l5260K6875J0391l2629K6892J7124k8518l384M139j3936j2132
$$ plain form
317 -127 7850 -4466 8778 9116 2142 12458 -4695 -6157 888 -13232 1644 2802 -9588 3773
331 3773 -4072 -5766 1962 -10108 -1253 -1994 -7558 10053 186 -1547 6602 -12221 -3080 4668 -5180
346 -5180 8859 7650 6888 14111 4440 11021 3009 -11091 3944 -6926 -7692 11897 -5196 -5417
360 -5417 1740 -12341 -6505 -5455 -5730 -368 -5347 8712 3364 -11717 6526 -6701 -16151 12801
374 12801 8799 11101 26801 15773 12698 9979 5262 -2175 -16957 -2363 -5432 -22882 3748
387 3748 -1819 -22386 -504 -5658 -11734 11614 13697 7968 6880 12322 5014 -18803 -6045 -7570
401 -7570 -31855 -2022 4872 -14316 14715 13930 -13179 -3412 4381 -4059 -8244 7404 12621 -5846
415 -5846 12405 12246 -23014 3861 14252 -18377 8515 25639 -2879 -6263 -2124 -16060 -28192
428b8192J3735L383k0280L3449K3750l5937K2147K0359m1873P748K2646j6390
440D545O556J6383j5180k2314J8904J1037l8210J3607K9833l6572J0104L0305
452B8998l4668j882J3433l5639j0118L4985J3989j8888J6234K6287l2462r9L0662
465C0832l2177K758L1126l6866q349L4675j5404k8945O044P891j7905J0191L3883
478A7754j7042K342K8851m2364j5689M0650j6694j6748K1429l165q957J0357N571
491F295j9058j588J7649k9145n090N0744q818j8397J7292k1858r428K3667k716
504d51k301J8002N553k2226l166K9727j3079k3029J2775j8300O45L8883j3445
517I588j3300J6200k0176k2080J4267K1980J511m660N148j6452J689L3916k1727
$$ plain form
428 -28192 -14457 -11074 -31354 2095 25845 -10092 12055 32414 -9459 -1711 20935 4545
440 4545 11101 27484 12304 -10010 8894 19931 -18279 -4672 25161 -11411 -1307 28998
452 28998 -5670 -7552 5881 -29758 -39876 -4891 9098 -9790 6444 32731 269 170 30832
465 30832 -1345 1413 32539 -4327 -12676 21999 6595 -22350 -16306 -8415 -26320 -16129 17754
478 17754 712 3054 31905 -10459 -26148 14502 -2192 -18940 2489 -676 -9633 724 6295
491 6295 -12763 -14351 3298 -25847 -30937 19807 10989 -7408 9884 -11974 -21402 2265 -451
504 -451 -2752 15250 20803 -1423 -4589 25138 12059 -10970 1805 -16495 -15850 23033 9588
517 9588 -3712 12488 -7688 -29768 -15501 6479 7990 3330 8478 -7974 -6285 27631 5904
530E904j7492K9372j6227j3239L1703N046r154k102j7943j8708J4278K9431j6265
543D604j3561K7968k0092k2730K9390q487j3640J9667j5897j0264L3879J5863
555B6700k3104j0320J4946j6950j1879L3884o303j4156K4808k8199k6948L8130
567F09K863k4111J3982J3323j0384M628K1542j5694j3504K2425k8837k5156N0328
580A2014J990l1355K2901k056k5941J6236J2016j7285P179K5037k4822j8560M5350
593B2704o342l9926K7984p34k6591L7772J3371k8729J3591J2711l5916j2577L7908
606A5226o009l1918L1100Q57l2691L7048P744m2848K3860K0853l4090N294L5251
619B9677j7250k8250K0414m711l1122L6324J1971m2627L1239K5583m3223R108
$$ plain form
530 5904 -11588 17784 1557 -11682 20021 25067 15913 13811 -4132 -22840 -8562 20869 4604
543 4604 -8957 19011 -1081 -23811 5579 -2908 -16548 3119 -12778 -23042 10837 26700
555 26700 3596 -6724 8222 -8728 -20607 13277 6974 -7182 17626 -10573 -37521 609
567 609 3472 -20639 -6657 6666 -3718 910 22452 6758 -6746 15679 -13158 -38314 12014
580 12014 14004 -17351 5550 3494 -22447 -6211 5805 -11480 -4301 20736 -4086 -22646 22704
593 22704 16362 -23564 4420 3686 -22905 14867 28238 -491 13100 25811 -10105 -22682 15226
606 15226 9217 -22701 8399 9256 -23435 13613 21357 -21491 2369 23222 -10868 -5574 29677
619 29677 12427 -15823 4591 -120 -31242 5082 17053 -25574 5665 31248 -11975 -2867
631b867K9888k9764j4273K4709o514j9034L0361M724m3004K3240K4171m3147J4432
644g078L4197l2443l232K4785k1495j5247K3179l545k9533K3588K4174l2269J2278
657b641L1087l3578j812K6288k5629n807K7248j1190k0558J6871Q971k6383P529
670i604K6943k4424l09K9330k3998n133K7620j9678j6951J8567j596j5969J1928
683c274J6610j7723j059K1973k0692o607K8309j7541j3536K3627q752j3629J3643
696A349K205j2791M649J4964j1566l534K3355j3928j3719K2638j1187j5156J7202
709D481m818j0115J1109L471r508j000J1778p152p995J8966o340j4785J7600l916
723A776j1197J5067j844r847N377L930j995j663R241l603j3106J1846m52j1862
$$ plain form
631 -2867 27021 -2743 -17016 7693 1179 -17855 12506 17230 -25774 -2534 21637 -21510 -7078
644 -7078 27119 -5324 -8556 16229 -5266 -20513 2666 -879 -30412 -6824 17350 -14919 -2641
657 -2641 28446 -5132 -6944 19344 -6285 -12092 15156 3966 -16592 279 9250 -17133 -9604
670 -9604 17339 -7085 -7394 21936 -2062 -7195 20425 747 -16204 2363 767 -15202 -3274
683 -3274 13336 -4387 -5446 16527 -4165 -10772 17537 -4 -13540 10087 1335 -12294 1349
696 1349 3554 -9237 -4588 10376 -1190 -4724 18631 4703 -9016 13622 2435 -12721 4481
709 4481 -337 -10452 657 4128 -5380 -6380 5398 -1754 -9749 9217 2877 -11908 5692 1776
723 1776 -9421 5646 3802 -6045 -668 3262 1267 -396 8845 5242 -7864 3982 3530 -8332
737h332J4777j621j2634R544L41m254M030J395j941n603M981K806r609Q019J066
752B965j2584J0091K626p743P902n87m230K288M74K136l398J515M203r119M638
767A177L378j0469O446K547p079O748j056l365J651k777K845k232q85N101o018
782c988K239N367p960L704J197o878N856M15k55L702l760K513j505l411N692m254
798a326j08O064n712L320J531o228K795k828r81M513l152M026O37n457M692l230
814a444k948M844l889K831L631l002L933l484l231L505m683L542M014m634N034
829D019r05l688L686m387m59J688k970O189q14j858M174o905j291L292m704M423
845e10J680k696M479k684m63J93n873M658k43j754Q208k326j131L060o210J225
$$ plain form
737 -8332 6445 4824 -7810 1734 2075 -2179 1851 3246 1305 -4298 683 3489 -6120 1899 2965
752 2965 -9619 472 3098 -4645 3257 2670 -1560 728 1202 3338 -60 1455 5658 -3461 1177
767 1177 4555 -5914 532 3079 -4000 2748 1692 -1673 -22 -2799 46 -2186 -3071 2030 -3988
782 -3988 -1749 3618 -4342 -638 559 -6319 -463 -48 -303 3399 -361 2152 647 -2764 2928 -1326
798 -1326 -1434 4630 -1082 2238 3769 -2459 336 -2492 -3473 1040 -2112 1914 2551 -2906 1786 -1444
814 -1444 -4392 452 -3437 -606 3025 23 3956 472 -2759 746 -3937 -395 3619 -1015 4019
829 4019 3114 -574 3112 -1275 -1734 -46 -3016 3173 2359 501 4675 -2230 -3521 -229 -4933 -510
845 -510 1170 -1526 2953 269 -194 -1 -5874 -1216 -1459 -3213 4995 2669 1538 4598 -1612 -387
861c87J258k434L893j655K549K520o789K262j391o198N955n95k24O129l234m37
877A222j259k949L002m638J058N655l763M446K385p176L169r34m250L782N46L151
893C447r20l036M507n256l102M999o302K581P975m709J509K582l645k720l033
908e123L723m99k498Q011l951k941R042p963n668Q123k204r89M391J956j077l678
924a345K964l964m992J1661k536p096J3973o23q376N217k490o333J571L214j738
939h93k226R317k981j2141J0843J382j2711J0237L516p429Q199L302q328j882
953a795N472l801q863J2339N532j2623R052M049j5461P101M364j3776M283J0399
967F272o041n419R412R10j3935O260O433j4249J0585J0745j7317N179J1658j5539
$$ plain form
861 -387 871 -1563 2330 675 3224 5744 -1045 1217 -174 -6372 -417 -1012 -1236 4893 1659 1222
877 1222 -37 -2986 16 -4622 -3564 2091 -1672 2774 5159 -2017 1152 218 -4032 -250 296 3447
893 3447 2527 -509 3998 -1258 -4360 639 -5663 -3082 4893 184 1693 4275 630 -2090 -5123
908 -5123 -1400 -1899 -4397 3614 -337 -3278 5764 -2199 -7867 256 -1948 -2937 1454 3410 2333 -1345
924 -1345 1619 -2345 -7337 4324 1788 -5308 8665 8042 -334 4883 2393 -3940 -2369 845 -893
939 -893 -3119 6198 3217 -8924 1919 3301 -9410 827 4343 -3086 5113 8415 87 -1795
953 -1795 3677 -124 -8987 3352 8884 -3739 5313 9362 -6099 1002 5366 -8410 -4127 6272
967 6272 231 -5188 4224 5134 -8801 -2541 3892 -10357 228 10973 -6344 -1165 10493 -5046
981e046m986J0628j957p223R511N777j3365P088R405j9809L627J6396j6358j570
995g882J6785o508o344R069k680j2783Q166R820j4721M240J7748j7936n769J6953
1009H158j2252o472J4810n656q333J3470N239j4137K650J3537j5812m489K0809
1022A1522q856o205J7897r435j2409J4509j627j3998P652J0470j2229k621J5594
1035A0264j0828r314J7308r799j1462K0241j185j2998J2429N108j3390J51R623
1048F148q366l929J6364p046j2109J7066l773j6618J3625K592j2681P419O917
1061E609q125J275R535q260r734J4297j404j3105J5269J986j5314R253K470j2212
1075h460N409O313q463j696J1803j872r829J0473K20j3704J1121M925j1933R389
$$ plain form
981 -5046 -10032 596 -1361 -8584 927 6704 -6661 427 9832 -9977 -6350 10046 -6312 -7882
995 -7882 8903 2395 -3949 5120 2440 -10343 -2177 7643 -7078 -2838 14910 -3026 -8795 8158
1009 8158 -4094 -10566 4244 -1412 -9745 3725 8964 -5173 -2523 11014 -4798 -9287 11522
1022 11522 2666 -3539 14358 4923 -7486 7023 5396 -8602 -950 9520 -2709 -5330 10264
1035 10264 -564 -9878 7430 -2369 -13831 6410 5225 -7773 4656 9764 -3626 -3475 6148
1048 6148 -2218 -6147 10217 3171 -8938 8128 4355 -12263 1362 3954 -8727 -1308 5609
1061 5609 -2516 -1241 8294 34 -9700 4597 3193 -9912 5357 7343 -7971 1282 3752 -8460
1075 -8460 -3051 3262 -5201 -6897 4906 3034 -6795 3678 3898 -9806 1315 6240 -5693 3696
1089C696N393j2433K389P654n742n282O877n41q082R378L239j3591O921M025j4246
1104a0345O566R199q071P79N554m241l335P142Q39r513O874M989j1420O466P808
1119I291j1913J679M927q542J410P513l121n054M869J456q832M791O447j0361
1133e440L562P241r697L643P552q347j559M995k137m018N096L577p495J747N611
1148D331r439L240Q316r526N94P341n885l17N606j653m513J997L267n690K511
1163A80P004r103j158P478p581N13O993n758k496L999m60k349K924L585o387j102
1179c718P834n512k08Q663p762k728O959l607q15N030j474m942J78M386l409j081
1195b206O725p522m028Q615m259j551P271m015l874M031K157j378Q29L421n099
$$ plain form
1089 3696 9089 -3344 -955 6699 957 -4325 2552 2011 -6071 3307 6546 -7045 -124 3901 -10345
1104 -10345 -3779 5420 -2651 -1872 3682 -559 -3894 3248 4087 -5426 1448 6437 -4983 1483 9291
1119 9291 -2622 -943 3984 -4558 -3148 4365 1244 -3810 1059 2515 -6317 -1526 4921 -5440
1133 -5440 -1878 5363 -4334 -691 6861 -1486 -3045 1950 -187 -4205 891 4468 -3027 -1280 4331
1148 4331 -5108 -1868 6448 -3078 -2484 4857 -1028 -1345 4261 2608 -1905 92 3359 -2331 180
1163 180 7184 -1919 -3077 4401 -3180 -2667 4326 -1432 -3928 71 -389 -2738 186 3771 -2616 -3718
1179 -3718 4116 -1396 -1604 7059 -703 -3431 3528 -79 -894 4136 2662 -2280 -2102 2284 -1125 -2206
1195 -2206 4519 -3003 -7031 1584 -2675 -4226 3045 -970 -4844 -813 1344 -34 795 4216 -883
1210h83l853P913k455l680P477m648m512N788r32j606K605K70k447j201M808r11
1226A733l638N392k539n689O849q29k900M694j418l066P89P34p53j756L355k00
1242G58m252N178K79m224N161n53l999L597j90q79J190J1o16l110J138J098l771
1259c184L956J495m810L960J64l582K859r05k078R82K67J193j477L90J162m315
1275c923K142K180l703M081J209k931K833k83j485M31j271R77p13O21K578l301
1291e58P15J062m155J756J178k953K527j01n58J156j114Q90j219q68K959j052
1307c35J297L068l579P02P37l197J755j24m24J174p85J639o73k092K254k646n73
1324a802L445k126J233J580k899N48n28j286Q37j242K523O58j250L030k064k036
$$ plain form
1210 -883 -4736 3177 722 -2958 4519 -129 -4641 1147 215 -1391 1214 1484 -963 -2164 2644 1733
1226 1733 -1905 3487 948 -4741 2108 1279 -1621 3073 1655 -1411 -622 112 -641 -2397 958 758
1242 758 -3494 1684 1963 -2261 2900 2347 -1652 1945 1755 876 2066 2077 1461 -1649 -511 587 -3184
1259 -3184 772 2267 -2543 1417 1581 -2001 858 -47 -2125 -1143 -876 317 -1160 -770 392 -3923
1275 -3923 -1781 399 -3304 777 1986 -945 1888 1605 120 551 -720 257 -456 165 2743 -558
1291 -558 157 1219 -2936 -1180 -2 -2955 -428 -529 -1087 69 -1045 -155 -1374 -2242 717 -335
1307 -335 962 4030 451 1153 1890 -1307 448 324 -100 1074 289 1928 1255 -837 1417 -1229 -1802
1324 -1802 1643 -483 750 2330 -569 -21 -549 -1835 -998 -2240 283 941 -309 2721 657 -1379
1340a379K246k230J61K372j419J271j64l32P13k688J124L67k123M217K01k108
1356B29K543k060k261J351j189O34M03L7J291j956J021O7l904K422J075k336L708
1373A075O29j383J104j161j69l10P16J565j895J953K303l940O19k3l928J724Q28
1390b93j308J902j78k22j353n37J924l047N25L190k236K439K309l799P26N12j868
1407a314R73J019J334n35j071J912k794q33K219l651M63L369k118J067J046j770
1423f84J75j135N59O52n29L064j457r88K995l079j291J951j860Q31J080o14J150
1440H20m06q3j04j765K307Op72L174n72o66Q09l325N8Q25j686J399o94J03J118
1459E46k174P11L54j563J538r87J113K642j503L25L2k781J797O5r47K750l60k59
$$ plain form
1340 -1379 867 -1363 -1202 1170 -249 1022 858 526 1239 -1449 -325 42 -2081 2136 2337 229
1356 229 2772 712 -1549 -198 -1387 -753 -350 -313 978 -978 43 110 -3794 -1372 -297 -2633 1075
1373 1075 1704 321 1425 264 95 -215 501 2066 171 2124 4427 487 1106 1083 -2845 -1121 -293
1390 -293 -1601 301 123 -99 -1452 -1989 -65 -3112 -2587 603 -1633 806 3115 -684 42 554 -1314
1407 -1314 -341 678 2012 1477 406 2318 -476 -1309 910 -2741 -2278 1091 -1027 40 1086 -684
1423 -684 -509 -1644 -1085 -433 -962 2102 645 -343 2652 -427 -1718 233 -1627 -796 284 -330 820
1440 820 414 331 227 -1538 769 775 3 3177 2605 1939 2748 -577 -519 306 -1380 19 -675 -572 546
1459 546 -1628 -917 -563 -2126 -588 -1575 -462 2180 677 1002 1034 -1747 50 115 -832 1918 1558 1299
1477A299k84o88J001k016l80R05k193K195K003l585J890N77l407J104J013N52
1493a4m4L73O18k063P88J314m157J886L456l855J918L018k694J46R05j659j329
1510a393J046J596k761P84L832m782m24M159l670Q31L866k837p34K285l10l044
1526a556N88K409m596o51N619k909l71N097m575j676M644j489j972L181J073l610
1542g94j65M375l354k056N640m381k642P062k311m167M520j732m347J950L189
1557G87l145k99N182l423k570P585j878n250O327j099n034M655J373m692O24K827
1573A970l555j882O391j714n238O674j47o098N540Q07o188K881K887m083K54M991
1589C490k301m654N636k40o238N782J708p528M083K609n984J697M445l363k029
$$ plain form
1477 1299 1015 327 1328 -688 -1068 -163 -2356 -161 1842 -1743 147 724 -2683 -1579 -566 -14
1493 -14 -58 315 933 -1130 -342 972 -3185 -1299 2157 -1698 220 3238 544 690 1595 -64 -1393
1510 -1393 -347 1249 -1512 -728 3104 -1678 -2102 2057 -1613 -782 3084 247 -487 1798 1488 -1556
1526 -1556 -968 1441 -3155 -3806 1813 -1096 -1467 3630 -945 -2621 2023 534 -1438 1743 2816 -794
1542 -794 -959 3416 62 -1994 3646 -735 -3377 3685 1374 -2793 1727 -5 -4352 -2402 787
1557 787 -2358 -2657 2525 -898 -3468 4117 2239 -3011 3316 2217 -2817 1838 3211 -1481 -857 1970
1573 1970 -1585 -3467 2924 1210 -4028 2646 2499 -3599 1941 2748 -3440 -559 2328 -1755 -1501 3490
1589 3490 1189 -3465 2171 1931 -4307 1475 3183 -4345 -262 2347 -3637 -1940 2505 -858 -2887
1604b887M913j08m782N508K237p602L891K889p289K343M784n385j172M043k193
1619h10l046M275J353n839K956L579o957L090N355o020J07M634l525p35M361l23
1635B455l758K045K517n240J960M456o477o6M761m662j35M665k927j907L114Q38
1651A639k995J585K812m507M3M980m609k95M672m426j501M592j460j954K457R16
1667A949l009O28L526l393j184M714l789j883N530k544k054L573j436k633J910
1682i5J463k502o06L644k811k357M680k052k767M585j547k489L685K2j694J047
1698B06J255j868j562L598r50k204L919j278l535L380p22k207K662m46j592M94
1714h50J295n64j312K224o11l188L625J54j964K919o40k465J648m6n72N36M76
$$ plain form
1604 -2887 2026 1918 -2864 2644 4881 -2721 1170 4059 -3230 -887 3897 -1488 -2660 1383 -810
1619 -810 -3856 419 1772 -4067 -1111 2468 -4489 -1399 3956 -2064 -1957 2677 -848 -1583 2778 2455
1635 2455 -1303 742 3259 -1981 -21 4435 -2042 -2108 2653 -2009 -2144 2521 -406 -2313 801 1639
1651 1639 -1356 229 3041 -1466 -1423 3557 -1052 -1347 3325 -1101 -2602 1990 530 -1424 1033 1949
1667 1949 -1060 -432 3094 -299 -1483 3231 -558 -2441 3089 545 -1509 2064 628 -2005 -95
1682 -95 1368 -1134 -1740 1904 -907 -3264 1416 -636 -3403 1182 -365 -2854 831 853 -841 206
1698 206 1461 -407 -1969 1629 679 -1525 2394 1116 -2419 961 239 -1968 694 248 -1344 -850
1714 -850 445 -119 -1431 793 182 -3006 619 773 -1191 1728 1088 -1377 271 225 -347 189 665
1731F65l10j368J923O34k588K202j04k807K885L65j168J302j78j178k84P3M38
1748E02j286N91R06k531J686N48k717J399K35p96J804J76KM76j82Q24j233K04
1766F08J107k622J343R03j841P95j48j647P20k63K53P34m79Q89p70l03J109j804
1784a416M88J065j373J768O64j192J253j066k61N61j165O11j8m10J401j291J58
1801b23P02j744J439O33m66J599q57q77P09j408K37j9r24P61m34P11J295j459
1819c25O93k00j797J686%o62J411j153j5N47k45Q30m97M98J102j316J235K91k725
1838f42P91o56j807J265p4k46J119m65J295r02L58R92k038J083J475k057P22K13
1856D26j895P87j96N34M91J92J307q41j64J534k688n50J176k297J117J629q27
$$ plain form
1731 665 355 -1013 910 1544 -1044 1158 1054 -1753 1132 1497 329 1631 1453 275 -9 64 502
1748 502 -784 -193 713 -1818 -132 416 -2301 -902 -667 -1463 341 517 519 995 813 1637 404 608
1766 608 1715 -907 436 1339 -502 293 145 -1502 -782 -1045 -792 -58 -537 352 -418 -721 388 -1416
1784 -1416 -928 137 -1236 532 1196 4 1257 191 -70 491 -674 -63 -81 -491 910 -381 -223
1801 -223 479 -1265 174 807 341 1940 1083 206 915 -493 -256 -275 -1199 -438 -872 -161 1134 -325
1819 -325 368 168 -1629 57 57 -605 806 -347 -362 185 -60 770 273 771 1873 557 1792 2083 -642
1838 -642 149 -507 -2314 -1049 -1123 -1369 -250 -715 580 -322 36 1028 -1010 73 1548 -509 213 426
1856 426 -1469 -682 -878 -344 147 339 1646 805 641 2175 -513 -1063 113 -2184 -1067 562 -265
1873b65L01J54L93l62n12J841j208j059K177j864r40J531k275n55K071j00O54
1890a8N17J003j81j243J705q61k268K504r24j686K667p12j300Q88K22n34j85J242
1908H36l53k096K067l86k994K503j26k453K465J156o53J078Q70o70j507J214L28
1925A279k886J913J194l592J812J609l071J296J163j054K33J305L44k318Q41J446
1941A514l633J171K326l202J108K645k564N55J616j302j391R00J248k361L02K701
1957A633l286L86L473l115R4L432k267m39K113J05k352Q1J402k593n70L745l131
1974a289j053L910k450j063L309j488j702J469J017p85l42K392k124j518L807
1989B090j700j518L739j884k135K709l88j877P41Q47j745q17L137q95k089L575
$$ plain form
1873 -265 36 190 583 221 -291 1550 342 -717 1460 -404 -1344 187 -2088 -2643 -572 -672 -18
1890 -18 499 1502 1321 78 1783 922 -1346 1158 234 -1452 1215 503 -797 91 313 -221 -406 836
1908 836 483 -1613 454 68 -2926 -423 -549 -3002 -537 619 -34 1044 1914 1244 -263 951 1279
1925 1279 -1607 306 1500 -2092 -280 1329 -1742 -446 717 -337 -104 1201 1545 -773 68 1514
1941 1514 -2119 -948 1378 -1824 -716 1929 -635 -80 1536 234 -1157 -257 991 -1370 -1068 1633
1957 1633 -1653 -1267 2206 -909 -815 2617 350 -89 2024 2129 -223 -142 1260 -1333 -1903 1842 -1289
1974 -1289 -2342 1568 -882 -1945 1364 -124 -1826 -357 660 -125 -467 1925 -199 -1717 2090
1989 2090 390 -1128 2611 727 -1408 1301 913 -964 -223 624 -1121 -1938 1199 304 -1785 1790
2005A790j112k894L319l22k131K135Q6j695L31J393q06j683K326J3k911L192J34
2022A165l037K757Q2k531J770N61r19M06R57j16j958J548L39k574K118O77l245
2039b000J721N27j877J956j99j146k15P14N42q72J613O3k784K303J247k309K637
2056A921j82k387J251N29r01N54k83p22j667J143J490j876J606P2l130K522J166
2073A106j547J544j53j687K00J122O59j169M45L21k863J948J594k642J757L03
2089I38l179J668J318r34N31m1k05j150J307J333j805J116Q22l441J324J697k407
2106a108J084L22k364M49Q69N37p56R35N14k742J643K316k437K110R49l628J225
2123h2J420j107O59M06r03j856Q22J723k122R46J201m166J138K975k365J186J856
$$ plain form
2005 1790 678 -2216 1103 781 -1350 785 871 -824 -493 900 94 -1589 737 750 -2161 1031 1165
2022 1165 -1872 885 967 -1564 206 767 -152 254 1211 1095 -863 685 1024 -1550 568 1245 -2000
2039 -2000 -279 248 -1629 327 128 -1018 -1233 -519 23 -849 764 827 -1957 346 1593 -716 1921
2056 1921 1739 -648 603 1132 231 785 502 -220 -1887 -744 746 -1130 476 548 -2582 -60 1106
2073 1106 -441 1103 950 -737 -537 585 1244 75 520 841 -2022 -74 1520 -1122 635 938
2089 938 -2241 -573 745 -189 342 301 96 -1054 253 1586 -219 897 1719 -1722 -398 1299 -1108
2106 -1108 -24 298 -2066 -1617 -748 -211 -967 -32 482 -2260 -617 1699 -738 1372 2321 -1307 -82
2123 -82 1338 231 890 1296 393 -1463 -641 1082 -1040 -94 1107 -3059 -1921 1054 -1311 -125 1731
2140A731k664l03J480O49m97N55J081l006O62K856k823K55K187l620j99K767j230
2157a19l63Q70R0j883P12K840k349j22L096l101n16L469k727r16J865j138j046
2174a338Q34J139j391o47K510j699j118L460k103j148L271j574r00J796o75j047
2190f30N90J480r08j162K471j619j956L072j720k188K809j112j138K300l29q38
2206h78J96J188k67j127K610q71k241K729n84j939K439q92j676J681Mj95K99N53
2224A029l75j918J726K66k580K553k71j942K241m2j229R59Km86j64P48K87k070
2242a266J353L65k600J816Q10k032K336K75r71R14j02k59o33L83Q02j881P00J104
2260A114k557J425Q91k473J388K50j116J088P5J42q93k58J273j616P86J720k242
$$ plain form
2140 1731 -933 -1236 244 893 396 951 2032 -974 -312 2544 -279 -24 2163 -1457 -1656 1111 -119
2157 -119 -482 388 478 -1405 -693 2147 -202 -324 2772 -329 -845 2624 -103 -1019 846 -292 -1338
2174 -1338 -504 635 -756 -1403 1107 -592 -1710 1750 -353 -1501 1770 196 -704 1092 417 -630
2190 -630 -40 1440 532 -630 1841 222 -1734 1338 -382 -2570 239 -873 -2011 289 -40 -878
2206 -878 -682 506 239 -888 1722 851 -1390 1339 755 -1184 1255 363 -1313 368 372 177 476 1029
2224 1029 654 -1264 462 728 -1852 701 430 -1512 729 687 -542 417 419 -67 -231 517 804 -1266
2242 -1266 87 452 -2148 -332 478 -1554 782 1057 86 1000 898 639 6 389 1191 -690 10 1114
2260 1114 -1443 -18 873 -1600 -212 38 -1078 10 85 227 -666 -924 349 -1267 -481 1239 -1003
2277a003R32J644j640P96N51j426J63l44O08k15n35J141j669k76J963j456K14
2294e52J521j469L17O95n43L55o70N14l61p61K071p54j168J703j287m17J474j296
2312f28k02P72j56M06l87N18L43j552J869j07j146J818r30q34J105r09j27l39
2330d86l42N54j287J085J005k024J449M8j527J815J30m60J074m47J96j71j86R35
2348A361j652J15J159j926Q03R46j763P46O2n81M21O3L64k83j61J233r52p81J725
2367H99j682N33J637j305N6N96o29P1n44Q00p58j060J619o27p79K230j327o08
2385h78J896p41L83K90l46P7r64R45j99j700J478n07j503K136n23o19J190q41
2403d26j4K55M8O01j261J121O34j791J572O82j782J155K64q77P52n83j89o46l94
$$ plain form
2277 -1003 -71 1573 -67 729 1280 -146 17 -327 281 66 -469 672 -997 -1273 690 -766 -552
2294 -552 969 -500 -183 512 -31 324 -346 168 -193 -954 1117 363 -805 898 -389 -806 668 -628
2312 -628 -830 -58 -214 192 -195 323 666 -886 983 876 -270 1548 618 -216 889 -20 -147 -486
2330 -486 -828 -274 -1561 -476 529 -1495 -46 2 -1525 290 420 -40 1034 587 783 612 426 1361
2348 1361 -291 -176 983 -943 -140 806 -957 -211 -149 -730 -309 -246 118 -165 -326 907 -45 -826 899
2367 899 -783 -250 1387 82 138 734 105 176 -368 432 -326 -1386 233 -394 -1173 1057 -270 -878
2385 -878 1018 277 660 950 604 681 -283 662 463 -1237 241 -266 -1769 367 -156 -775 415 -426
2403 -426 -440 -185 -137 464 -797 324 958 -833 739 1421 -361 794 1058 181 933 350 161 -485 -879
2422h79J093j663L26J558j770R78J635j741O11N62p45L20j28N45q63n75J388j217
2440e65k54K125j703p8J309j032K85K99l08j28r56R35J72j271K092m76j426K234
2458A254r55n59J146o83n25j36L38j27r91J137J40j763K022M88j806J818K77j369
2476b94P16k15K0m26N39M87j720J067J297k516J531J119k493P82O12j438N21N25
2494A14L9j459K70J667j934J152K111k614J46K262k191O42J412j591r28P79J141
2511A018q18k28J780k737n83L054j863j63K062k353p89J429K51l82M70J097k373
2528a128n92L440j312j019K889k881j576L006m40r40J303m26j426l57K607l75
2544G73j675K508j910k177L787l48j737J924m90k147Q73J518l83q75J561j366
$$ plain form
2422 -879 214 -1449 -1123 435 -1335 -357 1278 -463 148 710 -35 285 157 702 -161 -736 652 -565
2440 -565 -819 1306 -397 -475 834 -198 87 386 78 -50 -1006 -71 101 -1170 922 446 -980 1254
2458 1254 299 -260 886 203 -322 -458 -120 -247 -1238 -101 39 -1724 298 786 -1020 798 1075 -294
2476 -294 422 207 227 -199 340 827 -893 174 1471 -1045 486 1605 -888 -106 506 -932 -411 114
2494 114 153 -1306 -1036 631 -1303 -151 1960 -654 -508 1754 -437 205 1617 26 -902 -123 1018
2511 1018 200 -28 1752 -985 -1568 1486 -377 -540 1522 -831 -1620 -191 60 -322 148 1245 -1128
2528 -1128 -1720 1720 408 -611 2278 -603 -2179 827 387 -553 750 324 -1102 -1459 1148 773
2544 773 -902 1606 -304 -2481 1306 958 -779 1145 655 -1492 -619 899 516 -359 1202 -164
2560a64k346L174K93k532K470n50k623K159R17p79M41N59r21j480K261O93k401
2577h29J990k9l287K456J287j859P60K92j907l03J497Q61j702Q83M00l086K308
2594b68K122k650J305N36k445J017J348j1o12l6m7j726J430J779k317M18J268
2611A111l188J470J850j681L76L83j144j49J206R05j654K66J127k540R56K363
2627A657k270N59J033k313N86J055j14k20J12N90j532L52J925j880K07J848k563
2644i68M14J810j199J37N63p81p14J42J335r53j84J582k113l04K392j606j00J631
2662A084j796J1J032K5j46m0K53q90o97K231p51o15J642j621m79J789j210l9M15
2681A98n17k15k96J246n11p90J163o31q33K170j002m19J609j526k85N88p3K2n06
$$ plain form
2560 -164 -2510 664 957 -1575 895 345 -2278 -119 798 19 460 1019 98 -1382 879 1572 -829
2577 -829 1161 1132 -2155 301 1588 -271 489 781 -1126 -1429 68 929 -773 110 510 -2576 -268
2594 -268 1854 -796 509 1045 -1400 -383 965 954 342 306 259 -1467 -37 1742 -575 -157 1111
2611 1111 -2077 -607 1243 -438 -62 321 -823 -972 234 1139 -515 -249 878 -1662 -706 1657
2627 1657 -613 -54 979 -1334 -748 307 193 -27 85 675 -857 -505 1420 -460 -253 1595 -968
2644 -968 -554 1256 57 194 757 -24 -738 -596 739 -214 -398 1184 -929 -1233 1159 -447 -547 1084
2662 1084 -712 -701 331 356 210 170 423 -467 -1164 1067 316 -299 1343 -278 -757 1032 -178 -217 198
2681 198 -319 -534 -830 416 -95 -885 278 -353 -1186 984 -18 -437 1172 -354 -639 -51 -124 -102 -608
2700f08Q93L0p99J607o86j183J936j239o52J408p71m94P45m94J1O2M49J42j049
2719f92J405j99j342J497o71j117J326q09l33Q97k43N93j73K83K43j112J013R4
2737F60j042J331q23j158J268k80l35Q67m92n5k7J92O29j241O90k07j606J367
2755b62L8q01J523o71l48J121k35J41L9l44M83j446R81M34j552J243m46j137J698
2774D59j02p52J271r73J08J30m11M65j097P18J96j258J373J06r38J506k49r53
2792d01Q71m19k30J48j73K88q64M20O93j357J455O91j695J243P6j234R44l47k86
2811a77J11m07Q41q57M08R25j683O62J035j753R48M18j189O14k02o1Lj14J117
2830F39p66%J678j528K82P55j546M99N31j087L80Km1N8l99J179j001m75J697j486
$$ plain form
2700 -608 285 315 -484 1123 437 -746 1190 -49 -701 707 -64 -558 187 -307 -296 -234 215 357 -692
2719 -692 713 514 -828 669 -2 -1119 207 -602 -935 -38 -281 312 139 422 665 -447 566 660
2737 660 -382 949 126 -1032 236 -44 -379 488 -4 -59 -86 106 735 -506 184 -23 -1629 -262
2755 -262 -224 -1025 498 -173 -521 600 365 506 545 201 684 -762 219 653 -899 344 -102 -1239 459
2774 459 357 -395 876 -97 11 141 -270 195 -902 -184 12 -1246 127 233 -705 801 552 -401
2792 -401 470 51 -179 -31 -204 84 -780 -360 333 -1024 431 1122 -573 670 746 -488 456 109 -177
2811 -177 -66 -473 368 -489 -81 844 -839 -177 858 -895 53 471 -718 -104 -306 -367 -364 -478 639
2830 639 -127 -127 1551 23 305 1060 -486 13 544 -543 -163 -161 -202 -144 -543 636 -365 -840 857 -629
2850f29J9J522j214k05O15n93L11K28N00j88n71J338o18j114J601j189o89J579
2868G03j101P6N56k48j25j48M19L28j309J400n2j448J583m60j095J213m90l57
2886e55P66l76J03n23P14L49j400J195L08j701J447M23j419J100O2p66L29L3M41
2905E30o85N8P86j483O08J009j829R78K81j148R47Q0j20j92j30M91q40K95J339
2924I75j539J81J528j655M78Q91j097K43j5J59j39o93J367q21n53J396j153k14
2942f61J443j198J89Q33q31J69j71L19l7o52R55l13r36J741q87n86J562r60l33
2961c54M91k00K62j99J28K06p15R28J24j388J307m79n66J104q09j83M26o10L69
2980a58j13J40O16r57K91M88r29J287nj145J006o85K66O03m97L50n61n84R71o60
$$ plain form
2850 -629 -610 912 -302 -507 108 -485 -174 54 554 366 -205 1133 515 -599 1002 -187 -876 703
2868 703 -398 -322 234 -14 -139 -287 132 460 -849 551 499 -949 634 174 -921 292 -198 -555
2886 -555 211 -165 -62 -585 129 478 -922 273 581 -1120 327 750 -669 431 493 -273 56 89 530
2905 530 -155 -97 689 -794 -186 823 -1006 -28 253 -895 52 132 12 -180 -310 181 -659 -364 975
2924 975 -564 -383 1145 -510 -32 859 -238 5 -10 149 10 -683 684 -137 -690 706 -447 -661
2942 -661 782 -416 -227 606 -225 -56 -227 92 55 -597 358 45 -891 850 -37 -623 939 -21 -354
2961 -354 137 -63 199 0 128 334 -381 547 671 -717 590 111 -455 649 -160 -343 83 -527 -158
2980 -158 -271 -131 485 -472 -181 307 -622 665 660 -485 521 -164 102 705 208 558 -3 -587 384 -276
3000b76L93M40j230M59J70n00J138o41k45O37q09O08K68n46N37n41m76O35l87
3019c66O09R8n91P65p49PR74j052M38J35r72N40K52M6M28p31L03j3p38J457q83
3040d3j92Q16j496J63J130p64M88M1m34K64l50R37Nj090R04q72m00J774j030j03
3060b52R31j095K01N96k1L46r58M07l46r51J922n17j223J512q87p28J531k50p3
3079A45J63k31qm98P28J28j410J310l52r94J806o9j197R70m26l04L88K60J00j139
3099f30M69J04r69J451K34j664J570l94q42J157l9o10p8L4N4o09P53P38j812J319
3119B36M65j465J157M50j228N39l7j89P3q2M72r56L57R96j432Q89J156k168Q00
3138C3M23j295P27L8l49PL2Q69j020K00J448j726N09J261j729P42Q24j443K54
$$ plain form
3000 -276 117 557 -673 -214 -44 -544 594 -47 -292 345 -464 144 412 -134 403 -138 -614 21 -366
3019 -366 243 341 -250 515 -234 -227 747 -305 133 268 -704 -164 88 134 562 -169 134 121 -617 840 -43
3040 -43 -235 581 -915 -752 378 -386 102 143 -291 -27 -377 560 565 -525 379 -493 -893 881 -149 -252
3060 -252 679 -416 -215 381 360 706 -252 155 -191 -1142 780 263 -960 552 -335 -1063 468 218 145
3079 145 308 77 69 -429 299 427 -983 327 -25 -1019 787 718 -479 491 65 -239 149 409 509 -630
3099 -630 -161 -57 -1026 425 659 -1005 565 171 -671 486 447 -163 -241 -207 -153 -762 -9 729 -1083 236
3119 236 701 -764 393 843 -385 154 117 -72 1 -81 391 -565 -208 788 -644 245 1401 -767 33
3138 33 456 -839 -112 -74 -423 -416 -384 485 -535 -335 1113 -613 -104 1157 -572 170 994 -449 -195
3157a95N37l59J80k75Q92j059J55J262j392j36J543k086L10J135q59RM94j9k70
3176a33n8R13p17l22J318j027m96J528j343l34R60n62N0K94J73j19o03R36k56
3195B02p53J382p58j029J732j060n0J042j040K81k32K71M44p28O67j99j296J513
3213C89k80q74J386m80q81J004k3P3K43m42J93r98Q57M37j242J152l31j037R46
3232I2l43j48Q60p34k27J66o0J051q49J0L24j251J204O47q86O03n2q13O12k98
3252i2O06q7p46O64q74K49J005j048K79L76j273P75K13j70P03q76K68Km04J054
3272F24n64j37Q01j229K14R01q38L00j87m16O50m13M67L59q05P10m83n42J257
3291F69o71PO83r95N05j11k65N32p63L34L13r04O87L7p06P39k45q7N05m87M80
$$ plain form
3157 -195 342 -17 163 -112 780 -279 -124 1138 -254 -390 1153 -933 -623 512 -347 -338 156 137 -133
3176 -133 -191 722 5 -317 1001 -26 -522 1006 -337 -671 289 -273 -223 71 244 125 -478 458 202
3195 202 -551 831 73 -956 776 -284 -334 708 -332 -51 -283 -12 432 -296 371 172 -1124 389
3213 389 109 -765 621 141 -740 264 241 314 557 115 308 -690 167 604 -638 514 183 -854 92
3232 92 -251 -399 461 -273 -500 -334 -394 657 -192 -182 142 -1109 95 742 -144 459 407 -406 206 -92
3252 -92 514 427 -319 345 -529 -280 725 -323 -44 332 -941 -166 47 -123 580 -296 -28 -26 -430 624
3272 624 60 -77 724 -505 -291 610 -228 72 -115 -531 119 -294 173 532 -273 437 -46 -588 669
3291 669 -2 5 688 -307 198 87 -178 354 -409 -75 238 -666 21 58 -648 91 -154 -241 264 -223 257
3312B57j21l45O21m76m9Q91j124M60L90o77M42k78j62L86n00M90j04q00R75o46
3332c70j52Q95p97M4P46p66M86J4J26J58o85M47J29q44R04n32l45J122p04j06
3352b30N58m36M11k94l32P48q98Q91k01r68R71k71n39J238n50k9L58n04K20k55
3372a12k23Q11p19N6M28j065R08K47p60R78l64j69J47n0J14J07n34O97r06J69
3392b40O57p94M39L40p72L34K64n05M68o20M78k87k26Q26n00k38J179q76o6Q27
3412F88p29M61k23k21K51n25N95k85o62J032o38k19Q45o17R6N91n14K20k12j67
3432b33L42p34P41L06r54J037j95n30O19k77m19P54m42k83R1j41P08q86L63P20
3452E87r44P30J06p99Q49m77l64N51o16N41l70K2M85p58L00P82q82L06J66p94
$$ plain form
3312 257 136 -209 412 -64 -113 778 -346 114 504 -173 269 -9 -171 215 -285 205 101 -699 276 -370
3332 -370 -522 373 -424 -380 366 -400 86 100 226 384 -301 146 275 -569 335 -197 -542 580 -124 -230
3352 -230 328 -108 303 9 -323 425 -473 418 217 -751 220 -51 -590 648 98 69 427 -77 143 -112
3372 -112 -335 476 -243 -187 241 -824 84 331 -429 549 185 16 163 113 227 334 -200 497 -409 -240
3392 -240 417 -377 62 402 -370 -36 228 -277 191 -429 49 -238 -464 362 -138 -376 803 -73 -139 688
3412 688 -41 420 197 -24 227 -298 297 12 -650 382 -256 -475 370 -247 -151 440 -74 146 -66 -233
3432 -233 109 -625 116 422 -532 505 310 -220 399 122 -297 457 15 -268 -177 -318 390 -496 -133 587
3452 587 -357 373 479 -320 529 52 -312 239 -377 164 -206 -184 301 -457 -157 625 -257 49 215 -579
3472e79M77J21l10O45n65L69m04j70Q56m36k22J068j307J74Q26r12M45P7n83L70
3492f0k98M44j13k34O98n35m75J160q64J42M91p17L71Q6k88M38l46L13L9p60Q14
3513C06k85l93R02n80m21O87n60K69K60n00M11m01K27L22n00N57l32n80Q76k97
3533c2mM26m94o1K63l36N68l45P5J64q88P85J21n74J001n38m94N84l57K39K67
3554C70n30J31l66K69O25o09K79J28j054Q03J62m78O79n87M6N18l25K56k6l45
3574e4L36o69O62L03o13N14n01l74O61j97M6K62o56J03mL0M63m37j24K14l66N21
3596A20J64m65L65n87m6O83m25M26j90j79L33k19P8O44j074M10J27m95N66j80
3616E6l06M61p24M98L6j82Q53o87j50K81n10M89L31p37K58j08j38O18l28J72m9
$$ plain form
3472 -579 -102 19 -291 354 -211 158 -246 -416 440 4 -218 850 -457 -283 543 -369 76 153 -430 -60
3492 -60 -358 86 -27 -261 437 -98 -573 587 -277 -135 356 -361 10 96 -192 246 -100 213 252 -508 306
3513 306 21 -372 530 -50 -471 216 -344 -75 185 -315 96 -305 -78 244 -256 301 -31 -611 265 -32
3533 -32 -36 390 -104 -165 98 -238 330 -15 60 224 -664 121 242 -332 669 131 -363 221 -136 103 370
3554 370 -160 -29 -395 -126 499 -110 169 297 -757 46 208 -270 409 -178 -132 386 61 317 291 -54
3574 -54 282 -387 275 578 -35 479 -22 -396 265 68 114 376 -280 -177 -181 -151 312 -125 -249 -35 -401 120
3596 120 284 -181 184 -403 -449 234 -191 235 45 -134 199 -20 58 702 -372 38 165 -330 236 56
3616 56 -250 211 -513 -15 21 -161 692 5 -145 136 -374 115 446 -291 -33 -141 -279 339 11 183 134
3637A34n12L60k08J02P18q96P2O95r75Q87J38o36L33l76L34L14k82K71o37n21
3657f85O79l83N07M15q88K72J57k75N84j80k47J63l93K60J49R1L54o54l74O43
3677A95m89N72L38p39L8j42k9M12l97M27n62l85P93j2N5M80q10QM30k99L62l4
3699B12k32q0l37O08L4m29O73n83l14O51k93L44J85o85J01O4k90O05j91J33j96
3720b0m79O74n5j67N41n80k42M97l06P0j00q8K03j89K30O47n50J44lp45Q06r5
3742A93k35M34m35k26L38l66M80k03k4K03o39N50O9k14L59l30j46N08m24N6L76
3763C24m82K49l52K57M81o37L09K9l61L97k2j89M34m27k51K67j20K63ql22M24
3784B63n09J92K21m69K60L52m71L39k99K71n3k40K94j73k21M21m57K97L67n60
$$ plain form
3637 134 -378 -18 -226 -124 594 -302 -230 465 -510 377 515 -121 212 -164 170 484 202 473 -164 -685
3657 -685 -6 -389 118 533 -355 -83 74 -201 383 203 -44 119 -274 -14 135 226 580 -74 -448 195
3677 195 -294 278 616 -123 -85 -227 -256 156 -241 186 -376 -761 32 20 75 555 -255 -247 183 -116 246 212
3699 212 -20 -100 -437 171 205 -224 449 -134 -448 203 -90 254 439 -246 -145 -81 -371 234 43 176 -20
3720 -20 -499 175 120 -47 494 -86 -328 169 -137 -67 -167 -255 -52 -241 -11 636 86 230 227 -518 288 193
3742 193 -42 392 -43 -269 69 -297 183 -20 -44 159 -480 70 139 -75 284 -46 -192 316 -108 -52 324
3763 324 -158 91 -261 -4 477 -160 149 178 -183 214 192 3 437 10 -241 26 -94 169 161 -161 263
3784 263 -246 -54 167 -302 -42 310 -161 178 -121 150 97 -143 151 -22 -243 178 -279 18 385 -175
3804a75J00L12n20M98p0j16J96n15O69n43l97P16l46p2L40m35K67L45m24J37k33
3825b66K86J50l97L72J64m95M88l42j57L89l10j6K32j88M02m37pJ64k27K86k6
3846F5k21J55k8p6K54j71p5J14l31N97l68j27N01n52L70J67l62L36j6n37N68k42
3868B1J28ok42Q2J59l07M51m39pO06o49K82R1l59K58j10l8J73l64L73j28q7N05
3891C93k29l55O85p86L40R5k84O0J15M3J19l28L55k66k01M26m29r3N00k69q4K25
3913C2j41J33r3j3K70k47L1K95o30N61j7k68K94l92n7L00l34M46k17J12K14k06
3935G3k19M64l66N5J99n20L21k40J58K9k1J14l6l44N82k39P0J29n82N47q1j25
3957c2pP5j15K06l13L26K15m35M38l09j56L37l79J59n5k43L28m18K20J74k26M86
$$ plain form
3804 -175 -75 237 -283 215 145 29 225 -290 379 -164 -561 155 -191 -263 77 -358 -91 254 -170 -33 -266
3825 -266 20 170 -227 145 309 -186 302 -40 -197 192 -118 -134 98 -90 312 -125 -132 32 -195 91 65
3846 65 -156 -1 -29 -105 149 -22 -97 17 -314 283 -85 -212 289 -263 107 274 -88 248 232 -305 263 21
3868 21 149 143 -99 -17 142 -165 286 -153 -160 446 -203 79 170 -189 69 -41 -79 94 -270 103 -25 -112 393
3891 393 164 -191 494 -292 48 143 -141 -81 34 77 196 -132 223 -43 -244 182 -247 -340 160 -109 -193 32
3913 32 -109 24 -69 -82 188 -59 -28 267 -363 198 181 -87 207 -185 -242 58 -276 170 -47 65 279 73
3935 73 -146 318 -48 7 206 -314 7 -233 -75 -46 -67 47 11 -333 249 10 80 209 -373 174 93 -32
3957 -32 -39 36 -79 127 -186 140 355 -80 358 49 -107 230 -149 10 -45 -288 40 -378 -158 16 -210 276
3979B76j15n00N76k16p4L15k78J64o1k12J27J12J3J11m34L68o4l38L39r0k22J71
4001c2N3q7lJ2J59r3k21L41m04M69l0l31K09m4l12L47l84N2K55j7K76m2k38L73
4025C08l25P1K44n41L48o3j86P5j10K04L43l90J88k18j51L57j44n1O9l92M29l3
4047C2j12J81j47m0K89k04J84K58l76Q1r6k45L21l32J08o3j79L69Kp8L91l40j69
4070a65L68m97L41k4p1K45k93M9L63l93R2j48j62L41k07J11L08m28K04k95J26
4091a35K68R7o3O6m96M14m1m2K98l66j62J07j21J79K45k54L6k86L68O2k33L18
4113B59l67l9K28k2K2J10l74J67K09k24J17K23l78J41j49p3J49j93K56M6l79L07
4135C6k08K19K29k20M3k38n3K89j23l5L17n48K89Mk58L98k13J88Jm16N08j98K2
$$ plain form
3979 276 161 -339 237 21 -53 262 -16 148 87 -125 2 114 127 238 -196 172 108 -230 109 19 -203 -32
4001 -32 21 -66 -69 -57 102 9 -212 129 -275 194 164 -167 42 -2 -314 33 -351 -299 -44 -61 215 173 -65 308
4025 308 -17 54 298 -243 105 42 -144 -69 -179 25 368 -22 166 -52 -203 154 10 -41 28 -364 65 32
4047 32 -80 101 -46 -86 203 -1 183 441 65 146 50 -195 126 -206 -98 -161 -340 29 31 -47 344 4 -165
4070 -165 203 -294 47 23 -48 197 -96 -47 316 -77 15 -133 -295 46 -161 -50 258 -170 34 -261 -135
4091 -135 133 230 167 233 -263 151 110 68 366 0 -162 -55 -176 3 248 -6 30 -256 112 174 -59 259
4113 259 -108 -147 81 59 81 191 -183 -16 193 -31 86 309 -69 72 -77 -150 -1 -194 62 108 -271 36
4135 36 -172 47 276 56 99 -139 -192 97 -26 -61 256 -292 -3 1 -257 141 -72 116 117 -299 209 11 33
4158C3J29l90J87K25k23J26j1l30N34k19l4J70o35M76Rl80O87m70j58L56l21J60
4180g9M19k96K53j75Rq0r5M03k90j23J96q2l98N64l54J21L8m18M65j02N5Q0k53
4203a42K13o3k48L84j72j84L65m24L31k9k3j67J05J01J66j24L2J97p15L28O8o5
4225f6K37j59q4L5j76L29j17M4J15m61J30K84l94L05J12m67L37j61j53O52k85
4246E7r8N4J9K80k82n7L12m96ML09k44L4L9J4Jq3J13O4j20K20m12P9K02j63L70
4271B16Q8m17J61O0j02J13j61jJ16j21L27k48N6K13m90K32K15k92Q7J11j02j46
4293h5R7j29L30l91L96m62mL20k38J46N8j80J84n7k27J57J34n8J11j56J52P2l47
4316a77K96k43p4N42l51m0P4j25L09k31o2K03m47L43Ll41L21J16l25M00n3j10
$$ plain form
4158 33 162 -228 -41 184 -39 87 76 -254 280 61 27 197 -438 38 47 -333 354 -116 -274 82 -239 -79
4180 -79 340 44 297 122 131 51 -44 359 69 -54 142 60 -338 226 -128 -7 31 -387 78 -24 31 111 -142
4203 -142 71 8 -240 144 -28 -212 153 -271 60 31 8 -159 -54 47 213 89 121 318 -397 -69 -1 -66
4225 -66 171 12 -72 -37 -213 116 -1 43 158 -303 -173 111 -283 22 134 -333 4 -157 -310 342 57
4246 57 -41 13 32 312 30 -27 285 -211 -207 102 -142 -108 -69 -55 -54 -137 -24 40 -80 140 -272 -193 9 -154 216
4271 216 304 -113 48 108 6 119 -42 -43 73 -48 279 31 87 300 -190 42 257 -35 52 163 61 -85
4293 -85 12 -117 213 -178 218 -244 -248 72 -166 -20 38 -142 42 -15 -242 -85 49 -9 102 -54 98 170 -177
4316 -177 119 -124 -198 344 -7 -47 27 -98 211 -20 -82 121 -326 17 20 -321 0 116 -209 191 138 28
4338B8O1k04J97j31j10K25j86K91l7j30J09j72j1M8nP9%k04L03j20j32K10K6J0
4362A45j03j72K89r0q4J97l16Q6J89k25J83j24n7K48k37j62L92j38LQ7j82J32
4384F1j55q6R6p2L2K79k88J97j06j4M8Q6j81K87k20J39j90R8J01n02L58J63j04
4407B7J34j44k36K67pL7P4j71J14r0p6J89j94N4J57j93M05l84J20l7q4O3r0j73
4431b38M27k08j88K73J49l32L54k49J52k10K70q5n2k40J25mN0L0q1J74l59J88
4453e4N8k2n5J95k18M3p3J00K63m25J77L3j63K92l01j92L88Kj61J97j4lm8QK65
4478B92l57j76K79j62J85k34l8J58L9K0J63k98K10k3RJ99m83M32j58j94J89J60
4500B12l00L8L7r1J20q2K96k06l72O50m68q8K72k8l1m9R6Q4L1j56J94l12J94J56
$$ plain form
4338 28 89 -115 82 -49 -159 66 -120 171 134 4 113 -59 -70 -22 -27 52 52 -152 151 31 -101 109 135 145
4362 145 42 -130 159 69 -15 182 -134 -48 141 -84 99 -25 -82 166 -71 -233 159 21 24 111 -71 61
4384 61 -94 -180 -84 -156 -124 155 -133 64 -42 -56 -8 78 -103 184 -36 103 -87 11 112 -390 -32 131 27
4407 27 161 17 -219 48 41 78 152 -19 95 5 -71 118 -76 -22 135 -58 347 -37 83 46 -38 25 -65 -238
4431 -238 189 -19 -207 66 215 -117 237 -12 140 -70 200 115 63 -177 -52 -56 -6 24 -57 117 -242 -54
4453 -54 4 -18 -73 122 -96 -53 -126 -26 237 -188 -11 22 -141 151 -150 -342 46 48 -113 84 70 67 19 27 292
4478 292 -65 -241 38 -124 61 -173 -211 -53 -14 6 169 -129 81 58 67 266 -217 215 57 -137 52 212
4500 212 -88 -50 -13 -104 16 -66 230 24 -348 302 -166 -254 18 -10 -41 -90 6 90 121 -35 159 -153 41 197
4524A97l73K80j17k12K61k13J79n1K1Q4j96J24p1j33M77j85l65M87j03j46M38
4545C83j18l25J93L0q3k16Q1O1k87K25k1j97L13O9k75K59j26K93j36j20O2k6J2
4568E1R4l96J85L38l92K44p6r3K65r7j07j41K4L0qm7M01m44J08Q1k43J65K31j03
4592G0r9J85k32L3qK13j49k46J79q6J11L75n51J48J80j92J77j02J8R2j33j32J45
4615dq2L62j48q5j0q9NK56l32K76l39L7L2m4l3L32k23K12j64R1L28k18NN8l21
4640i8RN7k08L02k46J63J53l22K69N1%J03m12J00J85j74j23L00j64K18mk06K24
4663A77l96Q1K36l68L74j51J9L7n0L1p5J57K98k58k88L19j60J71J07m87M10k18
4685c4j40K16J0k85M16j44j05J18L3j5k15K21J2m46J68K42k18M12k98j55K54J4
$$ plain form
4524 197 -176 104 -13 -225 36 -177 2 -49 -28 56 -140 -16 -87 -220 257 72 -293 194 91 -55 383
4545 383 265 -60 133 163 80 -136 -55 6 -281 -56 -77 -274 39 108 -167 92 -34 259 123 3 65 39 51
4568 51 145 -251 -66 272 -120 124 48 -45 220 123 16 -125 -101 -71 -79 -126 275 -169 -61 20 -223 -58 173 70
4592 70 -29 156 -76 -43 -51 162 13 -233 -54 -140 -29 346 -205 -57 123 -69 108 6 24 116 -17 -149 -4
4615 -4 -86 276 128 43 33 -56 -51 205 -127 149 -190 -153 -121 -165 -198 134 -89 123 -41 50 378 160 165 223 -98
4640 -98 -89 -32 -240 62 -184 -21 132 -190 79 130 130 233 -179 -79 106 -68 -191 109 -55 163 159 -47 177
4663 177 -219 -138 98 -270 104 -47 -28 9 -41 -10 -85 72 370 112 -176 143 -17 154 261 -226 184 -34
4685 -34 -174 42 52 -233 183 39 -66 52 85 70 -145 76 88 -358 -190 52 -166 246 -52 -207 47 61
4707F1R2L4k17K88k69J22j88L2M61n97o0M38j98j69K61j29J01K4l42K20j90K10
4729a5J36k52J89J41l25R1NK4K04j26lJ4p6k56K72j88L83M2k90P1m01J88Q2k4
4753a14K97l17K07k9k10K53k1J06J63n22L10j74J66rj4Mq5j29J3K06k5O7k52O9
4777d0K69l66K04n2j26R5L9o1J37L5oO0k94J11m9L2J30k51J18K13l82M9L67l73
4801a41J16N4p1p3K7nj13L24L3k68k3K39j80K59p4j52j0J83k03Q0j7J8O7k00J78
4826D8m2r4K08k95M18j29k72L17q3Q0O0n24K31qn5M42l10n6K34j28J73o3n7J01
4850A96l04K50Kk32J42J25j25M8j78m3J81K6k49J36j41J89J9j43J00k8K32j24
4872G9m10N40j40n8N9J52l25L83k84R2p9prj91m4M50k58K33M6m60J83J68k39P0
$$ plain form
4707 61 153 187 -30 258 -11 111 -77 -45 416 -181 -241 197 -1 -170 91 -38 63 87 -255 -35 -225 -15
4729 -15 121 -131 58 199 -126 -35 -30 -6 198 72 69 83 7 -249 23 -165 218 260 -30 41 -360 -172 -90 -114
4753 -114 183 -134 73 44 -166 87 66 172 335 -187 123 -51 115 106 92 96 11 -118 -105 101 76 143 -109 -40
4777 -40 229 -137 67 15 -111 -16 23 -38 99 134 128 188 -106 5 -44 -12 118 -133 -15 198 -184 -135 232 -141
4801 -141 -25 29 -42 -115 -88 -93 -206 118 151 -117 -140 99 -81 178 104 -48 -58 125 -78 2 -15 3 70 -130 48
4826 48 6 -88 120 -175 243 114 -158 159 76 156 216 -308 -77 -85 -140 302 -8 -64 170 42 215 152 95 196
4850 196 -108 142 144 -88 54 179 54 102 -76 -119 62 88 -161 -25 -166 23 42 -101 -1 -29 203 79
4872 79 -331 209 69 11 70 222 -103 280 -4 88 9 2 -7 -198 -242 208 -50 183 229 -231 -48 120 -119 -49
4896d9kO7k21j29K83J2j2P9L4l3J34j71L9J9k9M7j60J90n8j05K19k53l7L61l19
4921i4K46R5k39jM1k03J68j56J76q1m3J93k22K2K77p6l34M34l44Q8l5N2J45k92
4945a83K07j6j12L2J22l1Q5L1k52K54n07M12n5o6J52k00j24L17k08K00J54l40
4967a28L73j98j69K66k32K01j21O8NJ16j58J6r2P9J75k99J0O0j20L52m99K61q
4990d2k69M11j57J62k6l6K9J52l46O8O8L4j0J9J2n3rp0K54j43j8j81K02R9k71
5015a21O4J09j97K55m9K1K35m64K50j00R1j65O1m5lj78K36L5o2K44j00l06K77
5038H8j89j08K48K3j56n4K37N9j61N1j57m5M25k55m5K35j74K2j38k64M84l7j18
5061b9Q5p3Q5k4j10K14pl54L09k17R6K27m00K80k15J10q9q8O2L87k93J21j31l38
$$ plain form
4896 -49 -51 16 -205 -334 -51 -39 -51 28 62 29 163 -8 31 50 21 68 -92 98 40 -65 154 -99 -136 225 -94
4921 -94 152 247 8 7 48 -155 13 -143 33 -48 -91 102 -120 -98 179 103 -231 203 -141 -53 -88 -36 109 -183
4945 -183 24 8 -104 -72 50 19 104 135 -117 137 -370 42 -13 -79 73 -127 -251 66 -142 58 212 -128
4967 -128 245 47 -122 144 -88 113 -8 60 65 181 23 39 -53 26 201 -98 -88 -28 -148 204 -295 -34 -42
4990 -42 -311 100 -57 105 79 43 72 224 -122 -54 14 48 38 57 69 16 7 -63 191 48 30 -151 51 150 -121
5015 -121 -57 52 -145 110 61 82 317 -147 103 3 94 -71 -10 -55 -58 -236 0 35 -27 217 117 -189 88
5038 88 -101 -209 39 62 -94 -148 89 148 -13 38 -119 -164 261 6 -39 196 22 44 -94 -358 126 89 -29
5061 -29 56 -17 68 44 -66 148 141 -213 96 -121 -25 202 -198 82 -133 -23 -112 -200 -138 249 -44 77 -54 -392
5085c92L72k3K05q1Pj39J67L8J06m30L24j12k12J58M1j1j5p2l3kJ05OnKO8k29
5111a57P5K98j75m8J14k01K72O3k54M0m0k47K00n9K88l57K24R7k85k3K09r5O9
5134Hj32J67j14J52K20l59J37J56k2l16N04m50J5L21n08Q8L01k34M3p0K00p6k42
5157b11L73j87j87L25m27K06L11k21p2Q6K6k8q6L95k85j95K35k11j63N03k08j39
5179a60K40k00J0N1L36j85n5J08k32j04K08r9k51M51M7m03K64p4O9k40L12q5m5
5202c7P4L9m24L16K07k62K10Q8j83o8N0q5M4M5M5q0N5K25l10J07jl17M64J09p30
5227d19N32K6j1j43k13L04k12J63K72n51J93mo6K12K35l77j1r9Q4qJ44MQ0k69
$$ plain form
5085 -392 -20 -43 162 81 88 -51 116 154 260 -170 154 42 -170 -12 29 18 3 -69 -102 -104 1 7 2 4 72 -157
5111 -157 -82 216 41 -7 107 -94 178 241 -13 27 -13 -260 -60 -119 169 -188 36 133 -152 -175 34 -61 8
5134 8 -124 43 -71 81 301 -58 79 235 213 -103 401 -49 -34 287 -221 -133 168 -66 -23 -93 107 31 -211
5157 -211 162 -25 -212 113 -314 -108 203 -18 -90 -4 22 -6 -92 303 18 -177 58 -153 -316 187 -21 -160
5179 -160 80 -120 -110 -59 277 92 37 145 -87 -191 17 -82 -333 118 165 -238 26 -48 21 -219 93 8 -37
5202 -37 37 76 -348 -32 175 -87 123 211 28 -40 10 -75 -31 14 59 -21 34 259 -51 56 55 -262 202 311 -419
5227 -419 113 139 128 -15 -228 76 -136 27 299 -252 -59 -63 -129 83 318 -59 -70 -169 -85 -93 51 55 135 -134
$$ [...]
8191C
##END NTUPLES=NMR FID
##END=
