##TITLE=1H_85-2021
 CDCl3, 8 sc, 
 26.08.2021
##JCAMPDX= 6.0         $$ Bruker NMR JCAMP-DX V2.0
##DATA TYPE= NMR FID
##DATA CLASS= NTUPLES
##ORIGIN= UXNMR, Bruker Analytische Messtechnik GmbH
##OWNER= root
$$ XWIN-NMR		Version 3.5
$$ Thu Aug 26 11:17:39 2021 Russian Standard Time (UT+4h)  she@DPX200
##.OBSERVE FREQUENCY= 200.131506
##.OBSERVE NUCLEUS= ^1H
##.DELAY= (6, 6)
##.ACQUISITION MODE= SIMULTANEOUS
##.ACQUISITION SCHEME= undefined
##.AVERAGES= 8
##.DIGITISER RES= 18
##SPECTROMETER/DATA SYSTEM= spect
##.PULSE SEQUENCE= zg30
##.SOLVENT NAME= CDCl3
##.SHIFT REFERENCE= (INTERNAL, CDCl3, 0, 15.7039)
##AUDIT TRAIL= $$ (NUMBER, WHEN, WHO, WHERE, WHAT)
$$ ##TITLE= Audit trail, XWIN-NMR		Version 3.5
$$ ##JCAMPDX= 5.01
$$ ##ORIGIN= Bruker BioSpin GmbH
$$ ##OWNER= she
$$ F:/spectra/data/she/nmr/H-F/1/audita.txt
$$ ##AUDIT TRAIL=  $$ (NUMBER, WHEN, WHO, WHERE, WHAT)
(   1,<2021-08-26 11:16:33.21 +0400>,<she>,<DPX200>,
      <created by zg, POWCHK disabled, PULCHK disabled
       configuration hash MD5:
       00 E9 B6 7A A2 85 ED C7 34 08 36 98 17 FE 4E 26
       data hash MD5: 16K
       14 62 23 9F 79 2C 6A 82 5E 92 7C 1E 06 31 6F 91>)
$$ ##END=
$$ 
$$ hash MD5
$$ AD 1E 01 5D AA E0 62 61 98 78 8D F7 3A B6 1A E5
##$RELAX= 
##$RELAX= 
##$RELAX= 
##$RELAX= 
##$RELAX= 
##$RELAX= 
$$ Bruker specific parameters
$$ --------------------------
##$DU= <F:/spectra>
##$EXPNO= 1
##$NAME= <H-F>
##$PROCNO= 1
##$TYPE= <nmr>
##$USER= <she>
##$AMP= (0..31)
100 100 100 100 100 100 100 100 100 100 100 100 100 100 100 100 100 100 
100 100 100 100 100 100 100 100 100 100 100 100 100 100 
##$AQSEQ= 0
##$AQ_mod= 1
##$AUNM= <au_zg>
##$AUTOPOS= <>
##$BF1= 200.13
##$BF2= 200.13
##$BF3= 200.13
##$BF4= 200.13
##$BF5= 200.13
##$BF6= 200.13
##$BF7= 200.13
##$BF8= 200.13
##$BYTORDA= 1
##$CFDGTYP= 0
##$CFRGTYP= 5
##$CHEMSTR= <none>
##$CNST= (0..31)
1 1 145 1 1 1 1 1 1 1 1 1 1 1 1 1 1 1 1 1 1 1 1 1 1 1 1 1 1 1 1 1 
##$CPDPRG= <>
##$CPDPRG1= <>
##$CPDPRG2= <>
##$CPDPRG3= <>
##$CPDPRG4= <mlev>
##$CPDPRG5= <mlev>
##$CPDPRG6= <mlev>
##$CPDPRG7= <mlev>
##$CPDPRG8= <mlev>
##$CPDPRGB= <>
##$CPDPRGT= <>
##$D= (0..31)
0 1.2 0 0 0 0 0 0 0 0.06 0 0.03 0 0 0 0 0.0002 0 0 0 0 0 0 0 0 0 0 0 0 
0 0 0 
##$DATE= 1629962192
##$DBL= (0..7)
120 120 120 120 120 120 120 120 
##$DBP= (0..7)
150 150 150 150 150 150 150 150 
##$DBP07= 0
##$DBPNAM0= <>
##$DBPNAM1= <>
##$DBPNAM2= <>
##$DBPNAM3= <>
##$DBPNAM4= <>
##$DBPNAM5= <>
##$DBPNAM6= <>
##$DBPNAM7= <>
##$DBPOAL= (0..7)
0.5 0.5 0.5 0.5 0.5 0.5 0.5 0.5 
##$DBPOFFS= (0..7)
0 0 0 0 0 0 0 0 
##$DE= 6
##$DECBNUC= <off>
##$DECIM= 32
##$DECNUC= <off>
##$DECSTAT= 4
##$DIGMOD= 1
##$DIGTYP= 9
##$DL= (0..7)
0 120 120 120 120 120 120 120 
##$DP= (0..7)
150 150 150 150 150 150 150 150 
##$DP07= 0
##$DPNAME0= <>
##$DPNAME1= <>
##$DPNAME2= <>
##$DPNAME3= <>
##$DPNAME4= <>
##$DPNAME5= <>
##$DPNAME6= <>
##$DPNAME7= <>
##$DPOAL= (0..7)
0.5 0.5 0.5 0.5 0.5 0.5 0.5 0.5 
##$DPOFFS= (0..7)
0 0 0 0 0 0 0 0 
##$DQDMODE= 0
##$DR= 18
##$DS= 0
##$DSLIST= <SSSSSSSSSSSSSSS>
$$ [...]
##$SUBNAM2= <"">
##$SUBNAM3= <"">
##$SUBNAM4= <"">
##$SUBNAM5= <"">
##$SUBNAM6= <"">
##$SUBNAM7= <"">
##$SUBNAM8= <"">
##$SUBNAM9= <"">
##$SW= 20.0188882624521
##$SWIBOX= (0..15)
0 0 2 0 0 0 0 0 0 0 0 0 0 0 0 0 
##$SW_h= 4006.41025641026
##$TD= 16384
##$TD0= 1
##$TE= 0
##$TE2= 300
##$TE3= 300
##$TEG= 300
##$TL= (0..7)
0 120 120 120 120 120 120 120 
##$TP= (0..7)
150 150 150 150 150 150 150 150 
##$TP07= 0
##$TPNAME0= <>
##$TPNAME1= <>
##$TPNAME2= <>
##$TPNAME3= <>
##$TPNAME4= <>
##$TPNAME5= <>
##$TPNAME6= <>
##$TPNAME7= <>
##$TPOAL= (0..7)
0.5 0.5 0.5 0.5 0.5 0.5 0.5 0.5 
##$TPOFFS= (0..7)
0 0 0 0 0 0 0 0 
##$TUNHIN= 0
##$TUNHOUT= 0
##$TUNXOUT= 0
##$USERA1= <user>
##$USERA2= <user>
##$USERA3= <user>
##$USERA4= <user>
##$USERA5= <user>
##$V9= 5
##$VALIST= <valist>
##$VCLIST= <CCCCCCCCCCCCCCC>
##$VD= 0
##$VDLIST= <DDDDDDDDDDDDDDD>
##$VPLIST= <PPPPPPPPPPPPPPP>
##$VTLIST= <TTTTTTTTTTTTTTT>
##$WBST= 1024
##$WBSW= 4
##$XGAIN= (0..3)
0 0 0 0 
##$XL= 0
##$YL= 0
##$YMAX_a= 626514
##$YMIN_a= -712537
##$ZGOPTNS= <>
##$ZL1= 120
##$ZL2= 120
##$ZL3= 120
##$ZL4= 120
##$ABSF1= 10
##$ABSF2= 0
##$ABSG= 5
##$ABSL= 3
##$ALPHA= 0
##$AQORDER= 0
##$ASSFAC= 0
##$ASSFACI= 0
##$ASSFACX= 0
##$ASSWID= 0
##$AUNMP= <proc_1d>
##$AZFE= 0.1
##$AZFW= 0.1
##$BCFW= 1
##$BC_mod= 2
##$BYTORDP= 1
##$COROFFS= 0
##$CY= 11.3945322036743
##$DATMOD= 1
##$DC= 2
##$DFILT= <>
##$DTYPP= 0
##$F1P= 2.36226072786647
##$F2P= -0.459571619588291
##$FCOR= 0.5
##$FTSIZE= 0
##$FT_mod= 4
##$GAMMA= 1
##$GB= 0.15
##$INTBC= 1
##$INTSCL= 1
##$ISEN= 128
##$LB= 0.24
##$LEV0= 0
##$LPBIN= 0
##$MAXI= 10000
##$MC2= 0
##$MEAN= 0
##$ME_mod= 0
##$MI= 1.114404
##$NCOEF= 0
##$NC_proc= 0
##$NLEV= 6
##$NOISF1= 3.799351
##$NOISF2= 2.8
##$NSP= 1
##$NTH_PI= 0
##$NZP= 0
##$OFFSET= 15.70392
##$PC= 1
##$PHC0= -13355.2
##$PHC1= 10.00099
##$PH_mod= 1
##$PKNL= yes
##$PPARMOD= 0
##$PSCAL= 0
##$PSIGN= 0
##$REVERSE= no
##$SF= 200.130013532006
##$SI= 16384
##$SIGF1= 3
##$SIGF2= 2
##$SINO= 400
##$SIOLD= 16384
##$SREGLST= <1H.CDCl3>
##$SSB= 0
##$STSI= 0
##$STSR= 0
##$SW_p= 3612.71676300578
##$SYMM= 0
##$S_DEV= 0
##$TDeff= 0
##$TDoff= 0
##$TI= <>
##$TILT= no
##$TM1= 0
##$TM2= 0
##$TOPLEV= 0
##$USERP1= <user>
##$USERP2= <user>
##$USERP3= <user>
##$USERP4= <user>
##$USERP5= <user>
##$WDW= 1
##$XDIM= 8192
##$YMAX_p= 0
##$YMIN_p= 0
$$ End of Bruker specific parameters
$$ ---------------------------------
##NTUPLES= NMR FID
##VAR_NAME=  TIME,          FID/REAL,        FID/IMAG
##SYMBOL=    X,             R,               I
##VAR_TYPE=  INDEPENDENT,   DEPENDENT,       DEPENDENT
##VAR_FORM=  AFFN,          ASDF,            ASDF
##VAR_DIM=   8192,          8192,            8192
##UNITS=     SECONDS,       ARBITRARY UNITS, ARBITRARY UNITS
##FACTOR=    0.0002496,     1,               1
##FIRST=     0,             0,               0
##LAST=      2.0444736,     0,               0
##MIN=       0,             -712537,         0
##MAX=       2.0444736,     626514,          0
$$ Real data points
##PAGE= N=1
##DATA TABLE= (X++(R..R)), XYDATA
$$ [...]
2395a41k525K971R19l518L785O09o142M838J133m926M899n49m620M297k68k253
$$ -141 -2666 305 1224 -2294 1491 2100 -4042 796 1929 -2997 1902 1353 -3267 1030 762 -1491
2411a491K816j454j388J446P11o63O45L83k620O87L217l570J752K105n783L377
$$ -1491 1325 -129 -1517 -71 640 -23 622 1005 -1615 -928 2289 -1281 471 2576 -3207 170
2427A70K588m728L248M50m633L482J036k157J248J00k045N19K077q44j343K539
$$ 170 2758 -1970 1278 1728 -2905 577 1613 -544 704 804 -1241 -722 1355 511 -832 1707
2443A707k640r33M561l143r70L828m434O71L987l726M93J847k748P42J740q69
$$ 1707 -933 -1866 2695 -448 -1418 2410 -2024 -1353 2634 -1092 -599 1248 -1500 -758 982 113
2459A13o89L71J60j524J912R37l140K378n96k332M114j646k193L821k800k29L544
$$ 113 -576 -205 -45 -1569 343 1280 -1860 518 -78 -2410 1704 58 -2135 1686 -1114 -1343 2201
2476B201k714m05J923j562j49J487l6j589L86J377k293J851J746m205K253J336
$$ 2201 -513 -918 1005 -557 -706 781 745 -844 -458 919 -1374 477 2223 -1982 271 1607
2492A607l602L587k27l135L137j117j163K587j338q04L99K34j35j05J560j565
$$ 1607 -1995 1592 1365 -1770 1367 250 -913 1674 336 -468 -69 165 30 -75 1485 -80
2508h0j166L065k639L50K843l776J219J921l605K635O54k771J992k30j230J463
$$ -80 -1246 1819 -820 -470 2373 -1403 -184 1737 -1868 767 1421 -1350 642 412 -818 645
2524F45l18q89K88O45K7j645K215j288j224L466k448r58L303k977J65K611k728
$$ 645 327 -562 -274 371 398 -1247 968 -320 -1544 1922 -526 -1484 1819 -1158 -993 1618 -1110
2541a110R07J080j640P33J76n40M22j41N86r83Q16P53k765K799k32k536L245j579
$$ -1110 -203 877 -763 -30 146 -394 28 -113 473 -510 306 1059 -1706 1093 861 -1675 1570 -9
2559ij833L701k048o87K435j780l10J408r79L35K56K83j351M1J976k209M34K075
$$ -9 -1842 1859 -189 -876 1559 -221 -531 877 -102 233 489 772 -579 -538 1438 -771 -337 1738
2577A738l232J911J016l051K527n45j821L004j381r47J918j452k64Q25N6l68k74
$$ 1738 -1494 417 1433 -1618 909 364 -1457 1547 166 -781 1137 -315 -579 246 302 -66 -340
2594c40J115j109p05L048k980nL013l671J485K095l544J770L54k344K327j60j061
$$ -340 775 -334 -1039 2009 -971 -976 2037 -1634 -149 1946 -1598 172 526 -1818 509 349 -712
2611g12O99k27k83J54R09n85j339K208j071j460L743k641j456L851l075K81K942
$$ -712 -13 -240 -523 -369 540 -45 -1384 824 -247 -1707 2036 -605 -2061 1790 -1285 -1004 1938
2628A938l274O68J243j789J407L70l69p73J83P07j103J613K00k854K657K14k475
$$ 1938 -1336 -668 575 -1214 193 563 194 -579 -396 311 -792 821 1021 -1833 824 1038 -1437
2645a437L529j485k292L529j742o16K628k289j07J268m32j76L85Q8j412P42J332
$$ -1437 2092 607 -1685 1844 102 -514 2114 -175 -282 986 554 378 763 851 -561 181 1513
2662A513k274J538J278m091K620J427m040L510J15l732K824L74j859J589j21j646
$$ 1513 -761 777 2055 -2036 584 2011 -2029 1481 1596 -2136 688 1062 -797 792 671 -975
2678i75M30J213m11p57J270j538r35L320k619q8K890m244J309K588l315J683R00
$$ -975 -545 668 257 -500 770 -768 -1703 1617 -1002 -1090 1800 -2444 -1135 1453 -1862 -179 721
2695G21l100K021P76j482O82N84j133q80K357l70j977K476p73k619M387j661k103
$$ 721 -2379 -358 418 -1064 -382 202 -931 -1811 546 176 -1801 675 -98 -2717 1670 9 -2094
2712b094M011l322j09L554k753M21J362j857M90J293j60j343Q36Q86k486K281
$$ -2094 1917 -1405 -1514 2040 -713 -292 1070 -787 -297 996 836 -507 329 1215 -1271 1010
2728A010J252l864K909L83l838M382o18l414L568j304j508K756o80j573J227J27
$$ 1010 2262 -1602 1307 1690 -2148 2234 1616 -1798 1770 466 -1042 1714 1034 -539 688 815
2744H15j230R56J183k189k36K344k749P48K722m246J550K085l989K830O91l350
$$ 815 -415 541 1724 -465 -701 1643 -1106 -358 2364 -1882 -332 1753 -2236 594 1285 -2065
2760b065K140M36k293J749P75j754o5J276j038p33K964k225j377M068l020j014
$$ -2065 75 511 -1782 -33 742 -1012 -1077 199 -839 -1572 1392 -833 -2210 1858 -1162 -2176
2776b176M489l854l90L783l381O28K383k323Q9J011j84l17P81K09j974J946K84
$$ -2176 2313 -1541 -1931 1852 -1529 -901 1482 -841 -752 259 75 -242 539 748 -1226 720 1004
2793A004k466L247o41l136M042j298k506M548k526j759L533j902o30K352j037
$$ 1004 -1462 1785 1144 -1992 2050 752 -1754 2794 268 -1491 2042 140 -490 1862 825
2808H25j053J030N36k100J460J278l449J628K085m072K439J340m062K951P36l826
$$ 825 -228 802 1338 -762 698 1976 -1473 155 2240 -1832 607 1947 -2115 836 1572 -2254
2824b254L161r2k456K146o9j450Q90P84j514k50K180j927m50K996l369LL551l665
$$ -2254 907 815 -1641 505 436 -1014 -124 660 -854 -1104 1076 -851 -1301 1695 -1674 -1671 1880 -1785
2842a785Q51K380l792J838J700l007J383J215j961L91J417q06r65K244p06k282
$$ -1785 -934 1446 -2346 -508 1192 -1815 -432 783 -1178 -787 630 -176 -1141 1103 397 -1885
2858a885L082q45k029L450j801j703L728k616j27K968k841j82K556j769k8J195
$$ -1885 1197 352 -1677 1773 -28 -1731 1997 -619 -746 2222 -619 -801 1755 -14 -42 1153
2874A153n87j505J692L74k209J885J052l928K821J031l809L448j63l225L142m43
$$ 1153 566 -939 753 1127 -1082 803 1855 -2073 748 1779 -2030 1418 1255 -1970 1172 729
2890G29j942K230j028q63J189k73n48K62Q45j339j93J820k045M95K044l377J598
$$ 729 -1213 1017 -11 -874 315 42 -506 -244 601 -738 -931 889 -1156 -661 1383 -1994 -396
2907c96J730l178K565K21l261K692M13k076J651K64j581L19J677r54j233K833
$$ -396 1334 -1844 721 942 -2319 373 786 -1290 361 625 -956 -637 1040 86 -1147 1686
2923A686j898j489L831k309j219L682l029j60K895k251J76J308j663M45O26l60
$$ 1686 -212 -1701 2130 -179 -1398 2284 -745 -905 1990 -261 -85 1223 -440 5 631 271
2939B71K74k54J37r66J161N65k308K385r50k155L870j727j756L159k295r36L067
$$ 271 545 291 428 -538 623 1188 -1120 1265 315 -1840 2030 303 -1453 1706 -589 -1525 1542
2956A542j657p93J542j034l90R67K64j038%J259j892P43J646k744J678P81k933
$$ 1542 -115 -908 634 -400 -790 177 441 -597 -597 662 -1230 -487 1159 -1585 93 874 -2059
2973b059K587M88k749K380n05j551J903j59j030K34N12j88q79J745o73j299K170
$$ -2059 528 1016 -1733 647 142 -1409 494 335 -695 -461 51 -137 -1016 729 56 -1243 927
2990I27j445k23K158k335O04J275k619K151N23k355J876K08j883J294M99p16o27
$$ 927 -518 -741 1417 -918 -314 961 -1658 493 1016 -1339 537 745 -1138 156 655 -61 -688
3007f88J316Jj751K245n38j993K536q64j405K585j737j89J790k273J139J133j692
$$ -688 628 629 -1122 1123 585 -1408 1128 264 -1141 1444 -293 -482 1308 -965 174 1307 -385
3024c85K16P85n54l17O76O09k197J213J231k662J943R45k864K108j38j869K317
$$ -385 -169 616 62 -255 421 1030 -1167 46 1277 -1385 558 1503 -1361 747 609 -1260 1057
3041A057j028p45J468j319L02J194j538N07J52k42m93N61R50j913O15J688k889
$$ 1057 29 -716 752 -567 -265 929 -609 -102 50 -192 -685 -124 826 -1087 -472 1216 -1673
3058a673J296J494k759J286Q79j759J113Qp64J067q64N47K04n86L75n4M06n31
$$ -1673 -377 1117 -1642 -356 523 -1236 -123 -115 -879 188 -676 -129 75 -511 -136 -190 216 -315
3076c15m39J724j934r0K719k901O69J929k519R96J380j609O17O7j19O1m60Q13
$$ -315 -754 970 -964 -1054 1665 -1236 -567 1362 -1157 -161 1219 -390 227 294 175 236 -224 589
3094E89n24r5N60q44R98k88q75J835j120j008K412k087L7K344k202O5J510j002
$$ 589 65 -30 530 -314 684 396 -479 1356 236 -772 1640 -447 -410 1934 -268 -203 1307 305
3112C05l14M88j54j88l61R01q09l5J335j801N86M83j503K259j099j500K776j593
$$ 305 -9 479 325 137 -224 677 -132 -167 1168 -633 -47 436 -1067 1192 93 -1407 1369 -224
3130b24q96K042j461n03J063j72k83k43P79k90r89J840j137q24K112j952M84J318
$$ -224 -1120 922 -539 -1042 21 -151 -434 -677 102 -188 -1177 663 -474 -1298 814 -1138 -654 664
3148F64j949J292Q7j541J662l60r56J398o43k53N37L55m1j065J143k7j615K438
$$ 664 -1285 7 94 -1447 215 -145 -1101 297 -346 -599 -62 293 252 -813 330 303 -1312 1126
3166A126j011r41K028j494O7J480j646P93K92j345J613j82p33O14k64O4l26Q89
$$ 1126 115 -826 1202 -292 -225 1255 -391 402 694 -651 962 780 47 661 397 461 135 1024
3184A024k00j406J603l44j572K118o66j527K405j352q59J805j209j79P31n30l5
$$ 1024 824 -582 1021 677 -895 1223 557 -970 1435 83 -776 1029 -180 -359 372 -158 -193
3201a93j67L95j53n47J250j278M58O31j639O98O50j587J939l98j647K153j101
$$ -193 -360 35 -118 -665 585 -693 -235 396 -1243 -545 105 -1482 457 59 -1588 565 -536
3218e36p38J749j249n22J340k63k66Q5P53r60l46K131j710l19K321k461N14K059
$$ -536 -1274 475 -774 -1296 44 -219 -485 -400 353 -607 -953 1178 -532 -851 1470 -991 -477 1582
3236A582k502J114R11j920J301n2l25P07q20K50j57K71M16o21O17m08j071K145
$$ 1582 -920 194 1105 -815 486 434 109 816 -4 246 89 360 776 155 772 364 -707 1438
3254A438j113o71J890j958MJ887j837O08N66j799J206R4m69K75k09L09j047R14
$$ 1438 325 -346 1544 -414 -410 1477 -360 248 814 -985 221 315 -154 121 -88 221 -826 88
3272H8L75k007J378O57k298K529j15k235K279j271o98J829n77m57J77o40Q77l37
$$ 88 463 -1544 -166 491 -1807 722 607 -1628 651 -620 -1318 511 -66 -523 -346 -986 -109 -446
3290d46K5L27o31Q97p77P14R89k771J410J174k572K715L67l294K353K41j410J652
$$ -446 -421 -94 -725 172 -605 109 1098 -1673 -263 911 -1661 1054 1421 -1873 480 721 -689 963
3308I63j24q92l35P65L48r31J112K5j605J555o17n15J580j638N4J287k015J312
$$ 963 839 -53 -388 377 725 -206 906 931 -674 881 264 -251 1329 -309 -255 1032 -983 329
3326C29R66k031R19L06j014R74J06n78q92O73J002j255J230n62j982K327o21j250
$$ 329 1295 -736 183 489 -525 449 555 -23 -915 -242 760 -495 735 173 -1809 518 -103 -1353
3344a353K605j871p75K039j340n0J715j737O7L85O4J7o3R36j570K75J563j683
$$ -1353 1252 -619 -1394 645 -695 -745 970 -767 -700 -315 -251 -234 -297 639 -931 -656 907 -776
3362g76R46P15k100J313N56j520J874o84j210J928q61k14J185j285k64P09M31
$$ -776 170 885 -1215 98 654 -866 1008 324 -886 1042 181 -33 1152 -133 -397 312 743
3379G43m78m17J726k292J63K369k583O01J651k750J223J571k278R62M56j622R32
$$ 743 265 -152 1574 -718 -555 1814 -769 -168 1483 -1267 -44 1527 -751 211 667 -955 -23
3396b3L04r0l17J14J78r18J356m63j256J814j246p60K414j586m42J716j715J65
$$ -23 281 191 -126 -12 166 -752 604 141 -1115 699 -547 -1307 1107 -479 -921 795 -920 -755
3414g55J286j303O29N1n59K18K99m8n34M60K83j292J673K03k185K476o29j999
$$ -755 531 -772 -143 -92 -651 -433 -134 -182 -716 -256 27 -1265 408 611 -1574 902 273 -1726
3432a726K761p02j560K324j059p94J480l75k63J03J62j13n29J472j082o29J804
$$ -1726 1035 333 -1227 1097 38 -756 724 349 86 189 351 238 -291 1181 99 -530 1274
3449A274j670K78J512k188J303N56j919J928k16j342J369m11p62M58P9k31PN16
$$ 1274 -396 -118 1394 -794 509 1065 -854 1074 858 -484 885 474 -288 170 249 18 25 541
3467E41m51o00J441j085q01K110j882j6K185k648N47J841k444J041O57r62J76
$$ 541 90 -510 931 -154 -955 1155 -727 -743 1442 -1206 -659 1182 -1262 -221 436 -526 -350
3484c50N07n3p18O08O06j722J234M95j932J835r2j691K282j326n03K125k018O43
$$ -350 157 104 -614 -6 600 -1122 112 607 -1325 510 418 -1273 1009 -317 -820 1305 -713 -70
3502g0R47j524O78K88n04R5J14N40j220N13J361k101J289Q49k287J339O34j945
$$ -70 877 -647 31 319 -185 -90 24 564 -656 -143 1218 -883 406 1255 -1032 307 941 -1004
3520a004J701m25q55J257r40J06O27q82M12J35P4q6o00J027j100k77J785j849
$$ -1004 697 272 -583 674 -266 -160 467 -415 -3 132 206 120 -480 547 -553 -830 955 -894
3538h94M38J564k227Q25J080j477J186j94p35R26o55K33K02l40M03l94M65J8r71
$$ -894 -456 1108 -1119 -294 786 -691 495 301 -434 492 -163 70 272 -68 335 -59 406 424 -547
3557e47J845j307o09K132j377n76J862j807N24R68r93K44k44L8k1k63O64k40n37
$$ -547 1298 -9 -618 1514 137 -439 1423 -384 140 1108 115 359 115 153 132 -131 533 293 -244
3576b44R03q95M48R5j196J514n91j342K313j075j066J945j316l93J069k94k61
$$ -244 659 -236 212 307 -889 625 34 -1308 1005 -70 -1136 809 -507 -900 169 -125 -386
3593c86j51M38n5j040J381l52j015J459p88J7R07j104Q19j13j511K306r76o51
$$ -386 -537 -99 -154 -1194 187 -165 -1180 279 -509 -492 415 -689 130 17 -1494 812 -164 -815
3611h15J455p58n80P41K65k06o24R12J81j488J732m38j130J855j030k31J080j111
$$ -815 640 -118 -698 43 308 102 -522 390 571 -917 815 377 -753 1102 72 -159 921 -190
3629a90N74L6j105J525o32p70J332o94k83L40K5M15j186R35M14j621J569p6j565
$$ -190 384 420 -685 840 208 -562 770 76 -207 133 158 573 -613 322 736 -885 684 608 -957
3648i57J696n96n26P50q24P90J67j121R28m99l20J024o74L56p23L23M54r13P94
$$ -957 739 143 -383 367 -457 333 500 -621 307 -192 -512 512 -162 194 -529 -206 248 -665 129
3667A29Q07j723J309J9j579J538N7j107R95l66K79j19o95R25o15j64J019j004
$$ 129 936 -787 522 541 -1038 500 557 -550 445 79 358 239 -456 469 -146 -310 709 -295
3685b95L20M4m08R54j223O30Q31j739P14Q13j596J149J32q53P07m11M94j96n04
$$ -295 25 69 -339 615 -608 22 853 -886 -172 641 -955 194 326 -527 180 -231 263 67 -437
3704d37J190j404K25R08j014M57M8r04J293q89K44J238j777O35O93j159R74L48
$$ -437 753 -651 -426 482 -532 -75 -27 -931 362 -527 -283 955 -822 -187 506 -653 321 669
3722F69j079M19l04Q38p70MP76j093J2J344j078L90M51j316J119n27j8J019j320
$$ 669 -410 9 -295 543 -227 -223 553 -540 -528 816 -262 128 579 -737 382 -145 -163 856 -464
3741d64L63O37j195Q43J90o31L08k88N41m89K29N03j458K74J647j637O31N69j430
$$ -464 -101 536 -659 184 374 -257 51 -237 304 -185 44 547 -911 -637 1010 -627 4 573 -857
3760h57Q36K47k78K94p23K83o2k46J208q39l53M05n69O97J31p08Q24o73j78J262
$$ -857 -21 226 -52 242 -481 -198 -260 -506 702 -137 -490 -85 -654 43 174 -534 290 -383 -561 701
3780G01j184O86L57j383Q11L57p69R28p46O8k0J7J101j025j30N29r16J076L09
$$ 701 -483 203 560 -823 -12 345 -424 504 -242 -174 -194 -177 924 -101 -231 298 -618 458 767
3799G67j263J295q33m11J685j339N32M44j305M49M71j7l63o05N53J53l34J166
$$ 767 -496 799 -34 -445 1240 -99 433 877 -428 21 492 475 112 -493 60 213 -121 1045
3817A045j125j35N58p97P56N23j214P95p32k65J228r77L2O85j034L11N68n8p6
$$ 1045 -80 -215 343 -454 302 825 -389 406 -326 -591 637 -340 -308 377 -657 -346 222 164 88
3836H8p53P71l84l10J896j446p25J233j023J84J302j278L16r6n70J307o84L7J43
$$ 88 -665 106 -278 -588 1308 -138 -863 370 -653 -469 833 -445 -129 -225 -795 512 -172 -135 8
3855Ho82M77L00J04J64j037P35l1n62J625j246o70J465j101M83R54j423K11j30
$$ 8 -674 -197 103 207 371 -666 69 38 -524 1101 -145 -815 650 -451 32 986 -437 -226 -356
3874c56j06R11k66q7k76k65O34r3J03L38j394P86M00r68J147j96j079J046q84
$$ -356 -462 449 183 96 -180 -445 189 96 199 537 -857 -71 329 -639 508 312 -767 279 -605
3893f05N92P74j123L59j38m37J026m46J93n70mM77k63M32O49j849Q77M97j177
$$ -605 -13 761 -362 -3 -141 -578 448 2 195 -375 -379 98 -165 267 916 -933 -56 441 -736
3912g36J487n2j555R37Jm03Q51m15J42o37M29K05l05J72k29o06J160n37R0R97
$$ -736 751 699 -856 81 82 -321 530 115 257 -380 49 254 -51 121 -108 -714 446 -91 -1 996
3932I96j751M93J011j094R99l44p34O96k64m4N27o98J33m93L41O05p71P50j99
$$ 996 -755 -262 749 -345 654 310 -424 272 8 -36 491 -207 -74 -567 -226 379 -392 358 159
3951A59r46J757j194k23J496k117K66J657j378N34L00p03M09l28O32l30l29N44
$$ 159 -787 970 -224 -447 1049 -1068 -802 855 -523 11 311 -392 17 -311 321 -9 -338 206
3969B06p04k17J371q81K60K35j158J339o12k05R97j405L22J031r28N03R4p08J96
$$ 206 -498 -715 656 -225 35 270 -888 451 -161 -366 631 -774 -452 579 -349 154 248 -460 -264
3988b64jN07k69j63P97j109J25J289j274K89M41r87J028k07o60J038q37k09R06
$$ -264 -265 242 -27 -190 607 -502 -377 912 -362 -73 368 -619 409 202 -458 580 -257 -466 440
4007D40m44L43j81j19J09k89Q57j83r94J030p15j79J247q57K4L57p73P71k4p86
$$ 440 -4 339 158 39 148 -141 716 533 -461 569 -146 -325 922 65 89 446 -327 444 420 -366
4027c66R41m26o99R76o87N68l42J38J63r00J213m23r07J277n69q95J757j129k44
$$ -366 575 149 -550 426 -261 307 -35 103 266 -634 579 156 -751 526 -43 -938 819 -310 -554
4046e54O55o08L53N3j10L70o21J52K62n06N14r6j14K38p56J114j66j174J410n51
$$ -554 101 -507 -154 -101 -211 159 -462 -310 -48 -554 -40 -136 -250 -12 -768 346 180 -994 416 -135
4066a35p12J348n76l28Q95r05j46N03k2P8l91M64Q6n11P05o64q9J031j070M81
$$ -135 -847 501 -75 -403 492 -413 -559 -56 -78 0 -391 73 159 -352 353 -311 -400 631 -439 42
4086D2O40j363J145j46o86R00l61l61O78o96K96j25j61O54q56L46K94n09P35k74
$$ 42 682 -681 464 318 -368 532 171 -190 488 -208 88 -37 -198 456 -400 -54 240 -269 466 192
4106A92m24N49p21L03N23j076J061p7o89L85l80K82j93KN45o85N7O47q52N24O07
$$ 192 -232 317 -404 -101 422 -654 407 330 -359 26 -354 -72 -265 -263 282 -403 -346 301 -551 -27 580
4127E80j100N58L24m69O34p03J60L90q45P16o9q4M40o92L93Oo85R65n78j10P04
$$ 580 -520 38 362 -107 527 -176 -16 374 -471 245 176 92 532 -160 233 239 -446 519 -59 -169 535
4148E35o25L62J18n51O05o4m32O82m60j12K54m55K76M98l48O5r1j01r4k50P94
$$ 535 -90 272 390 -161 444 380 -52 630 170 58 312 -143 133 631 283 348 257 156 62 -188 606
4169F06o20m30R19r81N23M36q22K72J65l18L14m00N88p0o56Q53n05p7N35q97L05
$$ 606 -14 -444 475 -506 17 453 -369 -97 68 -250 64 -336 252 182 -474 379 -126 -203 332 -565 -260
4190b60M88r07Q31l11k05O68p50%N46l71K36k98K1N13p03L60K7m53Q17k51m49
$$ -260 228 -679 152 -159 -364 304 -446 -446 100 -271 -35 -333 -312 201 -502 -142 -115 -568 249 -2 -451
4211d51O96r21N55K38n62P45j16q50R43m14m66M84l88N99j03k33P16q68L91L19
$$ -451 245 -676 -121 117 -445 300 184 -666 277 -137 -603 -119 -507 92 -11 -244 472 -396 -5 314
4231C14q64Q71Q4q25N91l46L5O63r57N95K57m51N53m74Q2K59l41L41k02l10Q69
$$ 314 -550 321 405 -420 171 -175 -140 523 -434 161 418 -33 520 46 128 387 46 387 185 -125 744
4252G44j085M50L99r79P02L05r04Q18l92kL25p64N21k6j77K36m21J48K00k63L79
$$ 744 -341 109 508 -471 231 536 -368 450 58 56 381 -383 138 112 -65 171 -250 -102 98 -165 214
4273B14l76l74P64m46J63M11q71O88r1n22R07m39l85P18r22P50j20j44K13m15
$$ 214 -162 -536 228 -218 -55 356 -515 173 82 -440 467 28 -357 361 -561 189 69 -75 138 -277
4293b77L05L67m92O06m19p50J016o10N5P45q87M34J17n12O97n66R2N59q42M21
$$ -277 28 395 -97 509 90 -660 356 -254 -199 546 -341 93 210 -302 395 -171 -79 480 -362 59
4313E9M39n29L75o63M46O8l94Q48p87n85J333o33l11R96o40l28N74j88O7j78j1
$$ 59 498 -31 344 -319 127 195 -199 649 -138 -723 610 -23 -334 662 22 -306 268 80 147 -31 -42
4334d2k02j52R14j44r03P67r87P14K58l91N79m12n86O25k06m8O87q47R7R0j77
$$ -42 -244 -396 518 374 -529 238 -749 -35 223 -168 411 -1 -587 38 -168 -216 471 -376 -279 -189 -366
4355c66J013p58j4P8l32Q52j88l34K90r38M69P85j021Q67m48p92J010L7m56P12
$$ -366 647 -111 -125 -47 -379 473 285 -49 241 -697 -228 557 -464 403 -45 -837 173 210 -246 466
4375D66o71m9r4O28J91o50M15J19j094J479k88m82N39r94J94Q80o00O05m38r93
$$ 466 -205 -254 -348 280 471 -179 236 355 -739 740 452 -30 509 -485 -291 589 -11 594 156 -837
4395h37J253l59M4O48r97P3J27K98O44j267L57m9p48J096J68q83Q07p22J55O22
$$ -837 416 57 101 749 -248 -175 -48 250 894 -373 -16 -65 -813 283 451 -432 375 -347 -192 430
4415D30k80q3j52o00M39L95l8J21n26l9L19J99M74r61J88K77r41J163J30r92R25
$$ 430 150 67 -85 -685 -246 149 111 232 -294 -333 -14 185 659 -302 -114 163 -778 385 515 -477 448
4436D48q13J19J188p56l9N4p21Q37k10L59j74o19M84l07L14N45j034J82K26q91
$$ 448 -365 -246 942 186 147 201 -520 317 107 466 292 -327 157 -150 164 709 -325 -143 83 -808
4456h08J442J38j316Q22l12m09R45m22Qp4n59Q42k70M7M13j570J220k92p0O53
$$ -808 634 772 -544 278 -34 -443 502 80 88 14 -545 297 27 74 487 -1083 137 -155 -225 428
4476D28j090N48J03p78J088J37j215P02k26j5O90j17m46m78L34O80o20N98j4r99
$$ 428 -662 -114 -11 -789 299 436 -779 -77 -303 -318 372 255 -191 -669 -335 345 -275 323 309 -690
4496f90O84J53l40P58o46l13L02m84P01N11j266R62m03n6Q29O2m67l69M5N14o42
$$ -690 -6 147 -193 565 -81 -394 -92 -576 125 636 -630 332 -71 -127 702 764 297 -72 -27 487 -155
4517a55O52J36j401N67O64m90R65q15l20M09k89M79J13p89L95m0k00M47j17Ol56
$$ -155 497 633 -768 -201 463 -27 938 123 -197 212 -77 402 515 -274 121 81 -119 328 211 217 -139
4538a39k7O55o81K0P20j324N42M41l32L36l48k84L92l03N01P3o96O23l52n2K37
$$ -139 -166 489 -192 -172 548 -776 -234 207 -125 211 -137 -421 -29 -332 169 242 -454 169 -183 -235 2
4559BJ45p2k57l02Q73o88K46O42j471M73Q91o04K28j49j22J15j55N99r2q25Q31
$$ 2 147 75 -182 -484 389 -299 -53 589 -882 -409 482 -122 106 -43 -165 -50 -205 394 302 -523 308
4580C08o03Q7M78m84K78k60k21J040q54L55M21j156P21K94l80K00j69k60L31l80
$$ 308 -295 -208 270 -214 64 -196 -417 623 -231 124 545 -611 110 404 24 224 55 -205 126 -254
4600b54P19j85k99L68n22q1P69o01L19l10n2R36o80k6M41o04J66L82n74N74m10
$$ -254 465 280 -19 349 -173 -254 515 -86 233 -77 -129 807 127 101 542 -62 104 486 -88 486 76
4621G6J88m6l76M80K16q16P52o50J79L61n95K29j88j19O89n90L58N07r63K54L74
$$ 76 264 218 -158 322 538 -278 474 -176 3 364 -231 -2 -190 -309 380 -210 148 655 -308 -54 320
4642C20n74M50m09M25k70j75K98J60n75Q12q42Q8O34p09L61o1j08Oj63k91P79
$$ 320 -254 196 -213 212 -58 -233 65 225 -350 462 -380 -292 342 -367 -6 -67 -175 -169 -332 -623 156
4663A56m39J75J18n11O84m84mL60o14M27K31m61K34k01P2N12n86M66l35j04O20
$$ 156 -283 -108 10 -501 183 -301 -305 55 -559 -132 99 -362 -128 -329 -257 255 -331 135 -200 -304 316
4684C16o91j1P35p68P24m5p87Q51n37K2O92o50N02j3l81M40l29j37L80p0K68m36
$$ 316 -375 -386 349 -419 305 260 -527 324 -213 -191 501 -149 353 340 -41 399 70 -67 313 243 511 75
4706G5j12M42l92M6K72o24M12L79n99M77l48l8M07m36K40n2n28Q21n38k54P51
$$ 75 -37 405 13 59 331 -293 119 498 -101 376 28 -10 397 -39 201 149 -379 442 -96 -350 401
4727D01r54Q88k57l54N72n57L0O79j022O58r0j72L17k48q1M01n99K35K04n70P77
$$ 401 -553 335 78 -276 296 -261 -231 448 -574 84 -6 -178 139 -109 -190 211 -388 -153 51 -519 258
4748B58n11R0L83q61P52K01p34R84o44m52Q00l75OM98n36K96k77O6K89m48L26
$$ 258 -253 -163 220 -641 111 312 -422 562 -82 -534 266 -109 -103 395 -141 155 -122 -56 233 -215 111
4769A11o8m19N80l39K48K91n30L98j67o03P90k19m57P88p15PM00m23L42j12Q8
$$ 111 43 -376 204 -135 113 404 -126 272 105 -498 292 73 -384 404 -311 -304 96 -327 15 -97 -9
4790iJ82m38L72j02m87R87k20q16R13q09M26J92o18Q38k20j29J52n06L37N6n5
$$ -9 173 -265 107 5 -482 505 285 -531 382 -427 -1 191 -427 411 191 62 214 -292 45 101 46
4811D6l8k17J52J54l20P07n29m46R30n46l86Q89k54k54M14n22M76k47K13L38o97
$$ 46 8 -209 -57 97 -223 484 -45 -491 439 -107 -493 396 142 -112 302 -220 256 9 222 560 -137
4832a37J72J67j65L74n39L8L55n70O17K35q99N28l35q9L49k93K65J6n12O40p1
$$ -137 35 202 37 411 -128 -90 265 -305 312 547 -352 176 -159 -248 101 -192 73 89 -423 217 146
4853A46l81J83Q5j88j81K60M46r63M63M42q24O90K28j236Q88j54j41O20o31K70
$$ 146 -235 -52 33 -155 -336 -76 370 -593 -130 312 -512 178 406 -830 58 -96 -237 383 -248 22
4873B2j18l99P86n01p4L46k74K35q3r8M46m59P4M89p30P51J60r99O13L5m28J086
$$ 22 -96 -495 291 -210 -284 62 -212 23 -60 -158 288 -171 -97 392 -338 413 573 -426 187 222 -206 880
4895H80p99m0J22n04N23p0j92J02n02N60n5j00P20p27j95P14p49P35R7j060N23
$$ 880 81 41 163 -341 182 112 -80 22 -480 80 25 -75 645 -82 -277 437 -312 423 520 -540 -17
4916a7K22m54P23n97J11qk73P26k53l30J01l91M51J51l27O03r64O1O13n40O36
$$ -17 205 -249 474 -123 -12 -20 -293 433 180 -150 -49 -440 11 162 -165 438 -526 -465 148 -392 244
4937B44K93j283M37M26o03R52m82k54LR4N26l72J53m4o60K68L31k21M45n25m6
$$ 244 537 -746 -309 117 -486 466 -16 -270 -267 -173 353 -19 134 90 -570 -302 29 -192 253 -272 -318
4958c18P78p19L26M49j039J55N44pq5j69j75J60j7P27q23J62O75j279J019J80
$$ -318 460 -259 67 516 -523 -368 176 169 84 -85 -260 -100 -117 610 -213 -51 624 -655 364 544
4978E44n72N15n38m68J022o22K0O25r33M38J35P8r3j62L03o36O3J052n38l57N23
$$ 544 -28 487 -51 -519 503 -119 -99 526 -407 31 166 244 151 -11 292 -344 -281 771 233 -124 399
4999C99j040M42N07m90L51k97m50P75j73P4J16p65K19L60j5J71p44P18n77M7J005
$$ 399 -641 -199 308 -182 169 -128 -578 197 24 98 214 -551 -332 28 13 184 -560 158 -419 -372 633
5020F33p18k94P73j034J75Q17l77K75n41p0P14l83kJ77m95q7M44K70p5l15J58
$$ 633 -85 -379 394 -640 -465 352 -25 250 -291 -361 353 -30 -32 145 -350 -437 7 277 202 -113 45
5041D5m94L48Q31p22m97Q63n46O3Q26p32L12n41J0N35l24N55p04l36N51m9K83
$$ 45 -449 -101 730 8 -489 374 -172 -109 717 -15 297 -244 -234 301 -23 532 -172 -508 43 -6 277
5062B77K84q21K19L54n70N82l59j60N02m11J45L02j05k90o9j97N97l19K96kn84
$$ 277 561 -260 -41 313 -257 325 -34 -194 308 -103 42 344 239 -51 -120 -317 280 -39 257 255 -329
5083c29M84j80M08j89m65L28k48k47R97m67p35O57p6r1L68k20r2k78K02N63p65
$$ -329 155 -25 383 194 -271 57 -191 -438 559 92 -643 14 -62 -153 215 -5 -97 -375 -173 390 -375
5104c75O72Jr50N66L01p1K28p59J58R8p2N40j28q40P61m04J73L25j91k06O1m8
$$ -375 297 298 -652 -86 215 144 372 -387 -229 -131 -203 337 209 -631 130 -274 -101 224 33 -173 -112 -160
5126a60J28j64J28m6n48O33Mk0M73p33K02P7k84P30m66k24O67r50O22K58m11M30
$$ -160 -32 -196 -68 -114 -662 -29 -25 -45 428 -305 -103 -26 -310 420 -46 -270 397 -553 69 327 -84 346
5148C46p53L11K35n39L75K14o81N24R6l38M28k72J11J66o30Q37m72k18N44k97
$$ 346 -407 -96 139 -400 -25 189 -492 32 128 -210 218 -54 57 223 -407 430 -42 -260 284 -13
5168a3Q2K61p12L44k37J99L26l69L55K50r32N91N8l76N12p76O83j62k65M27k02
$$ -13 69 330 -382 -38 -275 -76 250 -119 236 486 -446 145 203 -173 339 -437 246 84 -181 246 44
5189D4j63L75m52L84P5n37J95L9J9L48n43L90j02l12J58K26k77L61m25p3L76o38
$$ 44 -119 256 -196 188 263 -274 -79 -40 -21 327 -216 174 72 -240 -82 144 -133 228 -197 -270 106 -532
5211e32Q02p3m85L21j66j49L55l84J46K61m15L71k24k4K12k93K04J5j70L86p34
$$ -532 270 197 -288 33 -133 -282 73 -311 -165 96 -319 52 -172 -196 16 -277 -73 -58 -228 158 -576
5232e76M24j21j53Q83l95n78P49m29M4J69k21K65q9J53R9j73O4j97j72O27j42
$$ -576 -152 -273 -426 457 62 -516 233 -196 -152 17 -204 61 -28 125 224 51 115 -82 -254 373 231
5253B31l75O72o40J24L99n67L81j53l30O67n10M8K83n80M60j00k22M09l76M92
$$ 231 -144 528 -112 12 411 -156 225 72 -258 409 -101 -53 230 -350 110 10 -212 197 -179 313
5273C13k73j76N29l81Q0L73p97K9P05o70L83j18p8K23k56P0P8L7K59m55l0L25
$$ 313 40 -136 393 12 92 465 -332 -303 402 -268 115 -3 -81 142 -114 -44 34 71 330 -125 -155 170
5295A70n37O76r3n38N30n8m65P72m40j87N93o77L41J4j41L04k80J97P9k22K51
$$ 170 -367 309 216 -322 208 150 -315 457 17 -170 423 -254 87 101 -40 264 -16 181 260 38 289
5316B89k64LM39p88J15M61n85N54j34l48M69o23J61O16m65J37l09K65M55o80K59
$$ 289 25 28 467 -321 -206 255 -330 224 90 -258 211 -412 -251 365 -100 37 -272 -7 448 -232 27
5337B7J1k18M52m83l08O72k81oO24q72N69r8o32Q33l82N2J39j19L71k72j49L05
$$ 27 38 -180 272 -211 -519 153 -128 -134 490 -382 187 89 -543 290 -92 -40 99 -20 351 79 -70 235
5359B35p16N54o4n73P33k72j03P82q36L11K93l41j53L36m72N88l53KJ48k17J61
$$ 235 -481 73 9 -564 169 -103 -206 576 -260 51 344 3 -150 186 -286 302 -51 -49 99 -118 43
5380D3j48K75l8l31J68rk57K51J19n78J069n12j80N16n83O02m31RJ05k43L8L39
$$ 43 -105 170 132 -199 -31 -40 -297 -46 73 -505 564 52 -128 388 -195 407 -24 -15 90 -153 -115 224
5402B24l20M23n15M05q3k22J47J81q05R40l84k82O64n82K96M02m78K4J40k27J48
$$ 224 -96 327 -188 217 134 -88 59 240 -565 375 -9 -291 373 -209 87 489 11 35 175 -52 96
5423I6o8jJl16M98k72j56N59p97N22K37o60N30m17j07P56l98O7J41m41r0L60k72
$$ 96 28 27 28 -288 210 -62 -218 341 -456 66 303 -357 173 -244 -351 405 7 74 215 -226 -316 44 -228
5446b28M48k52o6j69K62J46l10j90M53o98O35L22p30M39k48l30O51k33k89M53
$$ -228 220 -32 -98 -267 -5 141 -169 -359 94 -604 31 353 -377 62 -186 -516 135 -98 -387 66
5466F6k92J28k27R4J36J91k01P3k79N45j29k77J16n04K29P19p93L53O0l48M86
$$ 66 -226 -98 -325 -231 -95 96 -105 -32 -311 234 105 -172 -56 -560 -331 388 -405 -52 8 -340 146
5487A46k00k03N49m28O2R1nJ55l95K00O1j39N04l89k45O99q73M87J78m76K56L3
$$ 146 -54 -257 292 -136 -74 17 12 167 -228 -28 33 -106 398 9 -236 463 -410 77 255 -221 35 68
5509F8k34M36j87j05J8k90M66o4P9Q3p19N17k6l76R44n78l77O70l03j9N15n54
$$ 68 -166 270 83 -22 -4 -294 172 108 187 270 -449 68 42 -334 610 32 -345 325 22 3 518 -36
5531c6r4L8L3L29j0k9j47k86L31m98M36O15j026Q3O29o70N11K51m68K20K2m94
$$ -36 -130 -92 -59 270 260 231 84 -202 129 -369 67 682 -344 -261 368 -302 209 460 -8 212 234 -260
5553b60P26n19n8j30n2N62j64j41m8l6K73J4l56M73q23K51L88l83L00Q1n29L94
$$ -260 466 -53 -111 -241 -293 269 105 -36 -84 -120 153 167 -189 284 -539 -288 100 -283 17 98 -431 -37
5575c7QqJ67k98J47k96J81L31l57J38K16q09P08J39m85L57n20L9P14n47N97j18
$$ -37 -29 -37 130 -168 -21 -317 -136 195 -162 -24 192 -617 91 230 -255 102 -418 -379 335 -212 385 267
5597B67q33M43K24j9N7j96J6q3j18N94n48R6J3n09Q68J03o10Q08p92P5M14l43
$$ 267 -566 -123 101 82 139 -57 -41 -124 -242 352 -196 -100 -87 -596 272 375 -235 573 -219 -144 270 -73
5619g3M29k84l68J96K97J0j95l4K94m76j49Q77o15J9P5l47N45P4l75M52m93rJ26
$$ -73 356 72 -296 -100 197 207 12 -22 272 -204 -353 524 -91 -72 3 -344 201 275 -100 352 -141 -150 -24
5642b4J93n8J40o45L80q7L28j0l60J33J9pN10l88m03N77p39O74k08j69J18q8l5
$$ -24 169 111 251 -394 -14 -101 227 217 -143 -10 9 2 512 124 -279 298 -441 233 25 -144 -26 -114 -149
5665a49N72o79L37j05l13R65o02L32J20p93L53P6j21K46k92J75K22p39N46p7l28
$$ -149 423 -256 81 -24 -337 628 26 358 478 -315 38 114 -7 239 -53 122 344 -395 151 74 -254
5686b54K49j18K6K92l42Q9l60J49K75j45K98K42o91L80k13j83O63l33j04M0j33
$$ -254 -5 -123 -97 195 -147 -58 -418 -269 6 -139 159 401 -290 90 -123 -306 357 24 -80 -40 -173
5707a73L90n8k48K51p17N30L06l98K84j23m84N90p5j72L00l82K05l29J74M78m21
$$ -173 217 159 -89 162 -555 -25 281 -117 167 44 -440 150 75 -97 203 -179 26 -303 -129 349 -72
5728g2j28L23l31M27Q1o80M92J20n96O91n02J77J66l88M47O0k23j29m5K74k25
$$ -72 -200 123 -208 219 300 -380 112 232 -364 327 -175 2 168 -220 227 287 64 -65 -110 164 -61
5749f1j23N48n96J5L47o60O07K4l29O31m53Q8K99n51K34K98l90J87n4J43j98Q9
$$ -61 -184 364 -232 -217 130 -530 77 101 -228 403 -50 38 337 -214 20 318 -72 115 61 204 6 95
5771I5L9j67k17O95m91J06J03m65L05K45k16J49M2k74K67m3k15J18M1no4n8J35
$$ 95 134 -33 -250 445 -46 60 163 -302 3 248 32 181 223 -51 216 173 -42 76 117 112 48 -10 125
5794A25m17N97m23k10P65q09J69M53p91K41M52m67K38K78n35M37l63O4k65L48
$$ 125 -292 305 -118 -328 437 -372 -203 250 -541 -300 152 -315 -77 201 -334 103 -260 -196 -461 -113
5814a13m7Q0M11m19j86M27J56n31N25m75K43J17m42J85j78P4rJ92M4l7o3p0J44
$$ -113 -160 -80 331 -88 -274 153 309 -222 303 -172 71 188 -254 -69 -247 -173 -182 10 54 17 -46 -116 28
5837B8J09o7m50L60N36q73N81j45l37M83k26l06N33l46j78P44n95J66j56K59Q1
$$ 28 137 70 -380 -20 516 -357 224 79 -258 225 -1 -307 226 -120 -298 446 -149 17 -139 120 201
5858B01m20N52n26k03R64o50K0O99r45L90K30n24P07l22l71P13l81j21J91l21
$$ 201 -219 333 -193 -396 568 -82 -62 637 -308 82 312 -212 495 173 -198 515 134 13 204 -117
5878a17N22n47J17M9l43O91k43m0L66m24q5Q92j286L00L99l07L57k64j73K64J2
$$ -117 405 -142 -25 24 -319 372 129 89 455 31 -54 838 -448 -148 251 -56 301 37 -136 128 140
5899A40l04K98l51K05p9K38j13l19L90k80r6L41j02j03N19q23M82J22m52M98k02
$$ 140 -164 134 -217 -12 -91 147 34 -285 105 -175 -271 70 -32 -135 384 -439 43 165 -287 211 9
5920Ik8j65j16L71r8k06O44m69J38j19k47J80L99k79K50j41l40N10l86L48J43
$$ 9 -19 -184 -300 71 -27 -233 411 -58 80 -39 -286 -106 293 14 264 123 -217 293 -93 255 398
5941C98q42O60l6k18J66j56J08j79k63O62n79J97J08k80N45o6n24M74k59k15O13
$$ 398 -444 216 180 -38 128 -28 80 -99 -362 300 -279 -82 26 -254 291 225 -299 175 -84 -299 314
5962C14m14Q6L58n75R1K48Qk6j35K81l40l13P51l41O3J16l20K35K09m70N25l56
$$ 314 -100 -14 344 -231 -140 108 116 90 -45 236 -104 -417 334 -7 56 172 -148 87 296 -174 351 -5
5984ej54N20k89J1P1l61K13L8R0j76j02m8L46m56P08p29K59J02n02M99K58o62
$$ -5 -159 361 72 83 154 -207 6 44 134 -42 -144 -192 154 -302 406 -323 -64 38 -464 35 293 -369
6006c69P17j97l07L46Lk84J63k17p7j04N8L60n23L88J14m47Q13m37l63P30r27
$$ -369 348 151 -156 190 193 -91 72 -145 -222 -326 -268 92 -431 -43 71 -376 437 0 -363 367 -560
6027e60K90R0l10M06J73j80J95p4r2J24k41l2K52j88L34n02L08Q9k40N49p48N1
$$ -560 -270 -180 -490 -84 89 -91 104 30 -62 62 -179 -211 41 -147 187 -315 -7 82 -158 391 -357 -306
6049c06M29k82L55J86p40M12J82l56L63m83L64j40OK98l71L18r5m08M01j4l99
$$ -306 123 -159 196 382 -358 54 236 -120 243 -240 124 -16 -10 288 -83 235 140 -268 133 119 -280
6070b80N98m44n9L92j68J90R4n53K20J65j45J76j29j60n3m4L59j49M4Q5o17N61
$$ -280 318 -126 -185 207 39 229 323 -230 -10 155 10 186 57 -103 -156 -200 159 10 54 139 -478 83
6092H3M38n57R1R5k94M87k96J9P7l47J73K70mj35k10Q0J04k69L77r5l07N58p42
$$ 83 521 -36 55 150 -144 343 47 66 143 -204 -31 239 235 100 -110 -30 74 -195 182 87 -220 338 -404
6115d04N15L17o91K28Lj60L14l47L24J02l99K47M6L4J1k96L92l40j51P15k32m50
$$ -404 111 428 -263 -35 -32 -192 122 -225 99 201 -198 49 95 129 140 -156 236 -104 -255 460 228 -222
6137b22O98p15J52N53m28n9M45l95J5j7O8J65m52R3K41o5L63q00K56K78o44O64
$$ -222 476 -239 -87 466 38 -21 424 29 44 27 95 260 -192 -99 142 77 440 -360 -104 174 -470 194
6159A94k79j89M90l28j08L87m41O6R3MM74l87r4J27l28P18l23M8K97q91L73M20
$$ 194 -85 -274 216 -112 -220 167 -274 -208 -115 -111 363 -24 -118 9 -319 399 76 124 421 -470 -97 323
6181C23n30L43L0j88M01n50R3K36l9j88l87P51L0k31q9J63m50L41Rk23L82n39
$$ 323 -207 136 166 -22 379 -171 -78 158 119 -69 -456 295 325 94 5 168 -282 59 68 -155 227 -312
6203c12J92K97l51M43k48J13L0o36P03J1m15n2J79j84K74j78J38j27n0K47k58
$$ -312 -120 177 -174 269 21 134 164 -472 231 242 -173 -225 -46 -230 44 -134 4 -123 -173 74 -184
6224a84j90M32l32l6M22k36M10j28k62J74j23K64K8l72L42j83m5K92j86J10k29
$$ -184 -374 58 -274 -310 112 -124 286 158 -104 70 -53 211 239 -133 209 26 -19 273 87 197 -32
6245c2K28Jj12j21L92m07o3M9J14J64j81k52M26k04J17L08l57J31k09M1k0j21
$$ -32 196 197 85 -36 356 -51 -114 -65 49 213 32 -220 206 2 119 427 70 201 -8 33 13 -108
6267a08J20O2k5J8n8p8K77l32j49L00o78P13r0r0K47k76K26q3m87J87K73l07N05
$$ -108 12 74 49 67 9 -69 208 -124 -273 27 -651 62 -28 -118 129 -147 79 -4 -491 -304 -31 -338 167
6290A67k50N0P6k46M22k51l20O19r03O80Nl07O20k32l86O43m7m36K68k03J24N7
$$ 167 -83 -33 43 -203 219 -32 -352 267 -636 44 49 -258 362 130 -256 387 340 -96 172 -31 93 150
6312A50j76K74l24K36K74o10K19R9k4K03l87O3J88m60N07k02l69P38l60l44N71
$$ 150 -26 248 -76 160 434 -176 43 142 118 321 -66 -3 185 -275 232 30 -339 399 39 -305 266
6333B66j01j55R5l97M30k46M0O9m21J034r96N4N48m48J76K93m81K75K67o11L04
$$ 266 165 10 105 -292 138 -108 -68 1 -420 614 -382 -328 220 -228 -52 241 -240 35 302 -309 -5
6354eQ9j0k15J00m23L50m7N3M7L07k12j37L76l21q8M03l14k91O53n75K97L03o86
$$ -5 84 74 -141 -41 -464 -114 -161 -108 -61 246 34 -103 273 -48 -136 267 -47 -338 315 -260 37 340 -346
6377c46L84j56p2L92l64M90m73M4L90m12K93L31q37N16K8l76M11l97J43K45m66
$$ -346 38 -118 -190 202 -162 328 -145 -101 289 -123 170 501 -336 180 208 -168 243 -154 -11 234 -232
6398b32K01K38m01M21k60Npj59M38k45m2J65m86N64O3n29L03J2k98P78o96MK21
$$ -232 -31 207 -194 227 -33 -28 -35 -194 244 -1 -43 122 -364 200 263 -266 37 49 -249 529 -167 -163 58
6421E8k80K80k22J9J22k27M46m64n2N28n52K2N14k83j45M78o77L10K20L6L4k6
$$ 58 -222 58 -164 -145 -23 -250 196 -268 -320 208 -344 -322 192 -91 -236 242 -435 -125 95 131 165 139
6443A39k62M5K11n6o6RM7p8K49o1l01M19l02j09M63k34l5L95n33j37L93l85J32
$$ 139 -123 -78 133 77 11 20 67 -11 238 177 -124 295 -7 -116 347 113 78 473 -60 -197 196 -189 -57
6466e7J72j43J32j50J55k99L57K0l48K55k85j59M61j87l07N69n41R3M55n23L61
$$ -57 115 -28 104 -46 109 -190 167 187 -161 94 -191 -350 111 -76 -383 186 -355 -262 193 -330 31
6487C1L80n77J1j6J49J1j11L06m40J66K74l51J97P1l16M11j62j01R2o5j78O29
$$ 31 411 -166 -155 -171 -22 -11 -122 184 -256 -90 184 -167 30 101 -215 196 34 -67 25 -40 -218 411
6509D11n63K74j29j00L85l67K44r7j94K03p4R0J83m84N0K86m14M54o7l68N34n12
$$ 411 -152 122 -7 -107 278 -89 155 58 -136 67 -7 83 266 -218 -168 118 -296 158 91 -277 257 -255
6531b55L2N39n76K18K37m73L58Q1k94N4r0J03L9j48P81n77J62O9m57K16J73n19
$$ -255 -223 316 -260 -42 195 -278 80 161 -133 -79 -169 -66 -27 -175 606 29 191 260 -197 19 192 -327
6553c27L94Q7m10Q16p42J82p6OJ27j18J50lq5o4J24p2M90n64K43K61n92L69m1
$$ -327 67 154 -256 560 -182 0 -76 -70 57 -61 89 86 1 -63 61 -11 479 -85 158 419 -173 196 155
6576A55o73N55K9o1J19j86K55k23O5rj96K56R4k99J89j58J11K71l52O1J34k52
$$ 155 -518 37 66 5 124 -62 193 -30 35 26 -170 86 180 -119 70 -88 23 294 -58 3 137 -115
6598a15j8N03o14N40j11m13K95j65M0L3pj3k25K89k15p8L13o3l44M56j2j52M81
$$ -115 -133 370 -244 296 185 -228 67 -98 -58 -25 -32 -45 -270 19 -196 -274 39 -24 -368 88 76 -76 405
6621D05n03J72j74j31K27J58k16K0r3K96j07j04J62l46J25J21k84K35O3n91N58
$$ 405 -98 74 -100 -231 -4 154 -62 -42 -135 161 54 -50 112 -234 -109 12 -272 -37 26 -565 -7
6642gj61j23O30o19L54K53l06l6q8J51r7k56M09j72L9M16n77p6N6K70l16L83m25
$$ -7 -168 -291 339 -280 74 327 21 -15 -103 48 -49 -305 104 -68 -29 387 -190 -266 -210 60 -256 127 -298
6665b98M68j95q7M06j95r4J09l61K82PO1l5l15K22q7j61N77l56L4M23m27Q2J97
$$ -298 170 -25 -112 294 99 5 114 -247 35 42 103 68 -247 -25 -112 -273 304 -52 -18 405 -22 60 257
6688B57m82N40l07J23L01k76j63J32j17L63j10k10L47p38K88M08p99N57J00m60
$$ 257 -225 315 8 131 432 156 -7 125 8 371 261 51 398 -340 -52 356 -443 114 214 -246
6708b46K00r0L12J96l89j52K34L1J09m38K47k4r9L21j51r3K23o03M41J33m55M23
$$ -246 -46 -136 176 372 -17 -169 65 96 205 -233 14 -10 -109 212 61 -32 191 -412 29 162 -293 130
6730A30q8l37M80k49J03o0P8j61k03L82M6m66J65p0Q3M87m65r6L55l58l8N10q11
$$ 130 42 -295 185 -64 39 -21 57 -104 -307 75 121 -345 -180 -250 -167 320 -145 -241 114 -244 -282 228 -583
6753e83O45j54L5J79k19K84J7m56N13m91L17J92m46L16O5l05P3J64j81J14Q8n5
$$ -583 62 -92 -57 122 -97 187 204 -252 261 -230 87 279 -167 149 214 -91 -18 146 -35 79 167 112
6775A12n8JQ5j77OM53o71N35q7k53K61k84m6N29l84l12N62k84j06K05k43J65K7
$$ 112 54 55 140 -37 -31 422 -249 286 199 -54 207 -77 -123 406 22 -290 272 -12 -118 87 -156 9 36
6798C6k2K42p40O00j66n8K70m73L10j53N9K47k94j05L75l60K1L00l23J6KK66m
$$ 36 14 256 -484 116 -50 -108 162 -311 -1 -154 -95 152 -142 -247 128 -232 -211 89 -234 -218 -216 50 46
6821D6k37N3J09l45P54n36m3M26m17K55J05n50O09k06J10lj08K36j79k32R3J74
$$ 46 -191 -138 -29 -374 380 -156 -199 227 -190 65 170 -380 229 23 133 130 22 258 79 -153 -60 114
6843A14k71N78m93K18K3k67Q7k7J12K53l14k01N68m12j46RJ21J20j93J10m6m9
$$ 114 -157 421 -72 146 169 -98 -11 -38 74 327 13 -188 380 -32 -178 -169 -48 72 -121 -11 -57 -106
6865a06K47j69q2K90n78O22M8n13M39m46J74K54q0Q2j1k35kJ93L1lj83J98j96
$$ -106 141 -28 -110 180 -398 224 272 -241 198 -248 -74 180 100 182 171 -64 -66 127 158 155 -28 170 -26
6888b6k29P67o83J94J98n43L88p5q4K88J30l63LL59j72j40J60J43k45J37J39n82
$$ -26 -255 512 -171 23 221 -322 66 -9 -93 195 325 -38 -35 324 152 12 172 315 70 207 346 -236
6910b36N47q2p08N94j54n5L31J83k36J51m40J79om3J8k49K41l7p3pM4L5K31l08
$$ -236 311 229 -479 115 -39 -94 237 420 184 335 -105 74 68 25 43 -206 35 -2 -75 -82 -38 -3 228 -80
6934h0K72k26k54L63j06m57P24k55k83K83K6r9j94J08N15l66o1J10o4J57l94n6
$$ -80 192 -34 -288 75 -31 -488 236 -19 -302 -19 7 -92 -286 -178 337 -29 -90 20 -44 113 -281 -337
6956c37L99k50J68L6n97P71l60j38L72M6k98L47k20L31l40pK83l95K96j21j99
$$ -337 62 -188 -20 16 -581 190 -170 -308 64 110 -188 159 -61 270 -70 -77 206 -189 107 -14 -213
6977b13J89q9o8N78p89K61K73m77P06m99RJ07L66m36K19j49L13k66OJ71m05L50
$$ -213 -24 -113 -181 397 -392 -131 142 -335 371 -128 -119 -12 354 -82 137 -12 301 35 41 212 -193 157
6999A57p5m04M15L9j4R7l20K8J76j54K65k52J83q8j19O8J48l5K75k55rQ5l82Q4
$$ 157 82 -322 93 132 118 215 -105 -77 99 -55 210 -42 141 53 -66 2 150 115 390 135 126 211 -171 -87
7023h7K06j47J13m5N7M18q68N57K6m80N34J55n28J55l61K74J95k06L0R4l35N65
$$ -87 119 -28 85 40 97 515 -353 204 230 -250 284 439 -89 66 -295 -21 174 -32 -2 92 -243 322
7045C22m68J58J02l15L93n7J78j26l31J26L82o62K32R0j22M14l73J07l1j27j1
$$ 322 -146 12 114 -201 192 135 313 187 -144 -18 364 -298 -66 24 -98 316 -57 50 19 -108 -119
7066a19k31j6O80m95k3K70j43K85k43N6L18n40n3J06OJ6L13m67J58k7ljR2k45
$$ -119 -350 -366 314 -181 -204 66 -77 208 -35 21 339 -201 -254 -148 -142 -126 187 -280 -122 -149 -152 -153 -61 -306
7090c06K11p4J77k23K92k12k99O24r3n28M26P1j0r3j31K01lp9l6m7K20j47M3J96
$$ -306 -95 -169 8 -215 77 -135 -434 190 97 -431 -5 66 56 -37 -168 33 30 -49 -85 -132 88 -59 -16 180
7114A80m51K26K21k98K59K24l89P2R5k25J48j72j60L49K0J02k50J16L5j11K85
$$ 180 -271 -45 176 -122 137 361 -28 44 139 -86 62 -110 -270 79 99 201 -49 67 102 -9 276
7135B76p6k25J75k4m26N74m50Q3K63k83K92k71R8j30k2P9K78m06J32J22k35O4
$$ 276 200 -25 150 126 -300 274 -176 -93 170 -113 179 -92 6 -124 -146 -67 211 -195 -63 59 -176 -112
7157a12j5J17p0rJ21k33K2L31l78L03r5l68L59n1r0R6q3R3j05j5M97k75j95L16
$$ -112 -127 -10 -80 -89 32 -201 -179 152 -226 77 -18 -386 -27 -78 -168 -72 -155 -62 -167 -182 315 40 -155 161
7181A61k88N9J67j93O67n16k89M02k23o5K76m75N69l37J40j9n4K7j53J19J56l5
$$ 161 -127 -68 99 -94 573 57 -232 170 -53 -118 158 -317 252 -85 55 36 -18 9 -144 -25 131 96
7203I6l02L78j64q7K42k43K84o1l59M24j90L4Lk42K14k00K40J09l05J17J0k42
$$ 96 -206 172 8 -79 163 -80 204 143 -216 208 18 52 55 -187 27 -173 67 176 -129 -12 -2 -244
7225b44L83k04j73M19j88Q2Q1j91r2L09k35J02j65p1J40M3r3p3N4K02k74K71j6
$$ -244 139 -65 -238 181 -7 75 156 -35 -127 182 -53 49 -116 -187 -47 -4 -97 -170 -116 86 -188 83 67
7248F7m26P49m79j13M42k59k33N07l20j95J65J30J80l40J48P5m46N03j14k65K07
$$ 67 -359 390 -89 -202 240 -19 -252 255 -65 -260 -95 35 215 -125 23 98 -348 155 41 -224 -17
7269a7p8L5J26m5K48j43O5O3k33j31L25o17M98l06L0K41j83K35j36j45J80j7J67
$$ -17 -95 -60 66 21 269 126 191 254 21 -110 215 -402 96 -210 -180 61 -122 113 -23 -168 12 -5 162
7292A62N3j87O4Q2l56K53K52l20n8m4j28m1K8L22p0o6J34j30J00j09k89K27J10
$$ 162 215 28 92 174 -182 71 323 3 -55 -99 -227 -268 -240 82 12 -54 80 -50 50 -59 -348 -121 -11
7315a1k53M02j46q2J69l06L11M4n19Q6L20j97K04M9N1k18j09M60m91M22n0o2j05
$$ -11 -264 138 -8 -90 79 -227 84 128 -391 -305 15 -182 22 71 122 -96 -205 255 -236 186 136 74 -31
7338c1J43l39O21q21K09M06l76J99k98L05K12l57L59L9o24M02K7j8Q5k1l72M20
$$ -31 112 -227 394 -427 -218 188 -188 11 -287 18 230 -127 232 271 -353 49 76 58 143 122 -250 170
7360A70k39J81om71L07j54J54O5n7J26K71l58K04k57K8N2k23J35J35m06M27j50
$$ 170 -69 112 106 -365 -58 -212 -58 7 -50 76 347 -11 193 -64 -36 16 -207 -72 63 -343 84 -66
7382f6LK2q1L22j70j12K25l13J82J85j66rj99P2M70o80K57J26j94J68K20k65k2
$$ -66 -63 -41 -122 200 30 -82 143 -170 12 197 31 22 -177 -105 365 -315 -58 68 -126 42 262 -3 -25
7405b5M7J08j00J2M8j73MK47l64K69L39n13K47ql03J21J%J91l15L41m7k6J40r6
$$ -25 22 130 30 42 90 -83 -79 168 -196 73 412 -101 146 138 -165 -44 -43 -43 148 -167 174 127 101 241 145
7430A45j3Ml95L79l16n7K84l88L25K74m24K29k25K77k73J41j81O80l73l05K35
$$ 145 132 136 -259 120 -196 -253 31 -357 -32 242 -182 47 -178 99 -174 -33 -214 466 93 -212 23
7451B3L3K75n63l8N3L83j75j65j40K88k48rJ43k12K50L12l31L1j2K69k37m4J26
$$ 23 56 331 -232 -270 -217 166 -9 -174 -314 -26 -274 -283 -140 -352 -102 210 -121 -90 -102 167 -70 -114 12
7474A2n8k04K27k43J16K01k36J92O9l12L66k25K74J85m96L41k96L22j07M2J2j27
$$ 12 -46 -250 -23 -266 -150 51 -185 7 76 -236 130 -95 179 364 -132 209 -87 235 128 170 182 55
7496E5j44L69k93n9K25k47j76N48k15R9j42O6J11j65n0J58l07o3J96L6J19m36
$$ 55 -89 280 -13 -72 153 -94 -270 278 63 162 20 86 197 32 -18 140 -167 -230 -34 2 121 -315
7518c15K58j71mJ1k0L29K0j20j71n5J08J62j99J41j8q2J55Ol01K19L2K90l18q5
$$ -315 -57 -228 -232 -221 -241 88 108 -12 -183 -238 -130 32 -167 -26 -44 -126 29 35 -266 -47 -15 275 -43 -128
7542a28J39M6k23K86o5k21L28n28J96M60m48N21j57k29K88k58K3K0poj6o2K19
$$ -128 11 57 -166 120 55 -166 162 -366 -170 290 -158 363 206 -23 265 7 30 50 43 37 21 -41 178
7565A78k71K25J02l62K43p6k48M25k42J18l11K74K1k00J09J39k45L07pl0K9k68
$$ 178 -93 132 234 -128 115 39 -209 216 -26 92 -219 55 76 -124 -15 124 -121 186 179 149 178 -90
7587i0L2K94p4k89J76n3K7j82q0L67J44j64j29j67L30rk25Q9o9k05K34M4J45o9
$$ -90 -58 236 162 -127 49 -4 23 -159 -239 128 272 108 -21 -188 142 133 -92 -3 -72 -277 -43 1 146 77
7611G7n61K04J72L8J81m41L84k37j26K00n9L97k34j74K18j5l69L92N7p9N6k23
$$ 77 -484 -280 -108 -70 111 -330 54 -183 -309 -109 -168 229 -5 -179 39 24 -345 47 104 25 81 -142
7633a42L96j66l10N54l55J00K50m01J29M6M6N6m47L19J10j43J71q0k09J26j61
$$ -142 254 88 -222 332 -23 77 327 -74 55 101 147 203 -244 75 185 42 213 133 -76 50 -111
7654a11j30K11k6R5j14j84M37m20J28L97l21rK26k48K20k72j27K96j06k75L79
$$ -111 -241 -30 -56 39 -75 -259 178 -242 -114 283 -38 -47 179 -69 151 -121 -248 48 -58 -333 46
7675D6l27N41q6l94J83N1n3M4r9M7J29n34O97m34M9J84l28K82j38K77k59N2lq1
$$ 46 -281 260 174 -220 -37 14 -39 5 -94 -47 82 -452 245 -189 -140 44 -284 -2 -140 137 -122 -70 -73 -154
7699a54J36Q9k09j9N2J25J00j09m40O86j19l41L94m15N3M73m75L57l65n7M22j77
$$ -154 -18 71 -138 -157 -105 20 120 11 -429 257 138 -203 191 -224 -171 302 -173 184 -181 -238 184 7
7721GJ73m70L69Qj36K43j61j40l1N48l11J18j14k57L52k51L33m32J17j1J14o3
$$ 7 180 -290 79 87 -49 194 33 -107 -138 410 99 217 103 -154 198 -53 280 -152 -35 -46 68 5
7743Em8l0J94m2p4J6k39N03k35o8P1J09m16O02m48K69J24j57k71k2J01K60m61
$$ 5 -43 -73 121 79 5 21 -218 285 50 -18 53 162 -254 348 -100 169 293 136 -135 -157 -56 204 -257
7766b57J99L30k49L1j86J04O8j3k07L64l42j00P6j68L63j12j7K18l24J5K85P5
$$ -257 -58 272 23 54 -132 -28 40 27 -180 184 -158 -258 -182 -350 13 -99 -116 102 -222 -207 78 153
7788A53q1p5J02j42k48M55j43j22K28j0l79M81l22N4j12k25M73j0j17R8n7J36
$$ 153 72 -3 99 -43 -291 164 21 -101 127 117 -262 219 -103 -49 -161 -386 87 77 -40 58 1 137
7810A37k36J3J17j57K34M1k70L17n0l71J53K74j43%r0j50K93k50K74j70q6J19
$$ 137 -99 -86 31 -126 108 149 -121 196 146 -225 -72 202 59 59 -31 -181 112 -138 136 -34 -120 -1
7832ak63M30k06j09M04k42K76l64j17L69k59j32N5j6K15j27p7L19l04J07J10l08
$$ -1 -264 166 -40 -149 255 13 289 -75 -192 177 -82 -214 -159 -175 40 -87 -164 155 -149 -42 68 -240
7854b40M6J92j03K82l03J29o8L96k08j64%N1J07j71J24OJ5l23N4K24o6p5P4q1
$$ -240 -194 -2 -105 177 -126 3 -65 331 123 -41 -41 10 117 -54 70 76 91 -232 -178 46 -20 -95 -21 -102
7878a02K62M2k31P1r1L06l03R5k08J54k18j20L68k3p7L4l6k09N61j76j30l60M43
$$ -102 160 202 -29 42 -49 257 -46 49 -159 -5 -223 -343 25 2 -75 -41 -77 -286 275 99 -31 -391 52
7901E2j34M1J63l10K49j27O6O8j11q3j98Q9K68j11J31n5j88L24L5j47J36M9m20
$$ 52 -82 -41 122 -188 61 -66 0 68 -43 -126 -324 -235 33 -78 53 -2 -190 134 169 22 158 207 -213
7924b13L52l61j0J81J40Kj10l6L5J34k12L49l24K29k58q7L10Q9m45K24L4n8Rj45
$$ -213 139 -222 -232 -51 89 91 -19 -55 -20 114 -98 251 -73 156 -102 -189 121 210 -235 -11 23 -35 -26 -171
7948a71M26j64r8K9k13J36N4R6J4l42K38Q7j06j00k6o9K99p9K84k33k26K51l49
$$ -171 255 91 -7 22 -191 -55 -1 95 109 -233 5 92 -14 -114 -140 -209 90 11 295 62 -164 87 -262
7971b62J61J78P7j50k40M7Q2J07r8L62n24M40j58j71J08L4j11J59q2J4J03j60
$$ -262 -101 77 154 4 -236 -189 -107 0 -98 264 -260 180 22 -149 -41 -7 -118 41 -41 -27 76 -84
7993h4J76k10o1L63m9j15J15j59J5j1J8jJ02j93M39l99n6J89k46L63j93P1J10
$$ -84 92 -118 -179 184 135 20 135 -24 -9 -20 -2 -3 99 -94 345 -54 -110 79 -167 196 3 74 184
8016A84j39N7k16R3l9j15J09R8r0J78j85K86j47l14J92R2j28jL29k32q4J42pn8
$$ 184 45 102 -114 -21 -60 -175 -66 32 -58 120 -65 221 74 -240 -48 44 -84 -85 244 12 -72 70 63 5
8040Em8j09L15j57K3J4l4K38m86K50j90J17J75r6J80j37k75L45j17p4J32J30n67
$$ 5 -43 -152 163 6 29 43 9 247 -239 11 -179 -62 113 17 197 60 -215 130 13 -61 71 201 -366
8063c66N59m83K34K3j56M47k68JJ95k46J75j14J23K27n19ML42l07N6J34Q3Ok86
$$ -366 193 -290 -56 -33 -189 258 -10 -9 186 -60 115 1 124 351 -168 -164 178 -129 -73 61 144 150 -136
8086a36jJ05N6J77n6j48J30l36Q0K73l31M44l41j6J41j25R1r9J90J2M28n89j30
$$ -136 -137 -32 24 201 145 -3 127 -209 -129 144 -187 257 -84 -100 41 -84 7 -92 98 110 538 -51 -181
8109a81J86j35L41k62L94k40K8M3k14K31j27n4K01l45j7L35m13K31J56q2k00K33
$$ -181 5 -130 211 -51 343 103 131 174 -40 191 64 10 211 -134 -151 184 -229 2 158 76 -124 109
8131A09j03J25k65K79p6l2L9R8o15O91j63m5Oj64O3J16k6Jo4O9k37j53K44m3J35
$$ 109 6 131 -134 145 69 37 76 174 -441 250 87 42 48 -116 -53 63 37 38 -26 43 -194 -347 -103 -146 -11
8156a1k6M6n4j12r6K16n8p1L05l68L86m3j66M3j18M8O1K14k78QR3q9N0j59K27
$$ -11 -37 9 -45 -157 -253 -37 -95 -166 139 -229 157 114 -52 -9 -127 -79 -18 196 -82 -74 19 -70 -20 -179 48
8181D8k07L19m4j44L49l99J63K9r4n7
$$ 48 -159 160 116 -28 321 -78 85 114 20 -37
8191c7
$$ Imaginary data points
##PAGE= N=2
##DATA TABLE= (X++(I..I)), XYDATA
0@%%%%%%Jj%%Qj6K4l2L2m0N1n9P2q8J04j25J49j73K03k37K76l20L66m19M80n45
$$ 0 0 0 0 0 0 0 1 0 0 0 8 -8 16 -16 16 -24 27 -32 40 -48 56 -69 80 -93 110 -127 149 -171 195 -224 256 -289
32b89O18o99P86q86R97j113J241j383J537j707J892k093K313k554K819l107L420
$$ -289 329 -370 416 -470 527 -586 655 -728 809 -898 994 -1099 1214 -1340 1479 -1628 1792
49A792l766M148m571N041n564O152o818P577q453R476j0690J2157j3969J6274
$$ 1792 -1974 2174 -2397 2644 -2920 3232 -3586 3991 -4462 5014 -5676 6481 -7488 8786
63H786j9312K3500k9651L9539n7849J02126l83824l75219J041722m13958l74105
$$ 8786 -10526 12974 -16677 22862 -34987 67139 -316685 -691904 349818 -64140 -438245
74d38245P14991l10387o78896N85885K78685l97571J09770R3284l71886J03191
$$ -438245 276746 -33641 -712537 -126652 152033 -245538 -135768 -42484 -414370 -311179
84c11179K99551j6857m5782j86724o9869K62963q6135O4237K80642m62240j65333
$$ -311179 -11628 -28485 -74267 -260991 -330860 -67897 -154032 -89795 190847 -271393 -436726
95d36726N63196j44809j65053M10984k76042l77162M79311J47574k90089K05032
$$ -436726 126470 -18339 -183392 227592 -48450 -425612 53699 201273 -88816 116216
105A16216k6103l74792L08924K30069k63903J84341o4776l96881M20568J77705
$$ 116216 90113 -284679 24245 254314 -9589 174752 109976 -286905 133663 311368
115C11368l93686K86665J8482n32936L53781L79766m35213J4996K59402l91070
$$ 311368 -82318 204347 222829 -310107 43674 423440 -11773 3223 262625 -128445
125a28445k2002N00752j74543k85818K12580j05032j13439K77781p993j33404
$$ -128445 -150447 350305 175762 -110056 102524 -2508 -115947 161834 153841 20437
135B0437n3547r9966J84028O8668j73847J62857o9229l35641L10958K42425l77652
$$ 20437 -33110 -133076 50952 119620 -54227 108630 39401 -296240 14718 257143 -120509
146a20509N0238K47138l83615p242N23915k54361l12233L82271j31712k54373
$$ -120509 -70271 176867 -206748 -213990 309925 55564 -256669 125602 -6110 -260483
156b60483M37847q902l43231J67193K3981j17944J92471K0912j51116J8444j2633
$$ -260483 177364 168462 -174769 -7576 16405 -101539 90932 111844 -39272 -20828 -33461
167c3461J789J50591k9274j42604P9420k3822q7354K32753j1038k49893J48231
$$ -33461 -31672 118919 89645 -52959 26461 2639 -84715 148038 137000 -112893 35338
178C5338J8446j59967K25939K6777k37373Q5700M2966q8871J23725K4922j45916
$$ 35338 53784 -106183 119756 146533 -90840 -5140 37826 -51045 72680 97602 -48314
189d8314J9547L7339n6114J02654L8710j87047N2743R1406j58426J25662J16557
$$ -48314 -28767 8572 -47542 55112 93822 -93225 -40482 50924 -107502 18160 134717
200A34717k63740M3444J56168j62377N8440J31174j71676l9503J22588l4915k2388
$$ 134717 -129023 -85579 70589 -91788 -33348 97826 -73850 -113353 9235 -25680 -48068
211d8068P8370n7078q1408Q5180J2851l1140O8559o9798m7299R6543m8368J5006
$$ -48068 30302 -26776 -108184 -23004 -10153 -41293 27266 -42532 -89831 6712 -41656 -26650
223b6650Q6344j27592n757J09146p4887J4001Q6040r0305m4060R3367J612n2461
$$ -26650 59694 -67898 -73655 35491 -39396 -25395 60645 -29660 -73720 19647 21259 -31202
235c1202O2186k865r5570P3705M6273p5427N8630n589q0031Q0828M863m3292O1184
$$ -31202 30984 28119 -67451 6254 52527 -22900 35730 30141 -49890 30938 35801 -7491 53693
248E3693l8658m0675O0378l807j8840K3672r640l4603K0692L8582m0224M183L3556
$$ 53693 15035 -25640 34738 30931 12091 35763 26123 -8480 12212 50794 10570 14753 48309
261D8309o7387K4111N6398o7324K0978K6127o4810L5549K2662l5763J8555q856
$$ 48309 -19078 5033 61431 -5893 15085 41212 -23598 11951 34613 -1150 17405 8549
273H549j7279J4521M118j116j2086O538o377j7494L7509j5619k6943L9166l0542
$$ 8549 -8730 5791 9909 8793 -3293 3245 -3132 -20626 16883 1264 -25679 13487 -17055
286a7055q718M3426l5973K128J9880l2930J8824Q781j6755R494p300L238j598
$$ -17055 -25773 17653 -18320 -16192 3688 -29242 -10418 -1637 -18392 -8898 -16198 -12960 -14558
299a4558k120J8589k2757K745J9684k7092J9407O966k5870K6125j0209r752K6995
$$ -14558 -16678 1911 -20846 -18101 1583 -25509 -6102 864 -25006 1119 -9090 -18842 8153
312H153k0272L991J1876j6903J6298n187l326J4768j8576J2497N497j6779K1880
$$ 8153 -12119 -8128 3748 -13155 3143 -2044 -5370 9398 -9178 3319 8816 -7963 13917
325A3917j1625m782K0783k1948J1222R264k0709J9491o479o631J7144j9212J1508
$$ 13917 2292 -2490 18293 -3655 7567 16831 -3878 15613 9134 2503 19647 435 11943
338A1943N649k0026K1860q821q713J9076j8416P761O336j8106J8077q841o726
$$ 11943 17592 -2434 19426 10605 1892 20968 2552 10313 16649 -1457 16620 7779 1053
351A053J6818j9071R564L860j8815K1351j1655q960K0981k1049M796R883j9089
$$ 1053 17871 -1200 8364 12224 -6591 14760 3105 -5855 15126 -5923 -1127 8756 -10333
364a0333J4476o068q085J4379j5408O364K271j3520J7336j4108k787J9603k6241
$$ -10333 4143 -1925 -10010 4369 -11039 -4675 -2404 -15924 1412 -12696 -15483 4120 -22121
377b2121J1403J0834k5818K0532k108j5452K0197j2254r33J0340j0050P818m729
$$ -22121 -10718 116 -25702 -5170 -7278 -22730 -2533 -14787 -15720 -5380 -15430 -7612 -12341
390a2341K334P388j6367J9849k870j9026L1360j5761r956L3114k6539K617K4720
$$ -12341 -10007 -2619 -18986 863 -2007 -21033 10327 -5434 -15390 17724 -8815 -6198 18522
403A8522k6546J1477J2926j7049Q105M705p18m087N244R915k1332J4227J3818
$$ 18522 -8024 3453 16379 -670 7435 12140 11422 7335 12579 22494 1162 15389 29207
416B9207l2165K7953L527l6799L9135o439k9228L8811j5842k1531L0984j0744
$$ 29207 -2958 24995 28522 -8277 30858 24419 -4809 34002 18160 -3371 27613 16869
428A6869j3048J5024k089j6418N617J7835k5622J321K6185m2954J0870L6094n2228
$$ 16869 3821 18845 16756 338 5955 23790 -1832 -511 25674 -17280 -6410 29684 -22544
441b2544J7160K6636n5938K6963K3128m4549K1258Q489l3955J6742J6641k3237
$$ -22544 -5384 21252 -34686 -7723 15405 -29144 -7886 603 -33352 -16610 31 -23206
453b3206r15J9548k7008n520M6646l6054j6568N3525n1656o740P2454n7410j1879
$$ -23206 -24121 -4573 -31581 -37101 9545 -26509 -43077 10448 -41208 -47948 24506 -32904 -44783
466d4783O0394n6564j631O2900l8836j9887M1179j9698k1310M9549j574m7027
$$ -44783 15611 -40953 -42584 20316 -18520 -38407 2772 -16926 -38236 11313 9739 -37288
478c7288L8090K809m1023O2116m396n5804N7364j8831l3850P9251k8784m5881
$$ -37288 802 3611 -37412 24704 20308 -35496 21868 3037 -30813 48438 19654 -26227
490b6227N9995k5631k6997O8911j3277n4295M0081Q838m5841N5064K1485q4461
$$ -26227 33768 8137 -18860 50051 36774 -17521 22560 31398 -14443 40621 62106 -22355
502b2355L9286L1849p2538O9135K5221j05425N6040K7223p9234P6109K3745j05052
$$ -22355 16931 48780 -23758 45377 70598 -34827 21213 48436 -30798 45311 69056 -35996
514c5996L8954M5938o9987L4325N9603r5040j7620Q9193n3434j5220Q3789p8183
$$ -35996 2958 48896 -21091 13234 72837 -22203 -39823 49370 -4064 -19284 64505 -13678
526a3678m0239Q2622l5071L4M4112p0416L231L6582l8451M8317J6630r1580K7271
$$ -13678 -53917 28705 -6366 -6332 37780 -32636 -29405 7177 -31274 17043 33673 -57907 -30636
539c0636N5259o5432L0356P6754j16622l1909J39267o8196m8276J41597r5370
$$ -30636 24623 -40809 -10453 66301 -50321 -82230 57037 -11159 -59435 82162 -13208
550a3208r9875J61562j9609q5077J07704l8211r8073R4829L3688n8194L5649q334
$$ -13208 -113083 48479 28870 -56207 51497 13286 -84787 10042 43730 -14464 21185 12851
562A2851o7643N5674M0681m6573L6044k1336p8451Q9845K5140p1948O9660l1703
$$ 12851 -54792 882 41563 -5010 31034 9698 -68753 21092 46232 -25716 43944 12241
574A2241r6355J05737K5445p1633N4832k6062p9640Q0406L4417n9302L5904j6002
$$ 12241 -84114 21623 47068 -24565 30267 4205 -75435 4971 39388 -19914 15990 -12
586a2q9243Q7555N4918j03944N8418J8947j52182J07515J08265j59361M2103P8893
$$ -12 -89255 -1700 53218 -50726 7692 26639 -125543 -18028 90237 -69124 -27021 51872
598E1872j62273M8499J57474j12765n2872R6890o7770l9997J35823j2356j01003
$$ 51872 -110401 -61902 95572 -17193 -70065 26825 -40945 -80942 54881 42525 -58478
609e8478M2214Q97k1404P3865j0921l1074K200n4665O4857P3653r5163K0455M5109
$$ -58478 -16264 -15367 -36771 37094 26173 -4901 -2701 -57366 7491 81144 -14019 6436 51545
622E1545j19306N5239J39069j11488n2761J06944p5991m7129J70381l6552j42462
$$ 51545 -67761 -12522 126547 15059 -37702 69242 -6749 -53878 116503 79951 -62511
633f2511J02200n3q9300J34496O144j32815N7951P500m6826R6651r894r3173L7649
$$ -62511 39689 39636 -49664 84832 90976 -41839 16112 23612 -23214 73437 63543 -29630 8019
646H019q18l3121Q6675K283j10322L1512L6504o2226P3181L9309j28744J6817
$$ 8019 7201 -25920 60755 63038 -47284 -15772 20732 -41494 31687 70996 -57748 -40931
658d0931N5321n3206N9907K2855r8171J7975J9907k1189P1159j0614q8648L5391
$$ -40931 14390 -38816 21091 43946 -54225 -36250 -16343 -37532 33627 23013 -65635 -30244
670c0244K1446m4034P6032K9550j32582K3064R1455q5757L8057R6690j44315k4616
$$ -30244 -8798 -52832 23200 52750 -79832 -56768 34687 -51070 -13013 83677 -60638 -85254
682h5254J28329n8015q504Q5449q4011n1108Q3198O966j6162K9270l8570l8868
$$ -85254 43075 -14940 -23444 62005 -22006 -73114 10084 17050 888 30158 -8412 -47280
694d7280M8966J3690k096K9592o3482k8523Q0287k4981p689O7896q7407m2845
$$ -47280 1686 15376 13280 42872 -20610 -49133 31154 6173 -1516 66380 -21027 -63872
706f3872J04792k2183k9001O2294n5668n7720P7384K0413m0827K8285j6482o1832
$$ -63872 40920 18737 -10264 52030 -3638 -61358 16026 36439 -4388 23897 7415 -54417
718e4417N6530L7852m6259K7724j7939o3278P0516K3513m9001M1381k6704o0048
$$ -54417 2113 39965 -6294 21430 3491 -59787 10729 34242 -14759 26622 -82 -60130
730f0130O9839K5325m4924K1977o586n2509L8824N0682m2408n408J8931n3090
$$ -60130 9709 35034 -9890 12087 5501 -47008 -8184 42498 90 -5318 13613 -39477
742c9477K4525O2161m8032l593J8651n3931L2942M8944m3174J668O755l8716K6317
$$ -39477 -14952 47209 -823 -4416 14235 -39696 -6754 42190 -984 684 7439 -31277 -4960
755d960L9818k5640j5276R872k2212M734M9127k1586k8665K3960k7914K375N6882
$$ -4960 34858 9218 -6058 3814 -18398 -13664 35463 13877 -14788 9172 -18742 -16367 40515
768D0515l4562k1161K7296l4655R819M8481k9780j9898J6736j5312p51L5607n311
$$ 40515 5953 -15208 12088 -22567 -12748 35733 5953 -13945 2791 -12521 -13272 22335 17024
781A7024l5262J1761N693j6829L5537J802m1293J8541l12j3707L9308j1623k9015
$$ 17024 -18238 -6477 -784 -17613 17924 19726 -21567 -3026 -3338 -17045 22263 10640 -18375
794a8375J9198q363l322K8323p314k2735M059R369o739J0177J4765k9728n121
$$ -18375 823 -7540 -10862 17461 10147 -12588 -8529 840 -5899 4278 19043 -10685 -15806
807a5806K3644j4029R907J3018k8842N536P786q486K0810o706j8616J2318l531
$$ -15806 7838 -6191 3716 16734 -12108 -6572 1214 -7272 13538 6832 -11784 534 -2997
820b997j774J4895j960j5638j878J5453o398m081K0951k0497j4070K9415r966
$$ -2997 -4771 10124 8164 -7474 -9352 6101 -297 -4378 16573 -3924 -17994 11421 1455
833A455o667J7689j6135m460R709j082O524o127m337N249o076N935M891m973k376
$$ 1455 -5212 12477 -3658 -8118 1591 509 7033 906 -3431 1818 -4258 1677 6568 1595 -781
848g81m728R613J05r730J6051q897j4101K1909n299r204J2905p532l524M622N96
$$ -781 -5509 4104 4209 -5521 10530 1633 -12468 9441 4142 -5062 7843 311 -3213 1409 2005
863B005L965q444K016N723j0647P902L050q277M418l865L413J897q773J1345m621
$$ 2005 5970 -2474 -458 5265 -5382 2520 5570 -2707 1711 -2154 1259 3156 -5617 5728 1107
878A107j0541J6466o571o931J1008o910n19K808k257M196o452K332N117r969O713
$$ 1107 -9434 7032 461 -6470 4538 -2372 -2891 -83 -2340 1856 -4596 -2264 2853 -7116 -403
893d03J384p254P359m738J214L704r410R973j456r461J3300n995n624J1014n867
$$ -403 981 -6273 1086 -3652 -2438 1266 -8144 1829 373 -9088 4212 -1783 -7407 3607 -2260
908b260k69L348l491L793m128L222L161q411Q047j582n343J0084p239K98P294
$$ -2260 -2529 819 -2672 1121 -3007 215 3376 -5035 3012 1430 -3913 6171 -1068 -770 6524
923F524j1428Q363L028j1100J0542k247o985R141k786j711J334o06J280n214O964
$$ 6524 -4904 3459 6487 -4613 5929 3682 -3303 5838 3052 1341 2675 2069 3349 -1865 5099
938E099M2j0311J2166m415q537J5693j0188m106J3023j2863K416Q558j1284L821
$$ 5099 5141 -5170 6996 2581 -5956 9737 -451 -4557 8466 -4397 -1981 6577 -4707 -886
952h86L589o202J659K314k70n947M796L347j2936J1507L245j8286J6803k42j7365
$$ -886 2703 -3499 -1840 474 204 -5743 -947 2400 -10536 971 4216 -14070 2733 2491 -14874
967a4874J9641m223j3170J6484n188p817J1069k470n520L994L911p161J518J0169
$$ -14874 4767 544 -12626 3858 -1330 -9147 1922 -548 -6068 -2074 1837 -5324 -3806 6363
981F363j2574K158J3464j8672P950J3274k3056J3060R827k3351J6260O206j9327
$$ 6363 -6211 -4053 9411 -9261 -1311 11963 -11093 1967 11794 -11557 4703 10909 -8418
994h418J2999M925j4280O200J0102j2672k245J7398j3280p365K4617j7320r299
$$ -8418 4581 9506 -4774 1426 11528 -1144 -3389 14009 729 -6636 17981 661 -8638
1007h638K7899k0482o628K8280k2901l657K2848j9012j440J7270j3835m539J4487
$$ -8638 19261 -1221 -7849 20431 -2470 -6127 16721 -2291 -3731 13539 -296 -4835 9652
1020I652o727j0115J6585m002j8033K2409m153k1458K9286r026k3602L3416j1938
$$ 9652 2925 -7190 9395 5393 -12640 9769 5616 -15842 13444 4418 -19184 14232 2294
1033B294k0675L3073j3771j9947K9669q033j8939K2682n87k4462J9041J0853k9455
$$ 2294 -18381 14692 921 -19026 10643 2610 -16329 6353 5766 -18696 345 11198 -18257
1046a8257J6177J6268l6240J8209K0058l6985J8521J5316l5370K0224J3663k8852
$$ -18257 -2080 14188 -22052 -3843 16215 -20770 -2249 13067 -22303 -2079 11584 -17268
1058a7268J6901P289k3909J4452J1918k0790P098J4364k4819O464K6152l1049
$$ -17268 -367 6922 -16987 -2535 9383 -11407 -4309 10055 -14764 -8300 17852 -13197
1070a3197L830L0160l9607P780L8063m2162L948L4958m0342M922L6944l1601o593
$$ -13197 -9367 20793 -18814 -11034 27029 -15133 -11185 23773 -16569 -11647 25297 -6304 -12897
1083a2897L0681k1719j1411L5341j3887k3863L1911j0080k2802M0097j2772k7293
$$ -12897 17784 -3935 -15346 19995 6108 -17755 14156 4076 -18726 21371 8599 -18694
1095a8694L5601j5944j6986L9797j9156j9282L0092j7003j0329L2114j3193k1279
$$ -18694 16907 963 -16023 23774 4618 -14664 15428 -1575 -11904 20210 7017 -14262
1107a4262K4346n843j9923L3197l072l7018L2075J277l5304M4326r36m8514L9417
$$ -14262 10084 4241 -15682 17515 14443 -22575 9500 10777 -24527 19799 18863 -29651 9766
1120I766L297l8827M2453M259m6931K5607J6073l3128K0705K1938m2424K883L3630
$$ 9766 13063 -25764 16689 20948 -25983 -376 15697 -17431 3274 25212 -17212 -14329 19301
1133A9301k9115N000L0962m0529o91L1443k6020J2150J7729l8023J0986J8011
$$ 19301 -9814 -4814 26148 -14381 -15072 16371 -9649 2501 20230 -17793 -6807 11204
1145A1204k3035K0454R797l7886J0885K3403k5179J0137K6863m3393o147M7403
$$ 11204 -11831 8623 18420 -19466 -8581 14822 -10357 -220 26643 -16750 -22897 24506
1157B4506k9833p759M5169m4775j8072N4708k4651j2754L8180l3504j8560M0424
$$ 24506 -5327 -13086 32083 -12692 -30764 23944 -707 -13461 24719 -8785 -27345 13079
1169A3079q340j4477K3858j7764k3522L4336M081k4301K5176j1676l2699M1031
$$ 13079 4739 -9738 14120 -3644 -27166 7170 11251 -13050 12126 450 -32249 8782
1181H782M761k9177K9167j4304k9558L9661K428k1009J9658j3285k0599K9509
$$ 8782 13543 -15634 13533 -771 -30329 9332 11760 -9249 10409 -2876 -23475 6034
1193F034P542j8707J2190n534k6158K9975J6458l2702J8729K136m1642L9206K1808
$$ 6034 13576 -5131 7059 1525 -24633 5342 21800 -10902 7827 9963 -31679 7527 29335
1206B9335m3382K0431O766m0678L0784K6368l3882K091J2690k5775J0729L1850
$$ 29335 -14047 6384 13150 -27528 3256 29624 -4258 -2167 10523 -15252 -4523 27327
1218B7327k3261j2749J7833k1443O078L4706k7795q787J7957k7845J4489L1364
$$ 27327 4066 -8683 9150 -12293 -6215 28491 696 -8091 9866 -17979 -3490 27874
1230B7874l0861m678J3949k2285J1079K7367k0220j4976J3535r660j722K9939
$$ 27874 -2987 -7665 6284 -16001 -4922 22445 2225 -12751 784 -8876 -10598 19341
1242A9341j3071k4495J9065r513l546L4072k0207k0172K2440j6285J549L3511
$$ 19341 6270 -18225 840 -8673 -12219 21853 1646 -18526 3914 -12371 -10822 22689
1254B2689k1884j9163J9305p856m440K8188p029l0752J5627R185j6838K5292L897
$$ 22689 805 -18358 947 -6909 -11349 16839 9810 -20942 -5315 3870 -12968 12324 16221
1267A6221l7223J4343J2448j6151K3799r25k9023J2021N846n148J6690l392k0238
$$ 16221 -21002 -6659 5789 -10362 13437 12512 -16511 -4490 1356 -3792 12898 9506 -10732
1280a0732M388R768l167Q570M369k3548J418J7590j0225J0262O964k8912P360
$$ -10732 -6344 3424 257 8827 13196 -10352 -8934 8656 -1569 8693 15657 -13255 -5895
1293e895J4772j2538J5912M83k6110J0204J0509q397R826M148k1760j469K0753
$$ -5895 8877 -3661 12251 12734 -13376 -3172 7337 -1060 8766 12914 -8846 -10315 10438
1306A0438o667m442J5729k0183j1708K9106o396q905J4976j6865p620J8510p60
$$ 10438 3771 -671 15058 -5125 -16833 12273 5877 -3028 11948 -4917 -12537 5973 5213
1319E213k107R75r813j101P539L843p61k329o837n051J3314K359q579R229j0309
$$ 5213 3106 4081 -5732 -6833 706 4549 3788 1459 -5378 -10429 2885 5244 -3335 5894 -4415
1334d415j1187K1945j792j0800J1098j0151p225J5356M39m527P50m714k663N911
$$ -4415 -15602 6343 4551 -6249 4849 -5302 -12527 2829 3268 -1259 -509 -5223 -7886 -1975
1348a975O856o154j358J341r422J0399Q035j3945N686J361j3534J4315O413j2479
$$ -1975 4881 -1273 -2631 -1290 -10712 -313 7722 -6223 -537 824 -12710 1605 8018 -4461
1362d461L587J62n217N368N115j455o607J346K244k021O632j458n885L494m221
$$ -4461 -874 -712 -5929 -561 4554 3099 -3508 -2162 82 -1939 4693 3235 -2650 844 -3377
1377c377N062O728j0751L694K498j0276R866N188j0299J947K046l314J219M737
$$ -3377 1685 8413 -2338 1356 3854 -6422 3444 8632 -1667 280 2326 -988 231 4968
1391D968k35q602L591M339o600O274P12p970M576j252O7N310p129J485L073p204
$$ 4968 4733 -3869 -278 4061 -2539 3735 4447 -3523 1053 -199 -132 5178 -1951 -466 2607 -4597
1407d597O157K836o837J199J721q02j203K347K673p881K624N964q367M471L318
$$ -4597 1560 4396 -2441 -1242 479 -323 -1526 821 3494 -4387 -1763 4201 -4166 305 3623
1422C623p853M412L26j773M131n008J849K459n358M602J171m015J685J40O31j606
$$ 3623 -4230 182 508 -1265 2866 -2142 -293 2166 -3192 1410 2581 -1434 251 391 1022 -584
1438e84L29L857o197K137N233p988L638L685p348M276L80l274L538k929R53J868
$$ -584 -255 3602 -2595 -458 4775 -3213 425 4110 -3238 1038 1418 -1856 1682 -1247 -294 1574
1454A574l789K305k45j590J902j280J637k677n56N331n870J016N757q605L034
$$ 1574 -2215 90 -155 -1745 157 -1123 514 -2163 -2719 2612 -3258 -2242 3515 -5090 -2056
1469b056N098p176L928J005m715L553o67O3Q50j804J397j018J014J286k457L419
$$ -2056 3042 -4134 -206 799 -3916 -363 -1030 -967 -117 -1921 -524 -1542 -528 758 -1699 1720
1485A720k785k086P903n978n68P603q722J159P574p073K042K932m281J226J761
$$ 1720 -1065 -3151 4752 -1226 -1794 5809 -2913 -1754 5820 -1253 789 3721 -560 666 2427
1500B427J64j903P75J519m212L652K209o349M971j206n374Q871l879m416Q363
$$ 2427 2591 688 1463 2982 -1230 2422 4631 -1718 3253 2047 -3327 5544 1665 -2751 5612
1515E612o903j884Q422n703j738M407k770k485L712J801o137K162M170q498M830
$$ 5612 -1291 -3175 5247 -456 -2194 2213 -557 -3042 670 2471 -3666 -1504 2666 -5832 -1002
1530a002N458j1104N481L533j0110Q558J269q722O724k14n509N600M47m133J850
$$ -1002 4456 -6648 -1167 2366 -7744 814 2083 -6639 85 -129 -5638 -38 409 -3724 -1874
1545a874K809m301M92O316o833r85Q882r268J997R595j1795L003Q067j1765N634
$$ -1874 935 -3366 -2874 3442 -3391 -4376 4506 -4762 -2765 6830 -4965 -1962 6105 -5660 -26
1560b6O116j0106L640N190o926J032O765n347l647Q873m003o582J2625n580p961
$$ -26 6090 -4016 -376 4814 -2112 -1080 5685 338 -3309 5564 1561 -5021 7604 2024 -5937
1575e937J3871p040o288J3620p929m494J1330o994l021Q634m923l811O779k116
$$ -5937 7934 894 -5394 8226 297 -4197 7133 139 -2882 5752 829 -2982 3797 1681
1589A681n376P655m79r307R759M17j2235J3207r65j3772J5055k235j2700J4927
$$ 1681 -3695 3960 3481 -5826 3933 4350 -7885 5322 4357 -9415 5640 3405 -9295 5632
1603E632k073j2053J1865N74j0465P852M071j1678N136P427j2325M074R864j4451
$$ 5632 3559 -8494 3371 3945 -6520 1332 5403 -6275 -1139 6288 -6037 -1963 7901 -6550
1617f550L699J0836j5699O730Q316j5067P236O026j2819P798M770j1572N169N899
$$ -6550 -2851 7985 -7714 -984 7332 -7735 -499 5527 -7292 506 5276 -6296 -1127 4772
1631D772r927K532R443j1310q88J3825j2867k128J7136j5524k809J8532j5512
$$ 4772 -5155 -2623 6820 -4490 -5378 8447 -4420 -6548 10588 -4936 -7745 10787 -4725
1644d725j910J7015j4348l340J5496r792m694J2770o087p783J2233j974j0169
$$ -4725 -6635 10380 -3968 -7308 8188 -1604 -6298 6472 385 -7398 4835 2861 -7308
1657g308J2357k104j2020J5016k527j1251J5318o141j0073J6494o150q230J4524
$$ -7308 5049 2945 -9075 5941 3414 -7837 7481 1340 -8733 7761 1611 -6619 7905
1670G905p635p672J4056l742r290J1578j020j3293J3383L819j7295J2720M770
$$ 7905 270 -7402 6654 2912 -6378 5200 4180 -9113 4270 8089 -9206 3514 8284
1683H284j9895J4682P224k0559J2441O028j8875J1954P378j5180N777O865j2582
$$ 8284 -11611 3071 10295 -10264 2177 8205 -10670 1284 8662 -6518 -741 6124 -6458
1696f458M383J0357j1729p82J0677j1605R04J3812j4485N27J2170j5641M946J2871
$$ -6458 -2075 8282 -3447 -4229 6448 -5157 -4253 9559 -4926 -4399 7771 -7870 -2924 9947
1710I947j6352L081J0268j4318N058J1168j2748j285J1076r519k477J5901r988
$$ 9947 -6405 -3324 6944 -7374 -2316 8852 -3896 -5181 5895 -3624 -6101 9800 -188
1723a88q990J6321q209p253J9387j0678j0672J8036r000n915J6996r527q677J3112
$$ -188 -9178 7143 -1066 -8319 11068 390 -10282 7754 -1246 -7161 9835 308 -8369 4743
1737D743m524o064J2428l606j1060R964J921j0880J2450M50j6352J2621K584j2638
$$ 4743 219 -5845 6583 2977 -8083 1881 3802 -7078 5372 5822 -10530 2091 4675 -7963
1751g963J4146j324j5073J2483J070r278J0931j009j2122P563M597p867N890L994
$$ -7963 6183 4859 -10214 2269 3339 -5939 4992 3983 -8139 -576 4021 -3846 2044 6038
1765F038j3838N174R923j2072N983O956j7034P070R910j3254P605N021j5557O346
$$ 6038 -7800 -2626 7297 -4775 1208 8164 -8870 -1800 8110 -5144 2461 7482 -8075 -1729
1779a729Q867r775L601N859j1924O30J2283p498k905J0858j1376m036J6831q711
$$ -1729 7138 -2637 964 6823 -5101 -4471 7812 314 -2591 8267 -3109 -7145 9686 975
1793I75m794J2139j1869l153J4625o695l481P201p553k162R288j532n039M198
$$ 975 -3819 8320 -3549 -6702 7923 1228 -2253 4948 -2605 -4767 4521 2989 -2050 2148
1807B148l093n077R848k86p607P034m470o622J4105m124p330R995p685m978J3848
$$ 2148 -945 -6022 3826 3540 -4067 2967 -1503 -8125 5980 1856 -5474 4521 -3164 -8142 5706
1822E706l775o908P056l357o176R725K662j0273L655M002r822P488P915j3676
$$ 5706 1931 -4977 2079 -1278 -7454 2271 4933 -5340 -1685 2317 -7505 -17 7898 -5778
1836e778L276N187r858Q112M944j0128K870J457l884M973K774n017j649K674j973
$$ -5778 -2502 2685 -7173 939 5883 -4245 -1375 82 -3802 1171 3945 -1072 -2721 -47 -2020
1851b020J968N044o208k080N522n711L621P050j0708R90N979q086N708N761r704
$$ -2020 -52 4992 -1216 -3296 2226 -3485 136 7186 -3522 -2532 3447 -4639 1069 6830 -2874
1866b874O73M239m014J950N301m709m983O207l17l791Q278m457p397Q696j608
$$ -2874 -2201 2038 -1976 -26 5275 566 -4417 1790 1473 -2318 5960 1503 -5894 2802 1194
1881A194l199Q122n428m878O165j471M7L154k972k626J587J826k87J178k73n499
$$ 1194 -2005 6117 689 -4189 1976 505 552 3706 734 -1892 -305 1521 1234 2412 2139 -3360
1897c360L315L072l931M523j316o784O428M51l797O029l636m804N064J21j318
$$ -3360 -45 3027 -904 3619 2303 -4481 1947 2398 -1399 4630 994 -3810 1254 1375 57
1912E7K049j156l539J083M205k589o17L001o178J435N674m999J420J804o089L754
$$ 57 2106 950 -2589 -1506 2699 110 -507 2494 -3684 -2249 3425 -1574 -154 1650 -4439 -685
1928f85K444l168K134q35l060K315J161k29o88J69j216j348M614j575k659L986
$$ -685 1759 -1409 725 -110 -3170 -855 306 77 -611 -442 -1658 -3006 1608 33 -2626 1360
1944A360l851m65N814m275K2K915m467J908K369k589J066k10r15M77J095J011
$$ 1360 -2491 -2956 2858 -1417 -1395 1520 -2947 -1039 1330 -1259 -193 -403 -1318 -841 254 1265
1960A265k272R24L39k655L948j17l793M089j889k124N193k932j187K975k859O97
$$ 1265 -1007 -83 256 -2399 1549 1432 -2361 1728 -161 -2285 2908 -24 -1211 1764 -1095 -398
1976c98J751j322k5k15Q61p42j10J954k557R52J636l719L018P47l945M031r46
$$ -398 1353 31 6 -209 652 -90 -200 1754 -803 149 1785 -1934 1084 1831 -2114 1917 971
1993I71k894M215k039j667L182j905o0Q16l83o1n90J574j117q82K863k970O68
$$ 971 -1923 2292 253 -1414 1768 -137 -197 619 236 175 -415 1159 42 -840 2023 -947 -279
2010b79K837m411J982K194m142K908L93l390K915p69o73J402n72k44n28L41L23
$$ -279 2558 -1853 129 2323 -1819 1089 1482 -1908 1007 238 -435 967 395 151 -377 -36 287
2027B87r04K088j536j903M064k695m21M025n337R84L151l706K144J339l401J361
$$ 287 -617 1471 -65 -1968 2096 -599 -1020 3005 -2332 -1348 1803 -1903 241 1580 -1821 -460
2043d60R36n14J60L38n69j959K118R48k817L369j488l525N372k041j743M358l741
$$ -460 476 -38 122 460 -109 -2068 50 998 -1819 1550 62 -3463 1909 -132 -1875 2483 -1258
2060a258j322M576k696K57K060k597O6J372J47r51M49O19l068K695J949m587L547
$$ -1258 -2580 1996 -700 -443 1617 -980 -914 458 605 -346 103 722 -2346 349 2298 -2289 1258
2077A258k63m378N067n01l105L910k209k327M258j143j085J384p15j660J364K153
$$ 1258 995 -3383 1684 1183 -1922 1988 -221 -2548 1710 567 -518 866 151 -1509 -145 2008
2093B008k596n6K827m693J793M206n885K455K419n933M186J714m601L067Lk763
$$ 2008 -588 -644 2183 -2510 -717 3489 -2396 59 2478 -3455 731 2445 -2156 911 914 -1849
2109a849K104J095j651n36J721j379j030M275l080j965N243m366l22N648n529
$$ -1849 255 1350 -301 -837 884 -495 -1525 2750 -330 -2295 2948 -1418 -1740 3908 -1621
2124a621J91M286n389J937L616m080J43K476k505j36L186j511k969L503m14l854
$$ -1621 -1430 2856 -2533 -596 3020 -1060 -917 1559 -946 -1082 2104 593 -2376 1127 713 -3141
2140c141O218j964m805O368k147l869O904l586k798N240k907j405M043j756k323
$$ -3141 3077 1113 -3692 2676 529 -3340 3564 -22 -2820 2420 -487 -1892 2151 395 -1928
2155a928K513N53l291K557J878n715L438K536o189M922J514p147N765O42n774
$$ -1928 585 1138 -2153 404 2282 -3433 5 2541 -3648 1274 2788 -4359 1406 2048 -3726
2170c726N506M8m787L979K68k883K131J462l315O70L328m047O29M315n678R86
$$ -3726 1780 1828 -2959 1020 1288 -1595 536 1998 -1317 -647 2681 -1366 -737 3578 -2100 -1114
2186a114N233p125K916M285p532L499L232n704K659K845n038J315L260l604q62
$$ -1114 4119 -3006 -90 4195 -3337 162 3394 -2310 349 3194 -1844 -529 2731 -873 -1735
2201a735M642l343k667O422l475l518P804m744l056P634n172j438O167m630j227
$$ -1735 2907 -436 -3103 3319 -156 -3674 4130 -614 -3670 3964 -1208 -2646 3521 -1109 -2336
2216b336M715l321j058L409j694k173L299k03l882M831p13n184O428j146n649
$$ -2336 2379 -942 -2000 1409 -285 -2458 841 638 -3244 1587 874 -4310 2118 972 -4677
2231d677P878k643n448P851k473m586O943k400l975M743l5l835L321K066n992
$$ -4677 3201 558 -4890 2961 488 -4098 2845 445 -3530 1213 1178 -2657 664 2730 -3262
2246c262K762M346o866K614M646q066L757L975p214M205K100o129L911J587m043
$$ -3262 -500 3846 -3020 -406 4240 -3826 -69 3906 -3308 897 2997 -3132 779 2366 -1677
2261a677K626J223l758J227L124l400k65M627n067l01O154o067k9O646p542Q36
$$ -1677 949 2172 -1586 -359 2765 -635 -900 3727 -1340 -1641 4513 -1554 -1583 5063 -2479 -1643
2277a643O446o771R73M813n593K76M039k987j239L611j792l207N182o90m872N866
$$ -1643 4803 -1968 -995 3818 -1775 -1499 2540 -447 -1686 1925 133 -3074 2108 1418 -3454 2412
2293B412k161m118P116l020l694O589m439k138O436l565j739M153l086j641M344
$$ 2412 251 -3867 3249 229 -3465 3124 -1315 -3453 2983 -582 -2321 1832 -1254 -2895 1449
2308A449m54m048L467Q72n408N119K092p972N608J565p655O905J061o425M607
$$ 1449 995 -3053 414 1286 -4122 997 3089 -4883 725 2290 -5365 1540 2601 -3824 783
2323G83K06m163M374L26l286J086J619k014P47K817l556k23L726m787K299M086
$$ 783 989 -3174 1200 1526 -1760 -674 945 -1069 -322 2495 -1061 -1284 2442 -2345 -46 4040
2339D040o769K798L088o480M412K815o878L072K182m315K411L029m067j279M516
$$ 4040 -2729 69 3157 -3323 1089 3904 -2974 98 2280 -2035 376 3405 -662 -1941 2575
2354B575k484k072N785l792l618O648l135k061O451n021j864M979l102NL225l069
$$ 2575 91 -1981 3804 12 -3606 3042 -93 -2154 4297 -724 -2588 2391 -711 -706 2519 -550
2370e50j152K177q1r75J554m47k686K571P63l290L981j509m383O103j461k886
$$ -550 -1702 475 394 -581 973 526 -2160 411 1174 -2116 1865 356 -4027 2076 615 -2271
2386b271N357l383l232N439j746j746L479j580l111K724K518l955J342K619n698
$$ -2271 3086 -297 -3529 1910 164 -1582 1897 317 -2794 -70 2448 -1507 -165 2454 -3244
2401c244K257M842n844J855K541n454L073K421l663K129k90k289K040P69j034
$$ -3244 -987 3855 -1989 -134 2407 -3047 26 2447 -1216 913 623 -1666 374 1143 109
2416A09J7K05j207j72L493k357j098L029l920N17M859m646K72L476n033J899K721
$$ 109 126 331 -876 -1048 2445 88 -1010 2019 -1901 -1384 3475 -1171 -899 2577 -2456 -557 2164
2433B164l145M30J195j866L54J907n08k042J913l70k383M348j390l324M378k363
$$ 2164 -981 -551 644 -1222 -868 1039 531 -1511 402 32 -2351 1997 607 -2717 1661 -702
2449g02j760N412l279j429L143k846L48K669j446q92L98N96r08J027J233l040
$$ -702 -2462 2950 -329 -1758 1385 -1461 -1113 1556 110 -782 -384 212 -696 331 1564 -1476
2465a476R50K170l459L137O65m591L611j81k725M179j575j907K148r75l95J648
$$ -1476 -526 1644 -1815 1322 1987 -2604 1007 826 -1899 2280 705 -1202 946 -29 -424 1224
2481A224k86j266l60K047j490j73K679l388JL327l627J597J984l885J834Q45k482
$$ 1224 938 -328 -688 1359 -131 -304 2375 -1013 -1012 2315 -1312 285 2269 -1616 218 1063 -1419
2498a419K435k65j914J513k10k78O7Q43n12j895K411p11j795L429k567j170L707
$$ -1419 1016 751 -1163 350 140 -138 -71 772 260 -1635 776 65 -1730 1699 -868 -2038 1669
2515A669k591J52K308l128J393J000j880J401J42r18J43J50N97j557J376N91k741
$$ 1669 -922 -770 1538 -1590 -197 803 -1077 324 466 -452 -309 -159 438 -1119 257 848 -1893
2532a893K701j12k866L445j240k076L719j842q95K522j925q2J246j011M06k16
$$ -1893 808 696 -2170 1275 35 -2041 1678 -164 -1059 1463 -462 -544 702 -309 97 -119
2548a19O14m66l31J376k216J061J681l118K034N39l300L268k45k566L140j194
$$ -119 495 29 -302 1074 -1142 -81 1600 -1518 516 1055 -2245 1023 778 -1788 1352 158
2564A58j194K061r67m40L19L58n2j369K419j204r99K335k237r1K646l093J023
$$ 158 -1036 1025 58 -382 -63 295 243 -1126 1293 89 -910 1425 -812 -903 1743 -1350 -327
2581c27J833l281K298M16k789K391k95j620J743p4n70l49P63j31j344K584j188
$$ -327 1506 -1775 523 939 -1850 541 246 -1374 369 295 -275 -624 139 8 -1336 1248 60
2598F0j933L263j884r64L666l251lK242k556J387Q19j996Q77P02q10N14J81N8
$$ 60 -1873 1390 -494 -1458 2208 -1043 -1046 1196 -1360 27 846 -1150 -273 429 -381 133 314 372
2616C72j443J447O68k364K452k32l073L559p57j925L485k019j535K971j552j25
$$ 372 -1071 376 1044 -1320 1132 900 -2173 1386 629 -1296 2189 170 -1365 1606 54 -71
2632g1J561j633l04N41O77o26O4J362k597Q80K172l128K100P87l902L205L45k820
$$ -71 1490 -143 -447 94 771 145 209 1571 -1026 -146 2026 -1102 998 1785 -2117 1088 1433 -1387
2650a387K988j498j318J771j33m70O27j75j043l4J783j192p93K511l483N50L607
$$ -1387 1601 103 -1215 556 423 -47 580 405 -638 -672 1111 -81 -874 1637 -1846 -1296 2311
2667B311l890Q77K234m038J844K156l004J366L52j649N93J022k35j084Q46J19
$$ 2311 -1579 -702 1532 -2506 -662 1494 -1510 -144 208 -1441 -848 174 -61 -1145 -299 -180
2683a80j836K912r61j850L012k437o18M121k988l66K939l556J020K643k382j26
$$ -180 -2016 896 -65 -1915 1097 -1340 -1958 2163 -825 -1191 1748 -1808 -788 1855 -527 -653
2699f53J025k09p27J314Q77k970J989R94l476L473L49l475L118p13k423M029j557
$$ -653 372 163 -564 750 1627 -1343 646 1640 -1836 1637 1986 -1489 1629 916 -1507 2522 965
2716I65j915K633j399o99J880j93j613K97J327j626M72K243l423P30K278l673
$$ 965 -950 1683 284 -415 1465 1272 -341 -44 1283 -343 129 2372 -1051 -321 1957 -1716
2732a716K254J914m609K355P73k727K592J0k559J660L41j506P60J237j645j246
$$ -1716 538 2452 -2157 198 971 -1756 836 846 -1713 -53 288 -1218 -458 779 -866 -2112
2748b112L124j398j463L739l127j066L922l269M06L085l814J003K086k462J402
$$ -2112 1012 -386 -1849 1890 -1237 -2303 1619 -1650 -1244 1841 -1973 -970 1116 -1346 56
2763E6R31k059j24J859m81j423K345p79k591L960q92k960M378j782k742M546j685
$$ 56 987 -1072 -1196 663 182 -1241 1104 325 -2266 1694 802 -2158 2220 438 -2304 2242 557
2780E57j613L191j881o71J712o20o29N30K00j368R94J399k715J606J260l776K783
$$ 557 -1056 2135 254 -417 1295 675 46 576 776 -592 402 1801 -914 692 1952 -1824 959
2797I59J252m233L705k75l814L941n30k500K569m77j871J466M75j120m32J978
$$ 959 2211 -2022 1683 1408 -2406 1535 1005 -1495 1074 597 -1274 192 667 -453 -885 1093
2813A093k240l36L247l148l5L214m315J397L056l896J665J552l814K087J232j865
$$ 1093 -1147 -1483 1764 -1384 -1419 1795 -2520 -1123 1933 -1963 -298 1254 -2560 -473 759 -1106
2829a106M53J084j054m71J497o41j459K793r72k472M321k265j552M122l041l31
$$ -1106 -653 431 -623 -1094 403 -238 -1697 1096 124 -2348 1973 -292 -1844 2278 -763 -1094
2845a094L383k751j41K376k027j17J565n70r89J067N84k181J505J025l297K801
$$ -1094 2289 -462 -603 1773 -254 -371 1194 624 -365 702 1286 -895 610 1635 -1662 1139
2861A139K3l320L586k98k902L835j964j742L590j760j510K429p82j468J248R80
$$ 1139 1162 -2158 1428 1130 -1772 2063 99 -1643 1947 187 -1323 1106 324 -1144 104 1084
2877A084j990M30K023l392J035K922m099J684K040m159K408J051k737J961Q1j685
$$ 1084 -906 -476 1547 -1845 -810 2112 -1987 -303 1737 -2422 -14 1037 -1700 261 342 -1343
2893a343J166K30l28j41P42p73p15K205j157j075K766k427m05L392l327P46K445
$$ -1343 -177 53 -275 -416 326 -447 -1162 1043 -114 -1189 1577 -850 -1255 2137 -1190 -444 2001
2910B001l531J467J872k748J256J242k274N43J317n64j273J479n9k372L067k60
$$ 2001 -1530 -63 1809 -939 317 1559 -715 -172 1145 581 -692 787 728 -1644 1423 1163
2926A163k938L627j125k513L754j726j132K271j680q9J254r66M7j47M00o16K45
$$ 1163 -1775 1852 727 -1786 1968 242 -890 1381 -299 -388 866 -100 -53 -200 200 -416 -171
2943a71J003j974O50J134k538K248P21l576L250k46k801L423j030j798J900m24
$$ -171 832 -1142 -492 642 -1896 352 1073 -2503 747 501 -2300 1123 93 -1705 195 -229
2959b29p86J214J20o04o87J566j193l72K670k521k4K493l085J445K181m136K020
$$ -229 -1015 199 319 -285 -972 594 -599 -971 1699 -822 -846 1647 -1438 7 2188 -1948 72
2976G2J298k432J455Q35j701K54L67M87j083J223o1j873J761J6j574K563j418
$$ 72 1370 -1062 393 1228 -473 -219 148 635 -448 775 714 -1159 602 618 -956 1607 189
2993A89j218K908k432L20J971k537Q20J167j941P02J020j118m69R94M02j613J333
$$ 189 -1029 1879 -553 -233 1738 -799 21 1188 -753 -51 969 -149 -618 376 778 -835 498
3010D98M03k318J997P41k639K329o69j601K302j299n29J913j586k58J540j071
$$ 498 901 -1417 580 1321 -1318 1011 342 -1259 1043 -256 -785 1128 -458 -716 824 -247
3026b47j17L27K08p75O6J650k237N86J775k688J141J460k374J340L8j449K096
$$ -247 -364 -37 171 -604 -538 1112 -1125 -539 1236 -1452 -311 1149 -1225 115 153 -1296 800
3043H00j156m49J457j065m37R41j52k92j65J213j377m42K496j998o05L183k780
$$ 800 -356 -805 652 -413 -850 91 -61 -353 -518 695 -682 -1124 1372 -626 -1231 1952 -828
3060h28k43K520k251N13J244j396P53l27q5N12o62O68l84J40K52p10J083m41j201
$$ -828 -1071 1449 -802 -289 955 -441 312 -15 -100 412 -250 418 34 174 426 -284 799 358 -843
3079h43K837j853j245L120k218o38K481j947m3J302r39J12j68M28J05q06Q19n56
$$ -843 1994 141 -1104 2016 -202 -840 1641 -306 -349 953 14 126 -42 386 491 -315 504 -52
3097e2L3O19j307J307J89k179K441p59j818K878j219j434K046r10n76O58k70J80
$$ -52 -19 600 -707 600 789 -1390 1051 292 -1526 1352 133 -1301 745 -165 -741 -83 -353 -173
3115a73n18O42j97q42J445q90j07J177j633J022M22k310K646o23j753K204m25
$$ -173 -691 -49 -246 -1088 357 -533 -640 537 -1096 -74 348 -1962 684 61 -1692 512 87
3132H7j254J321l14m58M49J74J23j135J387J5j371J874j118p29K124j730M50J585
$$ 87 -1167 154 -160 -618 -169 5 128 -1007 380 395 -976 898 -220 -949 1175 -555 -105 1480
3150A480k408J404L76j847J796k62r29Q66k7r7m69P09L27j568J428K60j872J909
$$ 1480 -928 476 852 -995 801 539 -390 476 449 352 -117 592 919 -649 779 1039 -833 1076
3168A076m85j340J841r39m12J477j629N36O29j454Q61K46q24M81k62N66j036N76
$$ 1076 591 -749 1092 153 -259 1218 -411 125 754 -700 161 407 -417 64 -198 368 -668 -92
3186i2Q66j970J191J071l061K081L51j980J800n04j024J261q85M28K37l08N34
$$ -92 774 -1196 -5 1066 -1995 86 437 -1543 257 -247 -1271 -10 -895 -467 -230 -538 -4
3203dr17R73n3r28J039q07m58J764j170L29R46k007J512N97k166K070j87j449
$$ -4 -921 52 -1 -929 110 -697 -1155 609 -561 -232 714 -1293 219 816 -1350 720 533 -916
3221i16J603n13r0J38O1n1m84J276m92j085K286j403j295K773j765q4J447j739
$$ -916 687 174 84 222 283 232 -252 1024 532 -553 1733 330 -965 1808 43 -41 1406 -333
3239c33L64J250j388O44m00j69M82j14J84n37p9M01r95J216J09j896J866p12j460
$$ -333 31 1281 -107 537 137 -32 450 336 520 -17 -96 305 -690 526 635 -1261 605 -107 -1567
3258a567K446j121r30J889j503K03R35r44J72k07K74k00L7J345j651Q2J545k008
$$ -1567 879 -242 -1172 717 -786 -583 352 -592 -420 -627 -353 -553 -516 829 -822 -740 805 -1203
3276a203J112J416l051J634P23j768K082m67j068J076o04L89L15m60L45n32K39
$$ -1203 -91 1325 -1726 -92 631 -1137 945 478 -590 486 -118 271 586 126 471 -61 178
3293A78J96m37J745k040j00K074k227P86J931l163R96J551k040O74Q54j138q0
$$ 178 374 -63 1682 -358 -458 1616 -611 175 2106 -1057 -61 1490 -550 124 978 -160 -240
3310b40L84N02q42J0R50j592P21Q58j281J302p16j292K209j747J65J729k282K34
$$ -240 144 646 -196 -186 764 -828 -107 751 -530 772 56 -1236 973 -774 -609 1120 -1162 -928
3328i28J446j251O65L21r84j51L50R35j174P14L64j933J478J097k298K013k09
$$ -928 518 -733 -68 253 -731 -882 -532 403 -771 -57 307 -1626 -148 949 -1349 664 455
3345D55k353K555l21j262K025q70j017J198J67l97j64O07r35m64K047j256m47
$$ 455 -1898 657 336 -926 1099 229 -788 410 577 180 16 623 -312 -776 1271 15 -432
3362d32J905k074M06J720k071R09J99j596J683K4r54J079n63r04J024K60n56m20
$$ -432 1473 -601 -195 1525 -546 363 562 -1034 649 673 -281 798 235 -669 355 615 59 -361
3380c61R91o71r78K023j030j042K353k332k59K900k210L2J088j598P62N10m34
$$ -361 630 -41 -1019 1004 -26 -1068 1285 -1047 -1306 1594 -616 -584 504 -1094 -332 178 -256
3397b56j36K64L4n48N39O03j756J161O12k281K639l89k083K350r63r01K004j025
$$ -256 -392 -128 -94 -642 -103 500 -1256 -95 517 -1764 875 486 -1597 753 -210 -1111 893 -132
3415a32k66P81r36O73K29j83M7k61Q27j233N39J263j934R71R14k589K169N73k609
$$ -132 -398 383 -553 120 349 166 213 -48 779 -454 85 1348 -586 385 1299 -1290 879 1452 -1157
3434a157K253j66j663J239K69j224P60L83l86o26J130l46j513K166j106p89K078
$$ -1157 1096 930 -733 506 775 -449 311 694 308 -318 812 466 -1047 1119 13 -776 1302
3451A302j974k59J698j781R76Q86j950J012K46j079Q25K53m38j83K05K83r91R46
$$ 1302 -672 -931 767 -1014 -38 848 -1102 -90 156 -923 -98 155 -283 -466 -261 22 -969 -23
3469b3J24j362J845r68j151L077j778q45K083j753r4J713j586L98Q69o18j66J32
$$ -23 101 -1261 584 -384 -1535 1542 -236 -1081 1002 -751 -845 868 -718 -320 549 -69 -235 -103
3487a03J097j664M36J357k137R51J107j732J213J84j667J685m04r93J507j075
$$ -103 994 -670 -234 1123 -1014 -63 1044 -688 525 709 -958 727 323 -670 837 -238
3503b38j78J154q34j34L75Q5k40l93J354j266l62K253k418K80J922k222N60Q07
$$ -238 -416 738 -96 -230 145 230 -10 -403 951 -315 -677 1576 -842 -562 1360 -862 -302 505
3521E05j578J082L53p81Q47p92L16M61l89L13o18P08k63j005K119j417p16K103
$$ 505 -1073 9 362 -419 428 -364 -48 413 24 337 -281 427 164 -841 1278 -139 -855 1248
3539A248j473n59K040j631K30Q77j242Q93n4n25P74o56K72j26J42J86p02P88J37
$$ 1248 -225 -784 1256 -375 -145 732 -510 383 329 -196 578 -78 194 68 210 396 -306 482 619
3558F19j530J841k73j865K305q89j159J684p27l92N82n85J68P1o6K62q04N38j83
$$ 619 -911 930 657 -1208 1097 208 -951 733 6 -386 196 -389 -221 -150 -216 46 -758 -220 -403
3577d03k46R15j016N05N57j936K045p7j623J678l07j125J271k17m92M17q4M42
$$ -403 -649 266 -750 -245 312 -1624 421 344 -1279 399 92 -1033 238 21 -471 -54 -138 304
3595C04n49M80M52j468Q38J26o72J581j132K3J069j868J381J85j471J368J11j223
$$ 304 -245 235 687 -781 57 183 -489 1092 -40 -17 1052 -816 565 750 -721 647 758 -465
3613d65J149p6n52k45N39P28j493P76P18j792J099N49j653J384m42l62P85j334
$$ -465 684 608 56 -189 350 1078 -415 361 1079 -713 386 935 -718 666 224 -138 647 -687
3631f87Q77O92j756J348l86o06P25j43M2m04J03J176j817Q68Q67k067J055O45
$$ -687 190 882 -874 474 88 -518 207 64 106 -298 -195 981 -836 32 899 -1168 -113 532
3649E32j488J174k82l81R06j387J265O0j235J377k71p03O69m11M01k80k51J425
$$ 532 -956 218 -64 -445 461 -926 339 399 -836 541 270 -433 236 -175 226 -54 -305 1120
3667A120j571K36J158j931J117O85j513M35L71j91L21o26Q12n91k46Q23n01k10
$$ 1120 -451 -215 943 -988 129 814 -699 -264 107 -84 237 -389 423 -168 -414 409 -92 -302
3685c02M34n65K55J81n01J384j533Q0J343j732N33Q10q58K82K95l67N60o97M30
$$ -302 132 -433 -178 3 -498 886 -647 -567 776 -956 -423 387 -471 -189 106 -261 299 -398 32
3704C2k03n92J201n43k81Q09j006P38R2p19J142j109l52J823j385K0R64j346N05
$$ 32 -171 -763 438 -105 -386 423 -583 155 247 -472 670 -439 -791 1032 -353 -333 631 -715 -210
3723b10K73J3L07o48N77l86o05J386n37m95J073j226L00N80o79P09n76n24J379
$$ -210 63 76 383 -265 312 -74 -679 707 170 -325 748 -478 -178 402 -277 432 -144 -668 711
3742G11j028J93Q34j442N70k7J98K12m36N18m29n87J528j277k96J493j446M41
$$ 711 -317 -124 710 -732 -162 -189 9 221 -215 303 -126 -713 815 -462 -758 735 -711 -270
3760b70Q33r54O75l01m32O47l18N59j25j120R50l37q2J134j418P16L9o88J361
$$ -270 563 -391 284 -17 -449 198 -120 439 314 -806 144 -193 -275 859 -559 157 196 -492 869
3779H69p60l11J158j619P14Q83j013P72o81j96P43k96L37l50o91N95q4L04N33
$$ 869 109 -202 956 -663 51 934 -79 693 12 -184 559 263 600 250 -441 154 70 374 907
3798I07j179O01j24r92J654n97j080J359r64J88P99o23J93n41j8P58o75O53j22
$$ 907 -272 329 205 -787 867 270 -810 549 -415 -227 572 -51 142 -399 -417 341 -334 319 197
3817A97j156R17k03l9R47j247J68L54q39J574n66q73J017p17oP67k51q8o89M86
$$ 197 -959 -42 -245 -284 663 -584 -416 -62 -901 673 107 -766 251 -466 -472 295 44 -44 -733 -247
3837b47K41m37P54p1j333J500k17l94J052r89l42N63n59J090l72o95Q72o65K05
$$ -247 -6 -443 311 240 -1093 407 190 -204 848 -141 -483 80 -479 611 239 -456 416 -249 -44
3856d4P12n06J24o60K94L50q46J258l9j785J680l36q03J645j292j21O09n13P98
$$ -44 668 162 286 -374 -80 270 -576 682 643 -1142 538 202 -601 1044 -248 -369 240 -273 525
3875E25j94n00J82l96P32r6j94L97j171L13J124j398Q65N86j942J332P0m71J039
$$ 525 331 -169 13 -383 349 253 59 456 -715 -402 722 -676 189 775 -1167 165 235 -236 803
3894H03r96k88N16k57N91m33j71J17p0N87l94j40R21j796Q53J214j623J075J11
$$ 803 -193 -481 35 -222 369 -64 -235 -118 -188 399 5 -135 786 -1010 -157 1057 -566 509 620
3913F20j721J291K04o57Q55o14j51J16J6P33r65j7L27o75P98M27r48Q73j039k9
$$ 620 -1101 190 394 -263 592 -22 -173 -57 -41 692 -273 -290 37 -638 160 587 -361 512 -527 -556
3933e56J433j090K46O65j536M24O62m73L80j40m59L94k2N93p03K6K34q82J313
$$ -556 877 -213 33 698 -838 -414 248 -225 155 15 -444 -50 -72 521 -182 -156 78 -804 509
3952E09p6j360J678j044p00J784q88m21Q95j019L74L69M20j09q62M55L1q38J301
$$ 509 433 -927 751 -293 -993 791 -97 -518 377 -642 -268 101 521 412 -450 5 36 -802 499
3971D99m25m98Q53r03P23M30j101J006q30m22J773p31m96Q67r30j9N57L8J85p68
$$ 499 74 -424 429 -474 249 679 -422 584 -246 -668 1105 374 -122 745 -185 -204 353 391 576 -192
3991a92L61Nm91J498j081m88J011j020P37M04j250N72K48o63P71K34m61k20j3
$$ -192 169 174 -317 1181 100 -388 623 -397 340 744 -506 66 314 -349 422 656 195 -25 -38
4010c8L03k14K93J22j135P73L36j097J154j63j015R83r88M81O05q99O39q5n39
$$ -38 265 51 344 466 -669 104 440 -657 497 334 -681 302 -686 -205 400 -499 140 55 -484
4029d84N85j35l63K08M6K3m71O96O4r73R49J13j594J382J19j223J299m39o75J088
$$ -484 101 -34 -397 -189 -143 -120 -591 105 169 -804 145 258 -1336 46 165 -1058 241 -198 -873 215
4049B15m90K68l21J27P67j003P20k01l57M25l38mO88q52N92L58j242J097P0r23
$$ 215 -275 -7 -328 -201 566 -437 283 82 -275 150 -188 -192 496 -356 236 594 -648 449 519 -404
4069d04Q73k53j6L02o13M54j31j92L85l30N10n59p28J159n11l81J261j022J11
$$ -404 469 216 200 502 -111 343 212 20 405 75 585 26 -702 457 -54 -435 826 -196 -85
4088h5O64r15N63j09l73J52l4J09Pl49P47n41k15P98p55M13j3m62N77k76k99J018
$$ -85 579 -336 227 118 -255 -103 -137 -28 -21 -370 377 -164 -379 419 -336 77 64 -398 179 -97 -396 622
4110F22r76J73R55j119M90L46o84M24l29K75j03k83R60q42k46P94n76K06N94r95
$$ 622 -354 -181 774 -345 145 491 -193 231 -98 177 74 -209 751 -91 -337 457 -119 87 681 -314
4130c14N11j22j34N16n71J40N42p45K71P7j71M01m39L17k8n65J056p33n21J094
$$ -314 197 75 -59 457 -114 26 568 -177 94 171 0 401 -38 279 251 -314 742 9 -512 582
4150E82q87q4P38o27M13p2k44N34m12k14M99n00P5J13j77M60n14M80k39p77J142
$$ 582 -305 -389 349 -278 135 63 -181 353 -59 -273 226 -274 -199 -86 -263 197 -317 163 -76 -853 289
4171B89n20l58R50n84j72O94n32o6K25p1K85n84L87M26q54M12J66p36J025p83
$$ 289 -231 -589 361 -223 -395 299 -233 -299 -74 -145 140 -444 -57 369 -485 -73 93 -643 382 -401
4191d01L06K55p92P54j12n49P99l36r2L96o84R15m67o2O68p21L11L43r09P50j09
$$ -401 -95 160 -632 122 10 -539 260 -76 -168 228 -456 459 -8 -70 598 -123 188 531 -378 372 263
4212B63n31R55n19j47L57r08Q27R7n61N40l84P2J92n36O22j67j71Q67j082M97
$$ 263 -268 687 168 21 378 -530 297 394 -167 373 -11 61 253 -283 339 172 1 868 -214 283
4232B83M39r12L61J63o51P75k88j42O61o93K08q4j36O39m07j99r2k89R15r00J61
$$ 283 722 -190 171 334 -317 458 170 28 689 -4 204 120 -16 623 216 17 -75 -364 551 -349 -188
4253a88R96j376K99O59p98M49K26o58M30j14j69J56k24M79m58k55O97m22K82R2
$$ -188 808 -568 -269 390 -408 41 267 -391 39 -75 -244 -88 -312 167 -291 -546 151 -271 11 103
4273A03p20J122n76l18R62j206N11N32p94M13M8p64O59r3mJ35l46M60k66j80Q58
$$ 103 -617 505 -71 -389 573 -633 -122 410 -384 29 77 -687 -28 -121 -125 10 -336 124 -142 -322 536
4294E36o86O07Rj156J116j59q16R30l87m11O61l64N53o48L4J73m52P35K96r00
$$ 536 -150 457 466 -690 426 267 -549 381 -6 -417 244 -120 433 -215 -181 -8 -460 275 571 -329
4314c29L44o1j65N90n92M93j63p45Q26J27r56R19o84k46Q36o1M2n45j35M14k00
$$ -329 15 -46 -211 379 -213 280 117 -628 198 325 -631 288 -396 -642 194 133 175 -370 -505 -91 -291
4335b91N42J17q31L84q4m30J142q22M86kj146R23Q4m78M70r1l54P27l85L76l50
$$ -291 251 368 -463 -79 -163 -593 549 -273 213 211 -935 -12 72 -406 64 -27 -381 346 -39 337 -13
4356a3j83K12l22O80J50q33L23m30K59O17m56K59q5q51J017L41p79J98j04j57
$$ -13 -196 16 -306 374 524 -309 14 -416 -157 460 4 263 178 -673 344 685 -94 104 0 -157
4376a57K44J90J80p09P9L95n82Q19J97j159J57K85l47J023o26j3J47p65O88O29
$$ -157 87 277 457 -252 -173 222 -360 459 656 -503 -346 -61 -408 615 -11 -24 123 -642 46 675
4396F75r58L03m52j03L69K30K22p60K53M57p12N97O50j297M55J59m48R90n14j86
$$ 675 -283 20 -432 -535 -166 64 286 -474 -221 236 -476 121 771 -526 -71 88 -360 630 116 -70
4416g0J5m39N87K51l35n0j6k14M64j1M10o05m53P96n22O70M64j438M58L78q07
$$ -70 -55 -494 93 344 9 -41 -57 -271 193 182 592 -13 -466 330 -192 478 942 -496 -38 340 -467
4437d67J042k05m99J73l70N90N02m06l63l22N7N54m18O60r20j73Q29q32Q92J07
$$ -467 575 370 -129 44 -326 264 766 360 -3 -325 -268 286 -132 528 -392 -565 264 -568 324 431
4457D31j239L51L53l06Q42Kq41P6r7N67j42j55K68p62J21P13k70N35o56r1O67
$$ 431 -808 -457 -104 -410 432 434 -407 -331 -428 139 -3 -158 110 -652 -531 182 -88 447 -209 -300 367
4478C67n25M10L53j164J91P06q19R55%l35p41L42P82l19j01N02j218M93P62p00
$$ 367 -158 252 605 -559 -368 338 -481 474 474 139 -602 -260 522 203 102 604 -614 -121 641 -59
4498e9M52k55l01L48l3K11J63q93J67M88o58O02K06o02J63l07P73m55j58L10j164
$$ -59 393 138 -163 185 152 363 526 -367 -200 288 -370 232 438 -164 -1 -308 465 10 -148 162 -1002
4519a002P42J082j170M91p4n96N62J54k54M85p05K0L28k59J58K9l53R4m5P97l40
$$ -1002 -260 822 -348 143 69 -527 35 189 -65 420 -285 -265 63 -196 -38 -9 -362 -268 -313 484 144
4540A44p65J218j096q0Q41k87m1L51p67O08m66L36L77o77K45K78o47Q42m98J62
$$ 144 -621 597 -499 -579 262 -25 -66 285 -482 126 -340 -4 373 -304 -59 219 -428 414 -84 78
4560G8k52j74J027p53j70P80p10k37J071p12j75P54n57o3P9J77J66p08N90N7m76
$$ 78 -174 -348 679 -74 -244 536 -174 -411 660 -52 -227 527 -30 -93 -14 163 329 -379 211 268 -208
4581b08P06k49k65J64k86O00k10n01P13o21j8J193j164L97J44n32J45M0K81l2
$$ -208 498 249 -16 148 -138 462 252 -249 464 -157 -175 1018 -146 251 395 -137 8 48 329 297
4601B97n15L46L28o34N35n26j8M37o57M81L62q05P08m68l0L20j00J29j98j69L70
$$ 297 -218 128 456 -178 357 -169 -187 250 -407 74 436 -369 339 -129 -159 161 61 190 -8 -177 193
$$ [...]
8191A93
##END NTUPLES=NMR FID
##END=
