##TITLE=1H_84-2023
 CDCl3
 8 sc, 
 25.9.2023
##JCAMPDX= 6.0         $$ Bruker NMR JCAMP-DX V2.0
##DATA TYPE= NMR FID
##DATA CLASS= NTUPLES
##ORIGIN= UXNMR, Bruker Analytische Messtechnik GmbH
##OWNER= root
$$ XWIN-NMR		Version 3.5
$$ Mon Sep 25 14:17:44 2023 Russian Standard Time (UT+4h)  she@DPX200
##.OBSERVE FREQUENCY= 200.13135
##.OBSERVE NUCLEUS= ^1H
##.DELAY= (6, 6)
##.ACQUISITION MODE= SIMULTANEOUS
##.ACQUISITION SCHEME= undefined
##.AVERAGES= 8
##.DIGITISER RES= 18
##SPECTROMETER/DATA SYSTEM= spect
##.PULSE SEQUENCE= zg30
##.SOLVENT NAME= CDCl3
##.SHIFT REFERENCE= (INTERNAL, CDCl3, 0, 15.7039)
##AUDIT TRAIL= $$ (NUMBER, WHEN, WHO, WHERE, WHAT)
$$ ##TITLE= Audit trail, XWIN-NMR		Version 3.5
$$ ##JCAMPDX= 5.01
$$ ##ORIGIN= Bruker BioSpin GmbH
$$ ##OWNER= she
$$ F:/spectra/data/she/nmr/H-F/1/audita.txt
$$ ##AUDIT TRAIL=  $$ (NUMBER, WHEN, WHO, WHERE, WHAT)
(   1,<2023-09-25 14:16:50.04 +0400>,<she>,<DPX200>,
      <created by zg, POWCHK disabled, PULCHK disabled
       configuration hash MD5:
       00 E9 B6 7A A2 85 ED C7 34 08 36 98 17 FE 4E 26
       data hash MD5: 16K
       75 63 70 58 9F F1 21 D5 44 23 01 83 BE E5 53 87>)
$$ ##END=
$$ 
$$ hash MD5
$$ DA 67 F4 90 D8 43 76 A5 05 93 35 7C 89 FF 14 74
##$RELAX= 
##$RELAX= 
##$RELAX= 
##$RELAX= 
##$RELAX= 
##$RELAX= 
$$ Bruker specific parameters
$$ --------------------------
##$DU= <F:/spectra>
##$EXPNO= 1
##$NAME= <H-F>
##$PROCNO= 1
##$TYPE= <nmr>
##$USER= <she>
##$AMP= (0..31)
100 100 100 100 100 100 100 100 100 100 100 100 100 100 100 100 100 100 
100 100 100 100 100 100 100 100 100 100 100 100 100 100 
##$AQSEQ= 0
##$AQ_mod= 1
##$AUNM= <au_zg>
##$AUTOPOS= <>
##$BF1= 200.13
##$BF2= 200.13
##$BF3= 200.13
##$BF4= 200.13
##$BF5= 200.13
##$BF6= 200.13
##$BF7= 200.13
##$BF8= 200.13
##$BYTORDA= 1
##$CFDGTYP= 0
##$CFRGTYP= 5
##$CHEMSTR= <none>
##$CNST= (0..31)
1 1 145 1 1 1 1 1 1 1 1 1 1 1 1 1 1 1 1 1 1 1 1 1 1 1 1 1 1 1 1 1 
##$CPDPRG= <>
##$CPDPRG1= <>
##$CPDPRG2= <>
##$CPDPRG3= <>
##$CPDPRG4= <mlev>
##$CPDPRG5= <mlev>
##$CPDPRG6= <mlev>
##$CPDPRG7= <mlev>
##$CPDPRG8= <mlev>
##$CPDPRGB= <>
##$CPDPRGT= <>
##$D= (0..31)
0 1.2 0 0 0 0 0 0 0 0.06 0 0.03 0 0 0 0 0.0002 0 0 0 0 0 0 0 0 0 0 0 0 
0 0 0 
##$DATE= 1695637009
##$DBL= (0..7)
120 120 120 120 120 120 120 120 
##$DBP= (0..7)
150 150 150 150 150 150 150 150 
##$DBP07= 0
##$DBPNAM0= <>
##$DBPNAM1= <>
##$DBPNAM2= <>
##$DBPNAM3= <>
##$DBPNAM4= <>
##$DBPNAM5= <>
##$DBPNAM6= <>
##$DBPNAM7= <>
##$DBPOAL= (0..7)
0.5 0.5 0.5 0.5 0.5 0.5 0.5 0.5 
##$DBPOFFS= (0..7)
0 0 0 0 0 0 0 0 
##$DE= 6
##$DECBNUC= <off>
##$DECIM= 32
##$DECNUC= <off>
##$DECSTAT= 4
##$DIGMOD= 1
##$DIGTYP= 9
##$DL= (0..7)
0 120 120 120 120 120 120 120 
##$DP= (0..7)
150 150 150 150 150 150 150 150 
##$DP07= 0
##$DPNAME0= <>
##$DPNAME1= <>
##$DPNAME2= <>
##$DPNAME3= <>
##$DPNAME4= <>
##$DPNAME5= <>
##$DPNAME6= <>
##$DPNAME7= <>
##$DPOAL= (0..7)
0.5 0.5 0.5 0.5 0.5 0.5 0.5 0.5 
##$DPOFFS= (0..7)
0 0 0 0 0 0 0 0 
##$DQDMODE= 0
##$DR= 18
##$DS= 0
##$DSLIST= <SSSSSSSSSSSSSSS>
$$ [...]
##$SUBNAM2= <"">
##$SUBNAM3= <"">
##$SUBNAM4= <"">
##$SUBNAM5= <"">
##$SUBNAM6= <"">
##$SUBNAM7= <"">
##$SUBNAM8= <"">
##$SUBNAM9= <"">
##$SW= 18.05172834244
##$SWIBOX= (0..15)
0 0 2 0 0 0 0 0 0 0 0 0 0 0 0 0 
##$SW_h= 3612.71676300578
##$TD= 16384
##$TD0= 1
##$TE= 0
##$TE2= 300
##$TE3= 300
##$TEG= 300
##$TL= (0..7)
0 120 120 120 120 120 120 120 
##$TP= (0..7)
150 150 150 150 150 150 150 150 
##$TP07= 0
##$TPNAME0= <>
##$TPNAME1= <>
##$TPNAME2= <>
##$TPNAME3= <>
##$TPNAME4= <>
##$TPNAME5= <>
##$TPNAME6= <>
##$TPNAME7= <>
##$TPOAL= (0..7)
0.5 0.5 0.5 0.5 0.5 0.5 0.5 0.5 
##$TPOFFS= (0..7)
0 0 0 0 0 0 0 0 
##$TUNHIN= 0
##$TUNHOUT= 0
##$TUNXOUT= 0
##$USERA1= <user>
##$USERA2= <user>
##$USERA3= <user>
##$USERA4= <user>
##$USERA5= <user>
##$V9= 5
##$VALIST= <valist>
##$VCLIST= <CCCCCCCCCCCCCCC>
##$VD= 0
##$VDLIST= <DDDDDDDDDDDDDDD>
##$VPLIST= <PPPPPPPPPPPPPPP>
##$VTLIST= <TTTTTTTTTTTTTTT>
##$WBST= 1024
##$WBSW= 4
##$XGAIN= (0..3)
0 0 0 0 
##$XL= 0
##$YL= 0
##$YMAX_a= 212842
##$YMIN_a= -175718
##$ZGOPTNS= <>
##$ZL1= 120
##$ZL2= 120
##$ZL3= 120
##$ZL4= 120
##$ABSF1= 10
##$ABSF2= 0
##$ABSG= 5
##$ABSL= 3
##$ALPHA= 0
##$AQORDER= 0
##$ASSFAC= 0
##$ASSFACI= 0
##$ASSFACX= 0
##$ASSWID= 0
##$AUNMP= <proc_1d>
##$AZFE= 0.1
##$AZFW= 0.1
##$BCFW= 1
##$BC_mod= 2
##$BYTORDP= 1
##$COROFFS= 0
##$CY= 11.3945322036743
##$DATMOD= 1
##$DC= 2
##$DFILT= <>
##$DTYPP= 0
##$F1P= 15.7292609196834
##$F2P= 12.9074282941183
##$FCOR= 0.5
##$FTSIZE= 0
##$FT_mod= 4
##$GAMMA= 1
##$GB= 0.15
##$INTBC= 1
##$INTSCL= 1
##$ISEN= 128
##$LB= 0.24
##$LEV0= 0
##$LPBIN= 0
##$MAXI= 10000
##$MC2= 0
##$MEAN= 0
##$ME_mod= 0
##$MI= 1.114404
##$NCOEF= 0
##$NC_proc= 0
##$NLEV= 6
##$NOISF1= 3.799351
##$NOISF2= 2.8
##$NSP= 1
##$NTH_PI= 0
##$NZP= 0
##$OFFSET= 15.70392
##$PC= 1
##$PHC0= -21709.97
##$PHC1= 9.852709
##$PH_mod= 1
##$PKNL= yes
##$PPARMOD= 0
##$PSCAL= 0
##$PSIGN= 0
##$REVERSE= no
##$SF= 200.130013532006
##$SI= 16384
##$SIGF1= 3
##$SIGF2= 2
##$SINO= 400
##$SIOLD= 16384
##$SREGLST= <1H.CDCl3>
##$SSB= 0
##$STSI= 0
##$STSR= 0
##$SW_p= 3612.71676300578
##$SYMM= 0
##$S_DEV= 0
##$TDeff= 0
##$TDoff= 0
##$TI= <>
##$TILT= no
##$TM1= 0
##$TM2= 0
##$TOPLEV= 0
##$USERP1= <user>
##$USERP2= <user>
##$USERP3= <user>
##$USERP4= <user>
##$USERP5= <user>
##$WDW= 1
##$XDIM= 8192
##$YMAX_p= 0
##$YMIN_p= 0
$$ End of Bruker specific parameters
$$ ---------------------------------
##NTUPLES= NMR FID
##VAR_NAME=  TIME,          FID/REAL,        FID/IMAG
##SYMBOL=    X,             R,               I
##VAR_TYPE=  INDEPENDENT,   DEPENDENT,       DEPENDENT
##VAR_FORM=  AFFN,          ASDF,            ASDF
##VAR_DIM=   8192,          8192,            8192
##UNITS=     SECONDS,       ARBITRARY UNITS, ARBITRARY UNITS
##FACTOR=    0.0002768,     1,               1
##FIRST=     0,             0,               0
##LAST=      2.2672688,     0,               0
##MIN=       0,             -175718,         0
##MAX=       2.2672688,     212842,          0
$$ Real data points
##PAGE= N=1
##DATA TABLE= (X++(R..R)), XYDATA
$$ plain form
0 0 0 0 0 0 0 0 0 0 0 0 0 0 0 0 0 0 3 -8 8 -8 8 -8 8 -16 16 -16 23 -24 25 -32 34 -40 45 -52 56 -64 72 -80 90
39 90 -100 109 -124 135 -150 167 -183 201 -222 243 -267 297 -328 360 -399 439 -489 545 -611 687
59 687 -779 891 -1035 1217 -1467 1820 -2361 3285 -5116 10096 -50046 -121637 69777 86525
73 86525 88258 212842 177846 54495 50347 75312 3749 -31698 42861 -52181 -139771 11041
85 11041 18498 -34241 85441 26516 -107250 -47421 -5073 -30251 12003 74530 21102 -40119
97 -40119 63307 78754 12770 115847 90281 -49624 18968 36260 -53166 -28977 -37686 -137316
109 -137316 -167567 -88724 -49651 -62584 38051 60536 -48240 23073 74051 -13715 44019
120 44019 72474 -25170 -11661 43532 26054 5078 32564 12887 -80976 -40752 19958 -55501
$$ packed form
0@%%%%%%%%%%%%%%%%Lj1J6j6J6j6J6k4L2l2L9m7M9n7O6p4Q5r7J08j20J36j52J70
39I0j90K09k33K59k85L17l50L84m23M65n10N64o25O88p59Q38r28J034j156J298
59F87j466J670j926K252k684L287m181N646q401J5212o0142p1591J91414J6748
73H6525J733J24584l4996j23351m148K4965p1563l5447P4559r5042q7590J50812
85A1041P457n2739J19682n8925j33766N9829M2348k5178M2254O2527n3428o1221
97d0119J03426J5447o5984J03077k5566j39905O8592J7292q9426K4189q709r9630
109a37316l0251P8843L9073j2933J00635K2485j08776P1313N0978q7766N7734
120D4019K8455r7644J3509N5193j7478k0976K7486j9677r3863M0224O0710p5459
$$ plain form
132 -55501 -10729 37910 -71590 -55088 13143 -22316 3619 63099 55574 31811 69669 106830
144 106830 43563 38318 64273 -45007 -55984 13959 -44489 -37464 18660 -33280 -55517 -20542
156 -20542 -11887 -29984 -14570 25077 -20123 -26747 44544 -2263 -20390 42581 -10580 -30714
168 -30714 31470 19713 6569 25739 18533 -22823 -44368 -9085 -33704 -56177 11268 -10677
180 -10677 -36682 35634 19590 -6050 36450 21188 -789 13983 29532 21692 1134 26690
192 26690 7819 -39727 5033 -1619 -39989 12385 6544 -23964 8551 4971 -10843 -7129 98
205 98 2360 -14115 16356 31725 -5024 25426 27437 -22210 5710 6310 -23797 -585 -292 -10671
219 -10671 -9746 -8905 -1703 -23097 -13220 7556 -23794 -153 23311 -11160 10723 18647 -10120
$$ packed form
132e5501M4772M8639j09500J6502O8231l5459K5935N9480p525k3763L7858L7161
144A06830o3267n245K5955j09280j0977O9943n8448P025N6124n1940k2237L4975
156b0542Q655j8097J5414L9647m5200o624P1291m6807j8127O2971n3161k0134
168c0714O2184j1757j3144J9170p206m1356k1545L5283k4619k2473O7445k1945
180a0677k6005P2316j6044k5640M2500j5262k1977J4772J5549p840k0558K5556
192B6690j8871m7546M4760o652l8370N2374n841l0508L2515l580j5814L714P227
205I8K262j6475L0471J5369l6749L0450K011m9647K7920O00l0107K3212K93j0379
219a0671R25Q41P202k1394R877K0776l1350K3641K3464l4471K1883P924k8767
$$ plain form
232 -10120 4184 4660 -90 4327 1193 13930 -2522 -7164 14228 -15808 -11287 13634 -15010
245 -15010 371 16573 -3451 9028 6161 -1193 2586 -9009 4232 -1040 -11333 13680 -4679
258 -4679 -9860 13039 -11730 -7500 6138 -12126 -30 -297 -5467 4725 -7709 2723 6483
271 6483 -7726 15248 8841 -719 20995 2686 364 10446 -10175 -2833 -5016 -14515 -723
284 -723 -12295 -6514 4350 -11409 5570 6251 -6689 12587 1454 -2268 10855 -6499 1997
297 1997 4487 -7902 7430 -2117 -3807 8854 -8151 1332 5315 -9974 6457 -170 -5705 8972
311 8972 -5972 328 6390 -8056 7631 3125 -3223 11709 -3489 -989 4809 -13298 -952
324 -952 -4061 -12743 4379 -6720 -3462 6351 -8835 3120 2306 -6511 10902 2196 4336 16062
$$ packed form
232a0120J4304M76m750M417l134J2737j6452m642K1392l0036M521K4921k8644
245a5010J5381J6202k0024J2479k867p354L779j1595J3241n272j0293K5013j8359
258d679n181K2899k4769M230J3638j8264J2096k67n170J0192j2434J0432L760
271F483j4209K2974o407r560K1714j8309k322J0082k0621P342k183r499J3792
284g23j1572N781J0864j5759J6979O81j2940J9276j1133l722J3123j7354Q496
297A997K490j2389J5332r547j690J2661j7005R483L983j5289J6431o627n535J4677
311H972j4944O300O062j4446J5687m506o348J4932j5198K500N798j8107J2346
324i52l109q682J7122j1099L258R813j5186J1955q14q817J7413q706K140J1726
$$ plain form
338 16062 -286 8172 6185 -8699 4295 -5049 -7085 5349 -7293 1669 2617 -10390 3246
351 3246 -6356 -9466 5577 -7500 1496 8672 -5621 6577 741 -6648 5124 -4485 3413 9285
365 9285 -1706 12312 2398 -8835 4525 -12533 -11234 2008 -8961 4615 9306 3129 13403
378 13403 2813 3713 6197 -8329 5887 1389 -10357 7418 -6955 -14397 -271 -13254 -7677
391 -7677 1756 -1133 10045 5420 7786 10102 -9151 1043 -1520 -17162 6792 4611 -2951 17430
405 17430 7671 1539 5028 -3651 -2441 -9895 -5871 1437 -15651 -2041 1356 -21005 -1137 1606
419 1606 -11965 11145 13699 7827 14785 10243 6450 -6881 -7004 1259 -17229 -1588 15197 -7615
433 -7615 8951 16284 -9711 487 3381 -8507 -2710 1870 6343 -1845 1540 14512 -9253 -3603
$$ packed form
338A6062j6348Q458j987j4884J2994r344k036J2434j2642Q962R48j3007J3636
351C246r602l110J5043j3077Q996P176j4293J2198n836p389J1772r609P898N872
365I285j0991J4018r914j1233J3360j7058J299J3242j0969J3576M691o177J0274
378A3403j0590R00K484j4526J4216m498j1746J7775j4373p442J4126j2983N577
391g677R433k889J1178m625K366K316j9253J0194k563j5642K3954k181p562K0381
405A7430r759o132L489q679J210p454M024P308j7088J3610L397k2361J9868K743
419A606j3571K3110K554n872O958m542l793j3331j23Q263j8488J5641J6785k2812
433g615J6566P333k5995J0198K894j1888N797M580M473q188L385J2972k3765N650
$$ plain form
447 -3603 15959 -10255 1443 21708 -3625 -1734 3441 -16038 -22227 -16994 -9674 -16748 -9414 14760
461 14760 -3698 -1510 25915 -3074 -6739 16235 -5965 -5761 15669 9056 407 1887 5011 -12614
475 -12614 -15819 12095 -4597 -12438 19943 -3101 -16165 13502 -3662 -16982 1271 399 -4916
488 -4916 7063 27445 16472 1232 22227 2142 -19366 17881 7406 -14726 13341 2606
500 2606 -19102 -2910 826 -14579 -17961 -685 -5746 -16655 19946 18227 -14046 12230 4871
513 4871 -26443 5357 14223 -8198 1381 7710 -10137 -18967 1515 -1739 -28667 -2743 5306
526 5306 -23429 12539 27970 -8623 4980 12735 -14002 -4271 19960 14916 517 15648 17022
539 17022 -15105 5233 22030 -19088 -6187 13654 -19967 -6251 18523 -4365 -13545 -1231
$$ packed form
447c603J9562k6214J1698K0265k5333J891N175j9479o189N233P320p074P334K4174
461A4760j8458K188K7425k8989l665K2974k2200K04K1430o613q649J480L124j7625
475a2614l205K7914j6692p841L2381k3044j3064K9667j7164j3320J8253q72n315
488d916J1979K0382j0973j5240K0995k0085k1508L7247j0475k2132K8067j0735
500B606k1708J6192L736j5405l382J7276n061j0909L6601j719l2273K6276p359
513D871l1314L1800Q866k2421R579O329j7847q830K0482l254k6928K5924Q049
526E306k8735L5968J5431l6593J3603P755k6737R731K4231n044j4399J5131J374
539A7022l2127K0338J6797m1118J2901J9841l3621J3716K4774k2888r180J2314
$$ plain form
551 -1231 -5979 -19291 3802 26487 -2735 4124 26619 -13175 -8355 23104 -9278 -14078 9941
564 9941 -5520 -13375 6983 10676 -15590 -15433 3388 -23610 -18097 23095 -3389 -11794 20563
577 20563 -4195 -15517 14522 8744 -8163 2982 13093 -6428 -6748 20374 -5280 -23768 9615
590 9615 -8471 -20410 22175 15191 -4577 15689 12057 -8284 -1761 14459 -1529 -13931 13859
603 13859 3247 -16580 19143 10709 -19010 7537 4926 -16264 3853 12196 -6203 -11422 1236
616 1236 -8757 -24473 4961 7576 -18432 12403 17944 -10923 12218 17429 -10966 -5806 2843
629 2843 -8994 -12668 6449 7162 -15091 3227 11354 -17829 4196 18719 -11456 1390 13991
642 13991 -8093 -6238 5696 -3176 -14334 -1479 8115 -9481 5037 22205 -7245 -828 15695
$$ packed form
551a231m748j3312K3093K2685k9222O859K2495l9794M820L1459l2382m800K4019
564I941j5461p855K0358L693k6266J57J8821k6998N513M1192k6484q405L2357
577B0563k4758j1322L0039n778j6907J1145J0111j9521l20K7122k5654j8488L3383
590I615j8086j1939M2585o984j9768K0266l632k0341O523J6220j5988j2402K7790
603A3859j0612j9827L5723q434k9719K6547k611k1190K0117Q343j8399n219J2658
616A236r993j5716K9434K615k6008L0835N541k8867K3141N211k8395N160Q649
629B843j1837l674J9117P13k2253J8318Q127k9183K2025J4523l0175J2846J2601
642A3991k2084J855J1934q872j1158J2855R594j7596J4518J7168k9450O417J6523
$$ plain form
655 15695 -12328 -7048 10450 -4823 -6137 6671 6075 -3830 2483 14046 -6068 -5381 15426 -7339
669 -7339 -7668 13634 -8421 -12052 3915 -6716 -9763 909 5496 -2254 -1373 13508 -1225 -8535
683 -8535 12016 -5344 -13300 9666 -2555 -7877 8733 2735 -3252 1813 5929 -48 -5227 8439
697 8439 938 -10506 9309 503 -12353 7153 106 -8367 5578 3936 -840 587 3415 670
711 670 -8364 2379 1308 -12889 3265 2541 -10695 6092 4728 -4999 4446 3123 315 1062 3009
726 3009 5346 -4740 1392 6104 -8415 2916 6653 -8542 2319 2743 -6456 1178 219 -1709
740 -1709 -2229 -2798 2586 -4464 -1395 7173 -5783 -20 7312 -5276 2826 5977 -2925 2094 -312
755 -312 -859 496 -2295 4411 -861 -2834 6676 -3266 -2109 5835 -5612 -1352 2261 -4493 1288
$$ packed form
655A5695k8023N280J7498j5273j314J2808n96r905O313J1563k0114O87K0807k2765
669g339l29K1302k2055l631J5967j0631l047J0672M587p750Q81J4881j4733p310
683h535K0551j7360p956K2966j2221n322J6610n998n987N065M116n977n179J3666
697H439p501j1444J9815q806j2856J9506p047q473J3945j642m776J427K828k745
711F70r034J0743j071j4197J6154p24j3236J6787j364r727R445j323k808P47J947
726C009K337j0086O132M712j4519J1331L737j5195J0861M24r199P634r59j928
740a709n20n69N384p050L069Q568j2956N763P332j2588Q102L151q902N019k406
755c12n47J355k791O706n272j973R510r942J157P944j1447M260L613o754N781
$$ plain form
770 1288 -60 -1179 1084 -5005 669 -1075 -5527 4641 -1400 -3181 5641 -2927 -893 2957 -3737
785 -3737 1918 861 -67 5479 -253 3203 3528 -4122 3414 -13 -3783 5157 -829 3 4080 -3390
801 -3390 792 -1156 -4858 1551 -3366 -714 3833 -3282 2910 1093 -4949 2490 -2611 -2657 4247 -1793
817 -1793 2882 3286 -2451 3258 -2044 -3301 2647 -3552 2030 4139 -1932 4691 -198 -3453 2075
832 2075 -4412 -1129 2056 -3059 3671 321 -3054 2109 -5335 -3204 739 -4633 2998 2557 -637
847 -637 5817 -996 -1135 2240 -4061 2091 1667 -687 6501 492 275 3869 -4950 -690 80 -4228
863 -4228 3190 252 -919 3090 -4012 -1425 -2046 -6331 2059 -1181 -565 6799 -273 1605 3637 -4351
879 -4351 411 -1137 -2082 3944 156 3294 3664 -3375 2584 -1991 -4655 3791 -1902 -334 5695 -1355
$$ packed form
770A288j348j119K263o089N674j744m452J0168o041j781Q822q568K034L850o694
785c737N655j057r28N546n732L456L25p650P536l427l770Q940n986Q32M077p470
801c390M182j948l702O409m917K652M547p115O192j817o042P439n101m6O904o040
817a793M675M04n737N709n302j257N948o199N582K109o071O623m889l255N528
832B075o487L283L185n115O730l350l375N163p444K131L943n372P631m41l194
847f37O454o813j39L375o301O152m24k354P188o009k17L594q819M260P70m308
863d228P418k938j171M009p102K587o21m285Q390l240O16P364p072J878K032p988
879d351M762j548r45O026l788L138L70p039N959m575k664Q446n693J568O029p050
$$ plain form
895 -1355 948 166 -3905 -707 -4425 -540 2691 -2495 4653 1958 -6039 1467 -4993 -7184 1341
910 1341 -2948 -357 2882 406 3107 -1204 675 2492 -4993 3559 4906 -2174 7644 3624 -3884
925 -3884 2316 -2299 -3189 1022 568 3222 -528 1575 3737 -6475 -709 1148 -9474 684 3813
940 3813 -2657 5863 4929 -70 365 -1228 824 -2245 790 6506 -4108 -104 4921 -8093 -1921
955 -1921 2429 -8154 -1767 2278 -670 1174 1548 2228 -5396 -5342 2516 -5935 -1411 9592 -3261
970 -3261 -333 6958 -4292 -2078 2647 -2174 -3127 -564 4769 -17 -295 8802 -3343 -6027 7854
985 7854 -2049 -847 12066 2281 -590 4237 440 -3310 -2225 2428 -3767 -6702 6606 -817 -6169
1000 -6169 7653 -3171 -10853 1849 -2571 -5269 3854 3889 -1172 -2907 3703 -497 -6306 7493
$$ packed form
895a355K303p82m071L198l718L885L231n186P148k695p997P506o460k191Q525
910A341m289K591L239k476K701m311J879J817p485Q552J347p080R818m020p508
925c884O200m615q90M211m54K654l750K103K162j0212N766J857j0622J0158L129
940C813o470Q520r34m999M35j593K052l069L035N716j0614M004N025j3014O172
955a921M350j0583O387M045k948J844L74O80p624N4P858q451M524J1003j2853
970c261K928P291j1250K214M725m821r53K563N333m786k78R097j2145k684J3881
985G854r903J202J2913r785k871M827l797l750J085M653o195k935J3308p423n352
1000f169J3822j0824p682J2702m420k698R123L5n061j735O610m200n809J3799
$$ plain form
1014 7493 2020 -7959 7996 3779 -6269 5746 1309 -8639 -3203 533 -1825 -2438 6877 3850
1028 3850 -7668 4333 3528 -9413 5605 6415 -7532 3814 6273 -3174 871 4114 -1450 -7534
1042 -7534 1174 3797 -6974 4681 8618 -9655 502 5678 -8643 -28 6863 -2190 -1677 4650
1056 4650 2765 -4651 1111 4882 -9891 -3037 6896 -8440 -1492 8753 -6807 -4984 3331 -4259
1070 -4259 -5049 2903 4800 -3109 1100 9483 -4018 -1420 11614 -4118 -3778 10020 -2047 -2617
1084 -2617 7459 1538 -4880 -1089 1978 -6120 -4356 8159 -3296 -6387 8731 -3465 -7409 7870
1098 7870 -724 -5770 4391 2324 -3230 290 6158 -2203 -6479 5088 -2738 -8960 7974 1220
1112 1220 -7708 5617 908 -6603 2285 3839 -2000 -1498 5191 1375 -5021 7372 3619 -8341
$$ packed form
1014G493n473r979J5955m217j0048J2015m437r948N436L736k358o13R315l027
1028C850j1518J2001q05j2941J5018Q10j3947J1346K459r447M045L243n564o084
1042g534Q708K623j0771J1655L937j8273J0157N176j4321Q615O891r053N13O327
1056D650j885p416N762L771j4773O854R933j5336O948J0245j5560J823Q315p590
1070d259p90P952J897p909M209Q383j3501K598J3034j5732L40J3798j2067n70
1084b617J0076n921o418L791L067q098J764J2515j1455l091J5118j2196l944J5279
1098G870q594n046J0161k067n554L520N868q361m276J1567p826o222J6934o754
1112A220q928J3325m709p511Q888J554n839N02O689l816o396J2393l753j1960
$$ plain form
1126 -8341 4851 2196 -8473 3921 4198 -5298 -278 1826 -2884 -4353 3086 2523 -6563 3867
1140 3867 5501 -6454 5184 7447 -6090 2118 4850 -3830 206 4083 427 -4436 330 2539
1154 2539 -7475 -354 4970 -8804 -1799 4445 -7087 -790 4623 -3129 -2189 2004 1734 -1917 1665
1169 1665 6269 -4049 -1431 7027 -4408 -1353 6618 -4266 -2690 3448 -1417 -1093 2016 2393 -2175
1184 -2175 -2051 5020 -1887 -2536 7111 -2858 -4061 5904 -1511 -1781 4467 -645 -2406 -935 1173 -1122
1200 -1122 -3064 3638 -1864 -5685 4669 -666 -3718 5616 -167 -2341 3442 1400 683 901 1988
1215 1988 48 -4383 2056 802 -4871 3569 241 -5311 2577 -448 -3410 1057 -1009 -1749 -1714 291
1231 291 1784 -2565 1825 2371 -4283 2743 3254 -2285 4237 2397 -1693 1811 67 -245 -877 -1042
$$ packed form
1126h341J3192k655j0669J2394K77r496N020K104m710j469P439n63r086J0430
1140C867J634j1955J1638K263j3537Q208K732q680M036L877l656m863M766K209
1154B539j0014P121N324j3774P005O244j1532O297N413p752R40M193k70l651L582
1169A665M604j0318K618Q458j1435L055P971j0884J576O138m865L24L109L77m568
1184b175J24P071o907o49R647r969j203R965p415k70O248n112j761J471K108k295
1200a122j942O702n502l821J0354n335l052R334n783k174N783k042p17K18J087
1215A988j940m431O439j254n673Q440l328n552P888l025k962M467k066p40L5K005
1231B91J493m349M390N46o654P026N11n539O522j840m090L504j744l12o32j65
$$ plain form
1247 -1042 1674 -2779 488 3908 -2786 1138 2308 -4309 437 831 -1937 1537 -243 135 -38 -1627
1263 -1627 1853 -1396 -1181 3362 -2085 498 3778 -2466 838 660 -3110 -38 -1043 29 1685
1278 1685 -819 2730 -91 -2044 2194 -2452 -1883 2086 -2259 211 1672 -1680 1143 -1059 -1382
1293 -1382 615 -2124 1192 1351 -1310 2988 -644 -1809 1741 -2207 -362 1717 -795 2922 1492
1308 1492 527 2727 -1224 394 748 -2478 1508 499 -1411 2281 -1482 -1347 320 -3265 -300 -460
1324 -460 -1544 2086 -754 -175 1058 -3096 -210 -383 -2219 2346 673 1070 3508 -410 1400 780
1340 780 -2025 1343 -798 -369 2510 -1706 452 523 -3256 87 -1539 -1793 1616 -823 1201 2012
1356 2012 -1323 1244 -1014 -2040 1312 -1677 479 2474 -1232 1769 587 -1975 711 -1816 -538
$$ packed form
1247a042K716m453L267L420o694L924J170o617M746L94k768L474j780L78j73j589
1263a627L480l249K15M543n447K583L280o244L304j78l770L072j005J072J656
1278A685k504L549k821j953M238m646N69L969m345K470J461l352K823k202l23
1293a382J997k739L316J59k661M298l632j165L550l948J845K079k512L717j430
1308A492r65K200l951J618L54l226L986j009j910L692l763J35J667l585K965j60
1324d60j084L630k840N79J233m154K886j73j836M565j673L97K438l918J810o20
1340G80k805L368k141M29K879m216K158P1l779L343j626k54L409k439K024Q11
1356B012l335K567k258j026L352k989K156J995l706L001j182k562K686k527J278
$$ plain form
1371 -538 1406 -1216 1855 862 -1121 1800 -1626 -982 1699 -1441 1674 2236 -782 1967 -561 -1646
1387 -1646 -182 -2883 -235 -31 -1902 2118 -237 -1105 2067 -2232 -668 1134 -1437 1794 1583 1023
1403 1023 2402 -449 651 329 -2530 1726 -29 -1577 2780 -1182 -1469 497 -2917 -1665 -1380 -2053
1419 -2053 441 -1035 1139 1504 -1964 1398 30 -2659 2827 848 -98 3093 412 368 485 -974
1435 -974 253 -1974 -70 1459 -1849 2402 2284 -2188 1729 443 -2585 1533 741 368 1017 -160
1451 -160 633 -1977 -1083 1077 -3421 -154 2208 -2691 1780 2162 -2324 217 -557 -2009 -764 24
1467 24 1792 -553 370 3124 -2160 26 3539 -2194 322 2281 -2106 37 895 -1236 -1915 -1873 -199
1484 -199 -2473 -950 3940 -765 -197 4233 -2057 -1055 2863 -1329 -474 1831 760 -79 420 2556
$$ packed form
1371e38J944k622L071r93j983K921l426O44K681l140L115N62l018K749k528j085
1387a646J464k701K648K04j871M020k355q68L172m299J564J802k571L231k11n60
1403A023J379k851J100l22k859M256j755j548M357l962k87J966l414J252K85o73
1419b053K494j476K174L65l468L362j368k689N486j979r46L191k681m4J17j459
1435i74J227k227J904J529l308M251j18m472L917j286l028M118p92l73O49j177
1451a60P93k610Q94K160m498L267K362m899M471L82m486K541p74j452J245P88
1467B4J768k345R23K754n284K186L513n733K516J959m387K143Q58k131o79M2J674
1484a99k274J523M890m705N68M430o290J002L918m192Q55K305j071q39M99K136
$$ plain form
1500 2556 -740 -1899 3097 -1652 -2520 3902 -806 -2231 2492 -1131 -2613 212 77 -976 -902 2484
1516 2484 72 -2772 2707 -972 -4026 2661 -676 -3478 2683 880 -1360 1366 1699 -363 -1840
1531 -1840 1637 423 -3201 3286 1712 -3538 2973 1562 -2959 2398 2420 -1305 475 1126 -455 -2603
1547 -2603 869 158 -5447 -128 1244 -4571 2294 3589 -2335 1527 2347 -1437 -285 2171 795
1562 795 -2596 241 1939 -3750 1039 3909 -3467 11 3068 -2735 141 2962 -1005 -2454 -742
1577 -742 -731 -3549 -314 3330 -2868 -621 4097 -2236 142 5193 -935 -1344 1939 -764 -1803 877
1593 877 2271 -2372 -1726 2624 -2318 -894 5421 -970 -1979 3214 -1410 -1797 2406 870 -1822 -747
1609 -747 1274 -1345 -1457 4239 -1016 -3687 2596 -1921 -3555 2907 -342 -3056 245 206 -1362 -52
$$ packed form
1500B556l296j159M996m749q68O422m708j425M723l623j482K825j35j053P4L386
1516B484k412k844N479l679l054O687l337k802O161j803k240K726L33k062j477
1531a840L477j214l624O487j574n250O511j411m521N357K2l725J780O51j581k148
1547b603L472p11n605N319J372n815O865J295n924L862Q20l784J152K456j376
1562G95l391K837J698n689M789K870p376L478L057n803K876K821l967j449J712
1577g42J1k818L235L644o198K247M718o333K378N051o128m09L283k703j039K680
1593H77J394m643O46M350m942J424O315o391j009N193m624l87M203j536k692J075
1609g47K021k619j12N696n255k671O283m517j634O462l249k714L301l9j568J310
$$ plain form
1625 -52 3431 599 -2230 3079 635 -2405 4501 1641 -2962 1708 183 -2458 853 1734 -1030 -2253
1641 -2253 625 -263 -3246 2409 1438 -4031 1157 840 -3242 2209 2611 -1137 306 1179 241 -736 2167
1658 2167 1933 -3014 376 1630 -3614 1255 2377 -3231 -446 553 -1604 -344 1471 910 -1394 217
1674 217 1691 -2150 418 3078 -2993 -937 1667 -2658 -283 2187 -805 -1328 -566 120 -1246 272
1690 272 3085 -970 -703 2942 -1402 -7 3464 -873 -737 1609 -268 -33 752 1388 -1045 -2121
1706 -2121 993 -1477 -1675 2695 -1256 -1934 1543 -1180 -1129 1326 0 -240 -89 1295 548 -549 2322
1723 2322 241 -2060 1651 -659 -1658 2163 -38 -976 453 -583 -316 -472 251 483 -1754 1175
1739 1175 733 -1763 1662 497 -2384 660 -473 -1142 923 144 377 -549 -37 716 -1387 467 1127
$$ packed form
1625e2L483k832k829N309k444l040O906k860m603M670j525k641L311Q81k764j223
1641b253K878q88k983N655r71n469N188l17m082N451M02l748J443Q73r38r77K903
1658B167k34m947L390J254n244M869J122n608K785R99k157J260J815n61k304J611
1674B17J474l841K568K660o071K056K604m325K375K470k992n23P62O86j366J518
1690B72K813m055K67L645m344J395L471m337J36K346j877K35P85O36k433j076
1706b121L114k470j98M370l951o78L477k723N1K455j326k40J51J384p47j097K871
1723B322k081k301L711k310r99L821k201r38J429j036K67j56P23K32k237K929
1739A175m42k496L425j165k881L044j133o69K065p79K33r26N12P53k103J854O60
$$ plain form
1756 1127 -1716 1326 1614 -841 1752 848 -590 635 -397 556 42 -285 919 -1780 -913 386
1772 386 -2533 -654 622 -1468 848 632 -377 1105 -504 26 -223 -973 814 -241 -273 1769 -740
1789 -740 133 1123 -1168 367 319 -657 604 -409 -10 52 -1315 337 -319 -853 1547 212 600 1855
1807 1855 -458 -91 6 -1516 -624 -1229 -833 327 -1028 544 559 -680 1288 -75 -304 1593 -277
1824 -277 560 992 -582 544 -286 -674 646 -883 558 987 -684 612 -492 -1647 -129 -2125
1840 -2125 -1431 -109 -1128 934 704 88 1994 211 623 1436 -772 863 239 -1097 528 -675
1856 -675 -887 233 -1116 375 751 69 1612 95 -129 758 -1649 -649 -385 -1551 691 133 153
1873 153 1757 36 523 549 -981 298 -579 -1122 519 -1197 -399 245 -1184 726 678 341 2025 878
$$ packed form
1756A127k843L042K88k455K593r04j438J225j032R53n14l27J204k699Q67J299
1772C86k919J879J276k090K316k16j009J482j609N30k49p50J787j055l2K042k509
1789g40Q73R90k291J535m8r76J261j013L99O2j367J652o56n34K400j335L88J255
1807A855k313L67R7j522Q92o05L96J160j355J572J5j239J968j363k29J897j870
1824b77Q37M32j574J126q30l88J320j529J441M29j671J296j104j155J518j996
1840b125O94J322j019K062k30o16J906j783M12Q13k208J635o24j336J625j203
1856f75k12J120j349J491L76o82J543j517k24Q87k407J000K64j166K242n58K0
1873A53J604j721M87K6j530J279q77n43J641j716P98O44j429J910m8l37J684j147
$$ plain form
1891 878 1061 1354 -493 371 -650 -1599 157 -1485 -579 854 -829 598 424 -863 161 -838 -602
1908 -602 112 -1163 379 224 -721 1300 -49 37 1826 63 807 1451 -371 394 -594 -1265 -465 -1610
1926 -1610 39 326 -681 1597 646 -247 1660 -232 -501 287 -977 -198 -317 -639 369 -937 363
1943 363 551 -947 1178 766 -631 1304 -50 -919 482 -760 -511 -244 -96 1155 145 1051 1448
1960 1448 -857 533 785 -1914 541 -243 -1565 108 -767 -615 -505 -352 624 -439 255 1594 -687
1977 -687 847 1649 -1287 576 658 -794 651 240 61 110 -97 582 -722 -382 1035 -1690 -447 1296
1995 1296 -1155 499 1288 -1118 -20 186 -278 -313 -621 803 -691 -725 1375 -865 -440 1922 -1270
2012 -1270 -502 1078 -702 126 445 -129 -529 -477 1027 12 -366 2204 -52 -553 1985 -423 -634
$$ packed form
1891H78J83K93j847Q64j021r49J756j642R06J433j683J427j74j287J024r99K36
1908f02P14j275J542j55r45K021j349Q6J789j763P44O44j822P65r88o71Q00j145
1926a610J649K87j007K278r51q93J907j892k69P88j264P79j19l22J008j306J300
1943C63J88j498K125m12j397J935j354q69J401j242K49K67J48J251j010R06L97
1960A448k305J390K52k699K455p84j322J673q75J52J10J53R76j063O94J339k281
1977f87J534Q02k936J863Q2j452J445m11j79M9k07O79j304L40J417k725J243J743
1995A296k451J654P89k406J098K06m64l5l08J424j494l4K100k240M25K362l192
2012a270P68J580j780Q28L19n74m00N2J504j015l78K570k256n01K538k408k11
$$ plain form
2029 -634 941 -846 -1206 -256 -296 -534 -909 652 -525 -1852 1651 79 -1021 2165 337 -1186 1268
2046 1268 300 -206 809 686 -255 -1320 922 446 -1401 1299 18 -2547 913 373 -1261 1237
2062 1237 265 -1011 -329 347 397 -458 696 555 -2148 592 973 -1608 997 1024 -1734 74 798 -4
2080 -4 151 391 97 -1652 -33 1499 -739 942 1677 -2018 4 1436 -657 518 662 -1003 -1334
2097 -1334 -715 536 -878 -394 878 -2045 -812 2022 -582 561 1922 -1178 -491 750 607 376
2113 376 590 574 -1438 -996 1582 -457 -509 1748 -1805 -1652 1268 -59 170 876 -485 -1198 -933 1325
2131 1325 610 -386 1554 -1024 -1982 1723 46 -393 1337 -1052 -1460 152 499 724 221 610 -561
2148 -561 -1767 1572 1013 -762 1765 -159 -1723 709 414 -86 643 -324 -1111 -1396 390 752 -1240
$$ packed form
2029f34J575j787l60R50m0k38l75J561j177j327L503j572j100L186j828j523K454
2046A268r68n06J015j23r41j065K242m76j847K700j281k565L460n40j634K498
2062A237r72j276O82O76N0q55J154j41k703K740L81k581K605K7k758J808P24q02
2080dJ55K40k94j749J619J532k238J681P35l695K022J432k093J175J44j665l31
2097a334O19J251j414M84J272k923J233K834k604J143J361l100O87J241j43k31
2113C76K14j6k012M42K578k039n2K257l553J53K920j327K29P06j361p13K65K258
2131A325p15r96J940k578r58L705j677m39J730k389m08J612L47K25n03L89j171
2148e61j206L339n59j775K527j924j564K432k95n00P29r67p87k85J786L62j992
$$ plain form
2165 -1240 737 -84 -2316 746 1023 -254 1332 454 -1084 -347 639 948 -112 450 466 -1513 426
2182 426 1351 -944 455 200 -1999 -168 360 13 321 139 -153 -881 1 1368 -279 303 1153 -1375
2200 -1375 -85 1014 -759 -20 -307 -795 -525 -66 822 232 35 1164 -776 -563 1338 -605 -91
2217 -91 1084 -880 -66 688 125 334 -308 -81 -565 -823 793 -310 -1123 740 -1134 -934 675 -499
2235 -499 -43 782 238 648 129 642 547 -695 619 -382 -906 967 -32 -498 921 -533 -376 -33
2253 -33 -509 250 -455 9 183 -920 340 36 -1079 624 -85 -536 1012 123 207 574 -400 241 -733
2272 -733 -317 380 -754 177 629 -619 787 511 -434 660 -6 -78 380 -171 244 -239 -725 309 -891
2291 -891 -151 368 -805 167 350 -532 257 -185 -407 95 -465 304 402 -27 911 -103 -65 800 -503 154
$$ packed form
2165a240J977q21k232L062K77j277J586q78j538P37R86L09j060N62J6j979J939
2182D26R25k295J399k55k199J831N28l47L08j82k92p28Q82J367j647N82Q50k528
2200a375J290J099j773P39k87m88K70M59Q88n90j97J129j940K13J901j943N14
2217i1J175j964Q14P54n63K09o42K27m84k58J616j103q13J863j874K00J609j174
2235d99M56Q25n44M10n19N13r5j242J314j001n24J873r99m66J419j454J57L43
2253c3m76P59p05M64J74j103J260l04j115J703p09m51J548q89Q4L67r74O41r74
2272g33M16O97j134R31M52j248J406k76r45J094o66p2M58n51M15m83m86J034j200
2291h91P40N19j173R72J83q82P89m42k22N02n60P69R8m29R38j014L8Q65j303O57
$$ plain form
2311 154 496 -502 580 0 -410 418 -756 -314 -111 -769 310 -53 -536 788 -407 -149 418 -692
2329 -692 197 194 -320 651 -234 111 328 -722 251 -89 -690 533 94 -90 796 -119 434 194 -579 213
2349 213 -148 -202 568 -463 191 253 -633 275 -218 -413 210 -523 71 268 -703 235 -132 -322 713 -171
2369 -171 325 685 -383 543 314 -661 531 -568 -276 395 -498 367 42 -434 623 -420 -169 451
2387 451 -607 258 76 -816 346 -360 -334 438 -403 194 582 -160 788 63 -113 568 -598 52 257
2406 257 -445 584 259 -93 720 -118 68 271 -425 315 -299 -739 263 -758 -415 289 -651 241 122
2425 122 -397 346 28 91 303 -386 390 -42 -415 607 -365 -216 702 -327 122 472 -346 296 -132 -114
2445 -114 417 -568 166 36 -376 736 13 -205 747 -303 -83 299 -514 -97 -183 -436 346 -657 379
$$ packed form
2311A54L42r98J082n80m10Q28j174M42K03o58J079l63m83J324j195K58N67j110
2329f92Q89ln14R71q85L45K17j050R73l40o01J223m39j84Q86r15N53k40p73P92
2349B13l61n4P70j031O54O2q86R08m93j95O23p33N94J97r71R38l67j90J035q84
2369a71M96L60j068R26k29r75J192j099K92O71q93Q65l25m76J057j043K51O20
2387D51j058Q65j82q92J162p06K6P72q41N97L88p42R48p25j76O81j166O50K05
2406B57p02J029l25l52Q13q38J86K03o96P40o14m40J002j021L43P04r40Q92j19
2425A22n19P43l18O3K12o89P76m32l73J022r72J49R18j029M49L50q18O42m28J8
2445a14N31r85P34j30m12J112p23k18R52j050K20L82q13M17q6k53P82j003J036
$$ plain form
2464 379 176 -582 700 263 -443 659 -153 -369 526 -250 142 -73 -92 300 -370 240 257 -593 75 -134
2484 -134 -934 139 -83 -846 -40 -315 -105 159 46 698 70 381 703 -340 317 660 -516 287 -26
2503 -26 -607 250 -64 -66 26 -319 507 -485 -250 572 -857 -65 651 -639 222 319 -279 182 -51 -24 -20 -530
2525 -530 189 -311 -482 592 -463 -297 705 -649 -22 567 -265 -159 278 282 87 -140 614 -152 -489
2544 -489 803 -87 -550 795 -408 -447 129 -570 -414 -175 -245 -288 -512 546 386 -258 1013 391 -282
2563 -282 922 -30 -337 765 30 -204 -50 216 197 -324 199 292 -907 307 8 -1116 469 -44 -838
2582 -838 84 -96 22 98 287 472 -425 123 482 -636 572 616 -1067 388 219 -521 356 119 -210
2601 -210 -333 -63 423 45 333 666 -731 -170 494 -635 451 632 -522 -274 -33 -148 -76 -169 301
$$ packed form
2464C79k03p58J282m37p06J102q12k16Q95p76L92k15j9L92o70O10J7q50O68k09
2484a34q00J073k22p63Q06k75K10K64j13O52o28L11L22j043O57L43j176Q03l13
2503b6n81Q57l14kR2l45Q26r92K35Q22j429P92P16j290Q61R7n98M61k33K7Mn10
2525e30P19n00j71J074j055J66J002j354O27N89q32J06M37Mj95k27P54p66l37
2544d89J292q90m63J345j203l9N76o99J56K39p0m3k24J058j60o44J271o22o73
2563b82J204r52l07J102p35k34J54K66j9n21N23R3j199J214k99j124J585n13p94
2582h38R22j80J18P6J89J85q97N48L59j118J208M4j683J455j69p40Q77k37l29
2601b10j23K70M86l78K88L33j397N61O64j129J086J81j154K48K41j15P2r3M70
$$ plain form
2620 301 -741 -469 582 -516 -65 925 -544 -24 578 -237 448 495 311 -166 -181 374 -144 -326 664
2639 664 -517 -533 327 -449 -128 469 -560 -577 -136 -334 157 -88 416 -303 -485 512 -242 -298 795 -155
2659 -155 -467 499 72 209 356 258 -40 -510 193 176 -448 582 -41 -704 545 -62 -326 552 71 -71
2679 -71 -14 -125 69 -92 7 154 -899 152 191 -501 640 376 -344 520 46 10 142 -2 254 -278 -21
2700 -21 471 -466 240 497 -912 221 387 -409 311 -253 -266 -328 -215 -79 -382 -205 606 -453 204 668
2720 668 -349 253 318 -522 161 266 -142 115 17 260 -298 -99 497 -126 -179 469 -339 -263 394 -522 141
2741 141 -207 -257 -52 -107 410 195 -93 606 47 -297 367 -160 -440 108 -198 -111 402 177 306 -75 314
2762 314 101 -313 483 28 -391 179 -312 -266 243 -338 98 151 31 278 -170 -222 56 -505 5 -89 -758
$$ packed form
2620C01j042K72J051j098M51R90j469N20O02q15O85M7j84m77j5N55n18j82R90
2639F64j181j6Q60p76L21N97j029j7M41j98M91k45N04p19j82R97p54n6J093r50
2659a55l12R66m27J37J47r8k98m70P03j7o24J030o23o63J249o07k64Q78m81j42
2679g1N7j11J94j61R9J47j053J051L9o92J141k64p20Q64m74l6J32j44K56n32K57
2700b1M92r37P06K57j409J133J66p96P20n64j3o2J13J36l03J77Q11j059O57M64
2720F68j017O02O5q40O83J05m08K57r8K43n58J99N96o23n3O48q08P6O57r16O63
2741A41l48n0K05n5N17k15k88O99n59l44O64n27k80N48l06Q7N13k25J29l81L89
2762C14k13m14P96m55m19N70m91M6N09n81M36N3j20K47m48n2K78n61N10r4o69
$$ plain form
2783 -758 313 140 -61 443 -37 29 295 -18 111 -142 -71 265 -239 -62 197 -560 45 64 -151 98 -99
2804 -99 -1 54 -461 -191 -415 -295 367 -381 186 608 -112 329 215 -65 327 -220 -204 171 -400 126 -60
2825 -60 -244 388 95 -60 271 46 130 150 -198 158 -177 -284 186 -227 207 73 -169 435 -184 -350 186
2846 186 -343 -52 148 -330 54 -296 -85 291 -14 174 437 -61 599 272 -139 451 -294 56 166 -150
2866 -150 22 59 -362 257 -148 -200 128 -269 -174 52 -461 170 63 -158 297 -236 118 332 -401 281 167
2887 167 -208 48 -324 161 97 -341 104 115 -164 192 -141 56 138 -279 -5 -178 -64 -43 -306 72 245
2908 245 -239 -86 0 -555 50 -64 24 242 -170 231 -78 -163 167 -144 -90 212 -224 96 35 -270 220 -113
2930 -113 -71 161 -109 -42 9 -310 127 -75 -129 462 -236 -52 262 -368 210 64 -155 394 47 9 292 -229
$$ packed form
2783g58J071j73k01N04m80O6K66l13J29k53P1L36n04J77K59p57O05J9k15K49j97
2804i9R8N5n15K70k24J20O62p48N67M22p20M41j14k80L92n47J6L75n71N26j86
2825f0j84O32k93j55L31k25Q4K0l48L56l35j07M70m13M34j34k42O04o19j66N36
2846A86n29K91K00m78L84l50K11L76l05J88K63m98O60l27m11N90p45L50J10l16
2866a50J72L7m21O19m05n2L28l97R5K26n13O31j07k21M55n33L54K14p33O82j14
2887A67l75K56l72M85o4m38M45J1k79L56l33J97Q2m17K74j73J14K1k63L78J73
2908B45m84J53Q6n55O05j14Q8K18m12M01l09q5L30l11N4L02m36L20o1l05M90l33
2930a13M2K32k70O7N1l19M37k02n4N91o98J84L14o30N78j46k19N49l47l8K83n21
$$ plain form
2952 -229 140 -43 -159 226 -300 -29 216 -247 295 157 -376 116 -357 -30 135 -435 110 74 -588 138
2972 138 -148 119 171 -153 -45 145 -44 192 93 41 196 -153 273 292 -195 405 24 -137 404 -189 92
2993 92 191 -334 4 70 -109 163 -87 116 -39 -642 255 117 -312 331 -181 -228 27 -247 -34 46 -165 333
3015 333 -231 -36 183 -338 94 128 -396 249 8 -144 203 -187 -12 -107 -89 271 -130 -50 312 -442 -93
3036 -93 373 -173 202 337 -299 31 -405 6 39 -292 249 -191 -354 231 -255 81 242 -303 0 294 40
3057 40 214 -11 116 -76 -325 -218 -34 -219 330 52 -209 295 -461 212 323 -361 77 -187 160 411
3077 411 -153 430 175 -420 280 240 -56 436 -208 -299 203 -283 -25 -271 -148 8 -287 184 320 -282 319
3098 319 78 -461 248 -122 -160 364 -91 154 -317 4 130 20 183 236 -353 139 -61 -411 239 -47 -181
$$ packed form
2952b29L69j83j16L85n26K71K45m63N42j38n33M92m73L27J65n70N45l6o62P26
2972A38k86K67N2l24J08J90j89K36r9n2J55l49M26J9m87O00l81j61N41n93K81
2993I2R9n25L38O6j79K72k50K03j55o03Q97j38m29O43n12m7K55k74K13Q0k11M98
3015C33n64J95K19n21M32L4n24O45k41j52L47l90J75r5J8L60m01Q0L62p54L49
3036i3M66n46L75J35o36L30m36M11L3l31N41m40j63N85m86L36J61n45L03K94k54
3057D0J74k25J27j92k49J07J84j85N49k78k61N04p56O73J11o84M38k64L47K51
3077D11n64N83k55n95P00m0k96M92o44r1N02m86K58k46J23J56k95M71J36o02O01
3098C19k41n39P09l70l8N24m55K45m71L21J26j10J63N3n89M92k00l50O50k86j34
$$ plain form
3119 -181 75 -73 223 243 126 538 -324 -54 348 -458 -63 215 -398 73 174 -291 217 -59 99 145 -214
3140 -214 356 -158 98 231 -360 -125 340 -317 187 373 -156 55 93 -82 112 -213 150 -257 -394 227
3160 227 -227 60 362 -293 -13 38 -68 209 297 69 -109 -49 27 -9 -289 531 -38 -371 293 -228 -46 371
3182 371 -53 84 32 -32 91 -31 176 56 -314 12 102 -361 210 -84 -70 150 -418 -12 126 40 244 -185
3204 -185 -115 176 -184 263 387 -211 58 -70 41 183 -179 135 158 -218 201 14 -120 232 -461 -313 335
3225 335 -255 357 27 8 180 -151 -154 333 -83 286 -50 28 434 -197 -321 265 -427 -10 66 -243 297 -34
3247 -34 -97 172 -179 137 128 -198 404 -308 -24 250 -245 91 115 -536 -35 -72 -93 94 -260 181 -25 -75 171
3270 171 -123 -210 312 -144 273 168 -170 232 152 -172 131 -89 44 268 -69 276 -180 -176 114 17 -242 124
$$ packed form
3119a81K56j48K96K0j17M12q62K70M02q06L95K78o13M71J01m65N08k76J58M6l59
3140b14N70n14K56J33n91K35M65o57N04J86n29K11L8j75J94l25L63m07j37O21
3160B27m54K87L02o55K80N1j06K77Q8k28j78O0P6l6k80Q20n69l33O64n21J82M17
3182C71m24J37n2o4J23j22K07j20l70L26R0m63N71k94J4K20n68M06J38q6K04m29
3204a85P0K91l60M47J24n98K69j28J11J42l62L14K3l76M19j87j34L52o93J48O48
3225C35n90O12l30j9J72l31lM87m16L69l36P8M06o31j24N86o92M17P6l09N40l31
3247c4o3K69l51L16rl26O02p12K84K74m95L36K4o51N01l7k1J87l54M41k06n0K46
3270A71k94q7N22m56M17j05l38M02q0l24L03k20J33K24l37L45m56MK90r7k59L66
$$ plain form
3292 124 -164 36 -56 -48 171 254 18 149 -248 189 33 -71 222 -91 -22 353 -280 14 35 -339 262 -43
3314 -43 -156 305 -298 -18 -100 -228 154 -41 -386 222 -171 -197 9 -149 109 115 -349 173 -103 -164 56 -228
3336 -228 -57 -41 -113 236 -46 52 135 -235 88 185 -67 105 107 194 227 -170 -4 -27 -213 93 -88 -28 260 -251
3360 -251 113 297 -185 159 -238 -101 104 -319 127 194 -161 257 127 -163 265 -210 99 367 -215 356
3380 356 -21 -179 -49 -161 54 338 -262 191 68 -151 324 -82 97 69 -249 164 152 -170 186 -95 -85
3401 -85 344 -157 312 250 128 65 -123 -3 113 -114 112 298 -42 330 15 0 248 66 -12 -55 -309 163
3423 163 -114 -234 267 -223 162 109 -232 230 -124 -128 31 -34 -70 237 -162 26 14 -78 56 -135 170 413
3445 413 -203 174 136 -266 166 -27 -19 105 -124 184 101 -35 340 -82 -12 363 -127 -39 255 -261 23 -113
$$ packed form
3292A24k88K00r2QK19Q3k36J31l97M37j56j04K93l13O9L75o33K94K1l74O01l05
3314d3j13M61o03K80q2j28L82j95l45O08l93k6K06j58K58Om64N22k76o1K20k84
3336b28J71J6p2L49k82R8Q3l70L23R7k52J72KQ7L3l97J66k3j86L06j81O0K88n11
3360b51L64J84m82L44l97J37K05m23M46O7l55M18j30k90M28m75L09K68n82N71
3380C56l77j58J30j12K15K84o00M53j23k19M75m06J79k8l18M13j2l22L56k81J0
3401h5M29n01M69o2j22o3j88J20J16k27K26J86l40L72l15j5K48j82p8m3k54M72
3423A63k77j20N01m90L85n3l41M62l54mJ59o5l6L07l99J88j2r2J34j91L05K43
3445D13o16L77l8m02M32j93QJ24k29L08q3j36L75m22P0L75m90Q8K94n16K84j36
$$ plain form
3467 -113 41 133 -298 198 174 -222 262 11 -234 111 -209 -103 117 -487 182 -232 -277 159 -334 -21 81
3488 81 -185 23 38 -146 85 -190 -237 -30 -138 206 36 -5 94 -204 -126 119 -338 159 200 -309 281 -13
3510 -13 -163 93 -18 -39 185 -183 -17 -77 -153 -70 -414 -110 -45 -302 62 -60 -333 217 33 -4 92 -55 140
3533 140 398 43 535 124 87 200 -437 46 141 -72 227 -19 -148 241 -211 44 72 30 55 -192 -125 244
3555 244 4 112 276 -101 35 27 -153 281 -68 -65 -134 -79 253 -114 -198 132 -216 7 115 -129 122 89 -168
3578 -168 63 41 137 -20 -61 153 80 -359 311 -124 -122 186 -172 -14 183 -162 214 58 -132 158 -76 174
3600 174 296 -147 18 -143 -142 226 -67 -87 82 -299 -74 -25 -186 184 -272 -60 141 -158 320 20 -141
3621 -141 314 34 -145 378 -114 -34 -27 -316 156 -122 92 55 -370 190 101 -165 286 -31 -161 126 -20 -94
$$ packed form
3467a13J54R2m31M96k4l96M84k51k45L45l20J06K20o04O69m14m5M36m93L13J02
3488H1k66K08J5j84K31k75m7K07j08L44j70m1R9k98P8K45m57M97M1n09N90k94
3510a3j50K56j11k1K24l68J66o0p6Q3l44L04O5k57L64j22k73N50j84l7R6j47J95
3533A40K58l55M92m11l7J13o37M83R5k13K99k46j29L89m52K55K8m2K5k47O7L69
3555B44k40J08J64l77J36qj80M34l49Lo9N5L32l67q4L30l48K23J08k44K51l3k57
3578a68K31k2R6j57m1K14p3m39O70m35KL08l58J58J97l45L76j56j90K90k34K50
3600A74J22m43J65j61JL68k93k0J69l81K25M9j61L70m56K12K01k99M78l00j61
3621a41M55k80j79N23m92Q0Pk89M72k78K14l7m25N60q9k66M51l17j30K87j46p4
$$ plain form
3643 -94 193 27 98 -116 -31 214 -246 298 22 -380 122 -206 -195 304 8 102 -127 -235 137 53 81 44 -120
3666 -120 166 48 -60 233 99 -16 -79 -272 -15 231 43 270 22 -364 59 -26 -134 -3 -250 -142 157
3687 157 107 185 -195 -267 110 -152 -28 159 26 162 -95 -120 188 -56 279 259 -125 -25 73 178 198 -72
3709 -72 73 119 -365 125 75 -178 -26 -181 -131 127 -96 140 124 -118 85 -256 -129 235 72 308 182 -192
3731 -192 178 41 51 5 -122 -97 -28 -158 -68 -155 -124 249 -355 -227 90 -71 397 -119 -116 85 -11 219 114
3754 114 -58 69 54 -163 289 -5 -76 168 -123 65 107 -163 176 107 134 20 -244 194 108 11 157 -185
3776 -185 -94 63 -144 41 97 -174 51 -158 -160 115 -7 -78 35 -84 80 166 34 278 -56 25 95 -158 198
3799 198 70 -183 105 -72 16 90 -176 -41 -211 -115 217 30 -61 -33 -93 297 -78 -149 217 42 176 149 39
$$ packed form
3643i4K87j66P1k14Q5K45m60N44k76m02N02l28J1M99k96R4k29j08L72q4K8l7j64
3666a20K86j18j08K93j34j15o3j93K57K46j88K27k48l86M23q5j08J31k47J08K99
3687A57n0P8l80p2L77k62J24J87j33J36k57k5L08k44L35k0l84J00R8J05K0k70
3709g2J45M6m84M90n0k53J52j55N0K58k23K36j6k42K03l41J27L64j63K36j26l74
3731a92L70j37J0m6j27K5O9j30R0q7L1L73o04J28L17j61M68n16LK01r6K30j05
3754A14j72J27j5k17M52k94p1K44k91J88M2k70L39o9K7j14k64M38q6r7J46l42
3776a85R1J57k07J85N6k71K25k09kK75j22p1J13j19J64Q6j32K44l34Q1P0k53L56
3799A98j28k53K88j77Q8P4k66J35j70R6L32j87r1K8o0L90l75p1L66j75J34k7j10
$$ plain form
3822 39 260 66 25 42 -205 65 62 -36 303 -27 -20 345 -63 -168 40 -46 14 -80 -188 214 -146 -144 90 41 -19
3847 -19 106 -185 257 123 90 233 -61 -51 212 -143 123 246 -203 195 133 -230 22 -90 -86 -23 3 248 63
3870 63 -36 285 -60 32 57 -38 -64 133 -47 165 -121 56 56 -64 31 -27 89 19 -61 -65 56 -349 82 -167 -33
3895 -33 142 -98 -40 80 42 225 82 -46 48 -10 27 39 -46 181 47 -113 65 -147 29 10 -188 220 -27
3918 -27 -137 -65 -52 23 168 -112 43 71 -46 313 -85 -32 68 -108 12 -46 -127 45 -34 -110 -84 -179 -14 93
3942 93 -128 228 -20 -149 74 62 -91 269 -45 171 -31 -88 117 -100 194 23 -153 -31 49 -153 -68 -251
3964 -251 -142 2 -126 143 162 -34 179 -72 -7 -7 -228 19 -74 -111 -86 -119 -224 159 -133 -91 31 -237 280
3987 280 -39 -107 -40 61 169 144 -169 91 -40 193 187 -175 60 -120 -139 12 -46 -279 205 -196 -8 -79 -109
$$ packed form
3822C9K21j94m1J7k47K70lr8L39l30PL65m08j05K08q6O0r4j08M02l60KK34m9o0
3847a9J25k91M42j34l3J43k94J0K63l55K66J23m49L98o2l63K52j12MO3K6K45j85
3870F3r9L21l45R2K5r5k6J97j80K12k86J77%j20R5n8J16p0q0mJ21m05M31k49J34
3895c3J75k40N8J20l8J83j43j28R4n8L7J2q5K27j34j60J78k12J76j9j98M08k47
3918b7j10P2J3P5J45k80J55K8j17L59l98N3J00j76J20n8q1J72p9p6K6r5J65J07
3942I3k21L56k48j29K23j2j53L60l14K16k02n7K05k17K94j71j76J22Q0k02Q5j83
3964b51J09J44j28K69J9j96K13k51O5%k21K47r3l7K5l3j05L83k92M2J22k68N17
3987B80l19o8O7J01J08k5l13K60j31K33ol62K35j80j9J51n8k33M84m01J88p1l0
$$ plain form
4010 -109 80 -115 15 137 9 232 152 -292 -103 176 -108 183 -4 -23 253 22 -43 -14 -218 122 -84
4031 -84 -148 209 -284 27 44 -139 -2 -18 -121 237 -125 192 128 -140 159 67 99 108 -60 -24 325 -3 255
4054 255 207 -96 420 -86 61 3 -78 102 -203 -168 35 -112 -96 230 -216 -134 -32 -358 -121 -11 -38 -67 -223
4077 -223 79 -51 -59 202 163 110 204 -145 132 76 -152 93 -39 -248 205 -61 1 -124 -171 -14 -1 125 149
4100 149 90 -25 -30 -232 170 54 -36 270 -128 86 64 -168 -21 89 -74 115 21 -240 252 -24 0 133
4122 133 6 58 113 17 107 -277 160 2 39 117 -62 -140 -51 -192 102 -11 -10 307 43 -146 189 6 73 125
4146 125 -59 227 -127 -166 2 -14 18 91 -237 142 87 -207 9 -390 69 12 -171 264 -106 -23 119 -236
4168 -236 -8 41 8 83 -55 -78 101 -88 -80 255 -78 -71 46 -83 279 58 -168 237 -48 255 -1 -23 108
$$ packed form
4010a09J89j95J30J22j28K23q0m44J89K79k84K91j87j9K76k31o5K9k04L40k06
4031h4o4L57m93L11J7j83J37j6j03L58l62L17o4k68K99r2L2Rj68L6L49l28K58
4054B55m8l03N16n06J47n8q1J80l05L5K03j47J6L26m46Q2J02l26K37J10k7k9j56
4077b23L02j30qK61l9n3R4l49K77n6k28K45j32k09M53k66O2j25m7J57J3J26K4
4100A49n9j15nk02M02j16r0L06l98K14k2k32J47J10j63J89r4k61M92k76K4J33
4122A33j27N2N5r6R0l84M37j58L7P8j79p8Q9j41K94j13JL17k64j89L35j83O7N2
4146A25j84K86l54l9J68j6L2P3l28L79n5k94K16l99M59n7j83M35l70Q3J42l55
4168b36K28M9l3P5j38k3J79j89QL35l33PJ17j29L62k21k26M05k85L03k56k2J31
$$ plain form
4191 108 -74 -210 323 -512 77 198 -226 -137 -72 -32 179 -162 23 26 -115 161 -189 34 184 -9 -84 3
4213 3 107 124 122 -23 254 -296 -221 32 -224 8 69 -146 53 -133 -99 420 -120 -131 -34 18 149 -256 -207 115
4237 115 -131 51 -58 -236 156 -91 -13 97 193 40 144 -189 168 -149 -168 195 -111 -89 112 -187 -86
4258 -86 -48 29 1 -117 -181 -25 -160 192 -36 -233 242 -149 -137 144 139 228 -16 15 221 40 31 -46 -205 112
4282 112 102 -201 163 84 -46 211 -187 -10 -136 -24 102 63 -82 -112 -43 98 -121 -139 98 -18 51 -55
4304 -55 21 -141 187 -56 102 63 -26 165 -83 -3 80 -27 165 221 -117 143 -128 -101 239 -392 -151 163 -262
4327 -262 259 -15 86 55 -281 -103 32 -73 145 -32 -284 93 46 199 200 -219 15 -81 97 158 -26 43
4349 43 120 -146 88 60 -27 205 -87 -63 273 152 163 152 -118 316 -198 -20 63 -137 15 -349 -69 106 -131
$$ packed form
4191A08j82j36N33q35N89J21m24Q9O5M0K11l41J85Lj41K76l50K23J50j93p5Q7
4213CJ04J7kj45K77n50P5K53k56K32O1k15J99j86L4N19n40j1R7N2J31m05M9L22
4237A15k46J82j09j78L92k47P8J10R6j53J04l33L57l17j9L63l06K2K01k99J01
4258h6L8P7k8j18o4J56j35L52k28j97M75l91J2K81nQ9k44L1K06j81rp7j59L17
4282A12j0l03L64p9j30K57l98J77j26J12J26l9j45l0O9J41k19j8K37j16O9j06
4304e5P6j62L28k43J58l9q9J91k48Q0Q3j07J92N6l38K60k71K7L40o31K41L14m25
4327b62N21k74J01l1l36J78J35j05K18j77k52L77m7J53Jm19K34r6J78O1j84O9
4349D3P7k66K34k8q7K32k92K4L36j21J1j1k70M34n14J78Q3k00J52l64K80J75k37
$$ plain form
4372 -131 71 -263 -217 44 -101 -66 374 -8 141 13 33 -71 263 -78 121 -51 -93 91 -80 22 14 48
4394 48 163 -71 172 161 -127 43 -75 -142 296 195 120 263 14 -115 108 -149 142 -20 -170 352 -103
4415 -103 -11 94 -217 -46 -78 1 31 -72 17 127 -157 131 -16 -318 38 13 -137 57 16 -32 -26 -68 281 67
4439 67 -213 194 17 209 -20 -4 82 -60 -94 -69 -152 170 -34 -111 82 -21 53 373 84 69 -5 -20 124 -26
4463 -26 -70 241 -109 -9 179 -142 -34 88 -97 -128 -31 -101 87 91 151 89 -161 172 13 -135 102 -117 -62
4486 -62 151 -102 21 -235 -19 -7 -42 175 42 -120 36 -19 -95 29 -17 89 96 -55 -48 -64 -60 191 64 74 -27
4511 -27 -102 217 24 -235 50 -131 76 259 -32 -11 124 -120 1 240 97 130 -234 44 -32 -144 45 -35
4533 -35 91 179 37 -7 47 -165 -13 -85 -14 57 139 53 298 -125 91 209 27 225 -154 33 -52 -185 188
$$ packed form
4372a31K02l34M6K61j45L5M40l82J49j28K0j04L34l41J99j72m2J84j71J02qL4
4394D8J15k34K43j1k88J70j18o7M38j01p5J43k49j29K23k57K91j62j50N22m55
4415a03R2J05l11J71l2P9L0j03Q9J10k84K88j47l02L56k5j50J94m1m8Om2L49k14
4439F7k80M07j77J92k29J6Q6j42l4K5q3L22k04p7J93j03P4L20k89j5p4j5J44j50
4463b6m4L11l50J00J88l21J08J22j85l1R7p0J88MO0o2k50L33j59j48K37k19N5
4486f2K13k53J23k56K16J2l5K17j33j62J56n5p6J24m6J06Pj51Pj6MK51j27J0j01
4511b7p5L19j93k59K85j81K07J83k91K1J35k44J21K39j43L3l64K78p6j12J89q0
4533c5J26Q8j42m4N4k12J52p2P1P1Q2q6K45m23K16J18j82J98l79J87q5j33L73
$$ plain form
4556 188 34 16 61 -208 -48 107 -249 176 279 -27 190 -96 -13 131 -57 -11 -34 -94 252 72 -57 -133
4578 -133 -147 -93 -60 -226 67 39 -2 156 -186 -89 200 -102 23 0 -75 22 57 52 -73 15 125 -28 -33 299 117
4603 117 87 168 -152 70 171 54 199 -42 -72 6 34 -47 48 -172 -98 131 -51 316 -13 79 -208 -162 59
4626 59 -111 51 120 -65 44 63 66 141 134 118 353 28 -31 244 -55 -35 -104 -98 181 -78 -35 63 -109 107 125 -96
4652 -96 90 -77 5 91 -14 4 8 236 148 -8 121 26 -55 226 234 -204 -21 104 -117 208 40 25 298 -92
4676 -92 19 -212 108 76 -127 194 142 -409 -1 -68 -208 75 -34 -92 78 -255 -12 -61 55 184 -94 77
4698 77 -26 -71 319 48 -312 51 -6 -53 80 -176 -26 -41 -116 11 -170 -212 295 -108 -73 100 -203 180 144
4721 144 -260 -15 -257 11 14 -133 290 158 60 173 -106 10 52 -9 -21 -149 44 49 29 43 207 -57 -82 103
$$ packed form
4556A88j54j8M5k69J60J55l56M25J03l06K17k86Q3J44j88M6k3o0L46j80j29p6
4578a33j4N4L3j66K93k8m1J58l42R7K89l02J25k3p5R7L5nj25Q8J10j53nL32j82
4603A17l0Q1l20K22J01j17J45k41l0P8K8q1R5k20P4K29j82L67l29R2k87M6K21
4626E9j70J62O9j85J09J9LP5pj6K35l25n9K75k99K0o9OK79k59M3R8j72K16J8k21
4652i6J86j67Q2Q6j05J8MK28q8j56J29r5q1K81Qm38J83J25k21L25j68j5K73l90
4676i2J11k31L20l2k03L21n2n51M08o7j40K83j09n8J70l33K43m9J16J29k78J71
4698G7j03m5L90k71l60L63n7m7J33k56J50j5p5J27j81m2N07m03L5J73l03L83l6
4721A44m04K45k42K68Lj47M23j32r8J13k79J16M2o1j2j28J93Nk0J4J64k64k5J85
$$ plain form
4745 103 -38 249 -8 -102 56 -127 3 -125 -195 123 -169 -24 84 -157 192 125 -102 324 18 -227 249
4766 249 5 -13 34 -144 -18 -97 21 -44 -94 60 -39 -210 64 195 -223 135 -250 -109 180 -26 98 26
4788 26 -59 44 70 36 59 -46 -56 -41 -205 -73 -134 -106 -51 -136 28 -5 -225 -44 -138 -34 25 -235 176 34 -70
4813 -70 162 13 129 100 -21 88 119 -45 -96 14 56 336 60 161 192 -186 182 144 -163 266 -35 -24 143
4836 143 -208 61 -157 -123 190 -63 -29 232 -56 -179 117 -16 -110 -66 -16 65 -16 288 16 -131 280 -89
4858 -89 44 226 54 114 57 -11 51 4 3 -99 130 103 46 -12 41 -215 -86 -11 24 154 0 -40 134 -56 -232
4883 -232 242 -188 218 217 -264 161 100 -104 -48 -103 -94 50 -43 121 84 -2 42 -188 -73 -19 1 77 173 -104 9
4908 9 -104 -16 67 -89 120 192 -58 178 -24 8 116 -11 -35 -191 -142 195 -23 70 113 -20 161 112 -206 130
$$ packed form
4745A03j41K87k57r4J58j83J30j28p0L18k92J45J08k41L49o7k27M26l06k45M76
4766B49k44j8M7j78J26p9J18o5n0J54r9j71K74J31m18L58l85J41K89k06J24p2
4788B6q5J03K6l4K3j05j0J5j64J32o1K8N5q5J64l3k20J81r4J04N9k60M11j42j04
4813g0K32j49J16k9j21J09L1j64n1J10M2K80k76J01L1l78L68l8l07M29l01J1J67
4836A43l51K69k18L4L13k53L4K61k88j23K96j33r4M4N0Q1q1L04k72j47M11l69
4858h9J33J82j72O0n7o8O2m7jj02K29k7n7n8N3k56J29P5L5J30j54m0J74j90j76
4883b32M74m30M06jm81M25o1k04N6n5RJ44r3J64l7q6M4k30J15N4K0P6R6k77J13
4908Ij13Q8Q3j56K09P2k50K36k02L2J08j27k4j56M9L37k18R3M3j33J81m9l18L36
$$ plain form
4932 130 0 -186 45 -13 6 -41 -177 120 115 -66 209 8 -35 85 -218 -120 5 -374 178 -390 46 -62
4954 -62 -25 106 -52 -28 19 -156 -239 95 -144 -87 104 69 231 -78 -41 9 -169 -54 60 235 62 23 -141
4977 -141 175 -87 98 113 -2 -84 -34 -21 10 282 -106 43 0 120 73 -4 79 -24 -3 -34 -45 -16 91 -144
5001 -144 10 -116 -198 -119 -166 224 90 83 252 -47 93 1 -154 231 43 -191 220 83 -100 18 -202 152
5023 152 133 -177 191 -60 -6 -119 -14 47 35 -119 -44 104 -29 -124 -122 39 66 -8 34 42 200 147 -69 -79 -3
5048 -3 47 85 89 -209 178 32 131 33 -145 -38 -37 -71 -53 -162 -65 200 -77 8 -220 -241 1 74 81 -73 -16 65 156
5075 156 -126 3 -60 -7 125 -284 -50 42 -43 67 58 -106 -35 -50 -36 35 -235 -32 -69 -5 125 -9 140 131 -129
5100 -129 186 34 88 -7 -39 40 8 23 13 15 -56 -101 -124 -275 -31 97 -140 -36 -65 82 -15 43 -32 -64 98 128
$$ packed form
4932A30j30j86K31n8J9m7j36K97nj81K75k01m3J20l03R8J25l79N52n68M36j08
4954f2L7J31j58K4M7j75q3L34k39N7J91l5J62l09L7N0j78J15J14J75j73l9j64
4977a41L16k62J85J5j15q2N0J3L1K72l88J49m3J20m7p7Q3j03K1l1j1K9J07k35
5001a44J54j26q2P9m7L90j34pJ69k99J40r2j55L85j88k34M11j37j83J18k20L54
5023A52j9l10L68k51N4j13J05O1j2j54P5J48j33r5KJ61K7p4M2QJ58n3k16j0P6
5048cN0L8Mk98L87j46R9r8j78J07Jl4J8j09R7K65k77Q5k28k1K42P3Pj54N7Q1R1
5075A56k82J29o3N3J32m09K34R2q5J10rj64P1j5J4P1k70K03l7O4J30j34J49rk60
5100a29L15j52N4r5l2P9l2J5j0Kp1m5k3j51K44J28k37J04k9J47r7N8p5l2J62L0
$$ plain form
5126 128 -43 5 -9 -53 50 104 144 -8 19 57 -67 -156 -66 41 -79 69 -21 48 -128 116 -68 69 -146 -5
5150 -5 -75 145 15 -135 119 67 -1 9 -155 6 108 -134 -86 246 33 40 -141 18 59 -48 229 -87 -165 159
5174 159 -59 -217 80 -4 106 37 53 -110 -20 -58 57 -130 131 26 -122 144 -194 -21 245 -224 102 31
5196 31 -19 107 -147 121 -9 32 106 36 -82 129 -112 -125 93 -64 -110 159 -34 -38 -213 -49 -13 -130 114
5219 114 -142 -93 125 -187 47 -81 89 -25 -41 167 16 -7 53 174 -63 -10 -47 -217 60 188 -65 162
5241 162 101 -136 164 -21 71 148 -61 164 -24 72 353 -88 27 59 -264 34 -18 61 50 140 -30 59 2 122
5265 122 45 -248 -143 -141 -23 148 8 -94 -70 -64 -136 -45 -42 24 -37 158 -37 -97 109 -77 -129 -34 -268 -69 124
5290 124 105 -17 -22 97 166 -80 -23 -99 -82 152 -31 -46 151 280 -156 16 -54 -47 95 41 12 -141 -97 249 53
$$ packed form
5126A28j71M8j4m4J03N4M0j52K7L8j24q9R0J07j20J48r0O9j76K44j84J37k15J41
5150ep0K20j30j50K54n2o8J0j64J61J02k42M8L32k13Pj81J59M1j07K77l16p8L24
5174A59k18j58K97q4J10o9J6j63R0l8J15j87K61j05j48K66l38J73K66m69L26p1
5196C1n0J26k54K68j30M1P4p0j18K11k41j3K18j57m6K69j93mj75J64L6j17K44
5219A14k56M9K18l12K34j28J70j14j6K08j51k3O0J21k37N3l7j70K77J28k53K27
5241A62o1k37L00j85R2P7k09K25j88R6K81m41J15L2l23K98n2P9j1R0j70Q9n7J20
5265A22p7k93J05KJ18J71j40j02K4Op2R1LO6o1J95j95o0K06j86n2R5k34J99J93
5290A24j9j22nJ19O9k46N7p6J7K34j83j5J97J29m36J72p0PJ42n4k9j53M4L46j96
$$ plain form
5315 53 393 70 84 25 9 7 -41 138 155 -42 54 119 -110 -106 -17 -305 39 -33 -84 55 -41 -23 61 -221 207 -149
5341 -149 42 71 -34 -213 211 -173 -36 -167 -6 45 -34 -144 -31 -31 22 -171 -105 -30 -141 -57 90 -107 -84
5364 -84 231 -77 -23 91 -74 58 -81 -105 -72 -360 68 -76 66 70 -58 90 -17 -57 221 -114 -40 -42 -18 -136
5388 -136 8 -59 131 35 -121 221 -69 21 142 5 -157 51 -128 -95 -52 -198 40 -9 -28 254 -71 276
5410 276 125 115 201 -53 -27 149 -47 -11 3 -14 245 138 36 -98 -172 71 -147 -142 -63 -15 -27 -8 -163 217
5434 217 -230 -150 -11 5 168 176 -90 166 116 17 6 -44 10 286 47 103 108 -170 43 -164 -48 81 -41 -1
5458 -1 86 -69 228 -161 -70 -87 103 172 52 -131 87 -181 27 125 1 197 98 -133 -46 -19 181 -94 5 -262
5482 -262 160 -207 22 -176 -179 64 -153 -184 27 -123 -122 -60 47 -94 69 -100 -138 100 -64 -2 -83 127 13
$$ packed form
5315E3L40l23J4n9j6km8J79J7j97R6O5k29MQ9k88L44p2n1J39r6J8Q4k82M28l56
5341a49J91K9j05j79M24l84J37j31J61N1p9j10J13%N3j93O6P5j11Q4J47j97K3
5364h4L15l08N4J14j65J32j39k4L3k88M28j44J42Mj28J48j07m0K78l35P4kK4j18
5388a36J44o7J90r6j56L42k90R0J21j37j62K08j79L3M3j46K38m9j9K82l25L47
5410B76j51j0Q6k54K6J76j96L6J4j7K59j07j02j34p4K43k18NP9M8j2J9j55L80
5434B17m47Q0J39J6J63Qk66K56n0r9j1n0N4K76k39N6Nk78K13k07J16J29j22M0
5458aQ7j55K97l89R1j7J90O9j20j83K18k68K08R8j24J96r9k31Q7K7K00k75R9k67
5482b62M22l67K29j98lK43k17l1K11j50JO2J07j41J63j69l8K38j64O2q1K10j14
$$ plain form
5505 13 -155 4 214 16 133 73 24 5 -75 -21 -82 0 104 -38 64 -4 -82 163 -218 114 162 -62 -129 8
5529 8 -92 36 -189 -45 71 49 -8 135 -75 17 108 -110 -12 -121 135 151 -177 77 120 -123 168 -49 -54 107
5553 107 -153 -160 -146 -100 26 -159 -126 34 -226 -115 22 46 6 -83 -158 118 26 143 103 -112 142 -17 145 43
5577 43 -131 158 196 -15 89 -84 153 87 -203 273 9 27 -76 -70 -221 73 -194 3 123 -21 176 -113
5599 -113 -93 52 -134 -19 -125 -112 102 -12 -68 160 -88 -54 -146 -211 141 54 -59 -29 -140 203 -6 -63 -84
5622 -84 -47 55 170 -18 211 27 -287 -52 79 -121 32 59 -136 131 127 114 89 91 165 -29 22 -268 -116 192
5646 192 -7 -144 -8 -40 66 138 -180 5 -116 -56 -21 -4 21 -111 141 -85 232 -11 107 126 -176 -120 -59
5669 -59 92 210 -1 -12 -127 7 101 -21 31 153 -122 69 84 45 246 -166 15 -43 -223 -10 -55 76 -94
$$ packed form
5505A3j68J59K10j98J17o0m9j9q0N4o1Q2J04j42J02o8p8K45l81L32M8k24o7J37
5529Hj00J28k25J44J16k2n7J43k10R2R1k18R8j09K56J6l28K54M3k43K91k17nJ61
5553A07k60pJ4M6J26j85L3J60k60J11J37K4m0q9p5K76r2J17m0k15K54j59J62j02
5577D3j74K89L8k11J04j73K37o6k90M76k64J8j03Oj51K94k67J97J20j44J97k89
5599a13K0J45j86J15j06J3K14j14n6K28k48L4r2o5L52q7j13L0j11L43k09n7k1
5622h4L7J02J15j88K29j84l14K35J31k00J53K7j95K67mj3k5KP4j94N1k90J52L08
5646A92j99j37J36l2J06P2l18J85j21O0L5J7K5j32K52k26L17k43J18J9l02N6O1
5669e9J51J18k11j1j15J34R4j22N2J22k75J91J5l9K01m12J81n8j80K13m5J31j70
$$ plain form
5692 -94 136 45 53 -12 -12 -63 9 45 108 -120 47 -115 58 45 -269 29 32 -115 89 39 -13 -76 35 -129 54 183
5718 183 -21 3 125 175 -299 -55 -30 2 74 -10 -60 152 -125 157 113 -51 112 -89 18 26 -147 19 19 -101
5742 -101 223 52 19 194 37 35 -68 -32 -132 -35 25 67 -135 108 47 3 294 88 -181 -152 10 -25 65 4
5766 4 -13 -91 -25 232 -95 -80 -3 -50 0 33 -124 -289 102 10 -133 -37 79 -5 -109 93 -163 -126 143 -68 -11
5791 -11 176 25 3 219 187 -125 30 138 49 -55 56 -15 -54 141 -100 -124 75 -220 67 8 248 119 -366
5814 -366 110 -35 245 -12 -279 -138 10 -44 -34 35 -323 77 -77 -34 238 21 -43 11 61 -63 156 -84
5836 -84 61 159 -123 147 49 156 -115 32 -64 -125 -23 -143 -24 85 242 -104 93 30 -59 174 -228 -82
5858 -82 5 -15 106 -69 -115 -16 17 -99 -13 -299 5 45 -189 49 -129 -22 46 -63 12 206 14 3 47 -207
$$ packed form
5692i4K30r1Qo5%n1P2L6O3k28J67j62J73j3l14K98Lj47K04n0n2o3J11j64J83J29
5718A83k04K4J22N0m74K44K5L2P2q4n0K12k77K82m4j64J63k01J07Qj73J66%j20
5742a01L24j71l3J75j57kj03L6j00R7O0M2k02K43o1m4K91k06k69K9J62l5R0o1
5766Dj7p8O6K57l27J5P7m7N0L3j57j65L91r2j43R6J16q4j04K02k56L7K69k11N7
5791a1J87j51k2K16l2l12J55J08q9j04J11p1l9J95k41k4J99k95K87n9K40j29m85
5814c66M76j45K80k57k67J41J48n4J0O9l58M00j54M3K72k17o4N4N0j24K19k40
5836h4J45R8k82K70r8J07k71J47r6o1J02j20J19J09J57l46J97o3q9K33m02J46
5858h2Q7k0J21j75m6R9L3j16Q6k86L04M0k34K38j78J07O8j09P5J94j92j1M4k54
$$ plain form
5882 -207 -169 -87 45 133 -19 -132 -88 18 -129 -171 -98 222 -73 44 -205 50 63 -124 -85 -42 -92 3 4 -78 -3
5907 -3 97 -93 -3 -93 -48 -16 -125 99 -53 43 12 -54 -65 108 7 42 102 9 115 -117 75 10 -94 -124 49
5932 49 -42 38 -203 -181 251 -238 -2 -150 -110 204 -174 -127 -82 -119 -40 126 -201 145 -90 -11 52 -110 -19 52
5956 52 -14 47 -46 134 220 -195 193 -238 -139 19 -47 92 66 -95 92 63 -146 40 -77 -13 -24 38 -27 -74 47
5981 47 -142 -12 -15 37 97 -171 -45 -46 189 -125 -119 101 -29 90 52 124 -7 9 28 69 -69 94 -126 -119 26
6006 26 5 -61 184 2 72 1 -27 -13 -65 107 183 -134 -41 -179 -54 160 200 -134 9 -25 -22 283 -117 37 116
6031 116 97 -163 -36 -23 177 -32 134 -245 -150 -25 -18 -228 -55 6 -111 83 -120 22 36 140 -2 -108
6053 -108 101 66 -106 127 206 -52 -125 -21 -53 140 -92 37 50 -231 83 -205 40 -114 -49 83 24 -46 -207
$$ packed form
5882b07L8Q2J32Q8j52j13M4J06j47m2P3L20k95J17k49K55J3j87L9M3n0R5Jq2P5
5907cJ00j90R0r0M5L2j09K24j52R6l1o6j1J73j01L5O0r3J06k32J92o5j04l0J73
5932D9r1Q0k41K2M32m89K36j48M0L14l78M7M5l7P9J66l27L46k35P9O3j62R1P1
5956E2o6O1r3J80Q6m15L88m31R9J58o6J39k6j61J87k9k09J86j17O4j1O2o5m7J21
5981D7j89J30lN2O0k68J26jK35l14OK20j30J19l8P2j31J6J9M1j38J63k20PJ45
6006B6k1o6K45j82P0p1k8J4n2J72P6l17R3j38J25K14M0l34J43l4LL05m00J54P9
6031A16j9k60J27J3K00k09J66l79R5J25Pk10J73O1j17J94k03J42J4J04j42j06
6053a08K09l5j72K33P9k58p3J04l2J93k32J29J3k81L14k88K45j54O5J32n9p0j61
$$ plain form
6076 -207 -148 82 -3 63 95 -27 42 78 -70 29 129 -35 -142 93 46 60 -36 -198 57 -68 -98 247 21 22
6100 22 128 -133 -62 53 -6 62 -99 -8 -139 -196 -140 -50 -64 -103 -61 -21 -159 -73 27 -22 -287 215 -120 -29 170
6125 170 100 141 -56 39 -103 -92 81 -135 73 -27 -164 195 -91 -47 -197 -39 40 6 -6 17 21 -177 38 13
6149 13 38 -6 -29 105 192 -115 -191 -29 21 -93 -183 -144 -39 -112 -48 55 -339 -87 116 -116 -90 -107 -349 9
6173 9 -207 114 90 -37 -22 -58 -26 118 -23 231 113 -31 17 23 128 155 -67 -17 -38 -86 127 -47 -185 83
6197 83 -241 27 1 -183 28 8 -27 44 78 -31 -69 -131 -3 -193 -113 55 -57 208 149 115 176 92 129 63 23
6222 23 3 -33 -12 39 143 -17 102 38 -1 78 -109 122 -95 199 72 -43 5 -10 -161 -37 -42 -198 -16 52
6246 52 -66 -72 -14 220 -3 245 -81 -24 -89 -77 -34 181 -22 -170 48 0 -162 96 8 103 143 -174 -47 26
$$ packed form
6076b07N9K30q5O6L2j22O9L6j48R9J00j64j07K35m7J4r6j62K55j25l0L45k26J
6100B2J06k61P1J15n9O8j61R1j31n7N6R0j4l9M2M0j38Q6J00m9k65N02l35R1J99
6125A70p0M1j97R5j42J1J73k16K08j00j37L59k86M4j50J58P9l4j2K3Mj98K15k5
6149A3K5m4k3J34Q7l07p6J62N0j14r0L9J05p3O4J03l94K52K03k32K6j7k42L58
6173Ik16L21k4j27J5l6L2J44j41K54j18j44M8OJ05K7k22N0k1m8K13j74j38K68
6197H3l24K68k6j84K11k0l5P1L4j09l8o2J28j90Q0J68j12K65n9l4O1q4L7o6m0
6222B3k0l6K1N1J04j60J19o4l9P9j87K31k17K94j27j15M8j5j51J24nj56J82O8
6246E2j18oN8K34k23K48l26N7o5J2M3K15k03j48K18m8j62K58q8R5M0l17J27P3
$$ plain form
6270 26 9 69 -18 -15 101 -191 103 3 -95 149 152 -74 -64 -2 119 -76 -188 124 -101 -22 -119 -20 101 -12 -2
6295 -2 287 49 76 167 92 -63 12 -195 -112 -35 56 -100 7 6 191 -76 51 175 -246 -36 -60 336 99 69
6319 69 -122 47 -108 -73 153 10 -14 -9 40 -254 20 11 29 -118 53 170 -9 -125 -117 232 2 108 116 -73
6343 -73 124 100 30 -11 -26 -7 131 50 -30 -12 119 65 -3 -50 -62 -79 62 33 80 -93 -37 -84 -95 67 10 -189 -153
6370 -153 -15 70 -474 16 187 -104 -145 -116 198 8 -191 205 54 258 73 -63 21 105 -116 61 -120 -29
6392 -29 49 -159 -28 -189 -63 -42 -23 -104 -75 -264 -47 -21 -190 102 125 -106 73 378 -76 -77 -99 18 235 192
6416 192 4 33 47 -27 212 92 201 -17 111 -20 -22 131 -48 -38 -23 -83 -18 -45 -199 -61 167 106 8 -41
6440 -41 48 -77 -207 -138 -126 151 89 -85 -33 -53 -105 -72 -89 -86 102 122 -12 -81 -21 -50 -277 -9 82 -46 114 -16
$$ packed form
6270B6j7O0q7LJ16k92K94j00r8K44Lk26J0O2J21j95j12L12k25P9r7R9J21j13J0
6295bK89k38K7R1p5j55P5k07Q3P7R1j56J07jJ85k67J27J24m21K10k4L96k37l0
6319F9j91J69j55L5K26j43k4NM9k94K74rJ8j47J71J17j79j16QL49k30J06Qj89
6343g3J97k4p0m1j5J9J38q1q0J8J31n4o8m7j2j7J41k9M7j73N6m7j1J62n7j99L6
6370a53J38Q5n44M90J71k91m1K9L14j90j99L96j51K04j85j36Q4Q4k21J77j81R1
6392b9P8k08J31j61J26K1J9q1K9j89K17K6j69K92K3k31J79L05m54jk2J17K17m3
6416A92j88K9J4p4K39j20J09k18J28j31kJ53j79J0J5o0O5k7j54J38K28o1r8m9
6440d1Q9j25j30O9J2K77o2j74N2k0n2L3j7LJ88K0j34o9O0k9k27K68R1j28J60j30
$$ plain form
6466 -16 -270 318 115 48 48 -9 50 77 -20 6 62 73 134 97 -79 106 -26 226 -35 -34 -27 -161 42 56 -73 -52
6492 -52 -103 -144 62 -27 65 -71 -37 -124 166 -12 35 -73 11 108 89 160 101 -146 -89 77 77 127 -54 109 125 -77
6518 -77 22 -27 -9 -33 195 51 63 -55 86 46 72 127 -127 -17 -54 -24 -159 -100 -98 -76 0 188 -4 -84 -187 58
6544 58 -57 229 -13 -29 50 -59 -35 -36 -68 89 75 -105 -76 -54 -36 -180 99 137 -22 -90 -3 -83 17 129 -52
6569 -52 118 -76 73 47 -248 42 -22 -73 -23 68 -8 17 100 50 17 -105 48 -187 -112 111 40 96 -18 -182 163
6594 163 -5 -274 77 21 75 -78 30 216 -111 -40 17 -104 -38 28 -16 -69 105 117 68 78 164 154 -95 93
6618 93 -123 -86 83 68 -76 47 6 36 55 -33 66 83 111 109 -43 62 -2 -115 -123 37 -2 297 -208 -101 101
6643 101 10 -49 -13 17 -43 -28 54 -15 -47 262 89 41 115 -130 8 118 223 15 87 155 -41 -33 -17 -16 -196 -93
$$ packed form
6466a6k54N88k03o7%n7N9K7r7K6N6J1O1l7j76J85j32K52k61JPj34K03J4j29K1
6492e2n1m1K06q9R2j36L4q7K90j78M7j08Q4R7j9P1n9k47N7J66%N0j81J63J6k02
6518g7R9m9J8k4K28j44J2j18J41m0K6N5k54J10l7L0j35N9KK2P6J88j92q0j03K45
6544E8j15K86k42j6P9j09K4jl2J57j4j80K9K2J8j44K79L8j59o8Q7q0J00J12j81
6569e2J70j94J49k6k95K90o4n1N0R1p6K5Q3n0l3j22J53k35P5K23p1N6j14j64L45
6594A63j68k69L51n6N4j53J08J86l27P1N7j21O6O6m4n3J74J2m9J0Q6j0k49J88
6618I3k16L7J69j5j44J23m1L0J9q8R9J7K8kj52J05o4j13qJ60l9K99n05J07K02
6643A01r1n9L6L0o0J5Q2o9l2L09j73m8P4k45J38J10J05k08P2O8j96QJ6Jj80J03
$$ plain form
6669 -93 18 -250 -21 -81 88 -70 -123 4 49 37 23 -172 99 -108 56 37 142 -187 119 256 -185 134
6691 134 44 -48 137 9 74 -91 61 133 -77 28 140 -80 -33 15 -40 -81 -13 105 -194 177 -6 100 -226
6714 -226 -118 -21 -194 237 -112 -171 59 -70 -140 74 -87 -45 79 130 41 154 145 16 -97 126 -96 140 64
6737 64 -39 -161 74 116 -126 89 -202 209 -30 134 -36 -85 -139 -193 -80 266 -21 -77 -133 -39 -243 -81 177
6760 177 18 0 14 20 43 95 -81 3 57 152 -114 -10 69 150 -204 115 -64 -20 -100 68 -60 122 -46 -3 81
6785 81 -71 55 202 35 -145 132 126 -82 -166 11 -89 -158 143 -208 -68 105 70 -114 -60 -29 -148 162 -28
6808 -28 10 -253 -121 3 70 -39 64 88 -67 14 -17 -38 -24 114 -103 89 -30 -82 -24 14 11 138 -58 -58 53
6833 53 8 58 166 -79 -11 82 103 -59 59 -52 0 13 -111 70 -51 -109 -63 -4 -104 18 -29 -30 -83 -14 -31 -27
$$ packed form
6669i3J11k68K29o0J69j58n3J27M5j2j4j95K71k07J64j9J05l29L06J37m41L19
6691A34r0r2J85j28O5j65J52P2k10J05J12k20M7M8n5m1O8J18k99L71j83J06l26
6714b26J08R7j73M31l49n9K30j29p0K14j61M2J24N1q9J13rj29j13K23k22K36p6
6737F4j03j22K35M2k42K15k91M11k39J64j70m9n4n4J13L46k87n6n6R4k04J62K58
6760A77j59j8J4OK3N2j76Q4N4R5k66J04P9Q1l54L19j79M4q0J68j28J82j68M3Q4
6785H1j52J26J47j67j80K77ok08q4J77j00o9L01l51J40J73l5j84N4L1j19L10j90
6808b8L8k63J32J24O7j09J03K4j55Q1l1k1J4J38k17J92j19n2N8L8lJ27j96%J11
6833E3m5N0J08k45O8R3K1j62J18j11N2J3j24J81j21n8M6N9j00J22m7jn3O9j7M
$$ plain form
6859 -27 107 -29 11 18 34 147 -102 -56 139 34 20 5 -172 -45 -13 -70 103 29 -31 42 -53 153 153 -152 43
6884 43 -20 -94 -7 0 -114 -84 -110 57 161 -42 29 -227 -34 -68 26 101 81 32 73 -90 -7 2 -18 206 -30 -89 140
6911 140 19 -249 -29 54 -34 -59 -41 65 -85 37 114 -43 48 92 115 86 -65 54 -63 56 88 41 146 215
6935 215 -50 85 141 18 70 13 -110 78 -90 87 70 -107 -129 90 -61 -36 22 -138 -296 -49 219 -96
6957 -96 47 76 -63 71 9 -289 3 -98 -150 -18 219 70 24 78 104 19 -179 -272 -47 -1 140 34 74 38
6981 38 -90 29 83 -7 -119 -251 -60 34 128 214 196 -114 -121 -50 -9 -194 -149 -179 174 -61 -147 -25 -151 -186 -24
7006 -24 27 -8 5 -137 84 -45 -27 -119 -93 128 69 -107 -33 -47 94 -23 -196 -105 -62 98 -123 11 132 26
7030 26 -173 10 96 116 -67 1 -51 30 -164 161 -7 -62 -75 33 91 -186 -140 -16 -31 10 -53 -29 80 49 -138
$$ packed form
6859b7J34j36M0PJ6J13k49M6J95j05j4j5j77J27L2n7J73p4o0P3r5K06%l05J95
6884D3o3p4Q7Pj14L0k6J67J04k03P1k56J93l4R4P5k0m9M1j63Q3Rk0K24k36n9K29
6911A40j21k68K20Q3q8k5J8J06j50J22P7j57R1M4K3k9j51J19j17J19L2m7J05O9
6935B15k65J35N6j23N2n7j23J88j68J77j7j77k2K19j51K5N8j60j58K47K68l15
6957i6J43K9j39J34o2k98K92j01n2J32K37j49m6N4K6q5j98r3K25M6J41j06M0l6
6981C8j28J19N4r0j12j32J91R4R4Q6j8l10pP1M1j85M5l0L53k35q6J22j26l5J62
7006b4N1l5J3j42K21j29J8r2K6K21n9j76P4j4J41j17j73R1M3J60k21J34J21j06
7030B6j99J83Q6K0j83O8n2Q1j94L25j68n5j3J08N8k77M6J24j5M1o3K4J09l1j87
$$ plain form
7055 -138 66 24 26 -155 92 -81 -156 4 179 3 -153 58 131 -37 63 168 -17 27 75 -2 37 45 107 235
7079 235 111 97 0 93 66 24 138 -69 -47 -9 39 -10 -99 43 53 18 41 -92 13 48 13 -59 138 -3 92 90
7105 90 21 -43 151 109 -195 -142 113 57 -122 -36 67 -94 71 136 262 62 20 -20 22 -122 117 -95 -11 80
7129 80 -115 -3 -160 11 -69 -156 -27 13 -37 -99 -30 -123 -77 64 -121 115 -71 63 167 -1 81 -37 -64 -57
7153 -57 -84 36 185 9 104 -11 44 144 112 -214 206 -26 -119 -94 -151 -78 -42 -88 -150 -71 85 2 60 3 -85 -70
7179 -70 96 114 -25 -4 -184 -34 71 4 73 18 83 80 90 -29 -108 -224 -23 -102 81 -37 -101 1 -117 105
7203 105 171 141 112 36 -335 132 9 -138 166 -128 168 259 52 -217 -64 218 170 -96 -216 -80 58 19
7225 19 100 -22 106 -85 -54 -189 -239 -45 110 -46 -46 -177 56 96 -72 11 239 101 -237 219 128 20 -60
$$ packed form
7055a38K04m2Kj81K47j73p5J60J75j76j56K11P3j68J00J05j85M4M8p7L9QO2J28
7079B35j24j4r7R3k7m2J14k07K2L8M8m9q9J42J0l5K3j33J05L5l5p2J97j41R5k
7105I0o9o4J94m2l04N3K55n6j79Q6J03j61J65O5J26k00m2m0M2j44K39k12Q4R1
7129H0j95J12j57J71q0q7J29M0n0o2O9r3M6J41j85K36j86J34J04j68Q2j18k7P
7153e7k7J20J49j76R5j15N5J00l2l26M20k32r3K5n7P3L6m6o2P9J56q3N8n7q8J5
7179g0J66J8j39K1j80J50J05o7O9n5O5lJ0j19p9j16K01p9J83j18o4J02j18K22
7203A05O6l0k9p6l71M67j23j47L04k94K96R1k07k69J53K82m8k66j20J36J38l9
7225A9Q1j22J28j91L1j35n0J94J55j56%j31K33M0j68Q3K28j38l38M56r1j08q0
$$ plain form
7248 -60 33 152 47 311 18 -176 96 -61 -173 -52 -129 -27 70 68 -27 158 -32 249 -121 104 2 -80 140
7271 140 -35 -224 98 88 -13 45 166 -156 -139 9 158 -89 75 144 116 -159 34 135 -72 -147 -152 -151 -273
7294 -273 -38 14 -198 118 53 -64 184 -65 96 -130 -199 129 -99 -162 -31 79 -68 -206 -39 47 -142 -120
7316 -120 57 -212 1 -84 5 36 24 -33 177 -52 -59 57 184 -75 76 -60 -7 -289 -13 147 -134 230 34
7339 34 -153 -124 -147 -74 -112 -127 -36 -234 -80 69 56 55 105 -67 38 16 -79 -7 -143 -40 -145 108 60 -53 80
7364 80 82 -204 39 -30 -91 100 -58 -164 23 -53 228 8 6 6 170 -34 81 15 -76 67 -126 55 -242 -243 55
7389 55 41 52 -158 -132 -73 125 -174 67 -131 -70 206 -135 -63 97 25 -27 -18 121 -42 -104 -68 23 25 70 -45 25
7415 25 10 99 1 90 1 144 -63 -48 118 -234 -188 -12 -208 73 -200 -80 -23 -156 -213 -103 87 87 -63 -27
$$ packed form
7248f0R3J19j05K64k93j94K72j57j12J21p7J02R7kr5J85j90K81l70K25j02q2K20
7271A40j75j89L22j0j01N8J21l22J7J48J49k47J64O9k8k75J93J01k07p5nJj22
7294b73K35N2k12L16o5j17K48k49J61k26o9L28k28o3J31J10j47j38J67Q6j89K2
7316a20J77k69K13q5Q9L1j2n7K10k29pJ16J27k59J51j36N3k82K76J60k81L64j96
7339C4j87K9k3P3l8j5R1j98J54J49j3jN0j72J05k2r5P2j36J03j05K53m8j13J33
7364H0Kk86K43o9o1J91j58j06J87p6K81k20k%J64k04J15o6r1J43j93J81k97jK98
7389E5j4J1k10K6N9J98k99K41j98O1K76l41P2J60p2n2RJ39j63o2L6R1KM5j15P0
7415B5j5Q9r8Q9q9J43k07J5J66l52M6J76j96K81k73J20N7j33n7J10J90%j50L6
$$ plain form
7439 -27 45 119 88 31 -168 105 57 -16 22 -19 -2 -178 118 190 9 49 19 10 -50 42 -47 -39 -269 -114 54 -46 -56
7466 -56 27 -14 -17 -19 -27 47 -90 -21 -39 -158 134 256 -38 -107 136 -143 147 10 224 73 -41 -97 227 -1 44
7491 44 -49 -17 -115 -118 -38 -41 -41 42 -92 -18 136 -6 9 -42 -181 57 -111 -238 -157 110 82 -34 -48 124 -110 103
7517 103 152 -94 -146 218 -125 -32 136 27 145 -429 199 30 -154 64 -10 -61 4 -8 106 -133 -36 -12 -106
7540 -106 -65 -115 6 1 -70 17 -111 53 -40 -123 -114 -208 15 31 136 -132 -84 -73 -66 -7 -32 -1 151 45 -106 278
7566 278 -45 -127 -40 61 -22 -126 -197 25 -7 -246 91 -55 2 -66 -19 43 125 -37 16 -85 -38 56 97 -55 -32
7591 -32 137 151 -117 -53 -29 -62 41 -156 -23 -128 62 7 70 -75 5 197 -41 -82 -127 -55 128 -69 -148 -70
7615 -70 -30 20 -226 -105 28 -160 -21 108 54 3 -47 -87 88 34 -46 97 -94 13 209 -158 113 77 4 112
$$ packed form
7439b7P2P4l1n7j99K73m8p3L8m1J7j76K96P2j81M0l0ro0R2q9Qk30J55J68j00j0
7466e6Q3m1lkqP4j37O9j8j19K92J22k94o9K43k79K90j37K14j51j14n6L24k28M5
7491D4r3L2r8lQ0l%Q3j34P4J54j42J5n1j39K38j68j27Q1K67k8j16j4J72k34K13
7517A03M9k46n2L64l43R3J68j09J18n74O28j69j84K18p4n1O5j2J14k39R7K4r4
7540a06M1n0J21np1Q7j28J64r3q3Rr4K23J6J05k68M8J1PN9k5L1J52j06j51L84
7566B78l23q2Q7J01q3j04p1K22l2k39L37j46N7o8M7O2Q2j62N3j01M7R4M1j52K3
7591c2J69J4k68O4K4l3J03j97J33j05J90n5O3j45Q0J92k38m1m5P2J83j97p9P8
7615g0M0N0k46J21J33j88J39J29n4n1n0m0J75n4q0J43j91J07J96l67K71l6p3J08
$$ plain form
7639 112 25 9 -135 198 147 10 -47 44 -15 -55 -168 -53 -60 -61 -123 30 45 46 -38 -61 269 -87 -326 -23 -137 2
7665 2 40 -98 142 67 58 9 -9 -47 -32 -58 78 -35 11 -71 67 -122 -4 62 -40 25 -171 64 176 -61 -21
7690 -21 -14 15 -37 -128 -19 32 -68 -20 65 25 -56 136 110 29 -138 20 -195 -24 148 49 -15 84 -57 -213 -55
7715 -55 -56 31 12 -30 151 94 108 -9 -5 -66 20 76 53 -63 63 -77 -185 -155 53 -30 -105 6 60 156 -161 -47
7741 -47 14 59 19 8 42 94 -55 142 -138 203 -34 6 26 52 -59 99 44 184 9 -16 156 -54 11 29 -9
7766 -9 -96 -77 -280 -152 -65 -86 -208 83 75 -213 -14 57 -19 -33 150 -3 -164 52 -62 25 64 -59 114 -24
7790 -24 -70 210 -29 34 -22 -151 20 101 -34 3 192 306 38 -11 -128 19 -90 -62 72 -32 21 117 -122
7813 -122 69 69 -23 -185 -199 59 -207 123 63 49 110 110 7 -39 65 -41 115 10 11 127 101 99 -27 68 -13 -228
$$ packed form
7639A12q7j6j44L33n1j37n7R1n9m0j13J15pjo2J53J5Jq4k3L30l56k39L03j14J39
7665BL8j38K40p5rm9j8l8J5k6J36j13M6q2J38j89J18O6j02O5j96K35J12k37M0
7690b1PK9n2r1J09N1j00M8Q5m0q1J92k6q1j67J58k15J71J72r9o4R9j41j56J58
7715e5jQ7j9m2J81n7J4j17Mo1Q6N6k3j16J26j40j08L0K08q3p5J11N4R6l17J14
7741d7O1M5m0j1L4N2j49J97k80L41k37M0K0K6j11J58n5J40j75k5J72k10O5J8l8
7766iq7J9k03J28Q7k1j22K91qk88J99P1p6j4J83j53j61K16j14Q7L9j23J73j38
7790b4m6K80k39O3n6j29J71Q1j35L7J89J14k68m9j17J47j09K8J34j04N3R6k39
7813a22J91%r2j62j4K58k66L30o0j4O1%j03m6J04j06J56j05JJ16k6kj26R5q1k15
$$ plain form
7839 -228 -66 114 76 128 12 93 13 -1 -172 -132 215 96 -202 41 -231 89 -90 67 -39 69 -182 -11
7861 -11 -100 -107 60 -26 95 94 -171 82 -98 62 75 82 31 14 -6 -65 148 -193 -68 46 41 -98 79 -179 145
7886 145 84 -158 72 -228 -91 -33 8 85 -137 -9 -26 -119 19 -163 -68 110 69 26 28 -21 39 57 -47 199 -21
7911 -21 -42 161 -61 5 236 -86 -35 -16 -121 91 -70 17 -48 32 187 144 13 -99 -95 43 45 -109 -52 -96 -42
7936 -42 70 25 -48 126 3 -204 -22 -238 15 50 85 36 -19 14 2 -46 169 75 -144 161 -87 91 -100 -108
7960 -108 123 99 -73 161 16 87 116 -175 -90 54 37 -28 -152 -74 -15 40 68 6 -46 -50 -22 6 -51 -145 -113 -108 -2
7987 -2 -88 -73 46 -56 35 90 -21 -48 -74 165 -7 -52 -3 30 -67 -202 169 55 -66 118 60 -67 53 13 -169
8012 -169 -58 10 13 126 -3 -12 -19 61 -81 43 121 -58 -72 45 49 81 21 -156 52 127 26 109 66 4 153 -8
$$ packed form
7839b28J62J80l8N2j16Q1q0j4j71M0L47j19k98K43k72L20j79J57j06J08k51J71
7861a1q9pJ67q6J21jk65K53j80J60J3Pn1j7k0n9K13l41J25J14nj39J77k58L24
7886A45o1k42K30l00J37N8M1P7k22J28j7r3J38j82R5J78m1m3Km9O0J8j04K46k20
7911b1k1K03k22O6K31l22N1J9j05K12j61Q7o5Q0J55m3j31j12MJ38Kj54N7m4N4
7936d2J12m5p3J74j23k07J82k16K53L5L5m9n5L3j2m8K15r4k19L05k48J78j91q
7960a08K31k4j72K34j45P1K9k91Q5J44j7o5j24P8N9N5K8o2n2mK8K8n7r4L2NJ06
7987bq6J5J19j02R1N5j11k7k6K39j72m5M9L3r7j35L71j14j21J84n8j27J20m0j82
8012a69J11O8LJ13j29rpQ0j42J24P8j79j4J17ML2o0j77K08P5j01Q3m3o2J49j61
$$ plain form
8038 -8 156 64 -83 106 -18 117 86 -159 84 -24 -59 -34 -17 33 -7 125 263 -118 41 -102 -22 111 37 -94
8062 -94 54 -75 -61 180 -91 142 91 60 73 -78 -247 -18 34 19 -197 -112 21 33 -40 80 -87 33 -27 -166
8086 -166 12 85 40 -102 86 71 138 -130 -70 182 -36 -69 9 -92 -19 -18 291 46 31 130 22 -94 -97 23 -28
8111 -28 -92 -67 -62 -67 -229 -6 9 20 39 70 -19 34 56 94 -27 54 -114 114 10 230 -14 219 0 97 -59 87
8137 87 -2 117 1 -58 95 -32 170 -194 188 80 -2 -59 -69 -77 -97 -213 -46 -120 -167 97 -94 27 55 55 -24
8162 -24 -5 -64 125 -83 4 56 -6 210 236 -58 -20 11 136 -115 129 87 -190 -62 116 12 -144 -10 29 -97
8186 -97 -37 -13 -164 48 -9
$$ packed form
8038hJ64r2j47J89j24J35l1k45K43j08l5K5J7N0m0J32J38l81J59j43Q0J33p4j31
8062i4J48j29J4K41k71K33n1l1J3j51j69K29N2j5k16Q5J33J2p3J20j67J20o0j39
8086a66J78P3m5j42J88j5O7k68O0K52k18l3P8j01P3JL09k45j5R9j08j16lJ20n1
8111b8o4K5Nnj62K23J5J1J9L1q9N3K2L8j21Q1j68K28j04K20k44K33k19R7j56J46
8137H7q9J19j16n9J53j27K02l64L82j08q2n7j0qk0j16J67p4m7K64j91J21K8%p9
8162b4J9n9J89k08Q7N2o2K16K6k94L8L1J25k51K44m2k77J28J78j04j56J34L9j26
8186i7O0K4j51K12n7
8191i
$$ Imaginary data points
##PAGE= N=2
##DATA TABLE= (X++(I..I)), XYDATA
$$ plain form
0 0 0 0 0 0 0 0 0 0 0 0 0 -8 8 -8 8 -16 16 -16 24 -25 32 -40 48 -56 64 -76 88 -104 118 -137 154 -177 201
33 201 -227 255 -288 325 -365 408 -455 506 -562 622 -691 764 -842 931 -1026 1132 -1246 1373
51 1373 -1512 1665 -1839 2032 -2249 2496 -2781 3108 -3498 3963 -4535 5253 -6188 7461 -9311
66 -9311 12250 -17669 31106 -141754 -175718 -54857 -140988 878 10240 -56305 -6102 105592
78 105592 81838 50821 101827 58466 -65054 53861 89548 -33705 22666 17569 -122737
89 -122737 -41133 52177 11660 6450 30748 -36785 -116028 -40512 18816 -57050 20597 80443
101 80443 -20535 66434 173290 88598 88066 98736 -4189 -48011 6236 17916 -53353 -44130
113 -44130 -26668 -140113 -101587 11748 -55936 -27386 53398 -26022 -22028 58995 37767 -999
$$ packed form
0@%%%%%%%%%%%qJ6j6J6k4L2l2M0m9N7p2Q8j04J20j40J64j92K22k55K91l31L78
33B01m28M82n43O13o90P73q63R61j068J184j313J455j606J773j957K158k378K619
51A373k885L177l504L871m281M745n277N889o606P461q498R788j1441J3649j6772
66i311K1561k9919M8775j72860l3964J20861q6131J41866R362o6545N0203J11694
78A05592k3754l1017N1006m3361j23520J18915L5687j23253N6371n097j40306
89a22737Q1604R3310m0517n210K4298o7533p9243P5516N9328p5866P7647N9846
101H0443j00978Q6969J06856q4692n32J0670j02925m3822N4247J1680p1269R223
113d4130J7462j13445L8526J13335o7684K8550Q0784p9420L994Q1023k1228l8766
$$ plain form
125 -999 13295 15038 -43469 -10588 84585 22118 2970 59373 -49571 -86581 -6019 -53226
137 -53226 -76767 -25911 -39021 -60382 -18175 40335 14852 6596 74175 27938 7767 106889
149 106889 67657 17142 62961 5802 -48033 -9335 385 -20050 -15524 18195 -7315 -37228
161 -37228 26203 2091 -54798 7020 -13601 -54598 21181 30517 1801 26951 28190 876
173 876 -10615 23275 19823 -25286 14385 6200 -58295 -9782 -8233 -61827 -19070 -8250 -30481
186 -30481 1015 25861 24081 6802 19966 23150 -23164 8460 32370 -18811 15204 30925
198 30925 -20135 2363 10370 -19659 -14329 -7984 -6032 -16323 -2748 21656 -13708 -3762 23976
211 23976 -19826 656 32458 -961 16164 28895 5148 4908 1305 1519 -12075 -16950 8542
$$ packed form
125i99J4294J743n8507L2881R5173o2467j9148N6403j08944l7010Q0562m7207
137e3226k3541N0856j3110k1361M2207N8510k5483q256O7579m6237k0171R9122
149A06889l9232n0515M5819n7159n3835L8698R720k0435M526L3719k5510k9913
161c7228O3431k4112n6889O1818k0621m0997P5779R336k8716K5150J239k7314
173H76j1491L3890l452m5109L9671q185o4495M8513J549n3594M2757J0820k2231
186c0481L1496K4846j780j7279J3164L184m6314L1624K3910n1181L4015J5721
198C0925n1060K2498Q007l0029N330O345J952j0291J3575K4404l5364R946K7738
211B3976m3802K0482L1802l3419J7125J2731k3747k40l603K14j3594m875K5492
$$ plain form
224 8542 -14798 -15035 19049 -15972 -15771 9572 -20817 -11597 6129 -3800 5537 4799 10312 5900
238 5900 -9287 12411 -3358 -16821 15654 -5782 -11129 16409 -6753 -5035 5869 -6778 2645
251 2645 -628 4783 11950 -5446 11683 6741 -14347 10628 -2048 -12738 12277 -3459 -2318
264 -2318 8367 -6534 731 -6958 -10600 779 -16267 -3553 4838 -12761 9298 7137 -4519
277 -4519 17043 5473 4271 15067 -570 7260 1939 -8312 4153 -11964 -8788 3331 -14948
290 -14948 148 3271 -9832 8612 -384 -3151 9883 -5607 2835 4523 -8372 7026 -2830
303 -2830 -5122 10143 -6488 2243 7571 -8535 5656 -1845 -8557 6290 -7989 -318 7969 -6126
317 -6126 8994 3934 -3715 11076 -3368 849 9867 -6085 6399 2351 -9032 3726 -10870
$$ packed form
224H542k3340k37L4084l5021K01K5343l0389R220J7726r929R337p38N513m412
238E900j5187K1698j5769j3463L2475k1436n347K7538k3162J718J0904j2647R423
251B645l273N411P167j7396J7129m942k1088K4975j2676j0690K5015j5736J141
264b318J0685j4901P265p689l642J1379j7046J2714Q391j7599K2059k161j1656
277d519K1562j1570j202J0796j5637P830n321j0251J2465j6117L176J2119j8279
290a4948J5096L123j3103J8444q996k767J3034j5490Q442J688j2895J5398r856
303b830k292J5265j6631Q731N328j6106J4191p501o712J4847j4279P671Q287j4095
317f126J5120n060p649J4791j4444M217R018j5952J2484m048j1383J2758j4596
$$ plain form
330 -10870 -9871 -110 -14111 -372 1379 -7315 8985 -2137 -2326 9210 -5785 5745 9455 -1411
344 -1411 13168 3828 -467 7375 -9306 -1813 391 -10732 6875 395 -3568 9839 -7079 -4434
358 -4434 337 -13671 -622 -1862 -3183 10323 -945 5437 8396 -8490 5892 828 -8537 8939
372 8939 -2443 -4090 4745 -10358 -4255 -5241 -8721 5949 -166 10212 19830 2247 14345 8448
386 8448 -12140 1781 -6795 -13298 1164 -5080 -25 1500 -3839 4361 -8198 -4149 7123 -9957
400 -9957 4653 11543 -9227 4534 2170 -11655 953 1045 4640 9614 9672 19015 2989 -1036 6988
415 6988 -20835 -15758 -2154 -22258 -5965 6381 -6472 2598 3660 146 -1695 -2495 10394 -1065
429 -1065 -1154 18447 -6343 -8014 9563 -15342 -9799 8824 -2579 3810 11133 8403 893 -6040
$$ packed form
330a0870R99R761j4001J3739J751q694J6300j1122j89J1536j4995J1530L710j0866
344a411J4579r340m295P842j6681P493K204j1123J7607o480l963J3407j6918K645
358d434M771j4008J3049j240j321J3506j1268O382K959j6886J4382n064r365J7476
372H939j1382j647Q835j5103O103r86l480J4670o115J0378R618j7583J2098n897
386H448k0588J3921q576o503J4462o244N055J525n339Q200j2559M049J1272j7080
400i957J4610O890k0770J3761k364j3825J2608R2L595M974N8R343j6026m025Q024
415F988k7823N077J3604k0104J6293J2346j2853R070J062l514j841q00J2889j1459
429a065q9J9601k4790j671J7577k4905N543J8623j1403O389P323k730p510o933
$$ plain form
443 -6040 4023 -11471 -17047 11830 -2193 -2100 29709 9975 2386 18138 1932 -4852 2805 4872
457 4872 -3464 -10217 4585 -10148 -25293 2839 -11852 -25997 9237 1598 -7113 19600 13254
470 13254 -3102 -1855 755 -7380 -12285 13537 9693 -11257 16915 8014 -20229 8238 1270
483 1270 -24261 -4621 -1185 -11766 -3394 9308 485 -18264 1206 4437 -16423 19720 29351
496 29351 -3924 18793 21667 -9044 4549 12913 -5892 -10850 3312 4487 -12041 8707 15047
509 15047 -25332 -9157 7294 -23299 3913 28476 -185 2949 15537 -806 -10046 5617
521 5617 7997 -20440 -8437 11680 -20480 -6154 18405 -23671 -23170 1976 -18870 -12403 16423
534 16423 10267 -7590 868 11046 -13088 -3644 26864 -5792 -7042 28540 1258 -2183 27195
$$ packed form
443f040J0063j5494n576K8877j4023R3L1809j9734p589J5752j6206o784P657K067
457D872q336o753J4802j4733j5145K8132j4691j4145L5234p639q711K6713o346
470A3254j6356J247K610q135m905K5822l844k0950K8172q901k8243K8467o968
483A270k5531J9640L436j0581Q372J2702q823j8749J9470L231k0860L6143R631
496B9351l3275K2717K874l0711J3593Q364j8805m958J4162J175j6528K0748O340
509A5047m0379J6175J6451l0593K7212K4563k8661L134J2588j6343r240J5663
521E617K380k8437J2003K0117l2160J4326K4559m2076N01K5146k0846O467K8826
534A6423o156j7857Q458J0178k4134R444L0508l2656j250L5582k7282l441K9378
$$ plain form
547 27195 1489 -18986 -3978 -3929 -15313 -1170 20303 -5700 -15283 15990 -8028 -16211 26143
560 26143 6015 -11764 19589 11560 -4559 12427 15368 -9651 -14960 8550 -4669 -14211 23181
573 23181 4326 -26354 5307 -5788 -28795 3852 7656 -13041 -1006 14529 1528 -5307
585 -5307 17823 3369 -26266 4261 3394 -23792 10855 12615 -21176 -3642 5240 -12887 -4131
598 -4131 16085 7303 -8796 12768 13918 -15768 8032 14008 -23270 -1051 15633 -8052 8826
611 8826 24260 3458 -5002 6071 1962 -16916 401 10509 -21336 -5971 13750 -17936 -3918
624 -3918 17111 -9342 -5131 14206 4797 -1734 9934 10103 -15204 -9916 7230 -18659 -8811 18970
638 18970 -7888 -5282 19407 -1278 -6105 9233 388 -12348 -4314 6695 -8773 -7140 14885
$$ packed form
547B7195k5706k0475J5008M9j1384J4143K1473k6003r583L1273k4018q183M2354
560B6143k0128j7779L1353q029j6119J6986K941k5019n309K3510j3219r542L7392
573B3181j8855l0680L1661j1095k3007L2647L804k0697J2035J5535j3001o835
585e307K3130j4454k9635L0527q67k7186L4647J760l3791J7534Q882j8127Q756
598d131K0216q782j6099K1564J150k9686K3800N976l7278K2219J6684k3685J6878
611H826J5434k0802q460J1073m109j8878J7317J0108l1845J5365J9721l1686J4018
624c918K1029k6453M211J9337r409o531J1668J69k5307N288J7146k5889R848K7781
638A8970k6858K606K4689k0685m827J5338q845j2736Q034J1009j5468J633K2025
$$ plain form
651 14885 -8192 -13364 14611 -4245 -9206 16126 2219 -7605 5097 2736 -7971 -5844 7209
664 7209 -3652 -8829 17160 5988 -5627 19461 4471 -11425 8067 29 -10670 213 2680
677 2680 -4520 -6793 6417 1112 -11717 9004 4429 -12723 10184 5476 -11493 4632 1459
690 1459 -9669 -2638 2031 -486 -4745 6524 7716 -7487 7068 8019 -12660 2852 4775 -11159
704 -11159 2431 5028 -3589 121 3375 2936 -3355 2484 7833 -8151 -29 7348 -11143 -1188
718 -1188 4898 -10748 -2373 2091 -3741 -42 1521 4130 -1897 -1413 8064 -4115 -1122 10076 -5930
733 -5930 -989 7790 -4400 1444 4473 -1365 -135 -1764 1784 -1713 -5045 4872 -4327 -6297 6637
748 6637 -4197 -2399 6845 -3764 -821 2483 -1651 1658 -519 2390 2078 -4208 4721 764 -4787
$$ packed form
651A4885k3077n172K7975j8856m961K5332j3907r824J2702k361j0707K127J3053
664G209j0861n177K5989j1172j1615K5088j4990j5896J9492q038j0699J0883K467
677B680p200k273J3210n305j2829K0721m575j7152K2907m708j6969J6125l173
690A459j1128P031M669k517m259J1269J192j5203J4555R51k0679J5512J923j5934
704a1159J3590K597q617L710L254m39o291N839N349j5984Q122P377j8491R955
718a188O086j5646Q375M464n832L699J563K609o027M84R477j2179K993J1198j6006
733e930M941Q779j2190N844L029n838J230j629L548l497l332R917r199j970J2934
748F637j0834J798R244j0609K943L304m134L309k177K909l12o286Q929l957n551
$$ plain form
763 -4787 6498 -1193 -3263 6273 -1353 722 3489 -1950 1204 -2998 -1359 2387 -4531 2864 2245
778 2245 -5795 3150 -1452 -5706 2253 -4048 -2113 1999 -2909 2718 -547 -1982 2925 -4617 -24
793 -24 3659 -3336 5207 3434 -2053 5151 -1502 -1317 2538 -3488 2465 1673 -1373 5074 -2015 -1512
809 -1512 2031 -6168 -10 864 -3613 4473 287 -755 3196 -4163 -425 -137 -4675 3451 14 -368
825 -368 5567 -2330 454 1399 -5144 1926 -17 -1258 6066 -78 2283 3164 -4480 1230 -1989 -4555
841 -4555 2771 -2296 -151 3584 -4360 631 -1687 -5970 1262 -2791 -102 4800 -1183 4019 1705
856 1705 -3920 2765 -2747 -1918 4620 -841 4231 4789 -1211 3158 -2257 -3674 813 -4764 898 2138
872 2138 -3294 3922 -1374 -4928 1689 -4876 -1747 2758 -1147 4357 1999 -354 2623 -4682 -1391
$$ packed form
763d787J1285p691k070R536p626K075K767n439L154m202J639L746o918P395o19
778B245q040Q945m602m254P959o301J935M112m908N627l265j435M907p542M593
793b4L683o995Q543j773n487P204o653J85L855o026N953p92l046O447p089N03
809a512L543q199O158Q74m477Q086m186j042L951p359L738K88m538Q126l437l82
825c68N935p897K784R45o543P070j943j241P324o144K361Q81p644N710l219k566
841d555P326n067K145L735p944M991k318m283P232m053K689M902n983N202k314
856A705n625O685n512Q29O538n461N072N58o000M369n415j417M487n577N662J240
872B138n432P216n296l554O617o565L129M505l905N504k358k353K977p305L291
$$ plain form
887 -1391 840 -4520 4452 3256 -872 6484 354 -1655 1377 -3452 -41 100 139 5618 -131 2006
903 2006 3811 -6220 398 669 -5506 3900 1215 -2467 1675 -3058 -3078 -4176 -5261 121 -4745 -92
919 -92 6909 -2468 2823 4124 -6733 -201 606 -3230 3524 2696 3050 1716 -497 3803 -3911 -2865
935 -2865 4679 -5493 -654 6832 -3471 228 2632 -5504 -2945 -1238 1184 1916 2356 8399 747
950 747 -1620 6780 -3986 -3932 6118 -4148 -1718 6148 323 354 714 -764 -4108 -6282 3475 -851
966 -851 -3533 8326 -2164 -7233 4722 -3842 -5994 3648 -682 -2342 1184 3744 295 -4937 2139
981 2139 -4221 -11406 4419 950 -5009 9349 2945 -4981 4098 2461 -939 1311 5252 2949 -2873
996 -2873 7357 5515 -6727 5083 1431 -11233 2907 3881 -4257 3594 3273 -4515 -5852 -577
$$ packed form
887a391K231n360Q972j196m128P356o130k009L032m829L411J41L9N479n749K137
903B006J805j0031O618K71o175R406k685l682M142m733k0j098j085N382m866M653
919i2P001r377N291J301j0857O532Q07l836O754q28L54j334k213M300p714J046
935b865P544j0172M839P486j0303L699K404q136K559J707K422P32M40O043p652
950G47k367Q400j0766N4J0050j0266K430P866n825L1L60j478l344k174R757m326
966h51k682J1859j0490n069J1955q564k152R642m330j660L526K560l449n232P076
981B139o360p185J5825l469n959J4358o404p926R079j637l400K250L941k303n822
996b873J0230j842j2242J1810l652j2664J4140R74q138P851l21p788j337N275
$$ plain form
1010 -577 -486 -7236 2788 5191 -8100 4428 8365 -6939 2592 4753 -8052 -1835 4161 786
1024 786 -1499 2975 2181 -10083 -2354 5083 -9304 571 9252 -7091 -217 8304 -3317 -1612
1038 -1612 3884 -715 -5222 1715 7405 -3333 616 9146 -8401 -5279 7805 -6187 -2832 8788
1052 8788 -1551 -3266 4154 2933 -3500 -546 6469 -4528 -3505 11252 -1415 -3764 10120 -3853
1066 -3853 -8567 3876 -2279 -6096 1353 2401 -5153 -5072 4597 -4084 -8079 7995 -1371 -7797 9610
1081 9610 2508 -4570 7852 3588 -4494 330 4406 -989 -2594 8511 1575 -8330 6023 677
1095 677 -10430 5367 2485 -8226 3008 3741 -3075 74 4896 -29 -6532 4147 3146 -7886
1109 -7886 5992 5612 -9908 1886 3115 -8715 -348 3558 -3250 -3275 2976 1935 -5454 3093 5455
$$ packed form
1010e77R1o750J0024K403j3291J2528L937j5304R531K161j2805O217N996l375
1024G86k285M474p94j2264P729P437j4387R875Q681j6343O874Q521j1621J705
1038a612N496m599m507O937N690j0738L949Q530j7547L122J3084j3992L355J1620
1052H788j0339j715P420j221o433K954P015j0997J023J4757j2667k349J3884j3973
1066c853m714J2443o155l817P449J048p554Q1R669q681l995J6074r366o426J7407
1081I610p102p078J2422m264q082M824M076n395j605J1105o936r905J4353n346
1095F77j1107J5797k882j0711J1234P33o816L149M822m925o503J0679j001j1032
1109g886J3878l80j5520J1794J229j1830Q367L906o808k5O251j041p389Q547K362
$$ plain form
1124 5455 -8217 1424 7128 -6779 2635 8045 -4585 -1371 3620 -2057 -3886 1448 2694 -6388
1138 -6388 -1434 5562 -6993 -1290 7525 -6465 -2089 7071 -1902 82 6238 2142 -2046 1459
1152 1459 5285 -2685 -727 8175 -4116 -3801 7270 -4117 -4022 4990 -3867 -5228 522 -109 -2970
1167 -2970 -1401 3891 -2853 -4618 6541 -1130 -4001 7153 -1540 -4966 4487 -207 -2607 1535
1181 1535 888 -2023 -2676 3708 487 -4285 5085 139 -6139 5464 1257 -3968 4214 704 -2706
1196 -2706 801 2493 1318 -1695 2732 1208 -5847 2668 1414 -6232 2387 427 -5553 2104 1709
1211 1709 -765 880 1238 1063 -2005 2196 4449 -3078 2303 3689 -5279 1619 2650 -3704 1173
1226 1173 617 -1730 -336 -245 1074 -3060 -2410 925 -5688 -1500 3507 -3451 790 3172 -2674 1047
$$ packed form
1124E455j3672R641N704j3907R414N410j2630L214M991n677j829N334J246r082
1138f388M954O996j2555N703Q815j3990M376R160q973J984O156m096m188L505
1152A459L826p970J958Q902j2291L15J1071j1387R5R012q857j361N750o31k861
1167b970J569N292o744j765J1159p671k871J1154q693l426R453m694k400M142
1181A535o47k911o53O384l221m772R370m946o278J1603m207n225Q182l510l410
1196b706L507J692j175l013M427j524p055Q515j254p646Q619j960n980P657l95
1211A709k474J645L58j75l068M201K253p527N381J386q968O898J031o354M877
1226A173n56k347J394R1J319m134O50L335o613M188N007o958M241K382n846L721
$$ plain form
1242 1047 1524 -251 1059 -118 2039 -367 -957 3831 -2058 -1645 3189 -3237 -420 3706 -1137 1396
1258 1396 1265 -1104 -123 -2079 388 -446 -2512 2960 -215 -1363 4255 -1440 -1264 2225 -2311 -9
1274 -9 1026 -319 1694 -833 332 694 -3003 1456 440 -2075 3592 -16 -585 2664 -1755 -840
1290 -840 -311 -2407 617 -1155 185 2297 -2034 967 174 -3607 798 -1082 -1921 2013 -1133 160
1306 160 839 -1907 979 -774 -987 2636 -429 2021 3502 -767 2432 298 -2048 1279 -1407 -318
1322 -318 1908 -975 1696 448 -1791 835 -2610 -1728 818 -2331 767 834 -2025 1535 -1224 -1572
1338 -1572 1231 -1729 1440 2184 3 3590 420 -715 1595 -2611 -629 619 -1931 2058 345
1353 345 -1023 1586 -2016 -808 126 -2581 1548 473 -491 2778 -1021 -204 783 -2673 294 179
$$ packed form
1242A047M77j775J310j177K157k406n90M788n889M13M834o426K817M126m843K533
1258A396j31k369R81j956K467q34k066N472l175j148N618n695J76L489m536K302
1274iJ035j345K013k527J165L62l697M459j016k515N667l608n69L249m419R15
1290h40N29k096L024j772J340K112m331L001p93l781M405j880q39L934l146J293
1306A60O79k746K886j753k13L623l065K450J481m269L199k134k346L327k686J089
1322c18K226k883K671j248k239K626l445Q82K546l149L098O7k859L560k759l48
1338a572K803k960L169P44k181L587l170j135K310m206J982J248k550L989j713
1353C45j368K609l602J208R34k707M129j075r64L269l799Q17R87l456K967j15
$$ plain form
1369 179 -906 2587 -19 413 1230 -2623 3 -884 -2689 1901 -271 63 3006 -866 674 847
1385 847 -1677 1012 -290 475 2254 -1097 1361 525 -2986 529 -1771 -2524 1381 -1094 304 1755
1401 1755 -986 591 -842 -1392 1015 -1504 1436 2858 -609 3134 1427 -1578 1694 -895 -1124
1416 -1124 841 -590 728 14 -1093 416 -3254 -1695 -11 -3630 993 1483 -2069 1779 443
1431 443 -1508 543 -527 328 118 -229 2377 -863 352 2458 -3307 -599 1197 -2687 1448 2712
1447 2712 310 1631 492 456 -610 -1139 2052 -1703 -1178 3187 -1717 -167 2714 -2426 -1058 631
1463 631 -1634 7 487 1335 -526 -1970 1018 -2324 -2517 3133 -1243 -913 4162 -140 144 2963
1479 2963 -393 -894 -885 -52 -905 -1872 2426 -857 -3610 2109 -1633 -3478 3000 -33 -1620 2133 541
$$ packed form
1369A79j085L493k606M32Q17l853K626q87j805M590k172L34K943l872J540J73
1385H47k524K689j302P65J779l351K458q36l511L515k300p53L905k475J398J451
1401A755k741J577j433n50K407k519K940J422l467L743j707l005L272k589k29
1416a124J965j431J318p14j107J509l670J559J684l619M623M90l552L848j336
1431D43j951K051j070Q55k10l47K606l240J215K106n765K708J796l884M135J264
1447B712k402J321j139l6j066n29L191l755N25M365m904J550K881n140J368J689
1463F31k265J641M80Q48j861j444K988l342j93N650m376L30N075m302K84K819
1479B963l356n01RQ33q53r67M298l283k753N719l742j845O478l033j587L753j592
$$ plain form
1496 541 -639 -235 1156 -509 -2549 2480 1409 -2358 4214 1748 -3014 2837 285 -2968 670
1511 670 706 -592 -473 1657 971 -2577 1802 1430 -4001 2006 1851 -4102 1465 1458 -2892 -298 705
1528 705 -1280 -2110 1020 1885 -2399 1513 2695 -4547 -155 2196 -4179 670 2973 -1626 293 2741
1544 2741 1234 -467 1732 2755 -2996 -500 2922 -3883 -1071 3376 -4296 -2239 2004 -1897 -619
1559 -619 2612 1584 -1372 88 2864 -2214 -1172 3700 -3135 -2500 4004 -1309 -529 4257 231 -1446
1575 -1446 634 1032 -1270 -746 2709 -2714 -4166 2461 -2162 -3002 4301 -821 -2780 2670 989 -586
1591 -586 1433 2331 -1555 -2886 2192 -560 -2867 3851 -241 -4107 2968 685 -2146 2796 1613
1606 1613 -1849 -885 1687 176 -1339 3085 871 -3766 2645 1675 -3068 3025 1561 -3705 -407
$$ packed form
1496E41j180M04J391j665k040N029j071l767O572k466m762N851k552l253L638
1511F70L6j298J19K130o86l548M379l72n431O007j55n953N567pm350K594J003
1528G05j985q30L130Q65m284L912J182p242M392K351o375M849K303m599J919K448
1544B741j507j701K199J023n751K496L422o805K812M447p672K057M243l901J278
1559f19L231j028k956J460K776n078J042M872o835O35O504n313P80M786m026j677
1575a446K080L98k302N24L455n423j452O627m623q40P303n122j959N450j681j575
1591e86K019Q98l886j331N078k752k307O718m092l866P075k283k831M942j183
1606A613l462R64K572j511j515M424k214m637O411r70m743O093j464n266L298
$$ plain form
1621 -407 473 -1899 -1153 973 -616 -3910 711 1709 -3062 2527 3094 -3553 945 2516 -1452 1351
1637 1351 2502 -524 -1716 792 1351 -1926 1145 2357 -4007 -758 2186 -3121 170 2426 -2340
1652 -2340 -1543 840 -319 -648 1357 2098 -1913 -200 3674 -1595 493 3992 -2402 -1596 1709 -1245
1668 -1245 -689 1545 181 -1499 -942 1784 -812 -569 3345 -1516 -1890 3093 -648 -694 2460 -971
1684 -971 -2075 -333 -147 -736 -825 1448 -1174 -2948 1631 -809 -2210 2646 -680 -1919 1902 449
1700 449 156 1387 1111 -400 -1329 1557 976 -1499 2725 570 -2722 1272 -83 -2042 893 -431
1716 -431 -1195 -442 128 701 -904 809 789 -2462 1082 1543 -1494 2057 1166 -1659 357 -161 -443 -23
1734 -23 69 654 -1086 147 1907 -1631 446 1239 -2553 183 961 -1077 1201 360 -373 -411 -893 415
$$ packed form
1621d07Q80k372P46K126j589l294M621R98m771N589N67o647M498J571l968K803
1637A351J151l026j192K508N59l277L071J212o364L249K944n307L291K256m766
1652b340P97K383j159l29K005P41m011J713L874n269K088L499o394Q06L305k954
1668a245N56K234j364j680N57K726k596K43L914m861l74M983l741m6L154l431
1684i71j104J742J86n89q9K273k622j774M579k440j401M856l326j239L821j453
1700D49k93J231k76j511r29K886n81k475M224k155l292L994j355j959K935j324
1716d31p64P53N70N73j605J713k0l251L544M61l037L551q91k825K016n18k82M20
1734b3R2N85j740J233J760l538K077P93l792K736P78k038K278q41p33l8m82J308
$$ plain form
1752 415 -1065 -727 1332 -1563 -250 1584 -1762 -42 734 -1263 429 646 730 1490 744 1507 -37
1769 -37 -870 1275 -1045 -959 1363 -1361 -498 642 -1404 35 -148 -801 284 -682 832 598 -795
1786 -795 1078 -622 -1507 852 -971 -252 1270 -173 977 805 -108 543 -1151 -309 -229 -1583 776
1803 776 101 -791 1428 -221 -193 1133 -103 766 686 -423 790 -818 -1007 -80 -2177 -685 -73 -1380
1821 -1380 1240 475 62 1526 -489 -71 264 -943 827 69 -45 1854 -168 953 1232 -738 917
1838 917 89 -1151 600 -1150 -785 -351 -2251 -622 -973 -1227 1156 166 986 1945 -104 1001 354
1855 354 -1144 73 -1093 -710 508 -480 719 670 -406 1129 -231 -408 945 -860 148 401 -1421
1872 -1421 230 -544 -824 787 -564 832 1455 70 1394 139 -1044 141 -2064 -1288 -403 -1728
$$ packed form
1752D15j480L38K059k895J313J834l346J720P76j997J692K17Q4P60p46P63j544
1769c7q33K145k320Q6K322k724Q63J140k046J439j83o53J085r66J514k34j393
1786g95J873j700q85K359j823P19J522j443J150j72r13O51j694Q42Q0j354K359
1803G76o75q92K219j649K8J326j236Q69q0j109J213j608j89R27k097J492O12j307
1821a380K620p65m13J464k015M18L35j207J770p58j14J899k022J121K79j970J655
1838I17q28j240J751j750L65M34j900J629l51k54K383r90Q20R59k049J105o47
1855C54j498J217j166L83J218r88J199m9j076J535j360j77J353j805J008K53j822
1872a421J651p74k80J611j351J396O23j385J324j255j183J185k205P76Q85j325
$$ plain form
1888 -1728 316 127 -151 1442 432 941 1319 -287 1247 616 -433 1350 -440 -708 581 -1166
1904 -1166 83 544 -279 957 -208 -248 -88 -1944 -635 -691 -1814 656 -45 -1 1831 298 702 1058
1922 1058 -448 615 -656 -365 450 -1357 -111 47 -1698 690 334 -632 1597 405 425 722 -433
1939 -433 161 -769 -1082 39 -1047 143 1108 -936 1107 952 -822 716 -149 -926 47 -671 143 -483
1957 -483 -299 844 -775 172 1821 -387 929 1911 -522 846 338 -854 -512 -1104 -503 -1028 -948 790
1975 790 -713 -631 1407 -1312 -270 1115 -1026 388 998 -157 150 20 653 -134 -600 1298 -605
1992 -605 -885 1727 -631 -774 1385 -801 -538 730 -330 195 89 529 37 -1297 1061 -113 -1523
2009 -1523 1200 -528 -1413 1491 68 -685 726 -263 -699 -747 350 -5 -1228 993 322 -1649 1569
$$ packed form
1888a728K044j89k78J593j010N09L78j606J534o31j049J783j790k68J289j747
1904a166J249M61q23J236j165m0J60j856J309n6j123K470p01M4J832j533M04L56
1922A058j506J063j271K91Q15j807J246J58j745K388l56r66K229j192K0K97j155
1939d33N94r30l13J121j086J190R65k044K043j55j774J538q65p77R73p18Q14o26
1957d83J84J143j619R47J649k208J316R82k433J368n08j192L42n92O01n25Q0J738
1975G90j503Q2K038k719J042J385k141J414O10j155L07j30O33p87m66J898j903
1992f05k80K612k358j43K159k186K63J268j060N25j06M40m92j334K358j174j410
2009a523K723j728q85K904j423p53J411r89m36m8J097l55j223K221o71j971L218
$$ plain form
2026 1569 795 -729 1919 790 -653 752 464 -29 -555 -18 -382 -1991 378 503 -1851 859 508
2043 508 -2066 836 757 -499 591 413 86 -486 633 1194 -1008 714 1058 -2092 439 1713 -1230
2060 -1230 303 624 -1414 -318 386 504 -348 -7 696 -1648 -39 2011 -1032 5 1342 -1941
2076 -1941 -539 1212 -213 -62 -42 -153 -1218 -337 1536 -691 -677 1385 -1721 -842 2304 85 390
2093 390 1437 -332 -414 535 1066 -132 -847 409 -1526 -1651 1637 -475 -1294 1032 -1359 -1361 996 847
2111 847 400 87 210 -529 -896 1973 733 -1188 1208 -666 -1854 1846 783 -632 531 -881
2127 -881 -1173 -463 967 864 -779 508 -136 -1919 1861 1240 -1377 843 -513 -1746 388 811 81
2144 81 -533 -622 -527 -1598 924 1696 -1161 671 328 -1593 1144 1621 -60 541 230 -295 -127 965
$$ packed form
2026A569p74j524K648j129j443J405k88m93n26N37l64j609K369J25k354K710l51
2043E08k574K902p9j256J090j78l27n72J119N61k202J722L44l150K531J274k943
2060a230J533L21k038J096P04J18q52L41P03k344J609K050l043J037J337l283
2076a941J402J751j425J51K0j11j065Q81J873k227J4K062l106Q79L146k219L05
2093C90J047j769q2R49N31j198p15J256j935j25L288k112q19K326k391kK357j49
2111H47m47l13J23p39l67K869j240j921K396j874j188L700j063j415J163j412
2127h81k92P10J430j03j643J287o44j783L780o21k617K220j356j233K134M23p30
2144H1o14q9R5j071K522P72k857J832l43j921K737M77j681O01l11n25J68J092
$$ plain form
2162 965 1216 -1149 -694 116 -2184 63 1701 -905 -30 -78 -1463 -211 688 706 -141 -322 639 -867
2180 -867 361 2096 -700 -283 923 -1242 172 1373 0 -95 -262 -597 -845 -438 1282 -308 -592
2197 -592 1029 -777 -245 1958 -132 -348 405 -901 -421 272 438 -141 -1019 162 -473 -964 1603 172
2215 172 -540 1143 -457 -581 1152 26 -22 -99 -29 252 -72 1082 926 -1080 818 -428 -1504 574
2233 574 -300 -1060 249 -726 -288 -50 -18 342 -461 206 702 -719 979 783 -895 646 -275 -862 529
2252 529 92 228 336 8 519 -349 -160 480 -1341 -174 338 -1035 545 422 -443 471 72 -348 112
2271 112 -119 508 -257 -368 601 -815 -370 411 -1000 267 678 -407 939 192 253 543 -352 414 -141
2290 -141 -465 797 -138 -185 771 -611 190 356 -776 -16 -526 -449 443 -652 143 92 -668 357 -422
$$ packed form
2162I65K51k365M55Q10k300K247J638k606Q75m8j385J252Q99J8q47j81R61j506
2180h67J228J735k796M17J206k165J414J201j373r5j67l35k48M07J720j590k84
2197e92J621j806N32K203k090k16P53j306M80O93J66n79q78J181o35m91K567j431
2215A72p12J683j600j24J733j126m8p7P0K81l24J154j56k006J898j246j076K078
2233E74q74p60J309r75M38K38L2L60q03O67M96j421J698j96j678J541r21n87J391
2252E29m37J36J08l28N11q68J89O40j821J167N12j373J580j23q65R14l99m20M60
2271A12k31O27p65j11R69j416M45P81j411J267M11j085J346p47O1K90q95P66n55
2290a41l24J262r35m7R56j382Q01J66j132P60n10P7Q92j095P95n1p60J025p79
$$ plain form
2309 -422 -363 1147 -176 419 917 -133 422 -12 -391 384 -527 57 444 -494 427 -264 -859 262 -522
2328 -522 -379 369 -466 202 270 -261 399 -465 -273 354 -684 627 141 -623 413 -69 -315 599 -255
2347 -255 228 264 -141 624 63 -105 526 -756 -53 471 -460 536 17 -124 469 -530 -295 -57 -1006 287
2367 287 -83 -383 739 -365 -88 312 -557 433 304 -180 779 48 26 326 -562 329 -53 -174 584 -142
2387 -142 -86 641 -423 -11 131 -860 151 -371 -236 300 -522 393 280 -457 707 -289 -234 469 -580
2406 -580 66 387 -524 294 78 -133 651 -205 290 562 -76 859 170 -494 378 -596 -445 262 -583 -68
2426 -68 -45 -548 545 -321 -77 308 -559 362 256 -582 672 -283 -155 673 -409 138 256 -187 430 -201
2446 -201 -84 342 -818 -79 215 -784 629 348 -165 773 -92 255 225 -273 176 -346 -495 348 -760
$$ packed form
2309d22N9J510j323N95M98j050N55m34l79P75r11N84L87r38R21o91n95J121p84
2328e22J43P48q35O68O8n31O60q64J92O27j038J311m86p64J036m82k46R14q54
2347b55M83L6m05P65n61j68O31j282P03N24r31R96n19j41N93r99K35K38r49J293
2367B87l70l00J122j104K77M00q69R90j29m84R59p31k2L00q88Q91l82j21P58p26
2387a42N6P27j064M12J42r91J011n22J35N36q22R15j13p37J164r96N5P03j049
2406e80O46L21r11Q18k16k11P84q56M95K72o38R35o89o64Q72r74J51P07q45N15
2426f8K3n03J093q66K44L85q67R21j06q38J254r55J28Q28j082N47J18m43O17o31
2446b01J17M26j160P39K94r99J413k81n13R38q65L47l0m98M49n22j49Q43j108
$$ plain form
2465 -760 169 353 -806 519 341 -429 578 257 -160 197 -470 195 -73 -150 743 -437 195 804 -461
2484 -461 355 481 -762 12 -489 -581 -216 -532 13 -484 -556 527 -314 -78 1150 -314 162 746 -379
2503 -379 238 354 -108 15 -319 234 7 -316 805 -241 -536 744 -430 -367 571 -272 -65 143 -244
2522 -244 48 -22 200 283 -564 516 -142 -754 765 -130 -577 300 -300 -236 59 -124 -66 -137 197 84 -574
2543 -574 658 254 -575 743 224 -483 617 2 -138 247 -13 -171 -601 -360 99 -717 198 6 -968
2562 -968 622 496 -580 639 244 -191 -54 61 308 -52 239 369 -632 -5 648 -791 313 429
2580 429 -793 68 197 -308 40 -218 -78 -369 -230 565 -222 200 1018 -600 -157 820 -466 -47 251
2599 251 -404 -227 -82 359 37 -244 728 -631 -530 845 -369 -208 931 -460 -339 425 -61 166
$$ packed form
2465g60R29J84j159J325j78p70J007l21m17L57o67O65k68p7Q93j180O32O09j265
2484d61Q16J26j243P74n01r2L65l16N45m97p2J083q41K36J228j464M76N84j125
2503c79O17J16m62J23l34N53k27l23J121j046k95J280j174O3R38q43K07K08l87
2522b44K92p0K22Q3q47J080o58o12J519q95m47Q77o00O4K95j83N8p1L34j13o58
2543e74J232m04q29J318n19p07J100o15j40L85k60j58m30K41M59q16R15j92r74
2562i68J590j26j076J219l95m35J37J15K47l60K91J30j001O27O53j439J104J16
2580D29j222Q61J29n05L48k58J40k91J39P95p87M22Q18j618M43R77j286M19K98
2599B51o55J77J45M41l22k81R72j359J01J375j214J61J139j391J21P64m86K27
$$ plain form
2617 166 -1 84 -368 -479 448 -207 -553 640 -741 -917 557 -480 60 596 -41 -192 -397 518 220
2636 220 -231 505 8 -428 773 199 -342 650 -179 -664 170 -53 35 -41 88 -59 -872 269 86 -710
2656 -710 393 52 -676 410 -89 -156 422 30 86 -106 146 612 -266 116 281 -754 230 615 -649
2675 -649 238 49 -589 179 -8 175 40 102 317 -748 -116 686 -683 -24 301 -871 52 352 -373
2694 -373 338 130 90 134 -336 395 -543 -121 679 -636 -64 630 12 311 430 -115 -5 9 -69 137 -563
$$ packed form
2617A66j67Q5m52j11R27o55l46J193j381j76J474j037N40N36o37j51k05R15k98
2636B20m51P36m97m36J201n74n41R92q29m85Q34k23Q8p6J29j47q13J141j83p96
2656g10J103l41p28J086m99o7N78l92N6j92K52M66q78L82J65j035R84L85j264
2675f49Q87j89o38P68j87J83j35O2K15j065O32Q02j369O59L25j172R23L00p25
2694c73P11k08m0M4m70P31r38M22Q00j315N72O94o18K99J19n45J10J4p8K06p00
$$ [...]
8191A93
##END NTUPLES=NMR FID
##END=
