##TITLE=1H_84-2021
 CDCl3, 8 sc, 
 26.08.2021
##JCAMPDX= 6.0         $$ Bruker NMR JCAMP-DX V2.0
##DATA TYPE= NMR FID
##DATA CLASS= NTUPLES
##ORIGIN= UXNMR, Bruker Analytische Messtechnik GmbH
##OWNER= root
$$ XWIN-NMR		Version 3.5
$$ Thu Aug 26 11:08:07 2021 Russian Standard Time (UT+4h)  she@DPX200
##.OBSERVE FREQUENCY= 200.131506
##.OBSERVE NUCLEUS= ^1H
##.DELAY= (6, 6)
##.ACQUISITION MODE= SIMULTANEOUS
##.ACQUISITION SCHEME= undefined
##.AVERAGES= 8
##.DIGITISER RES= 18
##SPECTROMETER/DATA SYSTEM= spect
##.PULSE SEQUENCE= zg30
##.SOLVENT NAME= CDCl3
##.SHIFT REFERENCE= (INTERNAL, CDCl3, 0, 15.7039)
##AUDIT TRAIL= $$ (NUMBER, WHEN, WHO, WHERE, WHAT)
$$ ##TITLE= Audit trail, XWIN-NMR		Version 3.5
$$ ##JCAMPDX= 5.01
$$ ##ORIGIN= Bruker BioSpin GmbH
$$ ##OWNER= she
$$ F:/spectra/data/she/nmr/H-F/1/audita.txt
$$ ##AUDIT TRAIL=  $$ (NUMBER, WHEN, WHO, WHERE, WHAT)
(   1,<2021-08-26 11:06:45.89 +0400>,<she>,<DPX200>,
      <created by zg, POWCHK disabled, PULCHK disabled
       configuration hash MD5:
       00 E9 B6 7A A2 85 ED C7 34 08 36 98 17 FE 4E 26
       data hash MD5: 16K
       96 06 F2 A7 CA 19 8F E7 7E C0 2D 5D BD 95 0D 1E>)
$$ ##END=
$$ 
$$ hash MD5
$$ 91 6E 5C AF DC 80 9B 47 6B D7 1E C3 F0 E3 48 D6
##$RELAX= 
##$RELAX= 
##$RELAX= 
##$RELAX= 
##$RELAX= 
##$RELAX= 
$$ Bruker specific parameters
$$ --------------------------
##$DU= <F:/spectra>
##$EXPNO= 1
##$NAME= <H-F>
##$PROCNO= 1
##$TYPE= <nmr>
##$USER= <she>
##$AMP= (0..31)
100 100 100 100 100 100 100 100 100 100 100 100 100 100 100 100 100 100 
100 100 100 100 100 100 100 100 100 100 100 100 100 100 
##$AQSEQ= 0
##$AQ_mod= 1
##$AUNM= <au_zg>
##$AUTOPOS= <>
##$BF1= 200.13
##$BF2= 200.13
##$BF3= 200.13
##$BF4= 200.13
##$BF5= 200.13
##$BF6= 200.13
##$BF7= 200.13
##$BF8= 200.13
##$BYTORDA= 1
##$CFDGTYP= 0
##$CFRGTYP= 5
##$CHEMSTR= <none>
##$CNST= (0..31)
1 1 145 1 1 1 1 1 1 1 1 1 1 1 1 1 1 1 1 1 1 1 1 1 1 1 1 1 1 1 1 1 
##$CPDPRG= <>
##$CPDPRG1= <>
##$CPDPRG2= <>
##$CPDPRG3= <>
##$CPDPRG4= <mlev>
##$CPDPRG5= <mlev>
##$CPDPRG6= <mlev>
##$CPDPRG7= <mlev>
##$CPDPRG8= <mlev>
##$CPDPRGB= <>
##$CPDPRGT= <>
##$D= (0..31)
0 1.2 0 0 0 0 0 0 0 0.06 0 0.03 0 0 0 0 0.0002 0 0 0 0 0 0 0 0 0 0 0 0 
0 0 0 
##$DATE= 1629961605
##$DBL= (0..7)
120 120 120 120 120 120 120 120 
##$DBP= (0..7)
150 150 150 150 150 150 150 150 
##$DBP07= 0
##$DBPNAM0= <>
##$DBPNAM1= <>
##$DBPNAM2= <>
##$DBPNAM3= <>
##$DBPNAM4= <>
##$DBPNAM5= <>
##$DBPNAM6= <>
##$DBPNAM7= <>
##$DBPOAL= (0..7)
0.5 0.5 0.5 0.5 0.5 0.5 0.5 0.5 
##$DBPOFFS= (0..7)
0 0 0 0 0 0 0 0 
##$DE= 6
##$DECBNUC= <off>
##$DECIM= 32
##$DECNUC= <off>
##$DECSTAT= 4
##$DIGMOD= 1
##$DIGTYP= 9
##$DL= (0..7)
0 120 120 120 120 120 120 120 
##$DP= (0..7)
150 150 150 150 150 150 150 150 
##$DP07= 0
##$DPNAME0= <>
##$DPNAME1= <>
##$DPNAME2= <>
##$DPNAME3= <>
##$DPNAME4= <>
##$DPNAME5= <>
##$DPNAME6= <>
##$DPNAME7= <>
##$DPOAL= (0..7)
0.5 0.5 0.5 0.5 0.5 0.5 0.5 0.5 
##$DPOFFS= (0..7)
0 0 0 0 0 0 0 0 
##$DQDMODE= 0
##$DR= 18
##$DS= 0
##$DSLIST= <SSSSSSSSSSSSSSS>
$$ [...]
##$SUBNAM2= <"">
##$SUBNAM3= <"">
##$SUBNAM4= <"">
##$SUBNAM5= <"">
##$SUBNAM6= <"">
##$SUBNAM7= <"">
##$SUBNAM8= <"">
##$SUBNAM9= <"">
##$SW= 20.0188882624521
##$SWIBOX= (0..15)
0 0 2 0 0 0 0 0 0 0 0 0 0 0 0 0 
##$SW_h= 4006.41025641026
##$TD= 16384
##$TD0= 1
##$TE= 0
##$TE2= 300
##$TE3= 300
##$TEG= 300
##$TL= (0..7)
0 120 120 120 120 120 120 120 
##$TP= (0..7)
150 150 150 150 150 150 150 150 
##$TP07= 0
##$TPNAME0= <>
##$TPNAME1= <>
##$TPNAME2= <>
##$TPNAME3= <>
##$TPNAME4= <>
##$TPNAME5= <>
##$TPNAME6= <>
##$TPNAME7= <>
##$TPOAL= (0..7)
0.5 0.5 0.5 0.5 0.5 0.5 0.5 0.5 
##$TPOFFS= (0..7)
0 0 0 0 0 0 0 0 
##$TUNHIN= 0
##$TUNHOUT= 0
##$TUNXOUT= 0
##$USERA1= <user>
##$USERA2= <user>
##$USERA3= <user>
##$USERA4= <user>
##$USERA5= <user>
##$V9= 5
##$VALIST= <valist>
##$VCLIST= <CCCCCCCCCCCCCCC>
##$VD= 0
##$VDLIST= <DDDDDDDDDDDDDDD>
##$VPLIST= <PPPPPPPPPPPPPPP>
##$VTLIST= <TTTTTTTTTTTTTTT>
##$WBST= 1024
##$WBSW= 4
##$XGAIN= (0..3)
0 0 0 0 
##$XL= 0
##$YL= 0
##$YMAX_a= 425558
##$YMIN_a= -503020
##$ZGOPTNS= <>
##$ZL1= 120
##$ZL2= 120
##$ZL3= 120
##$ZL4= 120
##$ABSF1= 10
##$ABSF2= 0
##$ABSG= 5
##$ABSL= 3
##$ALPHA= 0
##$AQORDER= 0
##$ASSFAC= 0
##$ASSFACI= 0
##$ASSFACX= 0
##$ASSWID= 0
##$AUNMP= <proc_1d>
##$AZFE= 0.1
##$AZFW= 0.1
##$BCFW= 1
##$BC_mod= 2
##$BYTORDP= 1
##$COROFFS= 0
##$CY= 11.3945322036743
##$DATMOD= 1
##$DC= 2
##$DFILT= <>
##$DTYPP= 0
##$F1P= 2.36226072786647
##$F2P= -0.459571619588291
##$FCOR= 0.5
##$FTSIZE= 0
##$FT_mod= 4
##$GAMMA= 1
##$GB= 0.15
##$INTBC= 1
##$INTSCL= 1
##$ISEN= 128
##$LB= 0.24
##$LEV0= 0
##$LPBIN= 0
##$MAXI= 10000
##$MC2= 0
##$MEAN= 0
##$ME_mod= 0
##$MI= 1.114404
##$NCOEF= 0
##$NC_proc= 0
##$NLEV= 6
##$NOISF1= 3.799351
##$NOISF2= 2.8
##$NSP= 1
##$NTH_PI= 0
##$NZP= 0
##$OFFSET= 15.70392
##$PC= 1
##$PHC0= -13355.53
##$PHC1= 10.20099
##$PH_mod= 1
##$PKNL= yes
##$PPARMOD= 0
##$PSCAL= 0
##$PSIGN= 0
##$REVERSE= no
##$SF= 200.130013532006
##$SI= 16384
##$SIGF1= 3
##$SIGF2= 2
##$SINO= 400
##$SIOLD= 16384
##$SREGLST= <1H.CDCl3>
##$SSB= 0
##$STSI= 0
##$STSR= 0
##$SW_p= 3612.71676300578
##$SYMM= 0
##$S_DEV= 0
##$TDeff= 0
##$TDoff= 0
##$TI= <>
##$TILT= no
##$TM1= 0
##$TM2= 0
##$TOPLEV= 0
##$USERP1= <user>
##$USERP2= <user>
##$USERP3= <user>
##$USERP4= <user>
##$USERP5= <user>
##$WDW= 1
##$XDIM= 8192
##$YMAX_p= 0
##$YMIN_p= 0
$$ End of Bruker specific parameters
$$ ---------------------------------
##NTUPLES= NMR FID
##VAR_NAME=  TIME,          FID/REAL,        FID/IMAG
##SYMBOL=    X,             R,               I
##VAR_TYPE=  INDEPENDENT,   DEPENDENT,       DEPENDENT
##VAR_FORM=  AFFN,          ASDF,            ASDF
##VAR_DIM=   8192,          8192,            8192
##UNITS=     SECONDS,       ARBITRARY UNITS, ARBITRARY UNITS
##FACTOR=    0.0002496,     1,               1
##FIRST=     0,             0,               0
##LAST=      2.0444736,     0,               0
##MIN=       0,             -503020,         0
##MAX=       2.0444736,     425558,          0
$$ Real data points
##PAGE= N=1
##DATA TABLE= (X++(R..R)), XYDATA
0 0 0 0 0 0 0 0 0 0 -8 8 -8 8 -16 16 -24 24 -32 40 -49 64 -73 89 -105 123 -145 169 -199 231 -265 304 -348
31 -348 400 -452 514 -580 652 -734 823 -920 1027 -1144 1273 -1410 1565 -1730 1911 -2110
47 -2110 2326 -2564 2823 -3111 3427 -3777 4168 -4602 5092 -5646 6282 -7017 7882 -8914
61 -8914 10168 -11736 13755 -16470 20329 -26280 36747 -60594 232817 -123497 -206653 407747
73 407747 -89546 -45929 425558 68473 -293612 100509 123029 -67231 114286 127990 -180485
84 -180485 -116860 8916 50013 87564 -97475 -141255 -8500 -171090 -4728 203546 -196115
95 -196115 -234327 71142 -142082 -127005 167926 -76788 -289321 -32189 -26877 -135534 75263
106 75263 -11860 -274771 -53736 -4281 -134348 111279 -15036 -281862 29304 21820 -166729
117 -166729 144353 76565 -262717 -20017 134830 -88472 31258 172079 -129123 -136483
127 -136483 169748 57127 -33235 117065 -20080 -84225 63765 63498 88174 24332 -87677
138 -87677 50513 24814 -51583 156464 64123 -184103 14482 126431 -82628 17108 161224
149 161224 -134221 -142510 180954 3740 -110506 146599 -37240 -179795 104499 58991
159 58991 -69337 46495 -26760 -94598 26083 38382 -6270 3478 -44618 -68482 31162 31351
171 31351 -38914 35389 -19288 -114337 63437 61112 -72650 53458 9089 -104044 62416
182 62416 70571 -32592 34190 13492 -43219 41369 70308 2911 18979 34367 -35967 31571
194 31571 97713 -22556 15409 67926 -66131 25336 112675 -39570 1938 61499 -47558
205 -47558 4466 77229 -888 -22399 21739 96 -20302 41758 27309 -38387 9231 772
217 772 -25596 45539 -1163 -34278 22023 -34598 -16179 47571 -29461 -27117 11514 -36882 -18762
230 -18762 20885 -10561 -39398 -15291 -5045 -37855 1849 14327 -56793 -15379 4944 -45028
242 -45028 12197 4286 -47605 937 -12113 -23790 18250 -10262 -20917 -2903 -9891 -3142 1933
255 1933 6583 -12374 -17235 16587 -8782 -4484 28394 -24171 -8435 25374 -18348 11339 19533
268 19533 -20409 9099 7970 -1953 17187 3549 4134 2884 3886 18221 839 12740 13069 -11237
282 -11237 21804 11381 -4760 27773 -2497 -3457 24957 -4729 9126 15808 -7903 10100 3729
295 3729 1966 11479 -4717 7298 -51 -7211 15149 -7497 -2560 11078 -16565 4640 5385 -15192
309 -15192 9410 -6900 -10225 8339 -12676 -208 1051 -14612 4705 -8763 -7682 5430 -16111
322 -16111 -186 -1411 -16360 7042 -9479 -10414 6904 -16129 -1219 1195 -15592 5662 -7853
335 -7853 -9179 7009 -14286 389 2478 -14450 7989 -5411 -7699 9973 -10577 2348 5346
348 5346 -10341 10536 -2095 -3731 12793 -8079 6342 8761 -7985 14270 1880 -2044 16585
361 16585 -4331 6336 12031 -5007 13846 3821 9 14678 -3161 8085 9229 -5149 14960
374 14960 654 -1702 16520 -6438 5186 11481 -9677 10790 3591 -5813 11412 -4212 718
387 718 5638 -7030 6724 -3683 -4048 7061 -13235 2139 2179 -17377 7391 -7306 -16338 8503
401 8503 -15060 -11115 3108 -18764 -5983 -4978 -14368 -4546 -12572 -7240 -8148 -14013 2372 -14895
415 -14895 -10823 6018 -20015 -1066 7009 -21190 6235 2092 -16331 12268 -542 -7915 9051
428 9051 -2181 325 5512 5587 4571 -2991 12756 4302 -2306 24231 -1124 -2933 27271 -4410
442 -4410 7514 28740 -6663 10943 20824 -1785 19220 18804 3430 11654 12524 11115 10862 19642
456 19642 9806 -5257 22365 8984 -7540 32978 -635 -18487 29489 -5291 -11404 29430
468 29430 -10369 -18533 12893 -4444 -8354 6698 -2904 -21063 -5780 7192 -17295 -252 5087
481 5087 -34706 -721 7381 -29296 13140 -2318 -42795 8717 -741 -26649 13081 -8531 -36398
494 -36398 -1362 2441 -19124 -3858 2811 -34680 -15446 19697 -24842 -7442 19118 -47211
506 -47211 -10108 34160 -32484 1128 26453 -46481 -6707 39177 -15854 -7656 26931 -17234
518 -17234 -24255 36985 15614 -25384 22315 3751 -32463 32406 19954 -18154 16018 -12254
530 -12254 -11472 30987 -5479 2287 18810 -33159 -3521 38778 -10612 -9711 28985 -18590 -34471
543 -34471 48357 20380 -45954 30196 12607 -60242 41974 42493 -52902 13412 18262 -45219
555 -45219 20310 35143 -26020 -8237 4914 -21774 5615 29383 -14946 -16281 7000 -24473
567 -24473 9151 40408 -27052 -8082 17892 -34243 22297 46063 -28870 3765 16086 -27170
579 -27170 31108 44914 -20033 1802 20441 -21307 21620 62957 -22528 -19910 48791 -25722
591 -25722 -4815 90875 -23394 -48888 61717 -11540 -25407 79797 2629 -59722 27761
602 27761 22929 -21113 34295 27952 -47627 -10607 30570 -5636 16262 10685 -39894 -3338 -115
615 -115 -8417 38457 -23590 -56008 20733 -17192 -32782 46242 -17078 -80155 7083 11410 -49625
628 -49625 14823 20427 -86040 -28208 44067 -42464 -12595 34324 -68504 -36482 39907 -22901
640 -22901 -6591 19656 -48349 -24169 25226 -5142 1679 14612 -35719 -26215 34021 6498
652 6498 -9320 27850 -26077 -33907 46641 12107 -8637 32278 -23282 -21374 42225 12631 10297
665 10297 25288 -24091 -8419 41320 16527 7595 29032 -15373 -25913 51544 28977 -21461
677 -21461 36400 553 -50511 48063 40353 -30855 20088 4244 -41757 23594 37848 -12114
689 -12114 -7775 -2824 -20375 6249 28878 -5378 -11188 -4586 -27275 13747 31344 -23029 639
702 639 1748 -43948 21470 38212 -30451 -4693 6112 -33881 7872 36316 -13369 -22464 5755
715 5755 -14523 -8580 34639 -1824 -28533 7917 -14286 -6092 38635 -9932 -21183 11420 -18704
728 -18704 1475 35927 -8525 -17883 7254 -6672 -4148 26444 8330 -25225 401 6647 -13524
741 -13524 23690 14270 -30876 1537 3430 -13028 24174 4718 -24763 1064 -3701 -5542 15958
754 15958 3916 -16354 -9873 1832 -2378 7022 13100 -18744 -13693 10203 -6931 9646 14817
767 14817 -23496 -5081 7653 -8610 15092 8779 -18413 -4455 2832 974 8496 7484 -8531
780 -8531 -14669 7610 7621 -980 12362 -7509 -15302 12429 2319 3187 12973 -13561 -5325 9660
794 9660 -1093 9847 7266 -9405 -4170 4417 7946 2292 2833 1225 -12997 4125 13318 -5823
808 -5823 4505 219 -12681 6756 3694 -279 5505 -10393 -3474 5267 -3057 4577 1606 -8039
822 -8039 -4066 276 5353 -2806 -2885 4358 -12439 -1241 12365 -8450 -1619 3737 -10363 1574
836 1574 3283 -1431 1224 -7030 -604 1659 -4395 5141 -1426 -5741 242 -2888 3369 -391 -4819
851 -4819 5406 -6827 -3862 9893 -5719 -1882 4452 -6216 1269 1806 -150 2539 -5515 2567
865 2567 2706 -4864 6724 430 -4065 4363 -1862 2728 2533 -3104 6042 -2641 -2177 8721 -4221
880 -4221 261 5559 -4258 2885 1348 -677 4671 -3450 2616 3551 -4660 5846 1268 -2544 5716
895 5716 -2287 1715 3140 -3245 6030 -600 -2783 7358 -3523 323 5774 -4109 2083 643 -2547
910 -2547 3520 -3121 554 1281 -5867 3033 -1268 -3659 3739 -5466 -1233 1407 -6937 2931 -1805
925 -1805 -6652 3855 -5064 -3371 3381 -5698 -771 -1283 -3984 1553 -4161 159 228 -6535 3536
940 3536 -2408 -4238 5423 -5418 -1302 4309 -6661 3207 2117 -5127 4651 -629 -1282 4753 -973
955 -973 2177 1252 1111 4759 -1711 5503 4493 -3566 9406 2333 -2296 11580 -387 193 9904
970 9904 -1726 3227 6742 -1215 4038 2359 1679 3005 113 4147 -700 368 5038 -4977 2914
985 2914 3717 -8255 5626 -101 -8303 7361 -2949 -7061 5634 -4900 -4526 2809 -3642 -4036
999 -4036 -2001 -237 -4960 -4351 3886 -8552 -5490 6027 -11550 -2843 5719 -13950 -727 3277
1013 3277 -12195 1435 722 -9463 1020 -763 -5046 -917 515 -2690 -4021 4653 -2319 -5289
1027 -5289 9401 -5311 -5777 13247 -7452 -3550 14129 -9578 -1890 13183 -6932 -1077 9731
1040 9731 -4359 -3547 7959 1895 -6394 6651 4739 -10626 8438 7394 -12174 9611 3930
1053 3930 -11995 12243 2884 -8745 10809 -1096 -5647 10137 656 -3510 6520 1372 -5568
1066 -5568 5983 7673 -8890 3954 9243 -14593 6903 14224 -17416 5621 11986 -17898 7101
1079 7101 12916 -14117 2956 8863 -9395 654 11443 -4466 -5672 9035 -3438 -5129 14776
1092 14776 -4541 -8242 13055 -7888 -3022 16458 -11193 -3817 11790 -12527 769 13192
1104 13192 -10714 -4193 7666 -8276 -3804 12789 -5620 -14304 11249 -2731 -14112 18952
1116 18952 -3062 -21753 16768 -2250 -17610 20989 -1267 -20645 11982 1616 -12268 11720
1128 11720 5157 -17301 1229 10734 -9938 2930 10721 -17327 -561 11530 -12508 8054
1140 8054 7631 -20673 6461 6939 -13140 13656 3992 -21124 6461 10383 -11851 5873 12096
1153 12096 -18933 -4902 21762 -10459 -4881 22131 -18478 -12241 25806 -8563 -6061 18543
1165 18543 -16788 -9760 18971 -3999 -4680 9765 -9697 -10676 13848 3001 -9743 10384 -3830
1178 -3830 -18264 17251 7208 -14183 13435 -4223 -17572 19605 5449 -9783 10720 -5805
1190 -5805 -10760 14631 5862 -5733 5962 -2294 -12823 11861 13030 -12882 4606 4144 -21894
1203 -21894 13845 18564 -19762 4386 6065 -21032 11194 16741 -13193 -1404 3220 -11674 3784
1216 3784 16012 -5983 -9058 4135 -9125 424 19880 -9887 -10142 8647 -14240 1848 21081
1229 21081 -13796 -8549 7000 -12877 1813 16556 -7435 -11161 2593 -3999 -2339 14748 -1225
1242 -1225 -16179 5206 -819 -5739 19037 -2810 -16754 10524 -3788 -4496 21058 -3661 -14126
1255 -14126 8162 -137 -3260 14646 3984 -15052 1340 8991 -6476 9086 11009 -17898 -161
1268 -161 11041 -8612 10296 8763 -16896 1592 6045 -4436 9373 5115 -10637 -2470 5761
1281 5761 195 2966 7818 -8099 -8218 9594 -900 375 10836 -11859 -6943 9285 -4932
1294 -4932 4095 7859 -13796 -4015 5586 -3028 3356 4639 -8587 -8479 5941 3402 -4587 6816
1308 6816 -3683 -14540 9034 5500 -6645 7976 -3778 -11100 7186 2932 -569 2922 -5512
1321 -5512 -4394 2034 3632 1586 -1453 -2456 -6009 1051 6766 -4162 611 299 -10862 5087
1335 5087 5777 -6681 3792 -1909 -8319 5262 2678 -1882 804 -3138 -2674 812 3674 113 -3313
1350 -3313 1727 -3860 -1000 8588 -4467 -2572 5568 -7722 1028 8011 -5123 -871 1682 -3382
1364 -3382 1544 2299 832 -2337 -2089 2683 -1189 1939 3473 -3949 1406 1272 -1405 6759 -1330 -2658
1380 -2658 5076 -3448 1231 6767 -3012 -579 1843 -556 1441 1410 2362 -2172 -2461 5121 -1421 -296
1396 -296 4512 -4704 -178 3302 -1927 3953 -713 -3026 3553 -1760 1213 4436 -2786 -28 901
1411 901 395 2285 -336 2231 -1123 -3065 5408 39 -1545 3952 -3543 -771 3243 -1604 2030
1426 2030 -1077 -3054 2566 -2139 604 2600 -3840 -359 -362 -793 1486 -2326 643 -1081 -3753 4154
1442 4154 -981 -3556 3104 -3920 -1796 2740 -2838 348 -1211 -3362 1443 -2425 -833 659 -3955
1457 -3955 -802 -1136 -1120 609 -3333 134 -586 -4429 3610 -718 -3592 3609 -2471 -1503 3321 -1678
1473 -1678 729 693 -1090 2628 -309 1261 2059 -1387 2645 955 335 3529 -1912 2649 2998 -2958
1489 -2958 4992 1839 -2702 5173 285 -848 4265 -45 923 1787 596 2364 -394 2172 1871 -1512
1505 -1512 3420 -61 -1209 3672 -2572 459 3106 -4178 2294 1053 -4507 2639 -554 -3454 1216
1520 1216 -1821 -2298 -849 -904 -1037 -3918 329 -1375 -4970 2456 -2447 -4726 3155 -4019 -2828 3250
1536 3250 -4751 -1144 1321 -3891 399 283 -2080 -203 -771 -100 -1551 259 1670 -3454 1640 1393
1552 1393 -4191 4546 479 -4412 5207 -1122 -2300 5985 -1391 -1137 4265 -863 -10 3202 1526
1567 1526 -1079 1028 3811 -2005 1458 5606 -4120 1739 5594 -4932 3458 3996 -4903 3812 2088
1582 2088 -3847 3579 927 -1864 1579 790 -1053 81 2572 -1667 -1714 4387 -3461 -1908 6415 -5161
1598 -5161 -1394 6504 -6464 -307 5896 -5930 8 3913 -4026 -566 3010 -1551 -2383 2511 184
1613 184 -4420 3807 698 -5867 4621 -354 -5753 6016 -1863 -4919 5803 -3419 -3172 5244 -3089
1628 -3089 -2430 3235 -2161 -2485 2510 453 -4803 1900 2358 -6859 3468 3568 -8734 4221 3507
1643 3507 -8968 5271 2494 -7919 4025 1791 -5648 2750 1682 -4497 -10 3058 -3061 -992
1657 -992 4674 -4787 -1953 6049 -5358 -301 6711 -7673 862 6392 -6731 2736 5885 -6726
1671 -6726 1775 5359 -4087 964 5753 -3341 -2453 7455 -1160 -4104 8954 -2400 -6664 10525
1685 10525 -1640 -5603 9697 -3728 -5648 8818 -1138 -3454 5976 -1505 -4591 4662 2434 -4078
1699 -4078 3258 2263 -6723 4073 4820 -7325 4641 2050 -9037 6466 3065 -7990 5127 113
1713 113 -8149 5241 2161 -6094 1517 1688 -6807 322 5737 -6234 -2006 5162 -8687 -582 8910
1728 8910 -8441 -1547 5814 -8696 1009 6994 -6748 -590 3764 -5538 -329 5596 -2632 -3916
1742 -3916 3732 -2206 -3544 7767 -1778 -6778 6321 -2732 -4085 9470 -3481 -5486 6244 -3509
1756 -3509 -1935 7665 -2177 -4002 3404 -282 -1810 5783 1742 -6197 3585 3446 -4793 6783 3241
1771 3241 -8208 5352 2563 -5640 8259 1443 -6905 4504 1428 -2905 5659 2126 -6025 737
1785 737 5045 -2986 1883 6006 -7279 -911 8516 -5069 1538 7690 -8062 -454 7146 -3696
1799 -3696 1819 4593 -5520 -1328 4025 -283 -646 2610 -2615 -4295 4362 494 -3645 4866 -4449
1814 -4449 -5820 6363 -2371 -2600 5240 -6750 -4530 5464 -2018 -2045 2615 -3843 -4988 3147 1721
1829 1721 -4295 1642 357 -8050 3220 4609 -6509 2209 131 -8334 3459 3341 -4424 903
1843 903 -1191 -4429 1436 2250 -896 -1690 -166 -2213 -772 4471 -1067 -1880 1706 -4079 1674 6173
1859 6173 -3354 909 1674 -4921 4010 4283 -2701 1354 602 -2541 1639 4126 258 -2295 1752 -771
1875 -771 -1856 6576 149 -4465 3616 -1545 -1676 6461 -915 -2270 2183 -1950 765 3528 740
1890 740 -792 -915 463 336 2306 2634 -2720 -453 1203 -2537 4139 1622 -4556 1979 -676 -2345
1906 -2345 4957 -116 -2748 967 -1103 -486 2024 1373 -1609 -1885 1370 -396 394 3593 -2777 -2104
1922 -2104 2727 -2149 1609 3209 -3595 -324 742 -1753 2552 550 -1965 -825 -875 660 289 641
1938 641 -153 -3450 963 306 -1607 2760 -1954 -3171 1966 -1637 37 2244 -2723 -561 403 -828
1954 -828 1286 -29 -689 -644 -872 1163 -769 36 1096 -2989 538 1120 -2339 1992 -600 -2394 2188
1971 2188 -1251 -834 1821 -1500 -136 263 -770 902 -575 552 -6 -1207 1349 -925 -318 2365
1987 2365 -2060 30 1291 -2341 1781 895 -1999 1522 -1075 -1290 1613 -537 -236 -110 -778 595
2003 595 -751 807 388 -1980 1285 -777 -952 2580 -1535 -568 1497 -2185 1290 1486 -1393 1150
2019 1150 -453 -508 1615 199 832 -280 -700 865 -747 1348 1071 -2096 1698 -1 -1626 3220
2035 3220 -652 -802 2164 -1707 1024 1745 -968 722 -68 -346 911 370 1480 -622 -484 1444
2051 1444 -931 1234 1681 -2701 1336 458 -1976 2705 -278 -1767 1144 -1552 -211 1267 -653
2066 -653 -43 -635 -381 172 -714 1169 -1321 -1565 1330 -1826 281 1725 -3167 350 522 -2218 1883
2083 1883 -203 -2101 558 -726 -272 740 -406 -495 -1201 566 221 -1062 1920 -890 -2133 2799
2099 2799 -1010 -357 2514 -2425 -230 1523 -1704 1048 966 -1283 192 62 477 119 229 709 -1538
2116 -1538 853 1357 -1827 2098 -70 -2400 2632 -245 -1047 2882 -1586 -733 1926 -931 463 985
2132 985 -727 -312 47 920 -808 -177 1465 -2275 513 2134 -2638 1230 1146 -3407 2145 698 -2276
2149 -2276 1957 -777 -1537 1299 -140 -358 38 306 -658 -729 1987 -868 -1571 2370 -2248 -824 3088
2166 3088 -2622 66 1784 -3095 563 1364 -2062 458 658 -1181 -114 423 108 -805 1087 230
2182 230 -2044 2636 38 -2136 2928 -1382 -1816 3619 -1915 -791 3088 -1913 -166 2369 -1300
2197 -1300 6 1117 -236 -629 1043 1514 -1948 1214 1662 -2751 2144 1430 -3303 2847 840 -2675
2213 -2675 2644 304 -1709 2121 -253 -1202 1212 553 -515 -175 1221 -1156 -163 2422 -2434 -173
2229 -173 2551 -3796 637 2456 -3762 1208 1535 -3869 1212 1185 -2434 192 598 -1532 -915 1264
2245 1264 -1055 -2107 2369 -536 -2648 3217 -1319 -2425 3399 -2242 -1588 3077 -1989 -963 1934
2260 1934 -1475 -474 1446 -587 -695 615 439 -1662 1174 1466 -2710 1515 985 -3360 3047 889
2276 889 -3312 2913 171 -2112 3145 61 -1489 1861 324 -944 974 1433 -1418 -370 2063
2291 2063 -1580 -210 2541 -2847 -176 2440 -2793 1524 1496 -3235 1387 911 -2162 1564 632 -1625
2307 -1625 46 799 -773 -485 2507 -1122 -1810 3118 -1243 -1837 3825 -2507 -1748 3847 -1862 -579
2323 -579 3015 -2072 -872 1376 -279 -438 991 223 -1729 498 1213 -2095 1157 656 -2960 2249
2339 2249 528 -2329 3114 -595 -2620 2794 -505 -1521 2092 -825 -1510 1247 1058 -1345 174
2354 174 1268 -2396 -494 2870 -2899 -56 2468 -3886 566 2674 -2651 469 1173 -2549 484
2369 484 813 -574 -600 151 -404 -826 1401 560 -1572 1091 -653 -1129 2822 -1146 -1332 2084 -2025
2386 -2025 6 2537 -1603 158 1116 -1548 207 1272 104 -1064 340 585 -1551 1665 1500 -2815
2402 -2815 1153 1284 -2088 2486 727 -2098 1828 -259 -545 2030 -122 -292 153 13 642 406 907
2419 907 -621 -1028 1354 -959 519 2143 -2189 154 1408 -1972 1691 979 -2130 607 -23 -783
2435 -783 1070 193 -550 -836 228 215 -877 1068 -747 -2126 1671 -822 -930 2558 -2065 -1365 1239
2452 1239 -1400 397 993 -1388 -635 -251 -94 25 -8 110 -1681 -255 1124 -1081 943 305 -2593
2469 -2593 1223 566 -884 1810 -880 -1260 1230 -327 385 635 -696 -199 -223 716 490 -342 1111
2486 1111 -1162 -682 1843 -1151 525 1036 -1957 912 980 -807 1622 -71 -823 885 -149 643
2502 643 542 -177 277 -996 734 793 -759 1294 -304 -1023 1417 -856 -163 1253 -1826 -23 485
2519 485 -1107 1046 -182 -660 12 -798 346 -24 -373 -29 -1427 250 662 -1453 1383 -2 -1574
2536 -1574 1087 -824 -530 1583 -1102 -284 559 -597 748 95 -172 221 -1071 419 170 -66 902
2553 902 -1254 155 1008 -998 1205 448 -1669 1291 -122 -328 1560 -206 -69 245 -179 716 260
2570 260 264 346 -1034 941 279 -551 1381 -881 -617 955 -796 937 673 -1326 911 -291 -444 994
2588 994 -246 -234 -99 -618 570 -308 562 450 -1426 695 424 -691 1329 -811 -1251 916 -1074
2605 -1074 121 646 -1494 192 -264 -718 476 -441 -151 -263 -773 670 -740 -223 332 -1610 513
2622 513 320 -1281 1048 -456 -1144 1034 -640 228 649 -1087 146 3 -205 636 -813 263 -256
2639 -256 -364 966 -504 45 908 -1490 321 1119 -1009 1077 58 -917 944 -157 87 789 -281
2656 -281 360 166 187 762 -174 739 -87 -329 1601 -451 -265 1313 -1054 185 1288 -1194 429 475
2674 475 -744 855 61 203 123 -566 444 -235 42 646 -859 509 200 -751 1097 -502 -931 1148
2692 1148 -982 -148 973 -1249 -169 -101 -998 343 39 -74 -130 -897 398 -623 -240 707 -1573 228
2710 228 520 -1303 937 -286 -1487 848 -302 -564 1026 -777 -171 -24 -444 355 -168 523 -31
2727 -31 -701 882 -99 6 1327 -1069 297 1052 -855 695 595 -1008 1012 16 -314 904 97
2744 97 27 84 122 453 -158 528 101 -1022 978 67 -541 1089 -1103 -527 1228 -1114 177 1067 -1172
2763 -1172 233 427 -635 227 -16 -325 -716 271 441 -1384 441 290 -1764 1089 339 -1408 1097
2780 1097 -284 -1388 1229 -607 -129 673 -582 -83 46 239 -221 -399 788 -905 -186 1225 -916
2797 -916 176 847 -1394 602 978 -1264 1242 368 -663 956 243 1 416 -51 149 -391 609
2814 609 90 -795 1230 -335 -660 1372 -824 -555 1661 -1295 -25 1078 -1046 303 509 -686
2830 -686 41 13 -212 -18 238 351 -961 421 439 -1270 794 269 -1312 1356 -412 -1059 1228 -777
2848 -777 -789 768 -539 -244 316 92 -224 -21 695 -567 82 894 -760 242 1419 -1405 749 785
2866 785 -1377 947 550 -1020 949 -16 -699 618 335 -42 -100 592 -317 -445 1173 -327 -989 1543
2884 1543 -674 -722 1609 -1037 -516 1442 -1146 -118 674 -523 282 -134 -524 -629 -178 185 -954
2901 -954 -133 308 -1148 341 215 -1571 585 -715 -1337 1292 -524 -445 917 -821 -659 758 -263
2918 -263 -475 -232 402 -459 -290 1085 -798 -90 1243 -1295 155 1267 -1143 756 406 -647 904
2935 904 350 -297 432 -98 -1 302 235 256 -124 440 -61 -440 1208 -211 -475 1447 -892 91 1738
2954 1738 -932 207 1024 -591 614 436 -78 487 -46 51 -566 438 416 -976 685 -205 -1002 883
2972 883 -258 -1153 1052 -664 -961 966 -480 -249 371 -363 46 -22 248 -19 -644 561 -368 -378 652
2991 652 -1082 -166 537 -1245 507 255 -946 534 -361 -768 521 -18 -401 346 -43 -51 -569 202 254
3010 254 -761 710 -81 -641 985 -274 -57 780 -942 371 651 -882 376 521 -341 150 71 124
3028 124 -23 -188 366 -575 542 735 -1145 657 323 -797 950 -297 -380 671 -716 -22 605 -559
3046 -559 408 359 -539 82 35 395 -251 -4 726 -1052 99 952 -919 185 486 -1022 137 10 -395
3065 -395 301 -268 -314 194 -284 226 -398 -70 -151 -724 657 -228 -468 938 -862 -500 884 -978 -17
3084 -17 472 -861 261 232 -475 229 -227 -260 75 -415 110 -234 -299 -27 -784 791 46 -639 470 -240
3104 -240 -586 1077 -329 51 733 -343 397 461 193 223 -319 368 667 -142 748 103 78 691 -537 460
3124 460 716 -657 749 103 -493 889 135 -68 708 -206 -26 -86 -108 48 -547 211 -87 -496 411 -221
3144 -221 -503 648 -561 -161 336 -951 106 -16 -812 300 -425 -514 137 -366 -278 -520 -201 284 -644
3163 -644 -175 79 -748 497 -157 -498 479 -261 -233 277 -238 354 333 -159 515 70 -18 465 -192 394 77
3184 77 111 673 -327 589 395 -471 714 450 -368 990 -26 130 624 -261 413 400 -52 408 -45 329
3204 329 203 -301 483 -31 -155 882 -441 -195 40 -742 391 180 -711 282 -545 -401 172 -368 -366 -252
3224 -252 -402 105 -334 -217 -70 -842 265 -223 -580 793 -431 -414 481 -749 75 407 -536 -152 -106
3243 -106 -284 221 -192 164 -349 -450 484 -334 300 565 -442 457 8 -398 749 -469 -196 630 -701
3262 -701 200 684 -229 276 63 -256 496 77 256 -39 -263 534 -311 39 678 -870 455 469 -335 430
3282 430 -21 -416 116 -490 207 117 -186 419 -171 -444 360 -122 66 -234 -427 451 -729 35 563 -975
3302 -975 82 472 -765 245 98 -492 328 -81 13 284 71 487 -295 61 568 -214 604 -32 -521
3321 -521 668 65 -31 1137 -432 9 393 -169 254 381 -100 -86 -95 263 285 57 396 -320 121 545 -293
3342 -293 254 87 -861 345 -310 -338 804 -133 -421 310 -292 32 -215 -67 -4 -535 -12 -28 -801 388
3362 388 -282 -914 362 -565 -6 79 -892 290 -106 -393 384 -605 -373 202 41 79 24 -29 -46 -246 363
3383 363 245 -350 705 -110 -11 984 -324 2 643 -562 367 645 -341 568 100 -55 244 13 442
3402 442 -310 146 529 -391 292 636 -632 322 -188 -722 514 -260 -231 395 -393 -110 187 -221 97 -365
3422 -365 -123 -98 -570 224 -477 -169 236 -760 42 538 -1120 229 107 -846 357 80 -359 186 -14
3441 -14 45 31 -91 152 -300 371 24 -609 504 -189 -480 532 -340 -255 480 -363 249 272 -494 590 7
3462 7 -104 9 -231 88 -106 119 219 -264 492 398 -260 633 68 -483 545 -323 -446 794 -285 -74
3482 -74 493 -328 -106 140 -77 -9 -261 487 -122 -558 243 -314 -153 522 -402 284 263 -393 505 -171 -525
3503 -525 311 -430 -7 307 -145 -26 -97 313 76 -419 539 -6 -495 701 -193 -164 605 -371 13 330
3523 330 -493 168 17 -474 -142 38 -94 218 -27 271 -535 61 457 -606 178 232 -637 257 21 -370
3543 -370 376 -384 -79 174 -372 -29 -116 -159 182 -47 -11 -120 -109 609 -476 -176 456 -570 116 566 -592
3564 -592 405 340 -390 234 11 4 307 -20 89 -74 -212 -3 -288 293 -126 -384 387 -414 -405 561 -353 -244
3586 -244 521 -557 -53 192 -225 121 -41 117 360 -578 108 -35 -297 526 -211 -77 161 -368 369 -207
3606 -207 -474 372 -140 -337 416 -599 -117 -19 -159 -104 10 122 115 -301 569 -195 -406 464 -298 15 416
3627 416 -414 391 -178 -368 273 -306 -92 433 -228 47 53 -236 140 195 195 -37 -492 678 75 -480 604
3648 604 -101 123 419 -264 459 195 -171 667 -244 -167 152 -213 -37 241 255 323 -203 151 456 -527 361
3669 361 194 -548 349 -48 -113 133 -322 -70 18 11 475 -395 -218 168 -126 115 -28 -226 53 -467 -244
3690 -244 263 -450 341 322 -745 68 -160 -451 220 -355 -25 -205 -423 67 -435 -472 309 -454 -262 -56
3710 -56 -160 520 -352 -31 421 -273 -52 219 -292 261 108 -194 387 -355 121 9 -297 554 -173 -123 352
3731 352 -374 55 58 -422 75 87 -59 379 -117 -37 143 -245 113 -37 -302 327 -24 212 386 -197 473
3752 473 -372 -133 423 -358 199 173 -472 33 171 -407 180 -78 103 67 -286 52 44 -285 301 -122 266
3773 266 183 -452 230 -312 -482 493 -343 -31 387 -497 90 83 -53 243 -451 -76 105 -264 214 104 -346
3794 -346 354 -166 130 128 -259 441 -135 -429 471 -149 -336 439 -639 62 115 -136 220 -344 75 181 -434
3815 -434 558 157 -383 216 -484 -148 370 -206 423 -399 -273 554 58 117 327 -437 -37 239 -64 231
3835 231 -37 94 26 -206 579 105 -138 284 -321 -7 515 -265 171 10 -311 86 14 70 238 -472 -71
3856 -71 178 -134 310 -67 -169 84 -528 656 203 -334 339 -433 -169 858 -475 102 -273 -651 168
3875 168 -14 7 315 -570 -152 -187 -372 302 -346 -309 -97 -238 326 185 -443 447 -158 -281 524 -69 13
3896 13 -70 -651 342 -199 -38 292 -435 -34 94 27 618 -203 -180 105 -348 229 398 -408 464 -127 -178 427
3918 427 -42 285 96 -369 245 139 133 521 -416 281 153 -184 565 -171 -20 387 -308 112 245 -403 183
3939 183 19 -507 406 -195 -44 -118 -399 157 -1 -3 283 -558 483 -173 -143 595 -69 -113 251 -439 -160
3960 -160 518 -327 -70 -69 -198 82 11 133 157 -505 -91 -170 -101 381 -305 -73 -93 -264 597 -18 -479 263
3982 263 -157 -94 53 -174 264 -18 86 382 61 213 229 -71 468 -137 -53 535 -680 -13 260 -509 213
4003 213 -46 -281 -45 -83 157 362 -153 88 -146 3 115 -181 148 369 -752 472 -140 -304 436 -118
4023 -118 188 298 -383 281 -1 -345 218 -9 27 132 -38 86 61 -286 160 -360 132 236 -548 318 81
4044 81 -613 499 -32 125 440 -248 -24 -108 -339 154 220 34 266 -193 25 -205 -222 364 -244 114 418
4065 418 -642 -270 225 -514 239 -67 -225 80 -27 -31 -61 -368 20 -340 12 142 -307 238 -69 -167 342
4086 342 -380 -178 191 -584 -9 -279 -240 301 -179 -40 392 -205 54 -55 -225 381 -218 22 254 -149
4106 -149 -1 326 -144 426 -104 -172 202 -340 52 79 -472 237 230 55 348 -95 97 411 54 357 91
4127 91 -144 579 -156 216 136 -79 436 155 -149 270 -334 235 280 -23 106 -113 -51 406 -255 6 382
4148 382 -333 188 -132 -167 84 -361 87 38 -306 27 -53 -218 103 -324 -43 206 133 326 -107 -20 357 -374
4170 -374 -4 104 -142 63 -180 -424 351 -380 8 33 -357 -84 -326 -219 85 -491 55 -157 -456 -64
4190 -64 -208 -177 280 -183 -23 107 -264 203 62 -94 323 -70 -46 83 -119 319 -232 -419 98 -15 183
4211 183 142 20 443 131 -198 371 -162 -3 298 -260 48 -45 -258 220 -321 52 300 -244 355 -101 -253
4232 -253 40 -438 132 97 -495 -10 -108 -323 106 -115 -386 41 -267 -42 -307 -62 39 -232 -133 11 -475
4253 -475 385 -465 -253 274 -319 -290 120 -484 106 -16 -333 10 -215 37 225 -106 287 118 -289 499
4273 499 -303 30 406 -84 345 133 -376 673 -31 -34 272 -227 110 126 -42 294 -105 113 126 134 478 -50
4295 -50 -8 728 -202 -492 177 -313 -76 282 -362 216 -91 -179 268 -474 288 -4 -433 123 -335 -40 75
4316 75 -446 134 -340 -155 522 -79 -451 276 -360 -150 294 95 242 -286 -277 193 37 32 -24 -270 435 -165
4338 -165 -171 463 -272 -4 -295 -405 471 -81 -93 133 -12 -26 332 -353 131 -129 -413 17 -328 232 371
4359 371 -242 37 -90 -152 137 -98 391 28 -321 692 -152 -202 432 -455 -108 362 -108 -33 -111 -24 301
4380 301 -346 257 51 -359 -39 -284 -203 200 -375 -49 68 -231 331 126 -362 227 -281 -56 222 -121
4400 -121 -154 -39 -65 467 -85 230 -134 -524 138 83 -229 529 -330 -162 149 -377 618 58 -151 150 -204
4421 -204 140 534 -300 182 -274 -226 419 -54 282 -70 -413 438 229 -167 273 -252 -83 212 -322 282
4441 282 153 -358 111 -398 5 387 -239 -243 -321 -50 248 -270 158 -46 -453 267 23 63 400 -377 -121
4462 -121 355 62 148 153 -117 -48 -131 237 494 7 150 -124 122 326 -48 563 -60 -456 91 465 -166 510
4484 510 -384 -292 246 142 596 -12 -165 192 -358 106 250 -57 150 -114 -134 268 -322 41 27 -802 263
4505 263 382 -412 247 -119 -451 18 -121 88 -337 -94 240 -298 30 497 -367 -73 -93 -390 461 -227
4525 -227 112 202 -613 113 102 -159 233 -225 -260 -45 -220 375 -216 -146 317 -184 55 404 -400 96 244
4546 244 -334 124 92 379 407 -452 274 330 -171 377 -110 -118 170 18 322 -205 -217 274 -379 0 433 -488
4568 -488 -151 48 -369 -36 65 -322 -140 -383 217 240 -254 120 -272 -116 195 -339 158 -142 -311 412
4588 412 -338 -175 187 -278 86 295 -470 68 -217 29 117 -52 134 27 -207 95 -170 -160 421 -236 293
4609 293 176 -511 347 -255 -153 579 -234 -33 113 -46 86 -90 176 254 -344 124 277 -456 151 73 -151
4630 -151 213 -272 -180 19 -325 236 -129 -40 160 -292 -62 34 -339 178 98 188 491 -149 243 282 -367 259
4652 259 -23 -232 299 183 43 158 -331 148 -121 61 463 -367 -52 252 -329 59 55 -80 271 -273 84
4673 84 286 -489 84 -92 -243 484 -277 -68 161 -550 -11 -305 -53 547 -244 6 403 -324 220 -89
4693 -89 -125 97 -378 31 117 -488 118 -136 -343 210 -595 -130 37 -459 182 -234 -453 102 -582 -119 139
4714 139 -380 -217 -93 -161 195 -29 -276 24 -271 294 -10 -252 452 -86 -176 214 -413 137 240 -306 535
4735 535 192 160 247 -47 192 160 -323 177 -131 343 277 -3 370 33 100 260 -143 498 479 -208 465 215
4757 215 -8 518 108 -40 347 -175 117 100 3 258 -18 -137 183 -262 27 21 -492 136 -242 15 284
4778 284 -639 204 64 -521 341 90 -362 -152 -107 -166 -115 -396 95 -136 101 143 -148 319 1 -341 305
4799 305 -263 -68 495 -95 30 -55 -571 245 -74 -17 284 -510 1 415 75 469 -275 -21 376 -82 383
4820 383 71 -480 399 -125 -99 638 -476 147 173 -97 268 -55 -176 177 -105 -12 -15 -193 361 -196 -234 500
4842 500 -195 302 199 -305 375 -52 -198 422 -391 -57 -258 -352 21 -72 125 -6 -53 225 -217 -483 515
4863 515 -125 -269 547 -141 70 136 -548 264 -130 -352 398 -272 -104 217 -123 267 13 -384 0 -427
4883 -427 198 204 -355 311 -199 -311 109 -431 -54 -49 -715 305 -193 -451 609 -182 42 283 -392 384 -51
4904 -51 140 170 -620 -64 343 -107 216 -213 -464 259 -277 95 388 -398 216 -68 -176 545 131 -21 135
4925 135 -161 200 15 106 406 -344 95 478 -301 500 -13 -539 407 -54 -60 465 -61 28 131 21 187
4946 187 -177 13 -6 -227 389 160 -156 379 -352 -33 261 -346 521 -66 -760 317 56 -4 62 -254 275
4967 275 -292 76 234 -92 173 293 -281 322 -1 -103 30 -391 -90 414 -482 -53 -34 -505 401 295
4987 295 -70 62 -347 104 73 -19 160 -260 -31 -35 -354 381 524 -30 367 -309 -112 717 -31 193 194 -476
5009 -476 309 272 -19 77 -132 -76 -57 -183 320 -220 -139 359 -454 300 371 -325 71 -239 -39 575 36 -12
5031 -12 115 -361 -23 100 1 491 -313 141 47 31 606 -464 -233 154 -484 569 276 -445 51 -242 -190
5052 -190 189 -204 115 43 -363 230 212 -197 -54 -670 12 258 -419 397 -128 -476 277 -255 232 416 -287
5073 -287 44 3 44 378 -215 279 -33 -547 127 113 85 55 -387 139 -2 -138 649 -281 -216 246 -430 111
5095 111 338 -375 -25 -550 -50 220 -52 143 48 -419 299 138 -32 319 -28 85 130 -96 399 -338 76
5116 76 215 -274 120 412 -179 93 -116 71 353 -45 103 124 -324 282 356 77 394 -208 250 16 -269
5137 -269 373 229 -218 29 129 317 150 -154 193 -222 -150 457 -278 -144 63 -755 185 5 -184 278
5157 278 -289 -126 78 -226 91 -241 -419 164 -315 -270 256 -350 -60 -159 -320 326 -336 82 207 -264 39
5178 39 88 -241 327 -209 -97 138 -549 339 31 -64 235 -378 -92 381 -205 155 -116 -165 253 -110 -10
5199 -10 73 -501 382 260 129 409 -177 -186 -101 -238 289 146 -467 431 -194 14 429 -1 -47 114 -353 1
5221 1 -88 -15 124 -131 393 79 -193 118 -58 113 266 -317 103 -187 -313 666 -343 -34 181 -68 74
5242 74 168 -183 91 -276 184 105 -144 441 82 -403 270 -243 194 200 -255 528 21 -270 314 -328 -1 208
5264 208 -401 100 -57 117 413 108 -297 -310 -529 360 -161 -283 420 171 -266 236 -298 191 55 -471
5284 -471 267 -189 -312 -93 -185 205 -74 -187 44 -99 114 204 -238 282 -59 -322 172 -252 -395 468 -286
5305 -286 46 221 -348 -115 18 -138 185 10 109 -83 -204 350 -235 -38 113 -371 153 453 -489 333
5325 333 176 -231 158 -362 -191 151 -139 -82 60 -134 -279 -511 212 -169 -375 379 -34 -166 395 -262
5345 -262 265 174 -487 143 83 -83 248 -165 -288 402 -142 272 -15 265 182 -35 250 36 -257 357 191
5366 191 3 661 -159 228 674 -111 161 151 -344 370 6 146 -99 -279 170 -130 193 163 -358 262 123
5387 123 -256 272 62 -427 191 8 -139 294 -475 218 -44 -193 237 -118 -111 -33 -475 114 -136 -208 351
5408 351 -242 -34 378 -210 335 -30 -346 46 -424 -385 287 -192 -95 195 -296 350 -321 -45 226 -323 285
5429 285 -184 -100 405 1 -70 264 -235 60 190 -431 286 -200 -257 451 -380 33 151 43 311 -202 120
5450 120 303 -243 381 -260 -219 273 -43 175 402 -483 260 205 -245 279 -282 -279 297 2 97 167 -224 205
5472 205 -79 24 -31 -273 480 -109 -430 636 -174 -217 337 -397 -156 210 -365 296 79 -57 236 -23
5492 -23 310 334 -7 -103 -140 157 276 -324 229 -143 -239 321 -130 168 84 -437 -3 136 -102 263 -249 -363
5514 -363 451 -269 250 -13 -331 253 -102 -51 466 -329 -158 449 -336 266 176 -91 105 -488 157 265 68
5535 68 60 -209 98 353 -144 216 20 -403 38 -66 126 346 -432 -72 66 -286 209 93 -176 81 -397
5556 -397 -66 250 -120 144 -83 -66 219 -154 304 41 -389 328 -76 -134 128 -459 62 270 -441 163 72
5577 72 -84 -45 -142 13 114 -90 85 -205 -143 139 -475 125 -81 -417 16 -132 -191 244 -402 -334 144 -190
5599 -190 491 -15 -242 161 -371 27 311 -28 329 -385 -147 54 -115 364 -181 -363 57 -93 44 -15
5619 -15 -272 -81 58 -224 542 -61 -81 -117 -154 213 192 5 80 -108 117 476 -101 220 196 -266 192 -13
5641 -13 -142 306 -59 -204 177 -177 388 -13 -277 51 -213 7 116 -206 546 -351 -178 359 -192 272
5661 272 84 -349 -107 311 -183 198 -405 -62 65 -80 302 28 -170 293 7 185 182 -168 1 -230 -319
5682 -319 294 40 250 31 -279 171 -77 -188 452 -88 -238 -230 -165 368 72 -362 175 -138 -13 213 -308
5703 -308 -258 -239 -271 301 -52 -9 -25 -437 103 205 -295 474 -263 5 379 123 287 212 -310 197 -152 183
5725 183 362 -169 334 -52 -10 340 -66 119 76 -473 196 350 -28 360 -222 -270 121 -121 244 333 -168
5746 -168 90 -318 64 341 74 361 -315 -20 86 -16 -13 154 -459 243 -14 -219 193 -219 -133 148 -268
5767 -268 -144 -98 -41 -2 104 -63 160 -230 279 -275 -391 -121 -107 -158 243 -392 47 198 -244 181 -212 -247
5789 -247 89 -60 -45 -11 -187 204 -146 -29 131 -430 176 95 70 309 -308 -87 267 -274 -84 289 -199
5810 -199 87 135 -1 240 -63 321 1 -233 379 -243 -71 47 -261 190 371 49 353 -170 -70 -10 -315
5831 -315 140 251 -114 319 283 34 286 -121 324 2 82 338 -231 45 261 -113 235 419 -341 94 94
5852 94 -189 369 -214 82 357 -281 213 -231 94 224 -360 -30 -107 -137 384 -277 73 333 -258 179 167
5873 167 -271 -38 129 -114 178 -247 22 -71 -229 301 -355 -202 114 -227 232 -155 -104 266 24 -119 383
5894 383 -181 -190 343 -221 257 -1 -150 151 -74 -39 92 13 64 -263 -433 125 -357 347 106 -244 318 73
5916 73 -100 101 -245 74 237 80 -40 -34 -51 181 -58 58 49 -416 175 -144 -188 349 -186 -10 -43 -347 191
5939 191 -166 -91 276 -58 30 -54 -324 134 -92 -252 215 173 41 283 -270 420 -106 -382 235 -34 -5 317
5961 317 -222 213 -16 -143 108 22 36 -10 -135 93 68 -341 -171 -280 173 -165 -303 190 10 -100 329
5982 329 -115 -29 85 -400 259 191 -298 113 -112 -38 331 1 22 264 -91 299 -341 -44 489 -330 327
6003 327 141 -186 336 -320 35 353 -258 48 121 -445 290 -112 -365 34 -267 86 62 -144 97 -226 235
6024 235 153 -378 69 10 -315 -25 -193 -375 -184 -348 97 109 -281 -52 20 -31 162 -380 117 -273 -204 416
6046 416 -260 -167 69 -317 148 313 -345 151 -216 -186 372 -18 257 179 -235 386 121 -24 414 -152 223
6067 223 -9 -66 418 -329 63 386 -192 4 97 -139 351 -74 -176 149 -199 341 103 -62 375 -259 -54
6088 -54 104 -270 292 40 -235 443 -354 -347 95 -194 141 169 -108 63 -186 164 77 115 147 -65 -165 9
6110 9 -217 -52 258 -227 98 14 -118 287 -78 -630 219 -394 30 476 -280 140 108 -148 292 -249 91
6131 91 -104 -377 393 -305 -359 270 -331 91 230 -443 225 -159 -281 226 -299 103 354 -241 289 -26 -25
6152 -25 -6 -258 163 151 -144 303 49 44 185 -449 33 481 -237 172 -123 -262 176 -158 130 40 -311 98
6174 98 -204 88 455 35 236 268 -123 195 22 -176 384 -101 -96 343 -177 203 45 -228 309 -28 -1 -37
6196 -37 -272 64 90 164 442 -196 -106 102 -313 240 350 -111 202 -98 86 351 -45 168 -142 -13 294
6217 294 -203 145 294 -185 92 -230 -15 355 160 -85 -24 -117 273 87 -336 326 -30 -202 145 9 18
6238 18 -106 -199 -125 -198 -106 138 -628 58 -123 -315 461 -77 -481 90 -188 179 48 -102 119 -368 12 212
6260 212 -122 238 84 -308 178 -16 72 356 -312 -14 138 128 328 28 87 311 12 512 187 -286 385
6281 385 0 164 278 104 229 161 -282 357 -4 28 27 -317 111 114 -5 67 -239 37 187 -256 78 105 -261
6304 -261 104 -254 -191 87 -97 -68 150 -107 -4 -176 -128 140 -252 57 -151 -329 339 -429 -64 182 -175
6325 -175 129 34 -301 398 103 -57 396 -263 -124 48 -207 147 -66 64 -1 -36 -48 63 16 250 199 -124
6347 -124 717 -174 123 258 -420 381 294 -173 450 47 -60 202 -69 130 -168 151 66 -510 38 -111 -152
6368 -152 424 43 -177 310 -102 71 96 -366 268 -48 -18 17 -446 -215 34 17 81 113 -309 421 -508 -55
6390 -55 211 -415 437 -374 25 426 -133 219 131 -179 287 -117 114 250 -194 74 326 -155 -73 54 103
6411 103 314 -29 210 171 -291 218 -82 -106 265 -229 16 -20 -6 99 95 124 431 64 217 113 -274 139
6433 139 -201 -98 369 -316 60 324 -162 346 173 -129 308 -363 70 194 -322 -129 1 182 101 -21
6453 -21 344 148 -185 114 -392 -50 387 -67 39 218 -120 -18 101 -221 199 -85 -180 366 -314 47 -99
6474 -99 -149 241 -93 60 59 64 -60 22 -303 251 2 -154 306 -185 -71 135 -4 264 -192 -107 -39 -116 413
6497 413 339 -256 139 -395 -141 350 -190 145 -73 -299 282 79 -177 181 -52 14 -29 -108 148 -412 -24
6518 -24 362 99 234 -187 -188 339 -130 324 193 -144 291 263 -212 306 81 -41 270 -290 62 37 41 155
6540 155 -164 177 183 -22 181 -28 -78 192 -453 -13 143 -177 413 181 -303 70 -218 30 162 -346 -116
6561 -116 69 -12 253 84 -119 380 -313 95 72 -482 220 -138 -152 248 -623 70 197 -84 51 -106 -158
6582 -158 -114 -279 -16 -121 202 264 -270 -152 -80 -336 119 168 -264 84 -277 -50 148 -137 -29 126 -447
6603 -447 16 0 -211 -14 -194 257 -105 -57 369 -103 -273 258 -589 186 403 -329 116 91 -194 471 -240
6624 -240 -42 204 -138 5 217 137 32 -87 -218 278 -244 140 -136 -124 156 -377 -184 398 -356 262 -63
6645 -63 -11 106 -33 323 225 -286 138 -36 -119 17 -5 236 133 -175 165 -55 -74 209 11 -248 66 -304
6667 -304 -78 130 -204 106 -241 -15 -78 -38 86 -11 -228 276 -134 -161 44 -264 28 -285 -472 357 -159
6688 -159 -46 380 -188 107 -133 -116 201 35 26 63 -335 236 133 -168 -100 -228 -65 162 -117 17 42 -7
6710 -7 244 -257 140 3 -9 137 97 84 -29 -221 6 99 52 292 -131 -136 363 -303 34 33 -248 -6 264 7
6734 7 223 23 6 199 -268 3 -174 62 138 -195 -2 -84 -156 116 15 -369 493 3 -219 131 168 -142
6756 -142 68 -304 204 -171 -152 243 -278 -60 -49 -232 220 -230 -139 -26 -426 -12 -221 -168 -52 -199 98
6777 98 63 -283 210 162 -149 39 -240 -336 363 -394 482 -46 -231 130 -228 -157 267 19 461 101 63 224
6799 224 -169 86 283 82 -81 167 -49 304 361 150 207 39 415 170 -187 299 -300 -176 65 -101 252
6820 252 -47 26 205 37 -143 71 -392 164 186 -89 -17 7 23 78 -126 228 -145 -83 80 -46 -27 265 -139
6843 -139 240 -55 -327 36 -200 -107 166 -227 104 19 -189 2 -194 -177 9 -135 42 -12 -346 -100 -144 -53
6865 -53 152 -178 210 -269 -393 248 -228 94 293 -410 76 247 -38 365 289 -33 -80 -376 -17 61 24 127
6887 127 -230 -150 172 -178 22 -25 -390 141 83 -142 276 -306 117 257 -447 241 -124 54 114 -84 -135 -81
6909 -81 -200 155 -300 109 270 -49 55 23 -265 325 -145 -320 214 239 1 73 -180 -10 -22 -191 -34 -99
6931 -99 310 198 -323 61 -83 -143 304 -99 121 103 -406 33 1 31 283 -103 -222 325 -86 -18 142 100
6953 100 123 -305 42 229 -300 73 -119 -314 377 -61 164 -19 -171 -16 -229 -235 304 -127 -192 28 -286
6974 -286 0 49 -18 264 -368 27 164 -294 233 67 -243 136 7 -213 69 -158 180 -11 5 47 -145
6995 -145 -278 371 -106 298 7 -259 27 18 96 260 -304 79 199 -371 94 -28 16 228 9 84 -272 -143
7017 -143 275 70 135 232 -113 248 66 -8 363 -181 -6 101 -229 88 115 -101 267 237 27 136 -18 16
7039 16 2 -161 157 254 54 84 22 34 -186 28 9 -257 -41 264 -292 56 -31 -23 51 -22 -150 193 -315 308
7063 308 10 -136 310 -265 33 185 34 76 -143 110 140 71 -27 53 -69 117 125 22 334 -190 -52 221
7085 221 -116 -28 93 -148 152 -131 -10 342 -224 66 178 -348 112 112 -30 365 -220 -132 287 -242 151
7106 151 225 81 137 -213 -121 524 -120 -72 -290 217 167 -165 56 85 162 235 -47 -229 274 -211 241 67 86
7129 86 -16 138 -177 86 -32 106 -242 -386 252 -151 -19 48 -505 109 80 -261 382 153 -192 104 46
7150 46 -135 116 -154 334 -245 -41 -79 -138 44 -120 -232 253 293 42 189 -153 161 39 -91 270 125
7171 125 -40 189 -107 178 33 -209 391 148 127 54 -241 -157 91 53 190 46 -235 216 -3 -239 30
7192 30 -86 148 178 -91 -66 33 -96 -3 -152 285 -299 -75 414 -197 -175 549 -196 -220 87 41 63 -141 -132 -13
7216 -13 -231 -156 -33 -160 134 -11 -57 -28 -405 156 -245 78 121 -217 162 -121 -41 106 52 -1 150 -36 -212
7239 -212 272 -167 103 207 -338 67 -54 80 295 -316 335 290 -31 320 -330 74 -39 -84 259 162 -124
7260 -124 27 -258 44 47 -307 179 167 -229 -88 -42 -77 -32 -323 -13 -161 -132 97 -88 -102 40 -24 193 66
7283 66 -208 200 -20 10 111 -335 81 -9 -243 191 -129 13 220 -112 83 -116 191 86 -45 -286 -24
7304 -24 -155 226 -30 -115 267 16 219 172 -138 133 276 -136 407 87 -145 280 84 -40 122 -148 231
7325 231 90 42 -73 -81 311 13 -183 217 48 -128 60 -110 163 355 -151 203 53 424 103 -271 145
7346 145 291 -286 207 -214 -163 -39 -176 109 -33 -341 6 65 30 366 -339 141 2 -154 166 -157 -134
7367 -134 -235 -536 -16 392 -166 43 -115 -159 326 -131 53 -87 -237 134 25 -85 107 -91 -7 184 -97
7388 -97 126 -144 -130 154 75 -35 -101 -152 -45 -81 -4 131 -243 -252 434 -204 13 132 -254 54 -139 114 -94
7411 -94 14 22 -386 -231 280 -160 341 178 -220 172 -179 -59 443 94 -20 160 96 177 -205 80 70 -66
7433 -66 -84 50 -123 51 1 173 117 -22 -117 82 -115 -10 -118 -166 193 -111 242 119 28 88 -251 -6 18
7456 18 -193 110 -36 -134 -11 153 -175 40 -137 7 121 -11 37 75 -92 6 286 101 171 -78 171 128
7478 128 -98 30 -198 73 103 -381 274 -65 -186 126 -194 -268 352 1 57 -75 -196 143 -76 48 1
7499 1 -443 -191 -77 -117 231 -359 8 64 -134 97 73 79 108 -121 -9 134 -172 -109 109 -44 38 -97 -169 6
7523 6 25 4 104 -365 142 39 -312 89 91 -140 120 -23 -53 -10 51 140 -177 -189 131 -19 196 -150 270 192
7547 192 272 2 -12 191 67 -304 -214 -184 -18 186 -175 -30 108 3 -41 121 27 119 218 -56 83 -201 -142
7570 -142 49 -73 251 234 53 83 101 -191 131 -518 -28 -164 126 191 -289 -502 209 -237 -176 43 -127 291
7592 291 -111 -35 35 53 -142 -142 -314 236 13 -20 36 -8 -70 22 -116 57 264 -82 111 -113 -145 -12 -63 242
7616 242 -57 -20 246 -131 96 73 -168 -28 -293 106 339 -39 209 -42 -157 108 -61 151 -58 -178 185
7637 185 -137 -208 -26 -73 35 86 -135 -178 -103 56 -39 -127 -1 34 -80 13 85 -170 5 26 119 103 -200 78
7661 78 256 168 221 -22 -88 98 -148 -162 322 -172 -7 -79 14 135 3 -232 -266 -209 16 -71 -148 38 18 205
7685 205 10 -267 139 195 -8 15 -236 42 51 -110 32 256 -157 87 -57 128 -121 -302 -10 -366 112
7706 112 350 -192 -146 178 46 187 76 36 46 231 13 48 187 -156 -26 111 238 -271 39 5 -248 204
7728 204 415 -240 294 4 287 39 -220 -70 -172 -280 51 72 -225 155 -36 -92 -67 4 -117 -123 111 72
7750 72 147 -92 -320 -201 68 167 -102 112 -89 -47 -140 119 158 55 -187 -105 -191 -40 27 -169 39 -20 -273
7773 -273 70 -175 293 122 -237 235 -208 108 211 102 80 49 -310 307 180 16 29 -82 155 -121 -60
7794 -60 77 177 56 -17 -69 -27 -179 56 76 -7 39 26 -9 28 66 175 279 283 80 204 -163 218 243 -201 -70
7819 -70 -25 -180 98 -46 49 148 -221 56 134 122 112 -183 28 119 27 185 -124 -52 175 -167 65 276 -184
7842 -184 -68 -35 -254 197 -270 -89 10 33 -30 261 56 485 34 -141 -19 14 62 20 -97 93 55 63 -21 12
7866 12 19 -266 236 -98 198 -14 98 193 -17 57 -14 317 7 -289 82 -266 227 -76 128 220 -149 350
7888 350 -78 -167 204 161 310 185 -188 -43 26 11 -14 -82 28 111 11 -146 -163 -122 110 185 54 -142 200
7911 200 153 -182 95 123 -156 -90 -71 34 222 -101 -149 65 76 -202 -77 209 173 -24 188 59 -99 -75 121
7934 121 21 175 281 -65 213 65 -198 217 -64 132 -37 61 365 -102 -40 114 -133 -89 106 -16 71
7955 71 101 -140 35 -89 145 339 -195 105 -224 129 114 -158 -125 -81 -208 48 12 -68 72 -47 -68 113 -163
7978 -163 49 150 -282 109 -8 10 187 167 283 177 134 -58 -169 67 89 -125 -9 17 -26 330 -141 179
8000 179 113 -23 -82 -29 26 219 -44 -86 27 183 86 82 62 109 -44 -59 239 -131 30 129 -123 -143 -123 158 95
8025 95 -225 -98 -30 -227 156 -149 10 105 -63 34 29 -133 59 -122 122 233 -95 -28 101 131 143 -16 -52
8048 -52 242 -95 112 240 200 -49 -77 113 47 -252 -124 97 -83 31 41 16 44 -145 -147 349 -132 271 -110
8071 -110 -16 114 -75 -73 114 -5 -27 -143 -97 -35 -133 -117 96 -241 9 10 -23 220 121 128 35 -227 -14 129 91
8096 91 298 -100 -112 78 -3 33 -19 -22 1 -243 56 111 -113 246 -144 345 173 72 96 -162 116 -36 -240
8119 -240 84 69 -73 12 6 41 -73 84 -148 26 26 100 -154 -86 -79 163 -144 177 63 6 50 -334 -64 -290
8143 -290 -41 146 99 -132 115 -104 -58 -31 -241 326 -174 170 132 13 89 -36 177 129 40 -30 -7 -190 -13
8166 -13 -157 -157 424 -101 -65 229 -163 -170 -174 -148 -121 0 -41 1 224 74 113 -460 125 -231 -120 148 -111 290
8190 290 -147
8191a47
$$ Imaginary data points
##PAGE= N=2
##DATA TABLE= (X++(I..I)), XYDATA
0 0 0 0 0 0 0 0 0 0 0 0 8 -8 8 -8 16 -16 21 -24 32 -32 40 -48 57 -69 80 -93 109 -125 142 -164 189 -212 240
33 240 -269 304 -342 384 -429 478 -532 590 -655 726 -801 884 -977 1076 -1186 1307 -1439
50 -1439 1584 -1747 1926 -2128 2357 -2614 2909 -3252 3655 -4142 4727 -5463 6411 -7684 9474
65 9474 -12185 16712 -25588 49117 -231850 -503020 262048 -35811 -297786 200518 -32284
76 -32284 -488082 -64978 119419 -175315 -92237 8676 -270912 -218119 19867 -3242 -34361
87 -34361 -150028 -223486 -20863 -74369 -67980 151606 -156492 -300494 102459 8489 -138168
98 -138168 144189 -5898 -274339 8250 131174 -58619 56179 73135 -191692 -13635
108 -13635 176226 -25982 89865 105231 -193794 58577 215776 -66744 115241 178773
118 178773 -182412 -3159 262492 11815 -5840 180412 -49799 -129469 200557 139679
128 139679 -80645 64759 21865 -97859 75298 90485 18238 -2664 -100660 9285 72303
139 72303 -57023 67579 60580 -192667 -34255 161762 -53140 -63204 121416 -86839 -173387
150 -173387 164955 79452 -165252 75776 33004 -188223 83065 127286 -101653 -266
160 -266 16917 -82479 37105 73748 -16317 -13864 -17512 -35037 47061 68607 -28163 8206 26850
173 26850 -71070 58161 118625 -61629 12651 64308 -74224 51849 115804 -38821 713
184 713 38502 -31002 32156 73911 -9837 -20497 22919 -23534 -1505 77824 -27783 -52959
196 -52959 48950 -50957 -32990 95296 -47594 -71906 46418 -43730 -40897 57168 -20393
207 -20393 -66052 -3908 -3868 -35361 7377 12195 -61034 -26727 8579 -38023 11547 770 -64863
220 -64863 118 -14956 -39594 35678 -22826 -56698 11686 -20904 -26334 22224 -7747 -39815
232 -39815 -11826 11703 -15539 -2499 27704 -34224 -19155 37972 -17164 7188 33947 -32637
244 -32637 5603 26720 -10041 27667 14152 -14607 14848 12296 10345 16493 12150 3404 -6469
257 -6469 24198 15539 -5897 30996 -2198 -14723 38534 836 -242 31329 -13409 2712 23900
270 23900 -2236 14285 7806 -2628 7467 2272 14032 2750 -2145 12121 -12609 5722 15736
283 15736 -17384 10106 1013 -21428 15914 -4641 -12588 10445 -16219 -6397 2548 -12125 1368
296 1368 -10114 -8609 -501 -16223 3683 -5305 -17737 7088 -14654 -10018 9507 -18629 -1448
309 -1448 952 -17894 6408 -6272 -9405 6374 -13660 47 1319 -11926 8226 -7100 -5346
322 -5346 9459 -12411 5143 5051 -11621 11750 -3124 -4294 13262 -8422 5615 7555 -7958
335 -7958 13107 -671 -1156 15428 -6545 7958 10222 -6441 15295 2149 -702 16295 -3876
348 -3876 8533 10567 -5075 15294 1546 -229 16056 -5815 7566 10125 -7848 13380 996
361 996 -4108 13265 -6932 2554 6814 -9411 8006 -2612 -5654 7817 -10871 1515 2209 -14372
375 -14372 7674 -6348 -10735 8914 -13721 -4149 4167 -15839 1347 -3971 -12416 2266 -11483
388 -11483 -4588 -2483 -13932 2000 -11272 -10050 4878 -18546 -2390 2251 -20598 5934 -3679
401 -3679 -16073 9144 -8415 -7018 7954 -7534 1782 1762 -1224 6987 -2277 9983 5342 -4260
415 -4260 19063 945 1563 24641 -5382 7434 22898 -6059 15857 17508 -3859 15997 10725
428 10725 3959 14248 9267 8903 3034 10829 13845 -2681 18136 8519 -11262 22937 4637 -7691
442 -7691 25200 -5617 -7212 19395 -7201 1285 12148 -10884 -3741 2100 -3622 -3980 -1949 -4520
456 -4520 -20727 -1806 2244 -27042 3586 -4719 -41251 7200 -3069 -35577 9371 -12115 -38175
469 -38175 3045 -5147 -21465 -3583 -8527 -23451 -11557 7429 -13408 -13474 6710 -26202 -11175
482 -11175 20635 -22340 -2024 12442 -37480 3538 21166 -24124 7279 7730 -29496 4570
494 4570 20347 -8355 -2365 12312 -13669 -8237 34666 661 -12590 31260 -15956 -12058 54709
507 54709 -5698 -12086 41901 -20112 -9827 56368 1494 -16959 30176 812 -19940 35367
519 35367 28421 -28927 7262 21407 -27742 20337 33214 -28206 2250 5916 -16584 28875
531 28875 5197 -16751 16710 -18821 -11514 42004 -2346 -24976 21241 -3494 -32431 36051
543 36051 32835 -51191 3081 34339 -50247 16377 58409 -54887 -15827 39335 -35302 3971
555 3971 44558 -27936 -22416 16962 -7035 2847 29850 -8753 -24344 15666 -119 3419 42630
568 42630 -15146 -24178 32287 -9755 7504 52794 -25306 -18907 31559 -14018 13418 44570
580 44570 -26396 -21630 23620 -10723 381 46217 -23823 -49698 36594 -3366 -34595 60797
592 60797 -14044 -85046 42269 14493 -54840 45361 5349 -85350 6971 34839 -34424 -1634
604 -1634 14902 -56793 -31905 33090 -9382 -19660 -1312 -46844 -20381 13207 -17441 9583
616 9583 -17674 -67146 13697 12690 -39803 26659 -108 -77078 6794 45099 -32770 -1249
628 -1249 35825 -55131 -27100 74582 -3724 -27968 48644 -26719 -32995 70390 13666 -16762
640 -16762 34399 -16549 -13522 53086 20072 -1657 21584 -10238 -11907 49824 30959 -13612
652 -13612 22004 2057 -25277 52214 36941 -22469 22498 159 -22993 47509 26281 -11842
664 -11842 14733 -14871 -13986 41641 18199 -15353 7310 -11149 -29649 35139 31350 -42876 -388
677 -388 9657 -53069 22553 46866 -50473 -15973 13140 -41374 7496 37649 -26428 -29656 -1598
690 -1598 -12466 1153 23531 -10697 -28068 -2446 -12152 5364 32262 -23436 -21751 12885 -27516
703 -27516 8901 45470 -31683 -24888 18339 -18679 1769 37813 -13073 -32538 8558 4650
715 4650 -7188 27494 4560 -36572 6142 9717 -8272 32238 -1109 -34134 14112 1722
727 1722 -5055 32720 -5772 -29081 9107 5420 -4219 18297 6365 -28723 -6611 17595 -8533
740 -8533 7954 15247 -33338 -8572 19204 -10746 11221 9204 -30127 -2135 10392 -4269 11953
753 11953 4075 -18280 -7508 9692 6165 3220 9162 -13050 -15383 18142 4977 -74 14642
766 14642 -18490 -10637 19923 -1595 5969 11226 -19020 -5385 12976 3980 5460 3925 -8042
779 -8042 -11175 9296 14860 -3660 3447 -2162 -15708 13089 11255 -5173 8137 -9543 -10791
792 -10791 14628 1909 547 4756 -12268 -5872 6903 5944 -676 -4817 -1172 -9532 -457 14442
806 14442 -7279 -6434 2489 -12577 3061 8525 -6610 1019 -7304 -7336 8644 -1256 -1314 2010 -8815
821 -8815 -3052 3270 4166 -1129 -6094 3804 -5136 -4467 14512 -4600 -8503 7628 -6449 -800 8414
836 8414 -2678 -135 -3362 -1599 5851 -2596 2612 2412 -6398 2629 1552 1847 3341 -5076 3738
851 3738 287 -5125 10879 -369 -6232 7833 -2186 -316 6060 -812 2262 -1846 358 6478
865 6478 -4028 3357 4473 -6167 4300 1874 -848 4313 -3410 2616 1595 -5140 7507 -820
879 -820 -4935 6945 -3189 -1023 4066 -3184 2617 -1465 -1735 4658 -5052 1332 3409 -5796 3183
894 3183 -478 -3400 3602 -4593 1064 1363 -7245 3911 -1430 -5662 4949 -4457 -3383 1896 -5247
909 -5247 847 -1906 -3824 1955 -5668 -583 1657 -6107 2275 -2122 -4179 4002 -4520 644 2924
924 2924 -6782 3552 956 -4301 5874 -1837 -1738 3712 -2075 3366 1059 -397 4157 -3186 3138
939 3138 4392 -3926 6833 1056 -2695 8408 -1253 1324 7340 -3414 4364 4844 -1937 6149 1657
954 1657 524 3917 364 4868 443 1295 5760 -4380 3615 4733 -7020 5991 1226 -7190 6349
969 6349 -2393 -4717 4183 -4737 -2819 173 -4106 -1221 -3714 -1822 -2758 -5891 1133 -5636 -5075 3017
985 3017 -9525 -1893 2527 -11485 1654 352 -11554 3460 -1626 -8764 2719 -2231 -5314 -1008
999 -1008 -140 -2741 -4425 3846 -2654 -7032 7921 -3801 -6173 10699 -6533 -3561 10920 -6592
1013 -6592 612 8845 -5220 2648 6042 -1403 2805 4699 1626 -235 6002 4422 -3750 8876
1027 8876 3246 -7042 13241 1712 -8104 14935 -1778 -7764 15000 -2170 -6085 11367 -1030
1040 -1030 -5266 7300 3636 -6094 2940 7512 -8810 2294 11974 -11113 1928 10331 -12669
1053 -12669 5689 9193 -12065 5726 4367 -9767 7193 2682 -7517 3842 2314 -6152 1892
1066 1892 6912 -8052 -3554 10262 -10414 -2944 16362 -14474 -5776 16569 -14271 -2835 16696
1079 16696 -13301 -5442 11692 -7958 -3848 10440 -3404 -9859 6424 870 -9036 9334 -157
1092 -157 -15411 9346 -475 -11440 13684 -5823 -13505 12121 -6899 -7508 13510 -8209 -10892
1105 -10892 8959 -3297 -6861 10320 -1291 -15522 7572 6774 -15056 11433 6956 -23687 11558
1118 11558 11530 -19880 13834 8752 -23792 8602 12409 -13149 6246 9209 -15368 -2134 15132
1131 15132 -5569 -4312 12033 -11137 -6913 17443 -7012 -2293 13068 -16733 -401 16822
1143 16822 -11311 4528 10614 -19307 2331 18015 -9062 -1761 13348 -12671 -9153 22777
1155 22777 -2046 -15059 18532 -6907 -19899 25785 2062 -18203 16304 -6685 -15876 20815
1167 20815 2511 -12708 8175 -3096 -10800 13159 8430 -12369 3980 4153 -15589 12272 15578
1180 15578 -17712 4453 6383 -17725 14940 13777 -16776 4319 2042 -12057 12379 9027 -11316
1193 -11316 -419 1370 -10390 6975 14625 -13920 -6161 9823 -15515 4140 22524 -20457
1205 -20457 -8704 14119 -15599 3121 21077 -15309 -9767 8450 -6737 706 14612 -5988
1217 -5988 -14500 4939 120 -3289 16139 -5626 -18373 10658 -2698 -4824 20618 -9708 -17188
1230 -17188 12306 -3120 -2402 17337 -5796 -14812 5941 4814 -1439 10867 2269 -16605 3807
1243 3807 10380 -5422 12634 3520 -20051 9161 8567 -8117 15706 1150 -19421 7806 7779
1256 7779 -5281 8795 3852 -15934 -1824 13617 -3689 -452 9855 -15747 -6885 16971 -5527
1269 -5527 -514 10113 -16456 -3977 13009 -4409 2241 4875 -12235 -4232 8416 1509 -1942
1282 -1942 3088 -6564 -10557 9256 4053 -6466 6238 -8089 -11685 12093 -239 -4122 6687
1295 6687 -11521 -6843 10327 -766 -1269 3479 -7280 -7439 7085 6955 -5277 1186 1075 -12192
1309 -12192 6992 11803 -9482 2069 1381 -11079 7222 7354 -4833 500 -4077 -4173 4218 3648
1323 3648 129 -3100 -2959 -2484 1190 7297 -2833 -4341 3155 -6785 2489 10374 -6811 -778 3209
1338 3209 -6422 5228 6401 -3460 236 -758 -1154 3240 3548 568 -3360 1247 480 -1859 7855 -1074
1354 -1074 -6601 6517 -2447 -2104 9832 -3407 -4328 4454 -1851 1136 3681 -216 -1397 -1453 3472
1369 3472 1846 -210 3666 -3002 -981 4202 -1608 3567 746 -5747 4248 -195 -2473 6550 -2773
1384 -2773 -4030 2899 -797 -41 821 -259 -1653 -3325 3899 467 -3443 3484 -2780 -2898 4727 -1538
1400 -1538 437 972 -4868 2627 918 -1968 3789 -2941 -2736 2074 -571 940 -1004 -814 -605 -3916
1416 -3916 3046 1125 -5137 2033 -1988 -3895 3835 -2012 -1581 -213 -4387 1839 -128 -2180 2431
1431 2431 -3463 -1915 1912 -1377 798 -1438 -1349 688 -3329 2564 1564 -5045 2343 -956 -3395
1446 -3395 3479 -1621 -1367 1303 -3154 1759 495 -1592 2519 -1997 -530 2602 -524 2281 -410
1461 -410 94 3354 -2040 3330 3520 -3421 4156 1940 -2125 5117 890 231 3005 -439 2693 1804
1477 1804 49 3006 -668 1101 2113 -1003 2876 -707 -515 3402 -3270 1433 3296 -4667 2345
1492 2345 1328 -4031 2709 -249 -2097 776 -1827 -86 -1147 -1342 873 -3519 -17 125 -4250
1507 -4250 1236 -2062 -3470 2572 -4778 -2184 1551 -5825 -13 930 -5011 334 -612 -2861 8
1522 8 -630 -388 -1943 -459 1643 -3681 1952 1809 -4565 3775 751 -3434 4896 -586 -2015 4978
1538 4978 -1521 210 3547 -663 1195 1453 1205 949 719 3012 -831 703 4125 -2445 2961 4046
1554 4046 -4157 4382 2816 -3789 5320 1191 -3508 4665 529 -1427 2845 1217 -854 -265 2980
1569 2980 -1131 -1663 4564 -2766 -2578 6011 -4403 -1745 5252 -5576 -620 3617 -5088 630 1479
1584 1479 -4007 270 342 -1846 -1067 1178 -1131 -3046 2780 -1021 -4696 5151 -2132 -5267 6591
1599 6591 -3549 -4401 7073 -4156 -3685 5336 -2906 -2596 3106 -1363 -3092 1384 1254 -4053 1040
1614 1040 3000 -5757 1768 3338 -6440 3689 2191 -7205 4848 581 -5089 5218 -536 -4299
1628 -4299 3871 55 -2830 2538 1764 -3412 631 4570 -4534 434 6262 -6869 437 7354 -7503
1643 -7503 1464 6641 -7913 1548 5560 -5785 1441 4057 -3636 -344 4170 -1023 -2108 4762
1657 4762 -917 -3543 6750 -1059 -3572 8133 -3274 -2991 9126 -3900 -1553 7889 -5198 -1296
1671 -1296 7230 -2920 -1671 5352 -1844 -3949 5918 1225 -6631 5477 1479 -9234 7367 2884
1685 2884 -9647 6656 802 -9222 7306 2010 -7734 3968 697 -5992 2885 3300 -5013 -493
1699 -493 3316 -5811 18 6144 -7479 -901 4923 -8628 1698 6485 -9445 796 4181 -8296
1713 -8296 2449 4794 -6989 -292 3476 -4657 -985 6361 -3592 -4669 6606 -2947 -3356 9944
1727 9944 -3984 -5864 8594 -4019 -2167 9686 -4405 -3760 6421 -2624 -1228 6731 -1149 -4489
1741 -4489 3757 1496 -3288 5725 1749 -8205 4957 3282 -5620 7706 863 -8177 6501 1235
1755 1235 -3980 7477 -2 -5287 3744 2484 -1622 3891 2412 -6196 790 6233 -4029 1679
1769 1679 4852 -8522 1269 6640 -6620 3225 3946 -9247 1923 4523 -4620 2429 2294 -6763
1783 -6763 -813 5605 -2173 -2493 4902 -5398 -4393 8528 -2814 -4793 6858 -6298 -5336 8233
1797 8233 -3292 -3197 4252 -5467 -3987 4456 -637 -3535 473 -2028 -4886 2720 1654 -5533 1537
1812 1537 -1230 -7161 5661 1453 -5680 3991 -2898 -5742 7019 596 -4123 2648 -1537 -3852
1826 -3852 3865 3592 -3993 -379 2762 -5070 1380 7498 -5291 -1392 4397 -5767 2474 7174 -4582
1841 -4582 9 2271 -2715 2739 3986 -540 -1237 908 720 933 5042 1009 -2940 2738 -288 203
1857 203 6895 -1909 -2330 3870 -2729 2027 5949 -3541 -1191 2167 -2052 1211 3816 -391 -3443
1872 -3443 505 1358 -2272 4017 1115 -6204 2459 1572 -3267 4890 372 -4921 2038 -249 -1000 3052
1888 3052 -765 -2368 -984 419 724 525 1241 -2879 -2244 2007 -1602 934 2098 -5747 -271 1978
1904 1978 -3104 3171 694 -4856 584 277 -716 2008 439 -1921 -2025 1569 1017 -860 2101 -1983
1920 -1983 -3830 3358 -343 -926 3088 -3545 -2047 2339 -1262 790 779 -3038 -751 106 657 392
1936 392 -509 -500 -2749 139 2406 -1911 1012 -1 -3573 2495 677 -1652 2458 -1787 -1696 2153 -225
1953 -225 887 528 -1157 3 -218 1125 361 -1104 1099 -1433 -293 2719 -2055 765 1406 -2702
1969 -2702 1879 1067 -1636 2190 -637 -824 1636 -672 785 362 -238 754 -1165 1013 450 -1190
1985 -1190 2123 -923 -1354 2390 -1488 379 1844 -2583 933 823 -1720 1812 106 -792 498 -745
2001 -745 615 50 137 901 -1820 1025 1122 -1106 2323 -181 -1981 2304 -990 -27 2718 -1733 397
2018 397 875 -1072 1597 517 -540 222 -767 1260 -148 177 1590 -1933 459 1559 -1885 2036
2034 2036 93 -2830 1880 -590 -700 2290 -1421 -745 692 -988 583 223 -147 -607 -1575 1213
2050 1213 -731 -564 1645 -2955 -668 1233 -2463 875 333 -2893 962 -200 -1247 1581 -1097
2065 -1097 -1063 -450 -467 743 -621 171 -339 -1895 1666 -125 -1084 2291 -2328 -920 2385 -1940 791
2082 791 1429 -2498 677 947 -679 1269 115 -71 -280 337 1120 -469 1114 580 -2102 2324 788
2099 788 -1765 2714 -1130 -1511 3142 -1132 75 1681 -1491 7 880 42 594 -182 430 -775 -117
2116 -117 1960 -1520 526 1113 -2982 1626 1554 -2679 2243 -241 -2259 2292 -463 -810 1321 -875
2132 -875 -747 249 284 -475 -1206 1092 -1432 -1067 2562 -2068 -708 2212 -3235 550 2122 -2568 897
2149 897 912 -2385 1115 588 -928 37 -24 -219 -801 1038 405 -2054 2166 -280 -2157 3198 -1136
2166 -1136 -1690 2757 -1947 -640 2822 -1762 78 1654 -1039 316 1187 232 -444 228 850 -1340
2182 -1340 1144 1648 -2543 1850 831 -2609 3147 -34 -2606 2941 -840 -1682 2715 -982 -1112 1683
2198 1683 -156 -859 434 1080 -1577 -340 2178 -2357 208 2906 -3394 463 2664 -3572 1410
2213 1410 1201 -2810 1237 678 -2526 581 522 -1176 -785 961 -801 -1471 1895 -1263 -2089 2990 -2274
2230 -2274 -1637 3427 -2816 -954 3210 -2988 -295 2531 -1891 -414 1714 -885 -577 1455 439
2245 439 -1669 1725 1221 -2900 2582 1001 -3234 3169 358 -2741 3458 -371 -2061 2415 -494
2260 -494 -1252 1649 -338 -758 722 1059 -937 392 2078 -1978 119 2557 -2626 1276 2723 -3734
2276 -3734 1451 1516 -3162 2004 1037 -2512 1103 1002 -1296 215 926 -748 -1416 1655 -428 -1727
2292 -1727 2767 -1748 -1889 3192 -1950 -801 2546 -2665 -43 2279 -2341 720 1524 -1955 -290
2307 -290 1266 -306 -843 1467 -265 -2655 2384 481 -3038 2967 -245 -3711 3463 -182 -2745
2322 -2745 2833 -1109 -1837 1897 -151 -866 651 44 -1030 -58 1606 -1220 -134 1739 -2345 547
2338 547 2381 -3005 1487 1254 -3430 2220 1086 -2735 1534 157 -2199 951 1516 -1082 -625 1086
2354 1086 -1267 -1420 2881 -1426 -2127 2951 -2013 -1254 3271 -2249 -1117 2170 -1845 113 1932 -612
2370 -612 -549 278 215 -175 984 1083 -1232 498 1043 -1684 2029 346 -2157 2248 -599 -1071 3202 -1308
2388 -1308 -1225 1855 -1123 -317 1615 125 -983 318 1251 -777 543 1829 -2499 58 2582 -1905
2404 -1905 1040 1815 -2854 908 980 -1487 1382 -119 -1232 118 -83 486 122 8 -386 -1676 896
2421 896 -382 -1107 1801 -1680 -1291 1974 -1708 195 1804 -2854 -196 1077 -1105 618 314 -1130
2437 -1130 -939 146 648 -827 547 71 -2291 1254 719 -1565 2037 -898 -2390 2140 -197 -459
2453 -459 1321 -1562 -573 935 448 738 -185 102 -411 -85 2223 -220 -142 1255 -1778 760 2061
2470 2061 -1369 1575 478 -1868 1667 566 -186 1017 -733 -170 398 515 737 -672 458 -265
2486 -265 -919 2056 -133 -1136 1581 -1702 -27 1718 -1380 488 625 -1583 523 41 -193 474
2502 474 -869 -49 -704 -66 725 -1055 86 -143 -1794 1115 -65 -1267 1380 -1139 -1018 1064 -849
2519 -849 378 652 -1193 426 -477 -77 241 -630 335 -696 -253 1359 -992 112 790 -1638 1119
2536 1119 810 -1245 1331 -403 -775 1140 -317 420 744 -636 306 -166 446 994 -707 588 -624
2553 -624 -460 1328 -388 308 944 -1540 579 949 -1001 1281 131 -1159 504 -56 3 413 -298
2570 -298 339 -1075 448 883 -958 864 -237 -1540 1283 -440 -553 1174 -1584 -256 559 -952
2586 -952 712 -176 -1199 -25 -491 342 -41 -242 222 -1123 -99 1132 -1159 506 34 -1723 1332
2603 1332 -255 -512 1074 -1369 -524 684 -614 647 101 -727 49 -347 516 -14 -583 497 -1068
2620 -1068 229 1404 -880 716 591 -1327 1070 598 -455 1086 -360 -107 824 -292 628 81
2636 81 -96 498 -182 726 286 -359 1201 -714 -285 1794 -839 82 1119 -973 627 464 -351 1059
2654 1059 -165 -50 567 27 716 -270 98 481 -818 761 144 -1261 1190 -425 -1081 1448 -1236
2671 -1236 -549 750 -1025 -56 99 -564 -14 -575 -361 -131 -585 390 -757 -358 579 -1115 296 259
2689 259 -1699 599 -193 -1119 1248 -759 -659 825 -560 37 -2 -331 58 -139 328 5 -353 992
2707 992 -737 -282 1371 -1025 382 1033 -1540 925 645 -814 1042 -96 -694 536 12 403 201
2724 201 -34 600 -475 429 519 -419 1157 -264 -547 1618 -529 31 1114 -1422 297 709 -891
2741 -891 512 -56 -368 169 -3 56 -372 34 582 -1118 580 453 -1557 773 -441 -1174 1130 -632
2759 -632 -708 754 -1138 -305 698 -823 -5 29 -128 -303 -377 637 -962 -393 929 -1239 41 931
2777 931 -1479 634 553 -1150 968 422 -788 1036 -269 -135 637 157 176 28 617 308 -610 1469
2795 1469 -124 -614 1449 -895 -71 1428 -1371 131 860 -1124 226 397 -823 192 114 -78 -215
2812 -215 252 253 -1118 410 250 -1289 1217 52 -1382 1608 -815 -1104 1305 -819 -455 921 -761
2829 -761 -268 635 -96 -344 -168 534 -676 242 640 -1111 369 868 -1323 709 656 -1419 1085 251
2847 251 -981 1124 -83 -280 813 -67 79 -1 608 80 -336 785 -179 -668 1316 -717 13 1433
2865 1433 -1288 266 1202 -1220 643 786 -1051 188 365 -572 -170 283 -225 -736 919 367 -1327
2882 -1327 874 -177 -1694 1352 -496 -1270 1138 -1003 -917 975 -672 -597 190 -579 -113 -309 133
2899 133 -295 -263 921 -562 323 866 -1160 558 413 -1374 923 463 -1254 1077 56 -372 872
2916 872 -22 -177 387 324 -28 -274 1039 -127 -343 1342 -441 -368 1575 -624 42 1098 -682 467
2934 467 396 -749 389 376 -159 607 238 274 -97 -20 451 -537 748 229 -835 1200 -279 -921 1205
2953 1205 -640 -827 1167 -654 -366 448 -630 -202 -115 -284 -295 -288 271 -1226 -275 548 -1205 347 350
2972 350 -1438 764 378 -1482 649 -5 -983 271 -54 -302 211 46 79 -575 475 8 -418 724
2990 724 -470 -266 830 -614 -73 1078 -1174 411 637 -986 389 331 -321 244 255 187 -39 335
3008 335 474 -483 705 491 -692 1071 11 -716 1006 -423 -379 779 -851 82 554 -778 -59
3025 -59 262 -298 62 25 396 -616 -311 591 -760 8 754 -930 481 422 -781 469 -289 -543 834
3044 834 -497 73 355 -293 -71 -4 43 -80 -156 510 -583 -799 1120 -654 -183 927 -1226 22 236
3063 236 -867 483 -285 -155 317 -408 46 245 -251 -81 -137 570 348 -842 387 74 -776 985 -200
3082 -200 -383 981 -735 -405 565 -216 218 141 -301 344 -167 647 241 -151 638 -604 289 703 -474
3101 -474 468 593 -744 1086 542 -546 736 -4 -259 939 -218 40 -183 -224 299 -112 511 -156
3119 -156 -465 371 -194 -27 598 -838 -95 -55 -987 576 163 -413 592 -247 -404 33 -344 99 -297
3138 -297 33 85 -887 138 108 -954 244 -478 -634 628 -487 58 318 -925 254 71 -386 414
3156 414 -284 59 421 -127 407 -133 191 506 -279 449 684 -477 671 298 -137 781 -8 109 760
3175 760 -569 581 414 -166 450 -98 124 239 -227 459 -243 9 756 -636 224 397 -806 453
3193 453 382 -850 179 -120 -391 390 -326 -267 -12 -457 197 -475 -65 61 -350 405 -339 -630 530 -617
3213 -617 -334 231 -795 -124 9 -696 328 -91 -487 220 65 -127 -190 19 449 -245 259 369 -349 466
3233 466 118 -500 799 -161 -231 850 -409 17 302 -363 173 137 61 328 -71 247 347 -352 703 -336
3253 -336 -154 743 -473 473 38 -631 616 -6 -414 613 -603 168 321 -302 326 -198 169 281 -388
3272 -388 225 -373 -107 626 -876 -468 817 -465 199 283 -633 307 -181 33 545 -354 -18 64 -488 415
3292 415 25 -302 -55 -569 212 -187 1 931 -580 -495 888 -285 10 749 -329 137 277 -109 160
3311 160 -316 230 4 -397 587 57 -237 418 -684 443 533 -522 486 -85 -545 550 -261 -261 181
3330 181 -622 51 -318 -324 242 -405 -102 -382 -459 358 -206 -459 302 -776 -19 435 -473 344 48 -819 270
3351 270 36 -379 189 -262 77 -220 14 544 -352 310 238 -503 475 8 -238 306 -394 197 514 -249
3371 -249 680 385 -203 526 137 162 419 1 105 64 -8 437 -471 428 280 -638 775 73 -562 715
3391 715 -402 -207 696 -628 50 157 -328 -90 -216 178 64 -308 774 -497 -495 557 -658 -35 270
3410 270 -992 493 195 -726 454 -483 -493 152 -405 -137 -21 -367 98 -181 -43 -92 -190 437 -179 -306
3430 -306 907 -677 -77 805 -372 -31 642 -284 188 181 3 212 -207 275 -199 106 565 -333 576 267
3450 267 -529 416 114 -665 877 -164 -248 536 -321 -8 178 -231 388 101 -4 242 -182 423 -117 -325
3470 -325 422 -521 -3 674 -732 298 -14 -722 650 103 -781 440 -74 -236 307 33 91 -399 57
3489 57 155 -303 109 -165 -374 545 -294 39 833 -491 201 318 -630 328 474 -624 305 -140 -3 -76
3509 -76 -254 -7 -434 93 57 -596 169 -33 -564 447 -299 -367 521 -427 -232 600 -289 171 416 -277 71
3530 71 -153 121 -172 -206 601 -543 -333 536 -774 187 426 -625 318 -159 -329 313 -195 -18 356 -120
3550 -120 36 111 -137 358 -336 331 60 -243 600 -149 -284 685 -591 141 439 -417 283 213 -69 415
3570 415 -273 -197 -36 -521 414 115 -7 63 -337 322 149 -649 617 -84 -219 705 -415 -409 400 -272 24
3591 24 194 -207 139 -262 378 -7 -109 169 -40 -307 211 -377 -4 -127 -216 414 -166 -388 758 -167
3611 -167 -251 514 -38 -4 48 -26 223 -166 432 318 -364 231 117 -384 448 -156 259 368 -236 603 -47
3632 -47 -463 515 65 -169 372 -263 -95 -37 -169 438 -613 319 486 -641 600 285 -366 380 218 39
3652 39 587 -96 135 231 -393 135 70 -185 176 42 216 -287 -15 365 -831 -47 440 -617 -37 213
3672 213 -551 227 -127 -239 104 -469 -38 -140 -324 -64 -248 -289 -114 -138 111 35 -77 310 -425 -3 572
3693 572 -494 103 355 -254 -241 -3 -222 157 -345 150 28 -342 462 20 -222 325 -69 29 358 -519
3713 -519 490 -135 -296 679 -288 35 108 -280 298 243 167 204 -111 124 33 -86 462 -77 -198 430 -362
3734 -362 353 392 -213 322 -142 -419 354 -346 -6 258 -501 242 203 -132 254 -58 175 295 -409 638
3754 638 -324 -46 243 -670 -94 421 -476 -33 -104 -338 129 -292 -72 83 -211 93 144 -30 548 -227 190
3775 190 -12 -522 427 55 -423 328 -473 -156 300 -321 206 -186 -37 286 -133 -108 207 -526 157 -37
3795 -37 136 271 -153 -68 385 -425 436 209 -363 224 -177 -206 187 -80 114 -157 -68 298 -97 230 100
3816 100 -597 168 9 -146 545 -155 -6 68 -138 450 226 -126 528 -269 -233 197 -228 147 -10 -412 147
3837 147 -66 374 113 -573 92 60 -139 421 -254 -200 130 -218 301 81 -472 212 -228 -215 280 -209 360
3858 360 47 -358 93 -308 287 122 -807 -176 52 -635 243 -620 -449 29 -276 255 119 -293 202 -385
3878 -385 -309 222 -114 528 -179 -322 350 -359 154 357 -455 152 -6 -320 372 -35 -24 -10 -280 313 187
3899 187 -121 129 -197 71 445 -163 367 -163 -234 229 -21 -99 656 -299 -172 458 -203 687 335 -459 152
3920 152 -388 311 244 -34 64 -372 -69 262 -427 215 3 -449 85 -107 -228 379 -688 -430 -187 -502
3940 -502 284 -146 -238 -28 -344 -243 217 -6 115 -219 -114 224 -132 403 51 -827 403 -167 -476 876
3960 876 -230 -256 -135 14 239 -41 -40 244 -490 79 57 -372 684 93 -392 317 138 381 279 -423 180
3981 180 169 101 483 -283 43 359 -477 154 51 -110 187 -468 319 76 -157 459 -28 -379 136 -199 69
4002 69 384 -441 39 180 -631 25 -40 -20 -6 -70 460 -420 73 637 -424 -33 323 -212 147 -111 -442
4023 -442 436 -416 77 265 -288 227 108 -279 306 9 180 247 -280 180 -175 -174 279 -144 -87 377 2
4044 2 -12 42 -418 444 -200 -551 235 -247 -86 329 -99 72 -453 -50 73 -474 316 -601 -479 354 -161
4065 -161 -77 98 -263 -67 -246 -528 225 -101 -199 187 -179 -12 165 -199 49 -112 102 46 -390 367 14
4086 14 -513 421 -311 -148 227 -16 -6 164 -22 404 -182 223 285 -287 362 107 -421 374 103 -83 537
4107 537 -181 319 326 -315 581 197 -406 460 -91 -113 156 -52 289 20 -77 307 -533 211 130 -75 397 -198
4129 -198 -55 443 -606 -53 75 -431 120 196 -449 109 -103 51 -120 -207 115 22 -73 275 -327 16 -140
4150 -140 -395 225 -227 -260 327 -722 0 248 -496 233 -67 -335 109 -414 -70 223 -161 430 -258 -239
4170 -239 260 -115 140 305 -288 229 -27 -181 360 -53 164 131 -27 384 -255 45 272 -503 109 381
4190 381 -288 360 -231 -114 192 112 170 235 -293 351 -74 -284 399 -158 170 236 -215 596 65 -126 428
4211 428 -110 -31 70 -394 229 90 -504 223 -323 -181 198 -196 43 -373 -136 390 -139 169 430 -468
4231 -468 102 -45 -210 296 -433 -203 194 -425 80 185 -222 524 -293 -263 127 -219 205 -8 -9 149 -341
4252 -341 142 399 -480 490 97 -307 577 -316 198 319 -12 257 327 -39 464 -92 -162 143 64 424 13
4273 13 -194 507 -362 -227 327 -313 357 36 -234 397 -167 -203 212 -150 -127 215 -353 30 -290 -140 39
4294 39 -245 17 -199 -434 448 -342 -371 303 -300 -199 96 -481 316 -320 -274 374 -188 -221 67 -238 130
4315 130 -198 27 58 -392 274 -31 -499 211 -116 -222 354 -127 -12 42 -182 472 123 -13 20 -57 141
4336 141 227 208 250 -317 -176 278 -4 598 -100 -495 300 -96 -114 521 -163 98 -150 -274 443 -153 -29
4357 -29 218 55 -83 16 -263 381 -109 -306 255 -334 22 -7 -238 95 -75 -420 217 -188 12 -32 -247
4378 -247 172 -116 68 266 -432 -105 258 -278 251 129 -352 249 -273 483 223 -617 211 -229 -217 556
4398 556 -313 69 105 44 334 -15 -189 69 -432 221 37 -122 150 -82 -270 478 -166 230 280 -507 181
4419 181 25 -209 148 -26 -94 -56 5 156 -43 -7 233 -312 218 298 -429 169 -160 -215 340 -252 -28 -109
4441 -109 -484 115 74 -11 398 -205 -171 345 -88 360 143 -139 193 -447 313 435 -325 198 -138 -504 432
4462 432 -12 160 174 -269 200 -103 -194 443 -144 -153 -13 -251 406 108 -254 293 -584 14 630 -509 487
4483 487 163 -375 415 19 33 -107 -595 134 30 -323 258 -251 -230 343 -286 446 -173 -307 210 -646 -131
4504 -131 462 -330 101 104 -510 233 28 37 -55 -146 -11 34 -96 318 -124 -47 420 -426 375 292 -385 351 -389
4527 -389 -61 636 -325 45 417 -327 199 -28 -3 270 -291 174 -37 126 660 -483 -389 472 -196 235
4547 235 106 37 192 -620 315 401 -319 27 -60 -440 -87 39 70 40 -292 169 -284 -252 444 -290 -116 259
4569 259 -289 297 383 -259 203 -185 -190 307 -348 174 111 -173 133 -186 49 253 -300 137 54 -325 682
4590 682 -143 -110 257 -219 204 257 -163 53 -23 46 389 -319 24 228 -364 239 145 172 498 -462 250 340
4612 340 20 471 35 -187 283 -250 -21 42 -418 391 -230 -112 150 -259 103 506 -431 87 7 -172 240
4633 240 -312 22 279 -305 281 -172 -111 102 31 -2 71 -284 108 50 -157 235 -329 33 306 -259 189 0
4655 0 -296 229 -359 206 283 -265 409 -95 -318 581 -276 -172 368 -488 186 -90 -195 252 -532 -134 56
4676 56 -376 138 17 -242 220 -588 -95 324 -500 76 41 -274 66 -220 -242 236 -565 196 5 -356 494
4697 494 -311 94 146 -549 95 -154 -161 355 -61 -84 392 -105 375 12 14 574 -95 -64 371 -169 319 291 103
4720 103 510 91 252 315 -316 135 -50 264 366 -102 286 -21 -65 411 381 -276 691 -56 275 357 -214
4741 -214 278 148 -123 255 -62 220 477 -250 44 -248 -89 252 -237 -128 275 -629 325 31 -761 -33
4761 -33 99 -474 187 -205 103 -390 -556 273 -390 -184 230 -488 329 -84 -486 82 -353 -229 324 -165
4781 -165 138 142 -402 147 75 -113 176 61 -17 12 -132 361 83 181 319 -661 3 22 -173 422 -313 68
4803 68 524 -145 67 292 -144 20 93 193 113 -291 100 292 -246 499 -146 215 437 -309 263 56 -503
4824 -503 504 -141 -402 334 -385 -43 52 -119 351 -204 -140 79 -394 296 -76 -326 130 -47 -59 87 -668
4845 -668 -7 -268 -250 478 46 -217 461 -438 4 24 -126 61 -161 -62 161 -331 242 36 -324 458 -13
4866 -13 -223 379 -204 216 83 -138 402 -69 -292 229 -104 323 147 -287 152 -21 -54 490 -213 46 251
4887 251 -353 284 49 -59 376 -224 -22 284 -322 650 -117 -466 -1 88 19 570 8 185 45 246 640
4908 640 -125 83 302 -303 364 147 -221 304 -369 -140 206 -12 -35 24 -321 186 -138 53 430 -156 -12
4929 -12 -75 -221 223 -90 142 396 -575 326 103 -178 253 -179 -218 284 -104 -168 -44 -223 201 -133 436
4950 436 68 -334 -91 -179 -120 274 -363 -2 425 -582 311 332 -158 120 -391 -234 568 24 367 -8 1
4971 1 253 -162 132 525 -229 106 -202 -639 539 -253 -72 200 -515 -75 553 -398 378 -232 -67 307
4991 307 122 478 -100 -141 338 -176 109 331 -374 -83 -156 -34 452 -174 -387 210 -561 197 120 -66 323
5012 323 -117 -136 -109 -66 417 -107 -333 379 -402 135 283 -369 192 -8 -299 553 -436 -10 164 -374 148
5033 148 304 -254 52 -347 -463 90 -198 355 -134 -336 131 -205 -1 419 -603 -138 46 -108 408 26
5053 26 -200 212 -304 92 281 -410 200 -207 -93 201 -89 244 -286 -746 243 -43 -221 532 -237 233
5073 233 -134 -32 560 -305 -158 255 9 364 134 -62 345 -40 -82 111 14 232 -6 -491 643 49
5093 49 -163 490 -357 -82 113 120 160 173 51 228 -175 262 374 39 333 -265 -256 272 155 172 116 -376 36
5116 36 -189 -168 330 -172 -162 214 -112 372 129 -203 76 -565 185 96 -251 13 -341 -87 274 -225 88
5137 88 186 -676 380 151 -149 211 -331 -317 -75 -17 255 -57 -384 343 -663 -48 124 -567 162 -12 -331
5158 -331 267 -151 154 290 -360 191 58 -108 549 -100 -54 290 -195 292 14 -8 172 -380 -172 364 -267
5179 -267 165 50 -7 431 -276 -13 58 -455 392 -90 -470 476 -589 -83 120 -118 351 95 -94 -13 -263
5200 -263 -37 289 -69 -191 -165 -102 257 -275 221 88 -359 376 75 -242 369 -353 -197 231 -85 272 56
5221 56 -175 186 -401 -89 205 -275 464 91 88 -69 -228 -300 240 -409 301 156 -334 276 21 -33 90 -139
5243 -139 -25 55 -54 198 -120 255 -15 -336 292 -22 -296 393 -119 -70 181 -311 163 -25 -281 225 77
5264 77 -187 36 -175 92 -32 -339 -8 -8 36 382 -228 21 340 -501 293 -221 -420 562 -254 173 430
5285 430 -254 364 91 -43 167 -262 434 -180 -198 80 -561 326 133 -414 125 76 -501 247 113 -406 288
5306 288 -356 194 259 -39 329 143 -3 192 10 136 -49 -145 342 108 132 391 -504 231 382 -68 189
5327 189 310 -165 224 -23 238 66 -312 338 50 257 313 -255 313 -16 -421 409 -358 -136 673 -240
5347 -240 119 218 -319 285 -109 -320 189 -121 89 -140 -312 358 -196 16 81 -184 103 117 -153 323 -363
5368 -363 -447 347 -447 53 220 -598 171 -11 -304 217 -387 -373 294 -73 123 -335 -403 66 -304 42 168
5389 168 -429 227 -196 -296 377 -196 -180 266 -385 65 20 -195 54 -280 -113 -186 57 189 -105 -133 242
5410 242 -442 254 351 -280 341 -221 -108 241 -39 -78 402 -138 271 36 155 278 -175 236 390 11 350
5431 350 -132 -96 350 -126 -33 598 -157 367 199 -111 298 -398 197 252 -241 192 -233 81 132 -266 -71
5452 -71 215 -235 315 53 -288 534 55 -90 293 -124 50 189 -286 429 -165 -100 162 -127 -144 -185 -31
5473 -31 -13 -366 -87 163 -241 380 266 -210 382 -410 -73 430 -315 -4 -89 -360 155 147 153 68 -105 227 5
5496 5 -9 223 -270 -412 151 -330 306 -22 -384 88 -312 -140 414 18 4 127 -33 141 -238 -172 -49 -50
5518 -50 326 -307 -161 590 -297 -262 279 -425 67 343 -476 86 -414 67 415 -86 14 -36 -283 357 -34
5539 -34 -315 -109 -436 358 109 -115 421 -128 -276 30 -196 347 169 -398 -74 -183 7 271 -105 -51 103
5560 103 -83 151 65 138 -4 -597 201 62 -93 453 -159 -382 87 -275 80 -11 -158 70 -124 -28 231
5581 231 -252 24 -15 -413 376 -157 -10 137 -568 -164 -37 -353 380 -168 -255 209 49 89 311 -219 -273
5602 -273 45 29 323 -65 185 -131 -121 316 80 183 123 -280 231 299 -277 572 -115 -451 338 108 170 294
5624 294 -23 163 -83 75 153 -259 -217 -253 -348 250 -184 -66 231 -10 43 -12 -169 -14 55 -177 283 -54
5646 -54 48 172 -267 163 -228 -84 333 -225 -95 -119 -272 521 117 -325 186 -330 -94 217 -166 150 -16
5667 -16 -205 97 -212 329 341 -318 225 -1 -89 109 -481 -10 271 -402 158 263 -137 224 -439 -200 291
5688 291 -512 377 -161 -573 373 -246 279 -127 -505 9 -195 -137 247 -127 7 392 -157 139 242 -25
5708 -25 206 -163 -28 319 -200 470 43 -306 434 -33 -127 381 -22 98 -123 -238 569 146 199 374 -230
5729 -230 318 -301 -254 158 -241 -22 318 -172 225 -118 -542 36 -150 -139 101 -223 -11 -124 -265 -73 -310
5750 -310 -80 268 -213 -34 -42 -159 165 -620 -235 209 -197 237 -122 -226 189 -143 -91 95 -194 -218 -237 -253
5772 -253 346 -331 260 153 -114 339 -139 -417 427 -26 -22 404 -238 183 -60 -253 261 -148 295 327 51
5793 51 60 259 22 362 179 66 294 -150 427 157 -27 19 -142 -309 205 -103 150 123 -280 344 53 -1
5815 -1 272 -45 264 214 111 295 -160 -161 405 -255 81 213 -331 -10 -137 -150 197 -146 -264 225 -87 250
5837 250 -64 54 -53 -556 124 -103 -241 420 -170 -126 463 -208 19 50 -604 391 175 -458 151 -116 -136
5858 -136 -17 -94 211 -515 -179 59 -298 384 84 -152 228 -154 -364 248 -155 44 366 -414 -97 31
5878 31 -38 238 -223 -47 113 -162 73 -79 63 451 -265 -31 209 -344 105 -41 -354 455 -58 22 55
5899 55 -158 37 30 -207 359 -75 -5 153 -169 431 -111 -222 171 -198 -12 188 -378 103 -95 -294 589
5920 589 67 96 398 -58 290 -78 -11 109 -210 91 95 -266 69 -90 -226 577 -245 -45 381 -504 242
5941 242 118 -215 325 14 -65 333 -129 317 12 61 100 -82 143 51 -100 141 -141 -271 580 -332 -154
5962 -154 142 -404 281 25 -417 147 -98 80 -101 -120 115 66 -142 404 -96 187 20 -324 435 17 -224
5983 -224 355 61 -89 156 -242 197 460 -262 181 -121 -102 280 -37 166 65 -265 206 -179 156 231 -542
6004 -542 88 213 -345 212 141 -117 109 -242 -46 158 -375 210 -166 120 -262 -401 359 -214 -270 184 -373
6025 -373 177 288 -225 -50 -4 -321 246 -87 -229 253 -150 313 -84 -117 3 -127 115 110 62 322 -161 -501
6047 -501 460 -122 -97 315 -172 139 282 -269 236 61 -49 173 -420 145 321 47 236 -180 -10 196
6067 196 -335 194 -4 -352 645 -167 -333 186 -448 -15 322 -327 124 134 279 -36 -213 -140 162 -177 332
6088 332 -233 156 342 -231 316 284 -365 349 17 -140 295 -271 -105 1 -131 181 -33 -50 -131 -316 403
6109 403 -260 -459 518 -126 -317 256 -233 -13 201 -439 288 109 -223 -2 -441 -103 145 83 91 -123 62
6130 62 177 -395 151 -7 -330 120 -45 -273 462 -256 67 -11 -116 450 72 92 -88 68 150 68 -258 149
6152 149 -116 -154 190 -446 41 141 -534 321 -31 -208 309 32 182 267 -250 66 333 -92 220 -308 98
6173 98 435 -254 244 22 -251 256 -90 220 214 -436 178 30 1 214 -3 -176 -50 -126 -4 154 -89 -16
6195 -16 -236 -225 56 -405 262 -68 -227 406 -139 -210 58 -291 285 -359 36 18 -199 -15 69 -205 48 18
6217 18 -152 243 -235 6 261 100 91 -3 -251 329 -142 8 221 -185 122 -19 -132 186 -190 139 189 -473
6239 -473 20 210 -366 432 -310 -9 -17 -237 199 50 -527 196 -20 74 179 51 32 -69 -37 402 -110 -150
6261 -150 1 -326 340 108 134 226 -159 37 201 50 176 59 -65 9 -81 -6 -64 -295 -174 45 -216 249
6283 249 14 -330 -14 -340 162 261 -305 137 -236 -234 -34 -169 125 -75 -275 459 -111 -113 288 -447 189 66
6305 66 -209 336 60 -364 294 -313 39 -53 -34 203 -50 90 235 -255 201 -98 -232 224 -10 7 299
6326 299 -276 223 365 -153 646 -186 154 378 -22 119 132 -111 164 -209 42 34 -71 369 -21 -219 284
6347 284 -228 -93 269 -373 -202 145 -155 229 -335 -153 168 -400 344 34 -290 148 -97 -212 151 -340
6367 -340 165 -2 -311 103 -5 -323 302 -237 -46 432 -156 -11 -24 -237 -101 -367 69 -118 -273 206
6387 206 -124 -94 253 -98 84 15 -206 399 23 -188 75 142 24 45 -71 190 161 -23 232 -78 202 146
6409 146 -257 234 59 78 284 -149 -63 187 -177 193 247 -258 257 116 -163 -96 34 -76 -86 6 161 -480
6431 -480 -64 1 -366 264 60 -521 176 -262 -80 22 -476 -9 100 -396 -93 -288 -6 96 -193 225
6451 225 -175 -42 298 -466 147 145 -188 470 141 -158 236 -259 -162 83 -232 150 103 48 176 -41 25 241
6473 241 -215 -20 -41 -161 167 -113 -141 -13 -208 315 1 -283 310 -165 -91 -53 -562 -131 237 -399 104
6494 104 -187 13 77 -259 -29 -193 -58 410 -31 -28 86 -201 150 50 -186 357 153 -7 236 -153 92
6515 92 36 2 225 13 -296 307 24 253 -218 129 402 -261 -30 162 45 -57 -176 -50 140 -167 -193
6536 -193 390 -17 232 73 -111 351 -62 189 39 -123 118 -269 -234 339 -207 -436 258 -412 187 -52
6556 -52 -209 -51 -168 -162 -11 -168 -185 -46 -50 166 47 -133 105 -575 82 70 -489 304 16 66 113 -136 -245
6579 -245 281 -281 51 -107 97 -29 -146 247 4 -95 103 -103 -143 216 -73 -94 214 -175 317 -260 -164
6600 -164 403 -225 155 21 -251 -17 -101 -30 162 -74 426 45 -259 -20 -214 129 193 -225 -45 137 -105
6621 -105 269 -192 -246 237 61 185 314 175 177 -197 -264 61 -90 42 117 -140 376 -49 -263 356 -144 -247
6643 -247 145 -483 73 196 -259 135 106 92 2 -310 11 -139 -152 401 -404 -94 72 -261 161 294 -158
6664 -158 374 -268 -335 329 -71 1 -5 -310 -99 -10 -105 273 -129 204 30 17 469 86 -31 208 -122 -153 10
6687 10 -63 216 -55 -45 339 -47 77 -144 -319 235 -218 22 16 -178 275 167 -176 267 -75 73 416 -89
6709 -89 93 -85 -285 88 102 -5 246 -213 -80 205 106 394 -79 226 103 -61 172 195 -139 441 -14
6730 -14 -116 191 -111 259 -116 -214 301 70 -223 245 -11 59 -87 -113 285 -20 -153 -91 -364 32 -101 -225
6752 -225 -64 -163 -150 250 136 10 26 201 94 -86 -75 262 -220 216 241 -107 404 -165 248 127 -222 276
6774 276 -52 -249 258 -187 82 121 -133 119 86 -117 125 -147 69 40 -83 140 15 -199 103 -17 -72
6795 -72 63 -247 228 -250 -159 93 -52 -153 187 -144 -243 -123 78 139 -134 54 109 -189 107 62 -468 48
6817 48 -172 -417 -134 -255 292 -81 -162 212 -107 -142 300 -277 58 71 -137 401 -89 -86 210 -173 99 160
6839 160 -51 46 98 -72 -79 -73 15 59 -423 204 -344 -239 -49 -162 -9 249 -387 32 0 -49 30 -402 -62 10
6863 10 -165 21 -19 -178 -30 -52 258 173 -119 328 78 -198 423 -57 -48 267 -3 205 -7 101 102 -32 28
6886 28 80 -227 170 -64 25 146 -241 -151 -48 -217 89 114 -168 165 -329 152 -318 -133 32 -62 -36 95
6908 95 55 -102 -164 -285 570 83 -232 98 -130 291 62 -209 257 -46 -2 -64 -311 101 11 2 -142 -350 1
6931 1 -5 191 -30 98 61 253 66 -267 187 -181 251 -62 -358 -65 84 -63 488 -147 -153 94 86 42 40 0
6955 0 -28 -306 77 -163 -66 105 -77 -389 121 -382 57 27 -246 12 -72 -9 51 -206 -58 39 -236 19 -214
6978 -214 65 219 -95 16 363 -168 -20 -393 -75 95 -139 -85 223 29 79 78 -151 76 125 -38 -68 -76 94
7001 94 -26 -48 226 -281 -127 185 -158 68 468 -84 70 35 -59 204 -85 290 144 -75 215 -152 -186 86
7023 86 -158 -104 97 45 101 32 176 56 -181 -37 263 -132 387 -104 -60 250 181 84 -193 21 140 -163 27
7046 27 20 -246 -206 64 -173 6 -31 44 61 -165 -86 264 -69 217 -152 20 115 -289 195 -50 -2 -129 167
7069 167 58 161 -237 338 110 -371 -3 145 -193 330 5 -224 -68 -72 216 56 -391 329 -206 -25 310
7090 310 82 -110 -220 12 273 -295 62 -51 -383 370 9 -103 154 -218 102 173 -279 128 -6 118
7110 118 -70 -60 98 46 -178 80 235 -142 339 -295 198 237 -149 135 122 -51 78 -193 -181 -5 -110 526
7132 526 -324 126 31 -214 68 134 39 104 38 -66 319 72 93 292 169 315 207 -187 100 29 -18 131 70
7155 70 339 2 -87 84 -245 143 8 1 185 196 -33 242 -246 -68 422 -84 -152 275 -178 137 -202 258
7177 258 430 -483 32 -229 3 223 -60 71 37 -340 367 -17 -437 169 -290 12 44 117 117 62 -7 67 168
7200 168 167 -47 21 108 122 -182 367 -200 58 126 -227 305 145 -172 48 164 113 218 -216 -42 -154 -225 438
7223 438 -110 505 94 -136 506 -115 121 218 -145 -168 -79 -72 -139 -47 32 215 36 -260 150 -119 136 46 49 287
7247 287 -166 -99 -56 -118 11 -165 -133 337 -129 -315 290 -8 -20 -219 -56 -16 -111 32 -206 53 -114 163
7269 163 -298 112 -203 5 -97 -152 -136 -41 -303 150 88 141 -53 -119 208 67 149 250 -209 -197 142 -222 -39
7292 -39 -27 -246 83 -13 -394 102 66 129 260 -178 159 -130 251 165 60 104 65 143 184 142 69 343 -124 -15
7316 -15 115 67 204 -135 -258 374 -128 -74 47 -316 41 -6 -19 11 -107 179 410 -46 55 -196 -149 106
7338 106 -271 239 -119 -326 106 -323 -1 6 -273 67 -47 -139 260 -28 -370 -94 -119 58 -129 44 404
7359 404 56 12 279 140 -57 -31 -174 158 -116 62 214 -204 232 -85 134 187 -355 105 20 -16 43 -32
7381 -32 -116 -76 125 58 203 -335 42 102 3 -51 369 25 314 59 15 24 -60 278 -101 -117 17 -134 155 212
7405 212 89 316 174 -140 -63 -56 132 143 -152 -44 256 3 15 -135 -214 84 -170 330 150 167 305 -210
7427 -210 111 165 142 5 -340 -82 -46 -221 76 -21 -121 47 40 -267 154 -4 -127 85 -434 135 -182 63
7449 63 82 -143 -145 -167 -118 241 44 80 155 -67 -101 -88 -128 68 169 -309 31 -81 -47 -229 -140 134 -288 -72
7473 -72 29 24 75 -31 -144 -154 -140 -177 70 -148 -7 24 -468 208 -17 -406 198 -40 -243 248 85 71 239
7496 239 -63 194 158 207 -17 -314 -32 -282 -312 165 104 -158 423 46 123 -234 -11 198 -233 -86 111 -225
7518 -225 3 209 133 184 25 -55 99 -209 -51 3 -14 462 -302 -222 94 -177 205 309 -260 -157 -28 47
7540 47 -255 -261 -10 -35 -129 418 -83 87 -168 -304 107 -148 -358 371 -270 -269 351 -156 84 -12 -248 38 67
7563 67 -205 30 -252 -228 -394 -69 -154 -194 -323 105 -259 -238 -15 188 144 -226 -282 133 0 30 151 -350 166
7586 166 420 -96 -44 -60 -1 -66 -228 27 -15 112 46 -145 -35 -90 -231 224 14 -72 -62 -123 -149 44 -290 12
7610 12 -15 -50 12 -54 275 40 -97 -5 89 -42 -95 -27 40 151 -104 86 144 -45 -123 -112 -14 7 -6 465 104
7635 104 -55 135 -299 2 -203 -164 -49 -185 -231 269 215 -202 297 -209 -44 -395 -70 62 -94 -119 -66 -69
7657 -69 1 -77 146 39 -73 -44 323 -38 -61 -17 -271 479 -48 -103 161 -381 27 -69 -234 -60 -64 187 -118
7680 -118 87 71 172 209 49 -113 236 141 71 140 95 42 260 -121 36 200 37 -16 57 -12 177 -131 146
7703 146 198 -334 12 -11 -120 97 -130 -115 101 -99 21 146 -55 -40 -12 102 -80 -137 205 -72 64 -74
7725 -74 -206 225 132 -133 173 -420 -212 292 -64 82 166 -220 80 -31 -92 9 -287 -24 231 155 -41 -312
7747 -312 118 -78 -64 -71 200 88 244 61 -98 -212 239 60 135 -15 -88 -67 -148 11 7 63 78 154 -159 56
7771 56 -27 258 -166 121 -35 45 169 169 147 -42 37 149 367 -156 -61 -179 -51 261 -200 -110 179 -126 120
7794 120 209 -262 184 21 -234 131 -228 -104 -132 -216 18 116 124 100 26 70 90 -177 -254 -248 -63 195 -46 198
7818 198 -7 -129 118 -10 -89 196 -114 382 161 -63 28 93 137 255 259 213 152 -349 314 -239 48 220 -355
7841 -355 -63 116 -258 179 -270 -190 28 -30 103 205 267 86 -2 -82 -56 -137 167 137 127 226 -131 64 -4 -94
7865 -94 -10 46 -313 205 46 -180 179 -141 -111 64 -71 216 209 91 262 33 91 268 -106 127 269 -228
7887 -228 -31 -20 -36 177 38 68 -153 188 292 -201 289 71 -378 -48 154 98 298 -296 -35 -156 -19
7908 -19 -46 -223 -371 -50 85 125 206 -153 135 60 163 161 -85 195 60 -322 -80 152 -36 193 -165 -111 115
7931 115 -115 -57 75 -28 322 -17 175 189 -294 312 -55 53 124 -154 63 97 -87 233 46 -195 -91
7952 -91 -173 242 -219 13 123 290 204 -52 -164 -37 132 -203 24 287 27 258 -183 121 -166 -154 265
7973 265 34 216 62 -31 35 -143 3 35 12 -59 -29 -89 16 125 10 89 -66 121 30 -12 -15 -9 -85 -69 35
7998 35 -105 58 -45 -149 -80 -7 -79 106 -176 -17 144 152 164 -171 -43 -97 -19 254 -59 -17 228 -266 215
8021 215 -69 -373 -15 -317 366 326 -210 10 -28 -231 267 -228 -85 223 179 -117 -128 -438 -70 -353 -82
8042 -82 124 -142 -120 59 -140 115 -34 112 451 216 203 -81 -33 -24 202 143 84 -5 -20 -38 15 -157 48 140
8066 140 163 293 -316 182 76 29 -141 130 -40 -310 387 -160 -11 47 -265 161 -95 142 -229 143 -147
8087 -147 45 -50 -11 99 -35 280 -77 -143 27 295 -57 116 -17 150 -106 -224 84 194 182 176 22 179
8109 179 3 -137 199 -114 -119 121 54 -4 82 -138 -103 117 39 82 -254 -208 -180 -42 142 101 -250 -81 98 -53
8133 -53 -1 -33 162 13 -22 -18 -38 -121 -102 -36 34 144 -131 116 -239 212 215 -319 67 274 2 -75 -48 -63 -35 59
8159 59 75 29 180 120 -91 -91 108 -168 372 82 -131 -169 90 -51 -123 -171 -81 66 -242 495 -72 -46 13 -112
8183 -112 2 194 -217 -145 -172 -207 -119 -286
8191b86
##END NTUPLES=NMR FID
##END=
