##TITLE=1H_83-2023
 CDCl3
 8 sc, 
 25.9.2023
##JCAMPDX= 6.0         $$ Bruker NMR JCAMP-DX V2.0
##DATA TYPE= NMR FID
##DATA CLASS= NTUPLES
##ORIGIN= UXNMR, Bruker Analytische Messtechnik GmbH
##OWNER= root
$$ XWIN-NMR		Version 3.5
$$ Mon Sep 25 14:25:37 2023 Russian Standard Time (UT+4h)  she@DPX200
##.OBSERVE FREQUENCY= 200.13135
##.OBSERVE NUCLEUS= ^1H
##.DELAY= (6, 6)
##.ACQUISITION MODE= SIMULTANEOUS
##.ACQUISITION SCHEME= undefined
##.AVERAGES= 8
##.DIGITISER RES= 18
##SPECTROMETER/DATA SYSTEM= spect
##.PULSE SEQUENCE= zg30
##.SOLVENT NAME= CDCl3
##.SHIFT REFERENCE= (INTERNAL, CDCl3, 0, 15.7039)
##AUDIT TRAIL= $$ (NUMBER, WHEN, WHO, WHERE, WHAT)
$$ ##TITLE= Audit trail, XWIN-NMR		Version 3.5
$$ ##JCAMPDX= 5.01
$$ ##ORIGIN= Bruker BioSpin GmbH
$$ ##OWNER= she
$$ F:/spectra/data/she/nmr/H-F/1/audita.txt
$$ ##AUDIT TRAIL=  $$ (NUMBER, WHEN, WHO, WHERE, WHAT)
(   1,<2023-09-25 14:24:36.01 +0400>,<she>,<DPX200>,
      <created by zg, POWCHK disabled, PULCHK disabled
       configuration hash MD5:
       00 E9 B6 7A A2 85 ED C7 34 08 36 98 17 FE 4E 26
       data hash MD5: 16K
       56 58 8C 50 03 D1 70 4F C6 E2 CE 8C 36 D3 60 36>)
$$ ##END=
$$ 
$$ hash MD5
$$ 4E 47 9C B6 F5 73 05 C1 5E 80 BA FD A4 35 F7 85
##$RELAX= 
##$RELAX= 
##$RELAX= 
##$RELAX= 
##$RELAX= 
##$RELAX= 
$$ Bruker specific parameters
$$ --------------------------
##$DU= <F:/spectra>
##$EXPNO= 1
##$NAME= <H-F>
##$PROCNO= 1
##$TYPE= <nmr>
##$USER= <she>
##$AMP= (0..31)
100 100 100 100 100 100 100 100 100 100 100 100 100 100 100 100 100 100 
100 100 100 100 100 100 100 100 100 100 100 100 100 100 
##$AQSEQ= 0
##$AQ_mod= 1
##$AUNM= <au_zg>
##$AUTOPOS= <>
##$BF1= 200.13
##$BF2= 200.13
##$BF3= 200.13
##$BF4= 200.13
##$BF5= 200.13
##$BF6= 200.13
##$BF7= 200.13
##$BF8= 200.13
##$BYTORDA= 1
##$CFDGTYP= 0
##$CFRGTYP= 5
##$CHEMSTR= <none>
##$CNST= (0..31)
1 1 145 1 1 1 1 1 1 1 1 1 1 1 1 1 1 1 1 1 1 1 1 1 1 1 1 1 1 1 1 1 
##$CPDPRG= <>
##$CPDPRG1= <>
##$CPDPRG2= <>
##$CPDPRG3= <>
##$CPDPRG4= <mlev>
##$CPDPRG5= <mlev>
##$CPDPRG6= <mlev>
##$CPDPRG7= <mlev>
##$CPDPRG8= <mlev>
##$CPDPRGB= <>
##$CPDPRGT= <>
##$D= (0..31)
0 1.2 0 0 0 0 0 0 0 0.06 0 0.03 0 0 0 0 0.0002 0 0 0 0 0 0 0 0 0 0 0 0 
0 0 0 
##$DATE= 1695637475
##$DBL= (0..7)
120 120 120 120 120 120 120 120 
##$DBP= (0..7)
150 150 150 150 150 150 150 150 
##$DBP07= 0
##$DBPNAM0= <>
##$DBPNAM1= <>
##$DBPNAM2= <>
##$DBPNAM3= <>
##$DBPNAM4= <>
##$DBPNAM5= <>
##$DBPNAM6= <>
##$DBPNAM7= <>
##$DBPOAL= (0..7)
0.5 0.5 0.5 0.5 0.5 0.5 0.5 0.5 
##$DBPOFFS= (0..7)
0 0 0 0 0 0 0 0 
##$DE= 6
##$DECBNUC= <off>
##$DECIM= 32
##$DECNUC= <off>
##$DECSTAT= 4
##$DIGMOD= 1
##$DIGTYP= 9
##$DL= (0..7)
0 120 120 120 120 120 120 120 
##$DP= (0..7)
150 150 150 150 150 150 150 150 
##$DP07= 0
##$DPNAME0= <>
##$DPNAME1= <>
##$DPNAME2= <>
##$DPNAME3= <>
##$DPNAME4= <>
##$DPNAME5= <>
##$DPNAME6= <>
##$DPNAME7= <>
##$DPOAL= (0..7)
0.5 0.5 0.5 0.5 0.5 0.5 0.5 0.5 
##$DPOFFS= (0..7)
0 0 0 0 0 0 0 0 
##$DQDMODE= 0
##$DR= 18
##$DS= 0
##$DSLIST= <SSSSSSSSSSSSSSS>
$$ [...]
##$SUBNAM2= <"">
##$SUBNAM3= <"">
##$SUBNAM4= <"">
##$SUBNAM5= <"">
##$SUBNAM6= <"">
##$SUBNAM7= <"">
##$SUBNAM8= <"">
##$SUBNAM9= <"">
##$SW= 18.05172834244
##$SWIBOX= (0..15)
0 0 2 0 0 0 0 0 0 0 0 0 0 0 0 0 
##$SW_h= 3612.71676300578
##$TD= 16384
##$TD0= 1
##$TE= 0
##$TE2= 300
##$TE3= 300
##$TEG= 300
##$TL= (0..7)
0 120 120 120 120 120 120 120 
##$TP= (0..7)
150 150 150 150 150 150 150 150 
##$TP07= 0
##$TPNAME0= <>
##$TPNAME1= <>
##$TPNAME2= <>
##$TPNAME3= <>
##$TPNAME4= <>
##$TPNAME5= <>
##$TPNAME6= <>
##$TPNAME7= <>
##$TPOAL= (0..7)
0.5 0.5 0.5 0.5 0.5 0.5 0.5 0.5 
##$TPOFFS= (0..7)
0 0 0 0 0 0 0 0 
##$TUNHIN= 0
##$TUNHOUT= 0
##$TUNXOUT= 0
##$USERA1= <user>
##$USERA2= <user>
##$USERA3= <user>
##$USERA4= <user>
##$USERA5= <user>
##$V9= 5
##$VALIST= <valist>
##$VCLIST= <CCCCCCCCCCCCCCC>
##$VD= 0
##$VDLIST= <DDDDDDDDDDDDDDD>
##$VPLIST= <PPPPPPPPPPPPPPP>
##$VTLIST= <TTTTTTTTTTTTTTT>
##$WBST= 1024
##$WBSW= 4
##$XGAIN= (0..3)
0 0 0 0 
##$XL= 0
##$YL= 0
##$YMAX_a= 201346
##$YMIN_a= -200665
##$ZGOPTNS= <>
##$ZL1= 120
##$ZL2= 120
##$ZL3= 120
##$ZL4= 120
##$ABSF1= 10
##$ABSF2= 0
##$ABSG= 5
##$ABSL= 3
##$ALPHA= 0
##$AQORDER= 0
##$ASSFAC= 0
##$ASSFACI= 0
##$ASSFACX= 0
##$ASSWID= 0
##$AUNMP= <proc_1d>
##$AZFE= 0.1
##$AZFW= 0.1
##$BCFW= 1
##$BC_mod= 2
##$BYTORDP= 1
##$COROFFS= 0
##$CY= 11.3945322036743
##$DATMOD= 1
##$DC= 2
##$DFILT= <>
##$DTYPP= 0
##$F1P= 15.7292609196834
##$F2P= 12.9074282941183
##$FCOR= 0.5
##$FTSIZE= 0
##$FT_mod= 4
##$GAMMA= 1
##$GB= 0.15
##$INTBC= 1
##$INTSCL= 1
##$ISEN= 128
##$LB= 0.24
##$LEV0= 0
##$LPBIN= 0
##$MAXI= 10000
##$MC2= 0
##$MEAN= 0
##$ME_mod= 0
##$MI= 1.114404
##$NCOEF= 0
##$NC_proc= 0
##$NLEV= 6
##$NOISF1= 3.799351
##$NOISF2= 2.8
##$NSP= 1
##$NTH_PI= 0
##$NZP= 0
##$OFFSET= 15.70392
##$PC= 1
##$PHC0= -21712.94
##$PHC1= 14.25271
##$PH_mod= 1
##$PKNL= yes
##$PPARMOD= 0
##$PSCAL= 0
##$PSIGN= 0
##$REVERSE= no
##$SF= 200.130013532006
##$SI= 16384
##$SIGF1= 3
##$SIGF2= 2
##$SINO= 400
##$SIOLD= 16384
##$SREGLST= <1H.CDCl3>
##$SSB= 0
##$STSI= 0
##$STSR= 0
##$SW_p= 3612.71676300578
##$SYMM= 0
##$S_DEV= 0
##$TDeff= 0
##$TDoff= 0
##$TI= <>
##$TILT= no
##$TM1= 0
##$TM2= 0
##$TOPLEV= 0
##$USERP1= <user>
##$USERP2= <user>
##$USERP3= <user>
##$USERP4= <user>
##$USERP5= <user>
##$WDW= 1
##$XDIM= 8192
##$YMAX_p= 0
##$YMIN_p= 0
$$ End of Bruker specific parameters
$$ ---------------------------------
##NTUPLES= NMR FID
##VAR_NAME=  TIME,          FID/REAL,        FID/IMAG
##SYMBOL=    X,             R,               I
##VAR_TYPE=  INDEPENDENT,   DEPENDENT,       DEPENDENT
##VAR_FORM=  AFFN,          ASDF,            ASDF
##VAR_DIM=   8192,          8192,            8192
##UNITS=     SECONDS,       ARBITRARY UNITS, ARBITRARY UNITS
##FACTOR=    0.0002768,     1,               1
##FIRST=     0,             0,               0
##LAST=      2.2672688,     0,               0
##MIN=       0,             -200665,         0
##MAX=       2.2672688,     201346,          0
$$ Real data points
##PAGE= N=1
##DATA TABLE= (X++(R..R)), XYDATA
0@%%%%%%%%%%%%%%%%Qj6J6j6J6j6K4l2L2l7M5m9N7o6P4q5R5j07J21j34J49j69
$$ 0 0 0 0 0 0 0 0 0 0 0 0 0 0 0 0 0 8 -8 8 -8 8 -8 16 -16 16 -21 24 -25 32 -34 40 -45 50 -57 64 -70 79 -90
38i0J91k12K33k58K87l17L51l88M26m69N18n69O25o90P62q41R30j033J149j285
$$ -90 101 -111 122 -136 151 -166 185 -203 223 -246 272 -297 328 -362 400 -441 489 -544 605 -680
58f80J445j635J867k159K536l035L736m792O539r890J8410p6700j36307K20342
$$ -680 765 -870 997 -1162 1374 -1661 2075 -2717 3822 -6068 12342 -64358 -200665 19677
72A9677J9455o0927J43650L4491j57969o7770N8820o447L5485J82881j03333k43360
$$ 19677 39132 -21795 121855 156346 -1623 -69393 -10573 -17020 18465 201346 98013 -145347
84a45347J12396P0579j26835Q4231J12067n8629o1762k8429m4657J1396J65336
$$ -145347 -32951 37628 -89207 -4976 107091 48462 -13300 -41729 -86386 -74990 90346
95I0346O0366j83791j1581R2786j00200p72J09795j153m221k1430p2433k8071
$$ 90346 150712 -33079 -44660 48126 -52074 -52846 56949 55796 51575 30145 -42288 -70359
107g0359O2633R5081l4036m6079N4465n5722n3915P4236J8826J3295R216o1103
$$ -70359 -7726 87355 53319 7240 61705 5983 -47932 26304 45130 58425 67641 6538
119F538j1312k880j0716K7970K244J6828j4974o9465Q882K3764K0246K2783n2108
$$ 6538 -4774 -7654 -18370 9600 11844 28672 13698 -55767 -46885 -23121 -2875 19908 -32200
132c2200K2983N1616p2911q920N3630M177K0794r180l5379l473K1543K5763n6790
$$ -32200 -9217 42399 -30512 -39432 14198 18375 39169 29989 -5390 -8863 12680 38443 -18347
145a8347r193R6398m7420p1531N2898j6812j7595N2552j3148l4659J3021K4292
$$ -18347 -27540 68858 21438 -50093 2805 -14007 -31602 20950 7802 -26857 -13836 10456
157A0456m0082m2022Q6841J8440q0622M8343R701p9565M3317M1992k9382J3469
$$ 10456 -29626 -71648 15193 33633 -46989 1354 11055 -68510 -25193 16799 -12583 886
169H86K3333k9710n0494M3549N4460o0683K2714O3481q4516k4855N3097k0107
$$ 886 24219 -5491 -55985 -12436 42024 -18659 4055 67536 -16980 -41835 11262 -8845
181h845J4375L8781k6098m9332k217M3273k7007j5658P8665k5816o3880L0752
$$ -8845 5530 44311 18213 -31119 -33336 9937 -17070 -32728 45937 20121 -43759 -13007
193a3007j5581n025N8961J194k9391j5920O555K988k1517M7161L1724n0228N216
$$ -13007 -28588 -33613 25348 26542 -2849 -18769 -12214 -9226 -30743 16418 48142 -2086 3130
206C130l124l3725M1272K4260q112J152k3280p520q222N036M2983j4788j7844
$$ 3130 6 -33719 7553 31813 23701 24853 1573 -5947 -14169 -9133 33850 19062 1218
219A218Q754l6385J339K3426l509K3893r601k7084M088j1892K2319K6401j7297
$$ 1218 9972 -26413 -25074 -1648 -5157 18736 9135 -17949 -13861 -25753 -3434 22967 5670
232E670Q620q325j7421J4801p305J7280J9015k9558J727q417j7580L1680o72r606
$$ 5670 14290 5965 -11456 3345 -3960 13320 32335 2777 4504 -3913 -21493 10187 9515 -91
246i1R818j8064K114j29l764K7063j2059n111J4972k9595P639J9894j6875J1146
$$ -91 9727 -8337 -6223 -6352 -10116 16947 4888 -223 14749 -14846 -7207 12687 -4188 6958
260F958m325j3754Q824j1109R647N128j6410K1451o735j6109K5001r132j20J6769
$$ 6958 2633 -11121 -2297 -13406 -3759 1369 -15041 6410 -325 -16434 8567 -565 -685 16084
274A6084j5528O618J929p011J2969j7083K92J3645k1220R716K437j9976J6000
$$ 16084 556 7174 9103 2092 15061 -2022 -1730 11915 -9305 411 2848 -17128 -1128
287a128n846o630J4701j0385R633L824j5508J7039l860k340J9974j7596J49Q177
$$ -1128 -6974 -13604 1097 -9288 345 4169 -11339 5700 1840 -500 19474 1878 2027 10204
301A0204j6797J2920j952r543J4614j6372k240Q411j4309J7631K578j3116J3637
$$ 10204 -6593 6327 4375 -5168 9446 -6926 -9166 -755 -15064 2567 5145 -7971 5666
314E666j2211P08J6939j2860J1058K467j6006J1710j0690k158J6452j4282N065
$$ 5666 -6545 -5837 11102 -1758 9300 11767 -4239 7471 -3219 -5377 11075 -3207 1858
327A858o44j8403J5887k899l827J7167j4079K086O972j3462J5197O17m593J3368
$$ 1858 1214 -17189 -1302 -4201 -8028 9139 -4940 -2854 4118 -9344 5853 6470 1877 15245
341A5245j6918k37Q518j4299J4894r81j5385J2610j0922k583J2344r994J0513
$$ 15245 -1673 -1910 6608 -7691 7203 6222 -9163 3447 -7475 -10058 2286 -7708 2805
354B805J393j1103J1974r702M134J7165j7634P034N082j8111J3620k464p719J1891
$$ 2805 4198 -6905 5069 -4633 -499 16666 -968 6066 11148 -6963 6657 4193 -3526 8365
368H365j0030M72j706r252J7718q639o059J9436j8324K00J6764j4933P877P147
$$ 8365 -1665 -1193 -2899 -12151 5567 -3072 -9131 10305 -8019 -7819 8945 -5988 1889 9036
382I036r037L560n923P475J426j4964K0266n060k0350K1719p681j0001J9980q764
$$ 9036 -1 3559 -2364 5111 6537 -8427 11839 6779 -13571 8148 467 -9534 10446 1682
396A682o696N135M12L539j3069J0370J2942k6199J0088R273k2926J8095N629j9776
$$ 1682 -5014 121 533 4072 -8997 1373 14315 -11884 -1796 7477 -15449 2646 8275 -11501
410a1501Q986K751l033n250k09J8648j3202p528J9412j8657K382K0893k0380L630
$$ -11501 -2515 236 -2797 -8047 -8256 10392 -2810 -10338 9074 -9583 -7201 13692 -6688 -3058
424c058J2121j2632j027j901R079M486j5653J0592k697j2160J7697j0321m545
$$ -3058 9063 -3569 -4596 -6497 2582 7068 -8585 2007 -690 -12850 4847 -5474 -10019
437a0019K1294j5241o468O087n768J2475l385p082R623o542K028k937n443K5048
$$ -10019 11275 -3966 -10434 -4347 -10115 2360 -1025 -8107 1516 -5026 -2998 -5935 -11378 13670
451A3670p523j5041J6156j2234R91J8497j6507K313J4069j0005j1671l054K0857
$$ 13670 6147 -8894 7262 -4972 -3981 14516 -1991 322 14391 4386 -7285 -10339 10518
464A0518l20k1385K0056o248k2635K7679o592j8471L1893J614k8364m12K1316
$$ 10518 10198 -11187 8869 2621 -20014 7665 1073 -17398 14495 16109 -12255 -12667 8649
477H649K235k1621K0206J3264l6395J5568J4279l7059K5826K8661l7716r542K5330
$$ 8649 10884 -10737 9469 22733 -13662 1906 16185 -20874 4952 33613 -4103 -13645 11685
490A1685r17k4319J2353L0692k8063o994K8858l6074j786N0166k6051k5843L1096
$$ 11685 10768 -13551 -1198 29494 1431 -5563 23295 -12779 -14565 35601 9550 -16293 14803
503A4803M36l0587m67L1371o651k1075K6105j6242k9639M5016K28l5433L1532
$$ 14803 15239 -15348 -15815 15556 8905 -12170 13935 -2307 -31946 13070 13298 -22135 9397
516I397J5041l1936r242K1635R630j6028J1802P016l3232J4887J5309l4744J6980
$$ 9397 24438 -7498 -16740 4895 14525 -1503 10299 17315 -15917 -1030 14279 -20465 -3485
529c485K7910k6219j4473N706P634j252l383J4251p162p558J1586k0260J937L1206
$$ -3485 24425 -1794 -16267 -10561 -2927 -4179 -7562 6689 -473 -8031 3555 -16705 -14768 16438
543A6438j0840r506m5o321R594p014l182J8892l598q330p933m644J7905j81l66
$$ 16438 5598 -3908 -3953 -10274 -680 -7694 -10876 8016 4418 -3912 -11845 -16489 1416 1235 869
558H69P147j6598R070M604k6864K1260K3513k2916q609M688m55o498M260J5876
$$ 869 8016 -8582 488 5092 -21772 -512 23001 85 -8524 -3836 -4291 -10789 -6529 9347
572I347j6471q64K0414l5490l791M8392j5503k1599K3338J76j9843K691K1629
$$ 9347 -7124 -7988 12426 -23064 -26855 21537 6034 -15565 7773 7949 -11894 -9203 12426
585A2426p196j0156K8948k0565l5534M5391O536l9580K5261J7290k9835p286J9122
$$ 12426 5230 -4926 24022 3457 -32077 13314 19850 -19730 5531 22821 -7014 -14300 4822
598D822l69j4009K4263O084m4219J8924K9784m2260P214L8275k3476j7721J4521
$$ 4822 4453 -9556 14707 20791 -23428 -4504 25280 -16980 -9766 28509 5033 -12688 1833
611A833J577j3178R965K1526k6871q280L4653k5632j8530M2017k891k3023J1524
$$ 1833 3410 -9768 197 21723 -5148 -13428 21225 -4407 -22937 19080 16189 -6834 4690
624D690K092j0402p01J5962k119j7332K0214k587l2367K3151J4969k1182O139
$$ 4690 6782 -3620 -4321 11641 9522 -7810 12404 9817 -22550 601 15570 -5612 527
637E27M323q013l004O40R448n147J000J1389k0632k424K0305j0083K90P168n072
$$ 527 4850 -3163 -6167 -5527 3921 -1226 -226 11163 -9469 -11893 8412 -1671 -1381 5787 715
652G15J585q766J366J1955p812N677J716j4850Q019J748m385O116k568N070n918
$$ 715 2300 -6466 -5100 6855 -957 4720 6436 -8414 -395 1353 -3032 3084 516 5586 -332
667c32j4056J7165k97j0189J4847o632r569P586j964J130L34N287L746j9492P752
$$ -332 -14388 2777 2480 -7709 7138 506 -9063 -1477 -3441 -2311 -1977 3310 7056 -12436 -4684
682d684J3957j8720R828J2163j7669K194N236m702P54L981Q487j2890p420J9618
$$ -4684 9273 -9447 381 12544 -5125 -2931 2305 -2397 -1643 2338 10825 -2065 -9485 10133
696A0133j2378o971K2884j0493j0005J0784n528l024M114N806j220j3913J0953
$$ 10133 -2245 -9216 13668 3175 -6830 3954 -1574 -4598 -484 5322 4102 -9811 1142
709A142K176j7496J7355N688j6958R035P99p508M937K897M572o870j917J0701
$$ 1142 3318 -14178 3177 8865 -8093 942 1741 -5767 -830 2067 6639 -231 -2148 8553
723H553j3640P95J6567j3284r9P548j0512K139J628O02K674q081O651p17j1368
$$ 8553 -5087 -4292 12275 -1009 -1108 6440 -4072 -1933 -305 297 2971 -5110 1541 824 -10544
738a0544J3664j106q420J0709n631k900N042m047N703k532l461Q769r689R32R252
$$ -10544 3120 2014 -6406 4303 -1328 -4228 814 -3233 2470 -62 -3523 5246 -4443 -3511 5741
753E741r935M632L160p127O482l555j29N521q597O162J519q766R098l537m978
$$ 5741 -4194 438 3598 -3529 2953 -602 -731 4790 -3807 2355 3874 -4892 4206 669 -4309
768d309P746o535K098K774o807P085m451l743R831p426J970O178q711M787ml420
$$ -4309 3437 -3098 -1000 1774 -5033 2052 -2399 -6142 3689 -3737 -1767 4411 -4300 487 483 -2937
784b937Q250n321J617L908j0003O639J231o492R687m534m059M852p266M805K090
$$ -2937 5313 -8 1609 5517 -4486 2153 3384 -3108 6579 2045 -2014 2838 -4428 377 2467
799B467m642P492o958l484P999p850M643N965q458M787l391l739P669l828M061
$$ 2467 -2175 5317 -1641 -5125 2874 -4976 -333 5632 -2826 1961 -1430 -5169 2500 -1328 2733
814B733K615r645O208k302m618J2033m798j424M235r169L500J957k454P659n838
$$ 2733 5348 -4297 1911 -391 -5009 7024 2226 802 5037 -4132 -632 1325 -1129 6530 692
829F92j508L152r591P286L962p490P742m979n805O729m516M138L632n353M325
$$ 692 -816 2336 -7255 31 3993 -3497 4245 -734 -6539 190 -4326 -188 3444 -1909 2416
844B416o130j622R713o632M174M840j1253N125N99m997Q900k568p34O36p130O664
$$ 2416 -3714 -5336 4377 -2255 1919 6759 -4494 631 1230 -3767 5133 2565 1831 2467 -4663 2001
860B001j573l327R839q369j824P147j0150M458N876o519L870k850j247M039n571
$$ 2001 428 -2899 6940 -1429 -3253 3894 -6256 -1798 4078 -2441 1429 -1421 -2668 1371 -4200
875d200O269R07o882R165o163m071J2038o995j260O373n937K372l67j901L883
$$ -4200 2069 2976 -3906 5259 -904 -4975 7063 68 -1192 5181 -756 1616 1249 -652 3231
890C231n087M430M93r853J1460j661j0895J1172k625n108P447m227o77O18J94
$$ 3231 -1856 2574 3067 -6786 4674 3013 -7882 3290 665 -4443 3004 -1223 -1900 -1282 -1088
905a088L162p649P084N962j5650P242P142j2299Q560L307q809L750M60r54l088
$$ -1088 2074 -5575 1509 7471 -8179 -937 6205 -6094 2466 5773 -3036 714 1174 220 -2868
920b868K568J0179j3334l035J3804j2842l2J3537j0710o71O566p068k630L106
$$ -2868 -300 9879 -3455 -6490 7314 -5528 -5560 7977 -2733 -3404 3162 -3906 -6536 -3430
934c430Q954m835r597J2973n011j0876J6530k940o960J1542o478p615N771N066
$$ -3430 5524 689 -8908 4065 -946 -11822 4708 1768 -5192 6350 -128 -7743 -1972 3094
948C094J254p322N317L721j4943P149O963r735J0403n39j3535N696K045n11N50
$$ 3094 4348 -2974 2343 6064 -8879 -1730 5233 -4502 5901 5362 -8173 -2477 -432 -943 -393
963c93m34N596q245m474Q619m808N362O979j3173L664L445p325O739J570N05L334
$$ -393 -827 4769 -3476 -7950 669 -4139 1223 8202 -4971 -1307 2138 -5187 1552 3122 3627 6961
979F961q661o53J678J734O716p962J245O049j4093L839Q352p997Q314R89j2321
$$ 6961 -1700 -2353 -675 1059 7775 -187 1058 7107 -6986 -3147 5205 -2792 5522 6511 -5810
994e810K521M102J183l486J908J0149j3869n128J4704j0217J544J5229j3612n677
$$ -5810 -3289 813 1996 -1490 418 10567 -3302 -8430 6274 -3943 -2399 12830 -782 -6459
1008f459J0985l233o172M434J2681p744j2716J4715m394j2002K1032l199j6184
$$ -6459 4526 1293 -4879 -445 12236 4492 -8224 6491 2097 -9905 11127 7928 -8256
1021h256J3896L4j4609L072J2963j669j3553Q918M327j9524J2620J1274j9285
$$ -8256 5640 5674 -8935 -5863 7100 5431 -8122 796 5123 -14401 -1781 9493 -9792
1034i792R790J1097j8538j724J2833J721r028L224J0824j4986l481J7146j2890
$$ -9792 -2 11095 -7443 -9167 3666 5387 -3641 -417 10407 -4579 -8060 9086 -3804
1047c804j739J8216j2751r527J0829L51n160r7R322k342j2031R822r61r970J5476
$$ -3804 -5543 12673 -78 -9605 1224 1575 -3585 -3682 5640 3298 -8733 1089 128 -9842 5634
1062E634n62j2545P762J5m791Q13K333O593o317l042O108p796L791P593p712M443
$$ 5634 5072 -7473 289 304 -4487 -3674 -1341 5252 -1065 -4107 2001 -5795 -2004 5589 -2123 2320
1078B320J304o099K840l153M440N997r496J805K393o468L815l98J424K033o202
$$ 2320 3624 -2475 365 -2788 1652 7649 -1847 -42 2351 -4117 -302 -700 724 2757 -3445
1093c445L788l118n168J3643l975q036J1218l858o796M980K783J146m243L726
$$ -3445 343 -2775 -7943 5700 1725 -6311 4907 1049 -5747 -767 2016 3162 -1081 2645
1107B645J661j2546R445P441j5448Q724P724j4164Q62O598j228l587K201O652
$$ 2645 4306 -8240 1205 8646 -6802 1922 9646 -4518 -3656 2942 1714 -1873 328 6980
1121F980j1513j464J4490j2472l219J7423j0148q174J0525j397m779J584P018
$$ 6980 -4533 -5997 8493 -3979 -7198 10225 77 -8097 2428 1031 -3748 -2164 4854
1134D854l681q865J2385j852j3050J6018J475j4502Q760L211p389N02M508K139
$$ 4854 1173 -7692 4693 2841 -10209 5809 7284 -7218 1542 4753 -2636 -2134 2374 4513
1148D513q047L285P014j3509L919J1710j3270J294Q417p625p66K505K081j644
$$ 4513 -3534 -249 6765 -6744 -2825 8885 -4385 -3091 5326 -2299 -3065 -560 1521 -123
1162a23m074P879m019p121J1873l603o495R387k620k995K283p90L556m068J075
$$ -123 -4197 3682 -337 -7458 4415 812 -5683 3704 1084 -1911 372 -418 3138 -930 145
1177A45N869r102K906N636q433M089K307m687K127k614K328J111o083O984j043
$$ 145 6014 -3088 -182 5454 -2979 1110 3417 -1270 857 -1757 571 1682 -4401 2583 1540
1192A540o792Q048k625k760N336k378M49p66j258N295n748O62O977q729J541N254
$$ 1540 -5252 2796 171 -2589 2747 369 818 52 -1206 4089 -1659 -997 5980 -2749 -1208 4046
1208D046o460K811J230j388R62l452M482l91n883Q689k470o383P869l122k898
$$ 4046 -2414 397 1627 239 1201 -2251 2231 1840 -4043 4646 2176 -4207 3662 540 -2358
1223b358M506k352J019k529m52M589o708K822N493q754L671L585o259L904R75
$$ -2358 2148 -204 815 -1714 -2166 2423 -4285 -1463 4030 -4724 -1053 2532 -3727 177 1152
1238A152r86J315l211M025j337m397Q114m142m090P049n324j278M189l322K236
$$ 1152 166 1481 -1730 2295 958 -3439 4675 533 -3557 3492 -1832 -3110 1079 -2243 -7
1253gj541r29L654n407L397L597o869N053R05n555M962j363r49K738l715K864
$$ -7 -1548 -2477 1177 -4230 -833 2764 -4105 948 1853 -3702 1260 -103 -1052 1686 -2029 835
1269H35j217l099N950m032j012N607n734J834K515l986M208j449j074L615m917
$$ 835 -382 -3481 2469 -1563 -2575 3032 -2702 -868 1647 -2339 1869 420 -654 2961 -1956
1284a956K614J987n239M814j603l409M872l936O78K825m857L956m34l371N354
$$ -1956 658 2645 -2594 2220 617 -2792 2080 -1856 -1178 1647 -3210 746 312 -3059 2295
1299B295l412L81L511m464L475r1l032N069l652q02M133n064K019J922m434L386
$$ 2295 -1117 -736 2775 -1689 1786 1695 -1337 3732 80 -722 3411 -1653 366 2288 -2146 1240
1315A240j803p71L157m034L121J044n198N323j361l241O175l591o30K874l812
$$ 1240 -563 -1334 1823 -2211 910 1954 -3244 2079 718 -2523 3652 61 -569 2305 -1507
1330a507K385n34j233M016m908J493K683o258N113J437n255M527j411k334L224
$$ -1507 878 344 -889 3127 -1781 -288 2395 -3863 1250 2687 -2568 1959 548 -1786 1438
1345A438k304K354m28k386M089m805j0N898o193J896L374o328K814O82j684L018
$$ 1438 -866 1488 1060 -1326 2763 -2042 -2052 3846 -2347 -451 2923 -3405 -591 91 -1593 1425
1361A425j953J254n21l204N673k544k666P059n077j807M972m243J320K301k060
$$ 1425 -528 726 205 -2999 2674 130 -2536 4523 -554 -2361 2611 -1632 -312 1989 -71
1376g1R34k459J827J115m712O084l31o337O129k511k977N954k503r96J516j678
$$ -71 863 -1596 231 1346 -3366 2718 2387 -3950 2179 -332 -3309 2645 142 -854 662 -1016
1392a016J366k463J716M051n731K798J915o704N845P97n081N025j065k601J252
$$ -1016 350 -2113 -397 3654 -2077 721 2636 -4068 1777 2574 -2507 2518 1453 -1148 104
1407A04j261K837k057p32L806n953J646M777p119M117L812o815K363J249j880
$$ 104 -1157 1680 -377 -1109 2697 -3256 -1610 3167 -3952 165 3977 -2838 -475 774 -1106
1422a106J606o44K059k499j479N332o210r0Q522p249r30N835n297L06L261q43
$$ -1106 500 -144 1915 -584 -2063 3269 -2941 -3031 5491 -1758 -2688 3147 -2150 -1844 1417 574
1438E74l41j077L531l352m123R449l090o624Q939k946n743O043j120k805K385
$$ 574 233 -844 2687 -665 -4788 4661 1571 -5053 3886 940 -4803 1240 120 -2685 -300
1453c00J575j605m937N807K682r100P368L560r868N282K800o072L531K638k111
$$ -300 1275 -330 -5267 540 3222 -5878 1490 5050 -4818 464 3264 -2808 723 3361 1250
1468A250l011J453L841p221J040Q114p900J1O463p354P86N318l102o60J215K038
$$ 1250 -1761 -308 3533 -3688 -2648 5466 -2434 -2423 4040 -3314 -2528 2790 -312 -972 243 2281
1484B281k864l132P135k090m313P316m299l629O113l369p96L459j055Q2k791J233
$$ 2281 -583 -3715 3420 1330 -2983 4333 34 -3595 2518 -851 -1647 1812 757 839 -1952 -719
1500g19K767l672L594R17m629M312k343l076N865k069q63J916m168J167O47j372
$$ -719 2048 -1624 1970 2887 -1742 2570 227 -2849 3016 947 84 2000 -2168 -1001 -354 -1726
1516a726K274j309J928r91n139O050J24m355P359k684m060M561j870j522K723
$$ -1726 548 -761 1167 176 -4963 1087 1211 -3144 4215 1531 -2529 2032 162 -1360 1363
1531A363J870q99n624L444K228p411O421L758r432M182K394o864K960M297r17
$$ 1363 3233 2334 -3290 154 2382 -5029 1392 5150 -4282 -100 2294 -4570 -1610 2687 1770
1546A770l939J360L889p429J211R365p870q88P789q150k157P705r52k970J069
$$ 1770 -2169 -809 3080 -4349 -3138 6227 -1643 -2531 5258 -2892 -5049 2656 1704 -1266 -197
1561a97L676m586m318R401j598o224R338k919p927O658R29m013J856K760j385
$$ -197 3479 -1107 -5425 3976 2378 -3846 5492 2573 -5354 1304 2233 -1780 76 2836 1451
1576A451o018L281M245p435M872M174r055K762L863m625J555K959K39k738j514
$$ 1451 -4567 -1286 2959 -4476 396 4570 -4485 -1723 2140 -2485 -930 2029 2268 -470 -1984
1591a984M549l110j611P098m516k176M805l779o44K781n29P29k884R95J974m610
$$ -1984 2565 -545 -2156 4942 426 -1750 3055 -724 -1368 1413 884 1613 -1271 -276 1698 -2912
1607b912L111K020m300K658p46k035K460j823K244R4l587M208j214k903M627j196
$$ -2912 199 2219 -2081 577 -169 -2204 256 -1567 677 771 -2816 1392 178 -2725 1902 706
1623G06j377J479j386J610j432J2L734n103R71M105n505J128L643l676K87N91
$$ 706 -671 808 -578 1032 -400 -388 3346 -1757 -786 3319 -2186 -1058 2585 -1091 -804 -213
1639b13J23l66k150M634k171m058O744k598m125O113j769k622K141K25K35k324
$$ -213 -90 -456 -2606 2028 -143 -4201 2543 -55 -4180 1933 164 -2458 -317 -92 143 -2181
1655b181K783K021o043L539L228o673L753L321n039J101J413o15j263j13L782
$$ -2181 602 2623 -3420 119 3347 -3326 427 3748 -1291 -190 1223 608 -655 -768 3014
1670C014l623k183N810m699j874O247l468j554K736j351Jn72K315J073m441M010
$$ 3014 -609 -2792 3018 -1681 -3555 2692 -776 -2330 406 -945 -944 -1516 799 1872 -2569 1441
1686A441Q97n428M795R45m080L153m07j034O6p93L104k960p08M230m531k66M180
$$ 1441 2338 -3090 1705 2650 -1430 1723 1316 282 348 -445 2659 -301 -1009 3221 -1310 -1576 2604
1703B604l463O69J600j792J015j547J362J273l693L086Q9m075L864o50k016K952
$$ 2604 -859 -190 1410 -382 633 -914 448 1721 -1972 1114 1203 -2872 992 342 -1674 1278
1719A278j575O30kj410K913j677o88L584l003J8K360k779J327Q2j136J430k821
$$ 1278 -297 333 331 -1079 1834 157 -531 3053 50 68 2428 -351 976 1058 -78 1352 -1469
1736a469J249J168l679K785N73l207K872p00j149K001j529J724n52j723L519k510
$$ -1469 -220 948 -2731 54 627 -2580 292 -408 -1557 444 -1085 639 87 -1636 1883 -627
1752f27o31L877l359M25J930k653J201k95k22J564k765J967Q73l921L707l91k952
$$ -627 -1258 2619 -740 -315 1615 -1038 163 -132 -354 1210 -1555 412 1285 -2636 1071 680 -2272
1769b272L518j198j252J472j434J512j163r66L284l444N23L087m149J856J723
$$ -2272 1246 48 -1204 268 -1166 346 -817 -1783 1501 -1943 -1420 1667 -2482 -626 1097
1784A097k732J825Ol23R92j550J831O9k468L619k220j418L479k648j04J618k306
$$ 1097 -1635 190 196 -127 865 -685 1146 1215 -1253 2366 146 -1272 2207 -441 -545 1073 -1233
1801a233J213j15j061K014k227J061J090l173L199l43k185L255j591q86K526k289
$$ -1233 -20 -135 -1196 818 -1409 -348 742 -2431 768 425 -1760 1495 -96 -982 1544 -745
1817g45J027O93j518J956j753N59J552l219K310R06l412L096p19k066K785j867
$$ -745 282 975 -543 1413 -340 219 1771 -1448 862 1768 -1644 1452 733 -1333 1452 -415
1833d15j74J313j662J811j798l26K867l578J287K290l950K434J140k952K393k85
$$ -415 -589 724 -938 873 -925 -1251 1616 -1962 -675 1615 -2335 99 1239 -1713 680 395
1849C95q42J069j203K149j532j049L485k853n96L354l438P43K157k729Q71K69
$$ 395 -447 622 -581 1568 36 -1013 2472 -381 -977 2377 -1061 -318 1839 -890 -19 250
1865B50m68N87j734K099n31k588L975j819k251M271k136j310K780j667L64K36
$$ 250 -218 369 -1365 734 203 -2385 1590 -229 -2480 1791 -345 -1655 1125 -542 -178 58
1881E8q3J194k358K089R71l886L597K55m063L726k62k514K186p81r0j52m66J793
$$ 58 -25 1169 -1189 900 1871 -2015 1582 1837 -2226 1500 1238 -1276 910 129 39 -113 -579 1214
1899A214k976J068K651m429K054K263m047K224J065k177J441k90M21m86j031L046
$$ 1214 -1762 -694 1957 -2472 -418 1845 -2202 22 1087 -1090 351 61 482 -4 -1035 2011
1915B011k312j251M354l630m72L763l590P46K027k007M38k98P63K8j931K517q30
$$ 2011 -301 -1552 2802 -828 -1300 2463 -1127 -381 1646 -361 77 -221 542 570 -1361 1156 326
1932C26k594L924k057j810M063k520o69J874j321N41j27M12Q15k436K190O17l122
$$ 326 -2268 1656 -401 -2211 1852 -668 -1337 537 -784 -243 -370 42 857 -1579 611 1228 -1894
1949a894L878o39l326L803r87j959K043n01j32n61J28J095l110K113J950m833
$$ -1894 1984 1345 -1981 1822 835 -1124 919 418 286 -275 -147 948 -2162 -49 1901 -2932
1965b932L173J546m686K588J393k065P58M14L67j731L16L124l540L54M496m969
$$ -2932 241 1787 -2899 -311 1082 -983 -225 189 556 -1175 -859 2265 -1275 -921 3575 -1394
1981a394j27M096l537N4K610j110r61m29K125j329j901M732k083l503N020k307
$$ -1394 -1521 2575 -962 -908 1702 592 -369 -798 1327 -2 -1903 2829 746 -2757 2263 -44
1997d4k853M189o77j743J017K64r5k232K498J515m612L476J267m674L126J339
$$ -44 -2897 1292 615 -1128 -111 153 58 -2174 324 1839 -2773 703 1970 -2704 422 1761
2013A761k645J945o05k78n98M9K401k604k51L246l811K78K787k995J019J155j968
$$ 1761 -884 1061 456 178 -420 -371 2030 -574 -825 2421 -1390 -1112 1675 -1320 -301 854 -1114
2030a114J347r23J70R90j801J997m44j967K700j373m93K453k523J189P41k213
$$ -1114 233 -690 -520 470 -1331 666 222 -1745 955 -418 -911 1542 -981 208 949 -1264
2046a264J987l17j042J772j208K25L95j265K164j658r45L056l063L03K596k943
$$ -1264 723 406 -636 1136 -72 153 548 -717 1447 -211 -1156 1900 -1163 -860 1736 -1207
2062a207P34J307j702N51k88R91j46k114L509j352k662M340j378k357L336j020
$$ -1207 -473 834 -868 -317 -605 386 240 -1874 1635 283 -2379 1961 583 -1774 1562 542
2078E42j157J087K28M73k240J680J559m457K575K072m518K624J215l230J257O69
$$ 542 -615 472 700 1173 -1067 613 2172 -2285 290 2362 -2156 468 1683 -1547 -290 379
2094C79j55r79J05K409k802r46M313l216q49M133k814o97K008q33R3n07J550K03
$$ 379 224 -755 -650 1759 -1043 -1989 2324 -892 -1741 2392 -422 -1119 889 56 149 -358 1192 1395
2112A395l029K878j59l195L676k20k803K098o20l06K0k89J775k074m88K723l092
$$ 1395 -1634 1244 1085 -2110 1566 1346 -1457 641 21 -285 -265 -554 1221 -853 -1341 1382 -1710
2129a710P78K400k810J147P25j691J252r15J143O88k212K183n82k068K789r71
$$ -1710 -932 1468 -1342 -195 530 -1161 91 -824 319 1007 -1205 978 396 -1672 1117 146
2145A46p24J648j287K70j13j032K213j443l61K274l077M33J802j991J166k3l28
$$ 146 -578 1070 -217 53 -60 -1092 1121 -322 -683 1591 -1486 -1053 749 -1242 -76 -99 -427
2162d27Q49k091J319J077k629K909j99k306K079o80n39J206o69J319j243j117
$$ -427 422 -1669 -350 727 -1902 1007 808 -1498 581 -99 -638 568 -101 1218 -25 -1142
2178a142K767k333J60K679k507J40J038j687R13l18M03M82j896J538r6k259L158
$$ -1142 1625 -708 -548 2131 -376 -236 802 -885 28 -290 113 595 -1301 237 141 -2118 1040
2195A040l46j764K138j247p95J062l01J337j189J3J686k851P28K620k866J354
$$ 1040 694 -1070 1068 -179 -974 88 -213 1124 -65 -52 1634 -1217 -489 2131 -735 619
2211F19Q20k104J110m57K25O52j353J712j101j839K730j293q54K501j817j61P16
$$ 619 1439 -665 445 -12 213 865 -488 1224 123 -1716 1014 -279 -1133 1368 -449 -610 106
2228A06j247J452m85J62J370k654J194J190k121J937J31j533J231j068Q2R23j180
$$ 106 -1141 311 -174 -12 1358 -1296 -102 1088 -1033 904 1035 -498 733 -335 -253 670 -510
2245e10J510n49j262J705j565N3J830j927Q33K81j582J546q85l13J868j871P16
$$ -510 1000 451 -811 894 -671 -618 1212 -715 118 399 -1183 363 -522 -835 1033 -838 -122
2262a22N15j513J844p82l67J404j842R18O60k002K292l91j476J859j313n0J096
$$ -122 393 -1120 724 -58 -425 979 -863 55 715 -1287 1005 614 -862 997 -316 -366 730
2279G30j241J071p79o06J865j725J54J784k556J081Q47j806J247l87pP98j356
$$ 730 -511 560 -219 -825 1040 -685 -531 1253 -1303 -222 625 -1181 66 -321 -328 470 -886
2296h86J235j69j421K427j122r13K126j590n6J413j265P66n36j92J023j741J483
$$ -886 349 180 -1241 1186 64 -849 1277 -313 -369 1044 -221 545 9 -183 840 -901 582
2313E82M61k432K222k49j985K236q54n36J024j098O62l56m28J810j698J83J683
$$ 582 1043 -1389 833 584 -1401 835 -19 -555 469 -629 33 -323 -751 1059 -639 -456 1227
2330A227k555J253J051j766J501k60q78Q57n00O56m2j017J566j256o67K144j980
$$ 1227 -1328 -75 976 -790 711 451 -427 430 -70 586 544 -473 1093 -163 -830 1314 -666
2347f66M84J444k316J002L18q66R34o39K91K35j344J627m73j479K837j545q54
$$ -666 -182 1262 -1054 -52 266 -600 334 -305 -14 221 -1123 504 31 -1448 1389 -156 -1010
2364a010J958j368J72R09p48N40o03L60L71j628J751L53k388K213m13j498K111
$$ -1010 948 -420 -248 661 -87 453 -150 210 581 -1047 704 1057 -1331 882 469 -1029 1082
2381A082j000o13Q24p83O02o95K44J174k031J005J352k784K023N03k334J882j99
$$ 1082 82 -531 293 -490 112 -583 -339 835 -1196 -191 1161 -1623 400 903 -1431 451 252
2398B52n32O58m00P67q42m16J859j787o6K265k653N23J696k012N83M14o12L17
$$ 252 -280 378 -22 745 -97 -513 1346 -441 -507 1758 -895 -372 1324 -688 -105 309 -303 14
2416A4p95J066j77j512K591j311j273K517j483n67J854j265M8O50l71N08j300
$$ 14 -781 285 108 -1404 1187 -124 -1397 1120 -363 -930 924 -341 -293 357 -14 494 -806
2433h06J271O32k101J707K19k313K087j09j365J627p89k48J35k01P82j297L73
$$ -806 465 1097 -1004 703 922 -1391 696 587 -778 849 60 -188 -53 -254 528 -769 -396
2450c96J488k327J054J175k151J284M12j429J223o47p0O38m62R01q03p96K055
$$ -396 1092 -1235 -181 994 -1157 127 539 -890 333 -314 -384 254 -208 693 -110 -906 1149
2467A149j582J04K001k215P13P48j653R23N9l31N22j019Q54o27q04K192j405m02
$$ 1149 -433 -329 1672 -543 170 918 -735 188 247 -84 438 -581 273 -354 -1158 1034 -371 -773
2485g73J968k082J07J615j415M83M20l98K59r04J243M11j945K189o95j754K466
$$ -773 1195 -887 -780 835 -580 -97 323 -75 184 -720 523 934 -1011 1178 483 -1271 1195
2502A195p70j198J557n90l09J49KL90j170Q63R52k531J376Q52k342J728L59j479
$$ 1195 425 -773 784 194 -115 34 36 426 -744 119 1071 -1460 -84 768 -1574 154 513 -966
2520i66R46M9K07n77k03J618j435l71K345k233J25J704j686N82O23p10J9j46L86
$$ -966 -20 29 236 -341 -544 1074 -361 -732 1613 -620 -495 1209 -477 105 728 18 37 -109 277
2539B77J74j721J885j15j679K084q84r11J303p79P6K59l30P38j029K69J113j542
$$ 277 451 -1270 615 500 -1179 905 21 -890 413 -366 -290 -31 -361 377 -652 -383 730 -812
2557h12Q41R49j902J383k26p16J012n95M38K11j175R92j19r01J442j232K29O86
$$ -812 29 978 -924 459 233 -483 529 -66 372 583 -592 400 281 -620 822 -410 -181 505
2575E05j557J314K3r88J405j052k16J155j325N84M47n62P66p18k04J022j319J223
$$ 505 -1052 262 285 -703 702 -350 -566 589 -736 -152 295 -267 499 -219 -423 599 -720 503
2593E03N15j708J452k86j274J451n62L08J60q47Q07r04l11K007j558p4J212j714
$$ 503 1018 -690 762 476 -798 653 91 399 559 -288 519 -385 -696 1311 -247 -321 891 -823
2611h23K99P18l47M77l41P2J63j325J476Mj292J702m04j125J322o99K61L12k70
$$ -823 -524 194 -153 324 -17 55 218 -1107 369 373 -919 783 379 -746 576 -123 138 450 180
2630A80L84r67L7J339j636Q67J078k157O35M46j062R65j4K58k04j106J212m79
$$ 180 564 -403 -366 973 -663 204 1282 -875 -240 206 -856 109 95 353 149 -957 255 -224
2648b24p76K028j029o09J238r98j33O66m07R71q99J49N24j551J262P01j481J203
$$ -224 -1000 1028 -1 -610 628 -370 -503 163 -244 727 -172 -23 501 -1050 212 913 -568 635
2666F35l88q46P85n60O33K80p44O75p86n55J156p01K99P44j152M94k29n32J330
$$ 635 247 -599 186 -374 259 539 -205 470 -316 -871 285 -416 -117 627 -525 -31 -260 -792 538
2685E38q82M42O27j442O84L78r41J386l55l72M46j040P03K80q43J425q98o78Q51
$$ 538 -344 98 725 -717 -33 345 -596 790 435 63 509 -531 172 452 -391 1034 136 -542 309
2704C09p91J62O70q14Q94r11o3R84j321P13R37j349P59K23j186R78o7n3M46q50
$$ 309 -482 -320 350 -464 430 -481 -544 440 -881 -168 769 -580 179 402 -784 194 127 74 520 -330
2724c30N65j83p12J670r36n50J536j467P5O73o33Q52m80o6L52j235Q83L78j254
$$ -330 235 52 -660 1010 74 -476 1060 -407 -332 341 -292 560 80 14 366 -869 14 392 -862
2743h62J357j92j121J076o71J66P35n91M00l75l50J030j031N39R23j730O71L44
$$ -862 495 303 -818 258 -413 -247 488 -103 297 -78 -428 602 -429 110 1033 -697 -26 318
2761C18p83P24j13l53O84q23P39l93q13J410p55l39J133j328N06N95j184R27p4
$$ 318 -465 259 146 -207 477 -346 393 0 -813 597 -158 -497 636 -692 -186 409 -775 152 78
2780G8l81O72q40M90M96j029J140n93n82J242q50j10J178j180N50Mo35P58n68
$$ 78 -303 369 -471 19 515 -514 626 33 -549 693 -157 -267 911 -269 281 285 -350 408 -160
2799a60P2N05j138Q80J3r01J351p10m11Q58o77qN88o86Q18n24M0O63j079O39O92
$$ -160 -88 417 -721 159 172 -729 622 -88 -499 359 -318 -326 262 -424 394 -130 -90 573 -506 133 825
2820H25j345J085k69r30J184k93k07L90m32L96n60m08J355j251q7J265j486M64
$$ 825 -520 565 296 -634 550 257 50 440 8 404 -156 -564 791 -460 -547 718 -768 -304
2838c04O14q17N99k50n1K82n28Q23k87n40J090p72k73J274j066j25R02p14J64
$$ -304 310 -507 92 -158 -209 73 -455 368 81 -459 631 -141 -414 860 -206 -331 571 -143 21
2857B1K58m53P20q83N61J85j117J070k26j003J305n64n81Q34k33O9q9k06O48p62
$$ 21 279 -174 546 -337 224 409 -708 362 136 -867 438 -126 -707 127 -106 -37 -126 -332 316 -446
2877d46M05O42j294P54N48j241R88j67o50Q26l21J32m9j82Q34q46j69R76j186
$$ -446 -41 601 -693 61 609 -632 356 189 -461 365 44 176 127 -55 779 -67 -236 740 -446
2896d46M63Q04j428M82M59p87N59j99k33K63l69N72J5q92J298p92j74J081p27
$$ -446 17 821 -607 -125 334 -453 106 -93 -326 -63 -432 140 155 -737 561 -231 -405 676 -51
2915e1j97P82o26J66Lm0M37o87Q50k84q23J037n09r26J346n46m86R66m74m3p7
$$ -51 -248 534 -92 74 77 37 474 -213 637 353 -470 567 58 -868 478 -68 -554 412 -62 -105 -182
2936a82M9O26j004N50P07j347P46M71j288R39m3l41K91k04K43k24j27P66n87j25
$$ -182 -133 493 -511 39 746 -601 145 616 -672 267 224 -117 174 -30 213 -11 -138 628 41 -84
2956h4J169j737M93R94j287M49L22n92L97l93K01ro91J175o79m54J439r57k64
$$ -84 1085 -652 -159 835 -452 -3 319 -273 124 -269 -68 -77 -768 407 -272 -726 713 -244 -508
2975e08R90p32M8M83o19N34j08n6N21q28P69m4j054J083k82n46R20q91K70R1m24
$$ -508 482 -250 -202 281 -338 196 88 32 553 -275 494 450 -604 479 197 -349 571 -320 -50 41 -383
2996c83O23o72J08J001j098K66M08q86Q49jq01J086m65o2N67p52N04k23l51P99
$$ -383 240 -432 -324 677 -421 -155 253 -633 216 215 -586 500 35 -27 540 -212 292 69 -282 517
3016E17p98K01O19r44M27N35j153Q79r6l82O77n84K29q0n79J011m87m46R55q10
$$ 517 -281 -80 539 -405 22 557 -596 283 187 -195 482 -102 127 47 -532 479 -8 -454 501 -309
3036c09J5N65q49L50M74r2K25l41O7L28j125J079L1r89J195p24m79J068n50L3
$$ -309 -294 271 -578 -228 246 154 379 38 105 433 -692 387 418 -571 624 -100 -579 489 -61 -28
3056b8K28l08L20o26K39P88j211O06L77j161P60J09m86O61l97R1J34n91J047o46
$$ -28 200 -108 212 -414 -175 613 -598 8 385 -776 -16 93 -393 268 -129 -38 96 -495 552 -94
3076i4j34Q75r50J66N58o55M51J65o16O28n08m8M15r59J087P8j023Q49n51l26
$$ -94 -228 647 -303 -137 421 -234 217 382 -234 394 -114 -162 253 -706 381 459 -564 285 -266 -592
3096e92R35o81M50O4q15P04j73k07J065j011L18J48o58P09k14j36O54n72o2M08
$$ -592 343 -338 112 176 -639 65 -108 -315 750 -261 57 205 -453 256 42 -94 560 -12 -74 334
3116C34j020R85Ql33N04n17l9J46m77P05o6p84R75n84k85O11j53P6K29n56L89
$$ 334 -686 299 307 -26 478 -39 -78 68 -409 296 230 -554 421 -163 -448 163 10 86 315 -241 148
3137A48o70J39R19q26N86J52p70M45Nk89O51m58Q5P0o57O60j49k92R81q96k59
$$ 148 -522 -383 536 -290 296 448 -322 123 128 -161 490 32 117 187 -470 190 41 -251 730 -166 -425
3158d25O07n91L11M33k79J7l02M4L73r37R58M12j063N18j36m91Q98l98K49J58
$$ -425 182 -409 -98 335 56 73 -229 -185 188 -749 209 621 -442 76 -60 -551 347 -51 198 356
3178C56o48O06l57j41Q23q13L11K44q31K85K38l52M13k36k6O0m64N59j70j35N13
$$ 356 -292 314 -43 -184 639 -174 137 381 -450 -165 73 -279 134 -102 -128 -68 -532 27 -143 -278 235
3199B35m76J15M35o37L06N83q63N06j71l96Q07o84N18O3n54O06l59m06P95m83
$$ 235 -241 -126 309 -328 -22 561 -302 204 33 -363 444 -240 278 341 -213 393 34 -372 423 -60
3219f0M7M48p73L18J50n00O92l55j45M27r65Q70n4n78J116p60k58Q64o82L16K75
$$ -60 -13 435 -338 -20 130 -370 322 -33 -178 249 -716 154 100 -478 638 -122 -380 484 -198 118 393
3240C93m98M40m53P9M93p40L30N13j136Q91k07o35P99m30M7L45l63Q1j82N8M80
$$ 393 -105 335 -118 -39 454 -286 44 557 -579 312 105 -530 269 -161 -114 231 -132 -51 -233 -175 305
3261C05q57N01M41q77M92J11l52O15m65o8M68n81M25q1k82Q83o89l43R01j032
$$ 305 -552 -51 390 -487 5 116 -236 379 -86 -154 314 -267 158 77 -205 678 -11 -354 547 -485
3281d85L56M36o39K30J49j23K87m82N46J7q03Q12k26p45J167n78m8M18m51O4J14
$$ -485 -129 307 -332 -102 47 -76 211 -271 275 292 -511 301 75 -670 497 -81 -129 289 -162 -98 16
3302A6j55O62o90N3M64o74M21K50o90N81j82k49N79l93J66j23m16N40k39k48P99
$$ 16 -139 523 -167 -114 350 -324 97 347 -343 238 56 -193 386 -7 159 36 -380 160 -79 -327 472
3323D72q86J93M12n38N91J0m90M40j14j70J56k66M84k45k53O48m52r9N97n25J02
$$ 472 -414 -221 191 -347 244 254 -236 204 90 -80 76 -190 294 49 -204 444 -8 -107 490 -35 67
3344F7K44m97K88k36L5J86l91N45j92p68R63l62m64J208o32k94M95l65R3J42j20
$$ 67 311 -186 102 -134 -99 87 -304 241 49 -719 244 -118 -582 626 -6 -300 195 -170 -77 65 -55
3365e5N26p55L20K93q72P99q9o22Q32j71k97K39l25J80pk04L55j64k41P55j071
$$ -55 471 -284 36 329 -543 256 167 -455 377 206 -91 148 -177 3 -4 -208 147 -17 -258 497 -574
3386e74L92L74p02O00J47n80M44k22J02Rk16O47n86k71Q00n99N0O93o80K04J96
$$ -574 -182 192 -510 90 237 -343 101 -121 -19 -10 -226 421 -165 -436 364 -235 -185 508 -172 32 228
3407B28k95J93k89L31K75q12O35k45m28O80k72m66N97l01p8L68l60L84k78J60
$$ 228 -67 126 -163 168 443 -369 266 21 -407 273 1 -465 132 -169 -247 121 -239 145 -133 27
3427B7K76n37N12L1p28N73O3m71O49l79j82M12k57K98k99k80P51p11J08M78o74
$$ 27 303 -234 278 309 -419 154 217 -254 395 16 -166 246 -11 287 -12 -292 459 -252 -144 334 -340
3448c40N40l6o26O47l0j71J23l04O8L15o88P10j39l95P76q12K62L31l55L35O4
$$ -340 200 164 -462 185 155 -16 107 -197 -129 186 -502 208 69 -326 450 -362 -100 231 -124 211 275
3469B75k73L69n29K55m2m65Q17m42k99N70l08m38R32o90k5M34n63P49l74M3K70
$$ 275 2 371 -158 97 55 -410 407 -35 -334 236 -72 -510 422 -268 -293 141 -422 327 -47 -4 266
3490B66p32N94j33l90N68J01k79M08m45J64k33p7O77o45J4O78q87M57K69p94O22
$$ 266 -466 128 -5 -395 173 274 -5 403 -42 122 -111 -188 489 -156 -142 536 -351 106 375 -419 203
3511B03q1l71K38j85Q6K14n72M93k08j58O23l68r5N61l65J8K04m55L97k44j0M81
$$ 203 122 -249 -11 -196 -110 104 -468 25 -183 -341 282 -86 -181 380 15 33 237 -218 179 -65 -75 406
3533D06q45N02L9n24O68k72l44P48m96l9L39m19M88j43k41K39k72MK84m92M64
$$ 406 -439 63 102 -422 246 -26 -370 378 -118 -157 182 -237 251 108 -133 106 -166 -162 122 -370 94
3554I4P0o79O99k30o1K00k4R7j6m96N83k56k2M22o60L93K14o55L61o0kK19k43
$$ 94 164 -515 184 -46 -107 93 69 166 150 -346 237 -19 -41 381 -279 114 328 -327 34 -26 -28 191 -52
3577e2J48j84k15M40m2l90M63m37L8M81k78L14q7m18M04m44K30K95n00M82K4o18
$$ -52 96 -88 -303 137 95 -295 168 -269 -231 250 -28 286 199 -219 185 -259 -29 266 -234 248 272 -346
3599c46O26k73q3N58m07n9J46k58K09k63K0O94q60R2K92m04L93J33m07K99l50
$$ -346 280 7 -76 482 75 16 162 -96 113 -150 -130 564 -296 -204 88 -316 77 210 -197 102 -248
3620b48J64K32l78N54j56l47N42l95j13N04o19L82Q1l84K71%k77K72j89J12J97
$$ -248 -84 148 -230 324 168 -179 363 -32 -145 359 -260 122 203 -181 90 90 -187 85 -104 8 205
3641B05m28K57O0k94N60m22k44M91n29K78J89K8L5j70J85J62n88M11k9l75N79
$$ 205 -223 34 94 -200 360 -62 -306 185 -344 -66 123 151 186 16 201 363 -225 186 157 -218 361
3662C61m21m3K89j08p4K12k34K16k44k10M61n07K59J79m13L82k02l3K61k93J26
$$ 361 -60 -103 186 78 4 216 -18 198 -46 -256 205 -302 -43 136 -277 105 -97 -130 131 -162 -36
3683c6J82n26L77q9nM14n07K95J04k35P2J97l78L48k52k68N36l77N31l20l54N93
$$ -36 146 -380 -3 -92 -97 317 -190 105 209 -26 46 243 -135 213 -39 -307 229 -148 383 63 -291 302
3705C02l60m28Q03n28J68K34o22M93k61J1M81m13Q9K27m63N31k56j45M96l61o6
$$ 302 -58 -486 317 -211 -43 191 -431 62 -199 -188 293 -120 -31 196 -267 264 8 -137 359 -2 -68
3726f8L77n72K10J65j79L17k87M6L57o37J92R8k78M80l35j71K47j50J71J34k80
$$ -68 309 -263 -53 112 -67 250 -37 9 366 -271 -79 19 -259 221 -114 -285 -38 -188 -17 117 -163
3747a63L18j83l73O09l80K42J88m48K79qj15J20k20K84q8l05M11p8k57M29m51
$$ -163 155 -28 -401 208 -172 70 258 -190 89 81 -34 86 -134 150 62 -243 168 90 -167 262 -189
3768a89J56J70m69L17R3k48J43j61Q4K05l46K91O6k97L07k02j31O78m36j85K77
$$ -189 -33 137 -332 -15 78 -170 -27 -188 -104 101 -245 46 112 -185 122 -80 -211 467 31 -154 123
3789A23KM0n7j59K69n28K65K52l99J71l1k16L68k8l65M31k62L28o3k21L24m58
$$ 123 125 165 108 -51 218 -310 -45 207 -192 -21 -52 -268 100 72 -293 138 -124 204 141 -80 244 -214
3811b14J39L45n16K33J90k52L04j97PJ71l47J32L01o72O30l56L6M36l18p2K25
$$ -214 -75 270 -246 -13 177 -75 229 32 39 210 -137 -5 296 -376 254 -102 -66 370 52 -20 205
3832B05l32M5K35k95K14j55p9K07l02L46j25k87N52j95j35K48j31M7j71LK73l02
$$ 205 -127 -82 153 -142 72 -83 -162 45 -257 89 -36 -323 229 34 -101 147 16 63 -108 -105 168 -134
3854a34J79K36n56N02m3n80M24P0k44K49j82O0O8j83M35n42Q9L91m43l5L23j26
$$ -134 45 281 -275 227 184 -396 28 98 -146 103 -79 -19 49 -134 301 -241 -152 239 -204 -239 84 -42
3876d2K01k11p6K58j16k7J1k1N1n4k38N71k52k66M41k93J44K61m87L29j22j09
$$ -42 159 -52 -128 130 14 -13 -2 -23 28 -26 -264 307 55 -211 230 -63 81 342 -145 184 62 -47
3898d7J43k40K86N7n63N23O3n57N58k37qK34l86K31jj88K12p3q9K49l60M77j16
$$ -47 96 -144 142 199 -364 159 222 -335 223 -14 -22 212 -174 57 56 -132 80 7 -82 167 -193 284 168
3921A68k23J27j68j10L06k06K30l0j46K35k56k40M60l60J43L11n13L67jl09K42
$$ 168 -55 72 -96 -206 100 -106 124 94 -52 183 -73 -313 147 -213 -70 241 -272 95 94 -215 27
3942B7j04o7K80j54K74j75l36L03lk15O68n07J80J51l91mq1Q0K96m41M02j11l06
$$ 27 -77 -144 136 -18 256 81 -255 48 45 -170 498 -9 171 322 -69 -73 -154 -74 222 -219 183 72 -234
3965b34L12j48n1J83k89Q2K45l83L28q0j61L76k89n7M94p00M88K7j78M15l29j21
$$ -234 78 -70 -121 62 -227 -145 100 -283 45 -35 -196 180 -109 -166 328 -372 116 143 -35 380 51 -70
3987g0J95j77K3R3k89M08k66N5L65n92K55M8j14K34j62l36K74o7m4K35l52M52
$$ -70 125 -52 -29 64 -225 183 -83 -28 337 -255 0 48 -66 168 6 -330 -56 -123 -167 68 -284 168
4009A68r5j08L26l75J06K24k02K09k42j32J39p2K32o3k85J46j6k60M64j81o7K45
$$ 168 73 -35 291 -84 22 246 44 253 11 -121 18 -54 178 115 -170 -24 -40 -300 164 -17 -84 161
4031A61k21J21j45j01L88k50P2J88l55K8K43m81O14j59l84L85j39j20L55j48N1
$$ 161 -60 61 -84 -185 203 -47 25 213 -142 -114 129 -352 262 103 -281 104 -35 -155 200 52 103
4052A03j10p6L99k31j97K59m85L75Q4l56K39j83j21K42J53O9Ln46O52l43j20M86
$$ 103 -7 -83 316 85 -112 147 -338 37 121 -235 4 -179 -300 -58 95 164 167 -379 273 -70 -190 296
4074B96k99l3M7k62O04j26o7j17j63J73K06l34K71M1n24M12j52K7J38j22M0o3
$$ 296 -3 -36 11 -251 353 227 160 43 -120 53 259 -75 196 237 -287 125 -27 0 138 16 56 -7
4096gk9P1j57o9L77m35J56K19j34N4J04k35K26j38l3K61k91j9K46k76K45j46j15
$$ -7 -36 35 -122 -191 186 -249 -93 126 -8 46 150 -85 141 3 -30 231 -60 -79 167 -109 136 -10 -125
4119a25K72l04L24l8m08L97Mj97J07l0j45Q5l28M09j64O4L77l00K2J53m29L77
$$ -125 147 -157 167 129 -279 118 122 -75 32 2 -143 -58 -386 23 -141 -77 300 0 22 175 -254 123
4141A23j18k0K73l90K04j1l04N52k22k11L69l17J95q6j21L3k15K00Q3m30L01K08
$$ 123 5 -15 258 -132 72 61 -243 309 87 -124 245 -72 123 37 -84 -51 -266 -66 17 -413 -112 96
4163I6k16K51p9n49M39L4LJ25k35J33J0k44L67r8L5K42m04R0J23l68N43k07j76
$$ 96 -120 131 52 -497 -58 -24 -21 104 -131 2 12 -232 135 37 72 314 -90 0 123 -245 298 91 -85
4186h5K56k73M00r6l42M79j92l81K87k17J0J60j57K09K3k69L11j31j8Q0k05J95
$$ -85 171 -102 298 202 -140 339 147 -234 53 -164 -154 6 -151 58 81 -188 123 -8 -26 54 -151 44
4208D4J86k59L2J02l36N69j20n0j19m2J44n5l63N91m54M9P1j00J10J87k47L62
$$ 44 230 -29 3 105 -231 338 218 168 49 7 151 96 -267 324 -130 -81 -10 -110 0 187 -60 302
4230C02k93o7Q6j97L28l3k36P8j76PM31m77M08M9l74L17j29r9K55l35J60K64m66
$$ 302 9 -58 28 -169 159 126 -110 -32 -208 -201 230 -247 161 210 -164 153 24 -75 180 -155 5 269 -197
4253a97N79k72k96M53m18J95O9n22M55O2k52J65j43K05J42m12M05j60k26L71j14
$$ -197 382 110 -186 267 -151 44 113 -409 46 108 -144 21 -122 83 225 -187 218 58 -168 203 89
4274H9k5P0j06N7j30j0J15p6L6R7k63K63pm15L29j68j5Q2N8rJ09k46K78k82J30
$$ 89 64 134 28 85 -45 -55 60 -16 20 117 -146 117 110 -305 24 -144 -159 -77 -19 -28 81 -165 113 -169 -39
4299c9K3p0L2M78n32J40M7k22M27l43L33k43j0J26m2q5J54m26n5O01m72J40J83
$$ -39 -16 -86 -54 424 -108 32 79 -143 284 -59 274 31 21 147 105 20 174 -252 -307 294 -178 -38 145
4322A45l44K49k35k2M48m18J3L36m33N42m60J16L74k14k18M32m35L68j52j27J89
$$ 145 -199 50 -185 -207 241 -177 -164 172 -261 281 -179 -63 311 97 -121 311 -124 244 92 -35 154
4343A54j02j78L93m8q7J2l92K80p8j20L32j61kj88R9K21k01J17N5j57J2K82n23
$$ 154 52 -126 267 219 132 144 -248 32 -46 -166 166 5 3 -185 -86 135 -66 51 106 -51 -39 243 -280
4366b80K57l7j00L20p8M7j83o4L19K1k71K43j31j12L31l97OJ65k14K8J00O7J44
$$ -280 -23 -60 -160 160 82 129 -54 -118 201 222 -49 194 63 -49 282 -115 -109 56 -158 -130 -30 37 181
4389A81m07L25N8k28J76k20L1Q1K4j30M43m28J97j2NK54m69J93Q4l71K25r4o1
$$ 181 -226 99 157 -71 105 -115 -84 -3 21 -109 334 -94 103 91 96 350 -119 74 158 -213 12 -82 -143
4412a43L38k17r6N9m2J39n5k39L65k77J08K59m45K20J94l83L52j28m8J92k36J61
$$ -143 195 -22 -118 -59 -101 38 -17 -256 109 -168 -60 199 -246 -26 168 -215 137 9 -39 153 -83 78
4434G8Jq9K05l53J17J72j93JL63m75K21L9k2K05n25K56J65l39L08r8l04L62l06
$$ 78 79 -10 195 -158 -41 131 -62 -61 302 -173 48 87 65 270 -255 1 166 -173 135 37 -267 95 -211
4457b11o2M25l02J88l9j18K29k10k2L06m79M47m0k87K38q1m2R8k45K18J29l46
$$ -211 -273 152 -150 38 -1 -119 110 -100 -122 184 -295 152 112 -175 63 -18 -60 38 -207 11 140 -206
4479b06K22j03l0K83l59j61M97m91M09n7k93K96q0k15M07k30K85j98K8K32j53
$$ -206 16 -87 -117 166 -193 -354 143 -348 61 4 -289 7 -73 -288 119 -111 174 -24 4 236 83
4500H3j29L38l48n8K11m18M93p3l2J44m47J38K52m40O24l61k99L08j1N7r9j0J48
$$ 83 -46 292 -56 -114 97 -321 172 99 67 211 -236 -98 154 -286 338 -23 -322 -14 -25 32 -67 -77 71
4523G1j1p5K07m15J11J79j08J72J71m32J87j18J30J03k81K14O8l88L28j92j19
$$ 71 60 -15 192 -223 -112 67 -41 131 302 -130 57 -61 69 172 -109 105 173 -215 113 -79 -198
4544a98L70j68o9R0j05M87l49j86M72l12j24J68k84K39J09l59L96j89k3K63j77
$$ -198 172 4 -65 25 -80 407 58 -128 344 32 -92 76 -208 31 140 -219 177 -12 -35 228 51
4565E1Q0lj32M4n9j41K49j52Q6j30j15K69j03M9K02j54j99L0n4J81r4j73M81k84
$$ 51 131 128 -4 40 -19 -160 89 -63 23 -107 -222 47 -56 -7 195 41 -158 -128 -182 -1 -95 -268 213 -71
4589g1q0K03k61K70ol00M01j97J5K45k04L1k10o0K87j77J42P7l54J05K56k86J05
$$ -71 -151 52 -209 61 55 -245 156 -41 -26 219 15 46 -164 -224 63 -114 28 105 -249 -144 112 -174 -69
4612f9N3j1J32k45R3J84l90L61K8k33J26Ol0K83l57K46k02n2K74l00J73K68n06
$$ -69 -16 -27 105 -140 -47 137 -253 108 136 -97 29 35 5 288 -69 177 -25 -77 197 -103 70 338 -168
4635a68L1L81m62K18j8P6m6k07J24n9j21L44K4p5K26m43O8L36k83J02l9j0J64
$$ -168 -137 244 -218 0 -18 58 12 -195 -71 -130 -251 93 117 42 268 -175 -107 229 -54 48 9 -1 163
4658A63m03K79N5j12K11r7q8J13j79Q9Q7o9jRj79J21p4K6N5j25M06j00l60J58
$$ 163 -240 39 94 -18 193 96 8 121 -58 31 118 49 48 57 -122 -1 -75 -49 6 -119 287 187 -173 -15
4682a5J82l66K67l14J82J62k33J43J50j65o6MM6J05k81K29J01j30k4K7j35L30
$$ -15 167 -199 68 -246 -64 98 -135 8 158 -7 -73 -69 -23 82 -199 30 131 1 -23 4 -131 199
4704A99k49k20L75k69K53l73M44Km13L99L1m42L48o3k1%J7M5L8k01K74k33PL62
$$ 199 -50 -270 105 -164 89 -284 160 162 -251 148 179 -263 85 22 1 1 18 63 101 -100 174 -59 -52 310
4728C10n87K28j6j2M9Q0k12L85j07K6o7j82K06o5j72J93q4K4P1k50J59j2R4j8
$$ 310 -277 -49 -65 -77 -28 52 -160 225 118 144 77 -105 101 36 -136 57 -27 -3 68 -182 -23 -35 59 41
4752D1o0N6j36N3l4K40l38L00J8j35R6m6r2J37k17L6j55K19j27Q9n8J72j51q1
$$ 41 -19 37 -99 -46 -80 160 -178 122 140 5 101 55 -37 100 -117 -81 -236 -17 -144 -55 -113 59 -92 -173
4776a73J86j33L20l47J83P5j66J30K7k37L23j51r9J62l25L04J43k17K91j52l26
$$ -173 13 -120 200 -147 36 111 -55 75 102 -135 188 37 -62 100 -225 79 222 5 296 144 -182
4797a82M34k86p1K18j39L57k91k14K56j59J0K80k39n1Q8k80J87P1J13j27j51K94
$$ -182 252 -34 -105 113 -26 331 40 -174 82 -77 -67 213 -26 -77 11 -269 -82 -11 102 -25 -176 118
4819A18m9k85K75j82J16K78m52J84K8mK10j41l16N23l66J18P2l43K56p7j28K98
$$ 118 69 -216 59 -123 -7 271 -181 3 31 27 237 96 -220 303 -63 55 127 -216 40 -37 -165 133
4841A33m3j6Lp6jj37J03L05l87l2L04k74J77k7j6J72k4k39J57j29J66j71kJ58
$$ 133 90 74 77 1 0 -137 -34 271 -116 -148 156 -118 59 32 16 188 164 -75 82 -47 119 -52 -54 104
4865A04j29lJ40k10oJ48l03L03k5J22R1l59L8K45j62J65j11k73N59m70m3M65k08
$$ 104 -25 -28 112 -98 -104 44 -259 44 19 141 232 -127 -89 156 -6 159 48 -225 334 -136 -179 286 78
4888G8J4m6l0Q1l5L6o6l10J20K41k66L41j4l69L66l74J63J51n9lj17K05K9o4L
$$ 78 92 46 16 97 62 98 32 -278 -158 83 -183 158 144 -225 141 -233 -70 81 22 19 -98 107 136 72 75
4913G5K39m81K15p2m7K03q9k0J11j70M8l7J6J6M3l4K4q8L36j91j76M4n9o3K44
$$ 75 314 -167 48 -24 -71 132 43 23 134 -36 12 -25 -9 7 50 16 40 -48 288 97 -79 -35 -94 -157 87
4938H7k85K71j74j89L35K3o5OM2p4J79k70K36j1k73K46j30j5J23j75J92L6k43
$$ 87 -198 73 -101 -290 45 68 3 9 51 -23 156 -114 122 111 -162 84 -46 -61 62 -113 79 115 -128
4961a28L06j41j56J10pL2j99Q6K23r9j71K01j63J9K92l87K60k6n9O0k84L63P3
$$ -128 178 37 -119 -9 -16 16 -183 -97 126 27 -144 57 -106 -87 205 -182 78 52 -7 53 -231 132 205
4984B05l12K01n8j11K12l6N1o4k23O5J77m44L84j27R3l7j57K47l9j39J39j5j05
$$ 205 -107 94 36 -75 137 101 152 88 -135 -70 107 -337 47 -80 13 -24 -181 66 27 -112 27 12 -93
5007i3K12k40Q2J47j80L1N8p1J46l66M36l03n3K41J03k59K86j58r5J83k52P5J21
$$ -93 119 -121 -39 108 -72 -41 17 -54 92 -274 162 -141 -194 47 150 -109 177 19 -76 107 -145 -70 51
5030E1QJ03m20Q5M15m11Q8J34r7J25k29K34j29n3R9R3q0N0J3j67J83l63K51K23
$$ 51 59 162 -258 -173 242 -169 -81 53 -44 81 -148 86 -43 -96 3 96 16 66 79 -88 95 -268 -17 206
5054B06k34%M1j00M16n74J80J89l88L66k81K4K02j39J26O2j72P3J36j24L2k75
$$ 206 -28 -28 13 -87 329 -245 -65 124 -264 102 -179 -155 47 -92 34 96 -76 -3 133 9 41 -234
5076b34J89J43k74J5L48l76K06Q6qP0j60J07J4k25j19L91q0J43l6r9j33n4J08
$$ -234 -45 98 -176 -161 187 -189 17 103 95 165 5 112 126 -99 -218 173 93 236 200 101 -32 -86 22
5099B2N2k74L01n7p2k3n2N4L15l20K03j27j24K91l1p1J76k41J72j90k37J17m7
$$ 22 74 -200 101 44 -28 -51 -103 -49 266 -54 149 22 -102 189 158 87 263 22 194 4 -233 -116 -163
5122a63P1K5l2M7J25j8N4j93q1J19o5L14j50q9J78j66l00O42n94K93K13j85j61
$$ -163 -92 -67 -99 -52 73 55 109 -84 -165 -46 -111 203 53 -36 142 -24 -324 318 -276 17 230 45 -116
5145a16J6K00q7j95J67j11K08J7j11J37r2o1p0K00j71K48l50j31K57r5J76N0k06
$$ -116 -100 100 13 -182 -15 -126 82 99 -12 125 33 -28 -98 102 -69 179 -171 -302 -45 -140 36 86 -120
5168a20K04p7j69K71j38NM2J06J24j47j53J41Rp6J04k50Q3J87k53J32mn6L62m39
$$ -120 84 7 -162 109 -29 -24 18 124 248 101 -52 89 98 22 126 -124 -41 146 -107 25 21 -35 327 -112
5192a12L53l81K1K89J0k25Q9j54J15J28k63M00r8l24L20j92j98K31j03J68m8j09
$$ -112 241 -140 -119 170 180 -45 44 -110 5 133 -130 270 172 -152 168 -24 -222 9 -94 74 26 -83
5214h3J87j52j01J88M8j44J88l07K52k03n4M12l59O9J17l77J41K10j42J64j07
$$ -83 104 -48 -149 39 87 -57 131 -176 76 -127 -181 231 -128 -59 58 -319 -178 32 -110 54 -53
5235e3qL11j94J11j25l4k6M6L4N1j39J53j30P2k5Jj69L78l92J12N0j29J21l0r5
$$ -53 -61 250 56 167 42 8 -18 28 62 113 -26 127 -3 69 44 45 -124 254 -138 -26 24 -105 16 -14 -109
5260a09K31j68o5J37k05K25J4l61K85J08q4J65k09J74j55J02J27j45L2N4l22K10
$$ -109 122 -46 -111 26 -179 46 60 -301 -16 92 8 173 -36 138 -17 85 212 67 99 153 -169 41
5282D1j76l4M10k07N0k16R5R3J38j59kj01N3J52k99O9l8J02J92j73l7K89l26J18
$$ 41 -135 -169 241 34 84 -132 -37 56 194 35 33 -68 -15 137 -162 -93 -131 -29 163 -10 -47 242 -84 34
5306C4J82r6k94K80j50K20N8l47K14k36J49n7L7J62l39P1J51l3K24k8l40J09K08
$$ 34 216 120 -174 106 -44 176 234 -113 101 -135 14 -43 -6 156 -183 -112 39 6 230 202 -138 -29 179
5329A79m23N59l84l0K60k07K46j82j07M4j35K18L0k21J8Q0P8j5L7J39o9j29N2
$$ 179 -244 315 -69 -99 161 -46 200 18 -89 -45 -180 38 68 -153 -135 -55 23 8 45 184 115 -14 38
5352C8l1p5J74j29k6J1j2L2K52k59J49l10m0M59l08N3l4rm1K73k41J09m6j95M17
$$ 38 7 -68 106 -23 -49 -38 -50 -18 234 -25 124 -186 -226 233 -75 -22 -56 -65 -106 167 -74 35 -11 -206 211
5377B11k87L38k12k3K49l34R9K03l56K44ok66K02m3m7M3N4k15K28j26J77j81J2
$$ 211 -76 262 50 27 276 -58 41 244 -112 132 126 -140 62 19 -28 15 69 -146 82 -44 133 -48 -36
5400c6J33p7Q9L9j75j1J08k9k1m1R1j91J5K60m0k67K53k02K93j00k11K48j20j93
$$ -36 97 20 109 148 -27 -38 70 41 20 -21 70 -121 -106 154 114 -153 100 -102 191 91 -120 128 8 -185
5424a85Q2M2J6L27l74P6J38k36M79l11k48K29j80O6J14M7j10O3q5L6j71K89jq4
$$ -185 -103 -61 -45 282 -92 -16 122 -114 365 54 -194 35 -145 -79 35 82 -28 35 -50 -14 -185 104 103 19
5448A9j12J60k89M63j39k40K81k31J53Q1j48K23o4k81M71m47K4K53k91L05j50
$$ 19 -93 67 -222 241 102 -138 143 -88 65 146 -2 221 157 -124 347 -100 -76 177 -114 191 41
5469D1m4M4k03K18Mk04K09j70R5K04k82M2J48k24K83N4n33J87p1J90j0l1R5J76
$$ 41 -3 41 -162 56 60 -144 65 -105 -10 194 -88 -46 102 -122 161 215 -318 -131 -202 -12 -22 -53 42 218
5493B18k25J35j7k42K24j80J13Pj02kJ32j05M0k42L28j50q8J85Nl0K6k9q6J60
$$ 218 -7 128 111 -131 93 -87 26 33 -69 -71 61 -44 -4 -246 82 -68 -156 29 34 4 30 1 -85 75
5517G5l8J5n5j36K45k01K61j22l74M91j03k41J56p1J93j58m3J65J68j69l5j88
$$ 75 37 52 -3 -139 106 -95 166 44 -330 161 58 -183 -27 -98 95 -63 -106 59 227 58 23 -165
5539a65oM88n27J10J58M7j55n7m3J85J25j14Q6m14K28K6j10L49k05k00N10l63
$$ -165 -171 317 -210 -100 58 105 -50 -107 -150 35 160 46 132 -282 -54 -28 -138 211 6 -194 316 -47
5561d7k7P1JK65k90k0R1k27J11J83j47K82q4l07K81L2k13K16k49j5l2J61Qk56
$$ -47 -74 -3 -2 263 -27 -47 44 -183 -72 111 -36 246 162 -145 136 168 -45 171 -78 -93 -125 36 44 -212
5585b12K18P3k1q6K2j06m6N1KL15j91O9L7l94L89j42j54K39j77J55j58o9N1j70
$$ -212 6 79 58 -28 -6 -112 -158 -107 -105 210 19 88 125 -269 120 -22 -176 63 -114 41 -117 -186 -135 -305
5609c05L40n3q3l6K1j33L53l77K76L19l89KN6j64M17k59J01R2k48J81j36k3L02
$$ -305 35 -18 -101 -137 -116 -249 104 -273 3 322 -67 -65 -9 -173 244 -15 86 178 -70 111 -25 -48 254
5632B54j93j68JJ33k01J19o2O8K8j28K24j05k1J4J30j22P7j17k3J78j61Q8L1k16
$$ 254 61 -107 -106 27 -174 -55 -117 -49 -21 -149 75 -30 -51 -37 93 -29 48 -69 -92 86 -75 13 44 -172
5656a72J85J89Jl71r9L00n6J7J23j00KJ08k6Kj77J27P7j22r4J64j72J47j1j50
$$ -172 13 202 203 -168 -267 33 -23 -6 117 17 19 127 101 103 -74 53 130 8 -86 78 -94 53 42 -108
5680a08M81m61j4P7j06J18J5p0K19k27K0K20k21R6N7r6P5k12J23k07K40J17j8
$$ -108 373 -88 -102 -25 -131 -13 2 -68 151 -76 -56 164 -57 39 96 0 75 -137 -14 -221 19 136 118
5703A18j18J40k66J5K24k85R3N1q6L7m6R5K52m77L34Q4j96p0J35j51J34k37K93
$$ 118 0 140 -126 -111 113 -172 -79 -28 -114 -77 -123 -28 224 -253 81 165 -31 -101 34 -117 17 -220 73
5726G3P2j97J58J32n5j2k58K2J45m14K40J28m5k9J7n9K58l01O9N7K33m10K53j00
$$ 73 145 -52 106 238 183 171 -87 -65 80 -334 -94 34 -11 -40 -23 -82 176 -125 -56 1 234 -176 77 -23
5750b3Kj8J19R3k07J09J7j24J11R1k60K05k00J28j25q0K57k57K47J09k60J29K
$$ -23 -21 -39 80 173 -34 75 92 -32 79 170 -90 115 -85 43 -82 -162 95 -162 85 194 -66 63 65
5773F5k2q5M2j32K06k28M27k53j9K06l14K7J30M6j97K26k96K19k05J68j15O5J17
$$ 65 43 -42 0 -132 74 -154 273 20 1 207 -107 -80 50 96 -101 125 -171 48 -157 11 -104 -39 78
5796G8q9m4l5R1q4K67j87j82J13l9K35j45k00K33k50m5L62j62rJ33j77M7lJ56
$$ 78 -11 -55 -90 1 -83 184 -3 -185 -72 -111 124 -21 -221 12 -238 -283 79 -83 -92 41 -136 -89 -92 64
5820F4j75k4l3K75l54K25J7J8J11j97pR3j45K29j9k52K90k74j4K83j00Q5j75Q1
$$ 64 -111 -135 -168 107 -247 -22 -5 13 124 -73 -80 13 -132 97 78 -174 116 -158 -172 111 11 96 -79 2
5844BQ9o8P8k8j87O7J40k05J37k09K94J07k41O4L9r6k0OR8Q5k32R0j56J87q7J54
$$ 2 91 23 101 73 -114 -47 93 -112 25 -184 110 217 -24 40 79 -17 -37 -31 67 152 -80 10 -146 41 -46 108
5870A08k8N4j76K65r4k61L54k06j7R0j94J69K8j29K2R2j45jJ23M0P7j51j08K22
$$ 108 80 134 -42 223 129 -132 222 16 -1 89 -105 64 92 -37 -15 77 -68 -69 54 94 171 20 -88 134
5894A34j17J71j61o1K22j69j70J40j72J23O4j28K31k83o2L18j78O2m8J82l6j19
$$ 134 17 188 27 -34 188 19 -151 -11 -183 -60 4 -124 107 -176 -238 80 -98 -36 -84 98 62 -57
5916e7J59K5k05J56j18rJ76o3Q0n5j19J2j3J50n2j17J46j79j67K02J45j75L18
$$ -57 102 127 -78 78 -40 -49 127 64 144 89 -30 -18 -31 119 67 -50 96 -83 -250 -48 97 -78 240
5939B40j23lk07j28J29K14j23J88k5j98K53k07P9Nj66M19l59k30J10L4J77Mn3
$$ 240 117 114 -93 -221 -92 122 -1 187 162 -36 217 10 89 94 -72 347 -12 -242 -132 -98 79 83 30
5962C0J63k01P0J98m90K60j38k7P3P3k27L01j38L3M2k59L51j36n1N4O6j95J53
$$ 30 193 -8 62 260 -230 30 -108 -135 -62 11 -216 85 -53 -20 22 -237 114 -22 -73 -19 47 -148 5
5985EPm6J32m2o1J7J1J38k92J8L26m10N2K08k5%P0O3k30j2J18n9j60K80n2Q3J9
$$ 5 12 -34 98 56 -5 12 23 161 -131 -113 213 -197 -145 63 38 38 108 171 -59 -71 47 -12 -172 108 56 139 158
6012A58j16m7j46K80n8O4j72N3R3jj68J89j67J46j84P5k25M23k20k34J03J23j51
$$ 158 42 -5 -151 129 71 135 -37 16 109 108 -60 129 -38 108 -76 -1 -226 197 -23 -257 -154 -31 -182
6035a82K32M2j41J37j58J51J26jj17j53J5K06l00J88J66l49L50k92PL33k03j11
$$ -182 50 92 -49 88 -70 81 207 206 89 -64 -49 157 -143 45 211 -138 212 -80 -73 260 57 -54
6057e4Kl43M62j19J36J84r9l01K51j90q6J89j25Q1m7k6L24k18jq6q2L07n1j82
$$ -54 -52 -395 67 -52 84 268 169 -132 119 -71 -157 32 -93 -12 -59 -85 239 21 20 -66 -148 159 108 -74
6081g4L6R9O9j02K5O9j28k3J7q3J8O7l4n5J89J6jk98J86J74j50l0K3j05J74k26
$$ -74 -38 61 130 28 53 122 -6 -29 -12 -95 -77 -10 -44 -99 90 106 105 -193 -7 167 17 -13 10 -95 79 -147
6107a47K23N7j3n2k59L3J60K9P9K70l69j1K59m74J85K55j84N2k43L58k57j5J45
$$ -147 76 133 120 68 -191 -158 2 31 110 380 11 0 259 -215 -30 225 41 93 -150 208 -49 -64 81
6130H1j44J28K1j27K5J35k37M02l18r1J68J2L1J6k53O0L33k65OJ38j63K07l26
$$ 81 -63 65 86 -41 -16 119 -118 284 -34 -125 43 55 86 102 -151 -91 242 -23 -17 121 -42 165 -161
6153a61nL01m33K37J64j21J39l05K18l1p2K14j85P2j75j4K63j89K85J9k36k7J88
$$ -161 -166 135 -298 -61 103 -18 121 -184 34 3 -69 145 -40 32 -143 -157 106 -83 202 221 -15 -42 146
6176A46k7J41j6k52q4K99n1k16l0k00L88j43J2p1K98l3j67n6K85k90Q1L8j72M53
$$ 146 119 260 244 -8 -92 207 156 -60 -90 -290 98 -45 -33 -104 194 161 -6 -62 223 -67 14 52 -120 333
6200C33k31r4p9K05k59J37p0K29j5l77K53J26j59J60j70J38o9L8M7k89J52J20
$$ 333 102 8 -71 134 -125 12 -58 171 156 -221 32 158 -1 159 -11 127 58 96 143 -146 6 126
6222A26j55k7K43j75p1R8j30N3kJ11k60j20L97p4r6K31k82N0J27j06K95n5l47
$$ 126 -29 -56 187 12 -59 39 -91 -38 -40 71 -189 -309 88 14 -82 149 -133 -83 44 -62 233 178 -169
6245a69K71j76k2J8j46J49K58m84L76j53r2J55J09l27K44q9J85M4l50K89J8j44
$$ -169 102 -74 -96 -78 -224 -75 183 -301 75 -78 -170 -15 94 -233 11 -78 107 151 -199 90 108 -36
6267c6P0k23K89j69k95M17k40L42j31%J27j46o6Q0m3J54K1k02k01K06M3j65K19
$$ -36 34 -189 100 -69 -364 53 -187 155 24 24 151 5 -61 19 -24 130 151 -51 -252 -46 -3 -168 51
6290E1p6K08j16k83J79O1J50m18K98N4M3l78M55k77N1k0NO0n3q1J68j86N3r5n2
$$ 51 -25 183 67 -216 -37 24 174 -244 54 108 151 -227 228 -49 2 -18 -13 47 -6 -87 81 -105 -52 -147 -199
6315a99J53J11n8J3j70m7L79k11J10k21j3L27j30j3j4j29R9n8K9R2M6q4k0j28
$$ -199 -46 65 7 20 -150 -197 182 -29 81 -140 -153 174 44 31 17 -112 -13 -71 -42 50 96 12 -8 -136
6339a36L45j07p9K04k41k8J27k35J84j05k9L21j81l4j47Q0j7L15m64J95P9j13
$$ -136 209 102 23 227 -14 -42 85 -150 34 -71 -100 221 40 6 -141 -61 -78 237 -227 -32 47 -66
6361f6J05%j0M7l9J39k62p8K90l1k68K61m5j44K1J43m3N3j76J35j54N4p4J09k0
$$ -66 39 39 29 76 37 176 -86 -164 126 95 -173 88 43 -101 -80 63 20 73 -103 32 -122 -68 -142 -33 -53
6386e3k3R3P8K6k19J52j12J17k8j36o4J24R6Qn1J53k83J71j07J49j39J16l59K48
$$ -53 -76 17 95 121 -98 54 -58 59 31 -105 -169 -45 51 59 8 161 -122 49 -58 91 -48 68 -291 -43
6410d3J11j78J02j02l7J41k17J39R3n9J69j17l4O3p1K1j68L13L8j62k2L9p0P1
$$ -43 68 -110 -8 -110 -147 -6 -223 -84 9 -50 119 2 -32 31 -40 -19 -187 126 164 2 -20 19 -51 20
6434B0m3J95j04k14J38J09m0j22J20M5O7j26l9J04r3R5Jo0K43k32k02J66No6O4
$$ 20 -23 172 68 -146 -8 101 61 -61 59 104 171 45 6 110 17 112 113 53 296 64 -138 28 33 -33 31
6459C1p2J94q1k26J93j77M0L92l93Q0J06k38L76j15l07J74L7k02M10p1k56K6J34
$$ 31 -41 153 72 -154 39 -138 -98 294 -99 -19 87 -151 225 110 -197 -23 14 -188 222 151 -105 -79 55
6482E5l5j66L04n2k57J99J4j42K11j57K6m1K09n0q2J10n6j07o2J38r8K17j84J5
$$ 55 20 -146 158 106 -151 48 62 -80 131 -26 0 -41 168 118 36 146 90 -17 -79 59 -39 178 -6 9
6506IjM4R7M5l48K04k42j34L76k4j28J83k5J62j75l4j0P5j35J03l8r1L76k01L
$$ 9 8 52 149 194 -154 50 -192 -326 50 26 -102 81 56 218 43 9 -1 74 -61 42 4 -87 289 88 91
6531I1k1j76L02k91l2K5k6M8P5o9J89J0j93K07k73J33O2j26R5M3r1Q0j51K16K0
$$ 91 70 -106 196 -95 -127 -102 -128 -80 -5 -74 115 125 -68 139 -134 -1 61 -65 30 73 -18 62 -89 127 147
6556A47l46N58k30k19K03l29K59J35j39J09k76N0P8k5J42p8j51J83j31p9J94M1
$$ 147 -199 359 129 -90 113 -216 43 178 39 148 -128 -78 0 -25 117 39 -112 71 -60 -139 55 96
6578I6r7J22j11Q0P8k10L34l21n6J97l05Q7J33j7M3J0l44N22k43q2K05j22J75
$$ 96 -1 121 10 90 168 -42 292 -29 -85 112 -193 -106 27 10 53 63 -281 241 -2 -84 121 -1 174
6601A74j92O9K16l03J79k01M4J31j64j12L33l67N2L28k58J37o6J50o3Q6k43J83
$$ 174 -18 51 267 -36 143 -58 -14 117 -47 -159 174 -193 -141 187 -71 66 0 150 87 173 -70 113
6623A13j71j6O2k40L50j45j05K11m1O9j13J05l9Q7qJ9J0j40J07m4J31k90J1J39
$$ 113 -58 -74 -12 -252 98 -47 -152 59 18 87 -26 79 40 127 119 138 148 8 115 71 202 -88 -77 62
6647F2j96r9M19n30M58l44K98J8O7j30J38m51M58k13L3K68l87rK42j38N6M5k96
$$ 62 -134 -233 186 -344 114 -230 68 86 153 23 161 -290 168 -45 -12 256 -131 -140 102 -36 20 65 -231
6670b31L05K1k82J63K3J6j28r4M05j9k54K07k01J52R3j06N0j36n2P2J3j93L60
$$ -231 74 95 -187 -24 -1 15 -113 -207 198 179 -75 132 -69 83 176 70 120 -16 -68 4 17 -176 184
6693A84k58J56q6M0K4k16J85R2l12J25K10o1q0j72L7K74j21j3R5J8n6m9k88L68
$$ 184 -74 82 -4 36 60 -156 29 121 -191 -66 144 83 3 -169 -132 142 21 8 103 121 65 16 -272 96
6717I6j60M5J17j06m1J01j23l9j8J95N9j78k3O8p1K41k86L1J17l5MJ64j32n6N0
$$ 96 -64 -19 98 -8 -49 52 -71 -110 -128 67 126 -52 -75 -7 -78 163 -123 -92 25 -10 -6 158 26 -30 20
6742B0K6k1j55K50O8m66J70J78j76M0o0K84j39j52J95j41k90K91n2K50p0Rl01
$$ 20 46 25 -130 120 188 -278 -108 70 -106 -66 -126 158 19 -133 62 -79 -369 -78 -130 120 50 59 -242
6765b42K24O2m5m0J05M1o1K8M4l52L92k49P3j2M5k8M6J31p8J03k84J84k45L35
$$ -242 -18 44 -1 -41 64 105 44 72 116 -236 156 -93 -20 -32 13 -15 31 162 84 187 -97 87 -158 177
6789A77k37L3K06p2j00p2J91j17k7j33K54j34j11K39j48q3K50j81P7P4l7r9j01
$$ 177 -60 -27 179 107 7 -65 126 9 -18 -151 103 -31 -142 97 -51 -134 116 -65 12 86 49 -50 -151
6812a51K70L7q1j60K16k94Q4jJ8K38l25J60J57k25r7J88pk28J88K14k30q5l6j3
$$ -151 119 156 75 -85 131 -163 -79 -80 -62 176 -149 11 168 -57 -154 34 27 -201 -13 201 -29 -114 -150 -163
6836a63K04%J9j49J77J53j99r6Pl5K14k56K35r4q1J31J19q3PP0j32k18J3K30m3
$$ -163 41 41 60 -89 88 241 42 -54 -47 -82 132 -124 111 17 -64 67 186 103 110 180 48 -170 -157 73 30
6861C0o5J51l83M13k31j05J47l0J35N1k07N3q7M7K67j44n1M4lQ5R1l99K95J8j85
$$ 30 -35 116 -267 146 -85 -190 -43 -73 62 113 -94 -41 -128 -81 186 42 -9 35 32 117 208 -191 104 122 -63
6886f3J07o0P9k04j00L05l9L4p3N3O5k02Q6P7k05N4J30P3k06J7k8L1RP1mj64J82
$$ -63 44 -16 63 -141 -241 64 25 59 -14 39 104 -98 -12 65 -140 -86 44 117 -89 -72 -100 -69 -60 11 7 -157 25
6913B5Q3r0m5P7j87J92pr5J45k06O2N7j41J85k6j64K60j23R1j12l1M8l6J44k01
$$ 25 108 18 -27 50 -137 55 48 -47 98 -108 -46 11 -130 55 29 -135 125 2 93 -19 -50 -2 -38 106 -95
6938i5m5K00J67l37K64j85r9K14j00L58l87R5j96K51o4Q0o0j27j49J34M5j47k1
$$ -95 -140 60 227 -110 154 -31 -130 84 -16 342 -45 50 -146 105 41 121 61 -66 -215 -81 -36 -183 -204
6961b04L72k35J8L2k4m6nj13J67J65k04Q8k9p7K16k63L32j45j09J07p0k2RJ76
$$ -204 168 -67 -49 -17 -41 -87 -92 -205 -38 127 -77 11 -18 -95 121 -142 190 45 -64 43 -27 -49 -40 136
6985A36l50K84o1M3R5k33r7N8L32q7k47K65k39K8Q4j48J2R5j62P7K5J2N2J25n1
$$ 136 -214 70 9 52 147 -86 -183 -125 207 120 -127 138 -101 -73 11 -137 -125 -30 -192 -115 -90 -78 -26 99 48
7010D8J2N0l9N4j42J04j43J17j4J14OL8m20K70j6q7J89l18J35o0j2J90j69nJ30
$$ 48 60 110 71 125 -17 87 -56 61 47 161 167 205 -215 55 39 -48 141 -177 -42 -102 -114 76 -93 -98 32
7035C2j14R0J8q0L41l90j48L22j73Q1k6M8L8J27k25K3o3J44N7k46K86k46Q5J85
$$ 32 -82 8 26 -54 287 -103 -251 71 -102 -21 -47 1 39 166 -59 -36 -99 45 102 -144 142 -104 -19 166
7059A66j80J32j28r3L2L6n3N6J07p9j30Q6j42J31M0M3p3p1K77l43L44k41L7R9
$$ 166 -14 118 -10 -103 -71 -35 -88 -32 75 -4 -134 -48 -190 -59 -19 24 -49 -120 157 -186 158 -83 -46 53
7083E3k23K99m8L1P1j51k24L89j84R7j27J81l2k4j44J81J5j42J13l37N19p0k30
$$ 53 -170 129 81 112 183 32 -192 197 13 110 -17 164 132 108 -36 145 160 18 131 -206 313 243 13
7106A3K22k04k50M68j86j65K25n0k10L22n6o4j19L6K6p3J04j3j50K41j03r8r6
$$ 13 235 31 -219 249 63 -102 123 73 -137 185 129 65 -54 -18 8 -65 39 26 -124 117 14 -84 -180
7129a80N6K12J42k72K40K6l54J55J95k79J34l16L39R0k90L73l45j7J98j96N4J78
$$ -180 -124 88 230 -42 198 224 -130 25 220 -59 75 -241 98 188 -102 271 -74 -91 107 -89 -35 143
7151A43j09j5nJ14q9o8N1J12q2j06o8K83j61%K4j05M0n9M9K1L5J02l47L07q2n9
$$ 143 34 19 14 128 39 -29 22 134 52 -54 -122 161 0 0 24 -81 -41 -100 -51 -30 5 107 -240 67 -15 -74
7177g4J99j35k3k95L47K28j98Kj0k18K95k21r1J49o1J93R7j82N8k48L8K21o2n6
$$ -74 125 -10 -33 -328 19 247 49 51 41 -177 118 -103 -194 -45 -106 87 184 2 60 -188 -150 71 9 -47
7201d7J84j85k8J67j90J91j16J2q4K39j36J68l59J89j25Q5J12p8j8j13J85p2O7
$$ -47 137 -48 -76 91 -99 92 -24 -12 -96 143 7 175 -184 5 -120 -35 77 -1 -19 -132 53 -19 48
7224D8J2K1k17j7L02j10q4N2j20R3j39P5K64l96J81J23k21N1J3K56j83k54L68
$$ 48 60 81 -136 -153 149 39 -45 7 -113 -20 -159 -84 180 -216 -35 88 -133 -82 -69 187 4 -250 118
7247A18k80K3J32j69J60J16k66L80l8k14O0L2j58Rk8K37k83K20J55l44pJ31Kp2
$$ 118 -162 -139 -7 -176 -16 100 -166 214 176 -38 22 54 -104 -95 -123 114 -169 51 206 -138 -145 -14 -12 -84
7271h4J99P9j49j00N3J74l20J32K5k4K20l06J04n7o4O8k2l9P4j65P3J37J9j1k
$$ -84 115 194 45 -55 -2 172 -148 -16 9 -15 205 -101 3 -54 -118 -50 -72 -111 -37 -202 -129 8 27 16 14
7296A4K9j48O1K11k23M4P2j54K01j37K07m80M99n7N4l63J47J10K8j79N2J30m99
$$ 14 43 -105 -44 167 -56 -12 60 -94 107 -30 177 -303 196 139 193 -170 -23 87 115 -64 -12 118 -381
7319c81L16J14m2%j28j10J94K4L6j29J40o5J23k07J85l30L06m6O0N6k02j03R8
$$ -381 -65 49 7 7 -121 -231 -37 -13 23 -106 34 -31 92 -115 70 -260 46 0 60 116 -86 -189 -91
7342i1N5j00J52n4J6j69QJ52k0J5K01O6k41j08N1J69p5k27K91j4j44j59M3K59
$$ -91 -36 -136 16 -38 -22 -191 -183 -31 -51 -36 165 231 -10 -118 -67 102 27 -200 91 77 -67 -226 -183 76
7366G6j40Rqj57J86M1p9J47j02K07j39L2j18J95j84k7Q3RO5l73L88j62O4l7p6
$$ 76 -64 -55 -63 -220 -34 7 -72 75 -27 180 41 73 -45 150 -34 -61 22 31 96 -277 111 -51 13 -24 -100
7391a00J4P1r9N3O4m%j40J42J17j33N6m1J03j73J0k5J6P8J06K6k6o0r2q9Q8M3
$$ -100 -86 -15 -114 -61 3 -1 -1 -141 1 118 -15 41 0 103 -70 -60 -85 -69 9 115 141 115 55 -37 -126 -38 5
7418EJ32j03j99K53m9j5p7P6j13R9K5K17j19r9K09k70O0J1j33P1L3k35K11j25
$$ 5 137 34 -165 88 39 24 -53 23 -90 9 34 251 132 33 242 -28 32 43 -90 -19 14 -221 -10 -135
7442a35J25p8r2J90P3k38J08j46Q6Q7o2J02R8L3q0o7J13q6l7M2j43K62j58N5j13
$$ -135 -10 -88 -180 10 83 -155 -47 -193 -107 -20 -82 20 118 151 71 4 117 31 -6 36 -107 155 -3 52 -61
7467f1o9N7P8K35k34K56l00J0R5k41K28J22q4l07M52k26k3K0R4o6R7J50j89j81
$$ -61 -130 -73 5 240 6 262 -38 -28 67 -174 54 176 92 -215 237 11 -12 8 102 36 133 283 94 -87
7491h7J82j05O0J18j27j43J97r9J60j67N3R5k07J14m1o6J24k58J86P9j37J9K42
$$ -87 95 -10 50 168 41 -102 95 -4 156 -11 42 137 -70 44 3 -63 61 -197 -11 68 -69 -50 192
7514A92m51J88P7m0L23j39r9J9q7P3K7k06J05q0Q9J92j00K2J32k89j2oO6K0j96
$$ 192 -259 -71 6 -34 289 150 51 70 -17 56 83 -123 -18 -98 -9 183 83 105 237 -52 -64 -70 -4 16 -180
7539a80O1K37k33N5K17k93M28l43J2K60k93%j00J45L85k88j92K04r9J59k22J81
$$ -180 -119 118 -115 -60 157 -136 292 -51 -39 221 -72 -72 -172 -27 358 70 -122 82 -17 142 -80 101
7561A01j87J58q7J66k6j60p1K1J94p9j79J49k33K08Q7j27J15P4k23N9L20j18l83
$$ 101 -86 72 -15 151 125 -35 -106 -85 109 30 -149 0 -233 -25 62 -65 50 124 -99 -40 280 162 -221
7584b21K07J1l7q1O1L2J12k15K37j0j41Q6m4o7l5J41p0M4Rj16J50O8m4ok18r3
$$ -221 -14 -3 -40 -121 -60 -28 84 -131 106 96 -45 41 -3 -70 -105 36 -34 10 19 -97 53 121 77 71 -147 -240
7610b40K31m0J99k15K66k08p3R6M6m5j43Q5j0K62k02J06n1l1l8j6j11J38r0J51
$$ -240 -9 -49 150 -65 201 -7 -80 16 62 17 -126 -41 -51 211 9 115 64 33 -5 -21 -132 6 -84 67
7634F7n1j39J71j21j9J95j16q9J65m6J36Q1L1k97L6N7Q3j47P8j95Q8P7K6p3J3
$$ 67 16 -123 48 -73 -92 103 -13 -102 63 17 153 234 265 -32 4 61 144 -3 75 -120 -32 45 71 -2 11
7659A1N4j4N0j02J0M3J43j07lJ8j31qm2n6k1K99k43j28M15k53N5J38k73K18o7
$$ 11 65 51 101 -1 9 52 195 88 85 103 -28 -36 -78 -134 -155 144 -99 -227 188 -65 -10 128 -145 73 6
7684Fn0J99p8Q8l02P2m4K3pK22L7j05M8k3k41K75k86L63k43K13j66k09K71k23
$$ 6 -44 155 77 165 -137 -65 -109 -86 -93 129 166 61 109 86 -155 120 -166 197 -46 167 1 -208 63 -160
7708a60p2J97M2L3J64k56OO4j75K66k25J31om5J26k74K40Lj50j38L02P3k17o3
$$ -160 -232 -35 7 40 204 -52 -46 18 -157 109 -116 15 9 -36 90 -184 56 59 -91 -229 73 146 -71 -134
7732a34N6J68k06O7N0Q8k4j68J10K0l1M1n6p4J35k2k26J67J74j22n2kl6j1J19
$$ -134 -78 90 -116 -49 1 89 65 -103 7 27 -4 37 -19 -93 42 20 -206 -39 135 13 -39 -41 -77 -88 31
7757C1M8P7j79J06k28J3J93j98J16j04N9K30j29j75J66j59J18R4j12o7J67K%k8
$$ 31 79 156 -23 83 -145 -132 61 -137 -21 -125 -66 164 35 -140 26 -133 -15 79 -33 -100 67 69 69 41
7781D1K3R0k98K50kj27K36q0k22J08J74j8k16N3J01M1k44Q2m3J10O0l20L20J61
$$ 41 64 154 -144 106 104 -23 213 133 -89 19 193 175 -41 12 113 154 -90 -8 -51 59 119 -201 119 280
7805B80l71K78l66K12r0rO1j83K15K43l02M5j7j7K5q3K7J91nj36j71P9N4J24n2
$$ 280 -91 187 -179 33 -57 -66 -5 -188 27 270 -32 13 -4 -21 4 -79 -52 139 134 -2 -173 -94 -40 84 32
7830C2p8Q2m1M5j64J70l5N6j01J31k33P3jJ22J26j91K07k72j37K56m4r3J64k55
$$ 32 -46 36 -5 40 -124 46 11 67 -34 97 -136 -63 -64 58 184 -7 200 -72 -209 47 3 -90 74 -181
7854a81K11J6n7j05J80N0N9l15L33l39J0J50j78J54O1l7l5M7L2j57R3q9K53l20
$$ -181 30 46 -11 -116 64 114 173 -142 191 -148 -138 12 -166 -12 49 12 -23 24 56 -101 -8 -97 156 -164
7878a64J80R7j51L34k31j16Lp3QJ82J6j43J62j09j20K54k8j65r8J28l1M1Q7k15
$$ -164 16 113 -38 296 65 -51 -48 -121 -113 69 85 -58 104 -5 -125 129 101 -64 -162 -34 -65 -24 63 -152
7902a52J9k2J52j71K07L9J08k01O4N9j88J43N7P5q5m2o1P4j32k6K61k88J58j20
$$ -152 -133 -155 -3 -174 33 72 180 -21 43 102 -86 57 114 189 104 62 1 75 -57 -83 178 -110 48 -72
7926g2L7J10j44J40r4Q5j20J15j32J22j72o4L79j40k6j22J08j85K23j61L46k21
$$ -72 -35 75 -69 71 -23 62 -58 57 -75 47 -125 -189 190 50 24 -98 10 -175 48 -113 233 12
7948A2j35q2M8K44k8j49K47l0j27J32j50R1q8r1O5j6k11L83j59k1K9l7N2J25j15
$$ 12 -123 -205 -157 87 59 -90 157 127 0 132 -18 73 -15 -106 -41 -57 -268 115 -44 -65 -36 -73 -21 104 -11
7973a1j53R9O9j41j78L32j01j19L12J28j65j14j44O8N8J34k46J31J07P7k36K33
$$ -11 -164 -65 4 -137 -315 17 -84 -203 109 237 72 -42 -186 -118 -60 74 -172 -41 66 143 -93 140
7995A40l70J50q5J75L5J02j62M9k6m7J78j07j89L78l48K23J03j06j27J78l22M08
$$ 140 -230 -80 -165 10 45 147 -15 34 8 -39 139 32 -157 221 -127 96 199 93 -34 144 -178 230
8017B30j66j65L36q4l73K71j59J31N6K05j38j85j24L46j62j19K8K05n7l36M24
$$ 230 64 -101 235 151 -222 49 -110 21 77 282 144 -41 -165 181 19 -100 -72 133 76 -260 164
8038A64k15J01n7Ok48M48j49k9J28j46N0j58j10L04j34O0j72n8J76lp4L02n26
$$ 164 -51 50 -7 -1 -249 199 50 21 149 3 53 -105 -215 89 -45 15 -157 -215 -39 -42 -116 186 -340
8061c40K37O6j0O7j19m8J51J5K7J83l74L25p9j56K39j64j90K36j65L18l07k5L7
$$ -340 -103 -37 -47 20 -99 -147 4 19 46 229 -145 180 101 -55 184 20 -170 66 -99 219 -88 -113 -76
8084g6J13j22K35j82j45K17n4K0J49l35Q6J05j41J95k36J44n7k7J03kK72k20l3
$$ -76 37 -85 150 -32 -177 40 -14 6 155 -180 -94 11 -130 65 -171 -27 -84 -111 -8 -10 262 42 9
8107IL1lP5j47J51r6l5M9P9j9k3n7j20K4j31K62k16R1j23L04j04n9P0Rl8j27Q5
$$ 9 40 37 112 -35 116 20 -15 34 113 94 71 14 -106 -82 -213 49 -167 -76 -199 105 1 -58 12 21 -17 -144 -59
8134e9K35j22l3j45k2P4K4o8K25j77J74l2j63M4K34j10l6l8L3o1j20K11J44k27
$$ -59 176 54 21 -124 -146 -72 -48 -116 109 -68 106 74 -89 -45 189 79 43 5 38 -23 -143 68 212 -15
8158a5o6J64k33lJ49j26M7J3L19l37J70j49l2N8n1K87l12L56j27j09K6K1j05L1
$$ -15 -81 83 -150 -153 -4 -130 -83 -70 249 -88 82 -67 -99 -41 -92 195 -117 239 112 3 29 50 -55 -24
8182b4j11J10j28Q7K08j19j86J35K0
$$ -24 -135 -25 -153 -66 142 23 -163 -28 -8
8191h
$$ Imaginary data points
##PAGE= N=2
##DATA TABLE= (X++(I..I)), XYDATA
0@%%%%%%%%%%%qJ6j6J6k4L2m0M8n6O5p3Q8j09J33j52J76k08K40k73L13l60M09
$$ 0 0 0 0 0 0 0 0 0 0 0 0 -8 8 -8 8 -16 16 -24 24 -32 33 -40 48 -61 72 -80 96 -112 128 -145 168 -192 217
33B17m63N24n91O65p45Q33r30J036j153J280j419J570j735J917k115K332k569
$$ 217 -246 278 -313 352 -393 440 -490 546 -607 673 -746 824 -911 1006 -1109 1223 -1346
50a346K829l116L435l788M181m625N126n699O361p134Q054r172J0558j2333J4702
$$ -1346 1483 -1633 1802 -1986 2195 -2430 2696 -3003 3358 -3776 4278 -4894 5664 -6669 8033
65H033j8037K3125l1925N1399j73785N5659K05791j62415N4407j1793j13609r177
$$ 8033 -10004 13121 -18804 32595 -141190 -85531 120260 -42155 12252 459 -113150 -122327
77a22327J28062K649p805J32629k9234k67632O9420J65271p6367M2187R1561j40059
$$ -122327 5735 8384 579 133208 103974 -163658 -94238 71033 -5334 36853 128414 -11645
89a1645q6120M5106K7048l572Q2009M9025j49577n2358J12791o6176q558J57068
$$ -11645 -97765 -52659 -25611 -29183 52826 101851 -47726 -100084 12707 -53469 -62027 95041
101I5041j9019j01379k4640j7281K9281N6098L5933m4011n3991N7697k7293q2647
$$ 95041 76022 -25357 -49997 -67278 -37997 18101 54034 10023 -43968 13729 -13564 -96211
113i6211R6855P4789k2804k0906o5082O014O6693r6J621n625M291J0308o5004
$$ -96211 644 75433 52629 31723 -33359 -27345 39348 39252 40873 35248 39539 49847 -15157
126a5157j5489M4706J8012J7655n7042l5819N6741l4379k1514N9283j3506m716
$$ -15157 -30646 14060 32072 49727 -7315 -43134 13607 -20772 -42286 16997 3491 -1225
138a225J6824k8838o722J8136L1290j1920k3120O5437k6452q1902P2018K1218
$$ -1225 15599 -13239 -19961 -1825 29465 17545 -5575 59862 33410 -48492 23526 44744
150D4744n5522M0210J0413l8313L208Q426k1262k1075O9754K5809j07241J5820
$$ 44744 -10778 29432 39845 1532 4740 13166 -8096 -29171 40583 66392 -40849 -25029
162b5029O0922p2369J1408N7515l6546j027J9368l7531m0333M3678P1421n3929
$$ -25029 35893 -36476 -25068 32447 -4099 -5126 14242 -23289 -63622 -19944 51477 -2452
174b452l1747O6882n2115l8184P7713p421j4183M3022k3778n0327J717M9998M615
$$ -2452 -34199 32683 -19432 -57616 20097 12676 -1507 41515 17737 -32590 -30873 19125 23740
187B3740l1834M7117j4576q1099M0366K5182k7424M1492J816m3332j1104M506
$$ 23740 -8094 39023 24447 -56652 -16286 8896 -18528 22964 24780 -18552 -29656 -25150
199b5150J2730n356K7391K9356o4919j7477L4618j8857K7807K8801k8640k140
$$ -25150 -12420 -17776 9615 38971 -25948 -43425 -8807 -27664 143 28944 304 -1836
211a836r288r073J1260R000L8719p231m3068J0302j0254P01L7888j2214l883k165
$$ -1836 -11124 -20197 -8937 63 38782 31551 -11517 -1215 -11469 -10768 27120 14906 11023 8858
225H858l1812P215J830O339K9159k1204j2780J247j7929K3623J2156j329J5637
$$ 8858 -22954 -15739 -13909 -7570 21589 385 -12395 -11148 -29077 -5454 6702 5373 21010
238B1010k6950m938J6796j6759K2110J1784k2047Q222j4014r080J5611l441J6945
$$ 21010 -5940 -10878 5918 -10841 11269 23053 1006 9228 -4786 -13866 1745 -1696 15249
251A5249p221k3581K1124j0727m572K8519j6381R50J1041k0014O051l67J225J3048
$$ 15249 8028 -15553 5571 -5156 -9728 18791 2410 3360 14401 -5613 438 71 1296 14344
265A4344k2446M013O118k2077K0214qj8047K0205o684l388J1695j0928J3507K00
$$ 14344 -8102 -4089 2029 -20048 166 158 -17889 2316 -4368 -7756 3939 -6989 6518 6718
279F718q474J8300j3958J02J7073k2581M443O228j4824J3965q007r316J0065j4872
$$ 6718 -1756 16544 2586 2688 19761 -2820 1623 7851 -6973 6992 -1015 -10331 -266 -15138
293a5138R370O624j4726J8795m906j0199J7116j2024P521J3853j5705Q833o668
$$ -15138 -5768 856 -13870 4925 19 -10180 6936 -5088 2433 16286 581 9414 2746
306B746j0555J7886j1656J282R432k0094Q505j411j1991K0675o163j305J0452
$$ 2746 -7809 10077 -1579 -297 9135 -10959 -2454 -3865 -15856 4819 -1344 -2649 7803
319G803j8809R340P476q206J7168r160o714J1064j7424P319P534j3466J3805r206
$$ 7803 -11006 -1666 5810 -2396 14772 5612 -1102 9962 -7462 -143 7391 -6075 7730 -1476
333a476j3033J3696r522P394R495j4392J0831m309p280J7613j0047N239J1200
$$ -1476 -14509 -813 -10335 -2941 6554 -7838 2993 -1316 -8596 9017 -1030 4209 15409
346A5409j9593P245l13j0948J6609p644m548O526j5258Q476J367p828J8215j0731
$$ 15409 -4184 3061 2748 -8200 8409 765 -3783 2743 -12515 -4039 -2672 -10500 7715 -3016
360c016l849J5066j6315P432J2449j2489J0207m164p416Q603q892R404j7j6594
$$ -3016 -6865 8201 -8114 -682 11767 -722 9485 5321 -2095 6508 -2384 7020 7003 -9591
374i591J7428q398j4177K1214j0020k780J3967j3248R83L018J992P962j4649J0234
$$ -9591 7837 -561 -14738 6476 -3544 -6324 7643 -5605 -4622 -1604 388 8350 -6299 3935
388C935Q731k3948J5416N843j9148J8905j522j5938R211P20K311n597J64J6375
$$ 3935 12666 -11282 4134 9977 -9171 9734 8212 -7726 1485 2205 4516 -1081 -917 15458
402A5458k0168j486K1402k0665N494J7069k2800L540R672q758p57q73J2333o582
$$ 15458 -4710 -6196 15206 -5459 35 17104 -5696 -2156 7516 -1242 -1999 -2872 9461 2879
416B879j7302K0336o269j1122K4104j3655q304J9600j2216n030P297L845O492
$$ 2879 -14423 5913 -356 -11478 12626 -1029 -9333 10267 -1949 -6979 318 4163 10655
429A0655j5246J754R249j4673J2939J599j5176J9859p485j6317J3470k892M944
$$ 10655 -4591 -2837 6412 -8261 4678 6277 -8899 10960 3475 -12842 628 -2264 2680
442B680K648j4374P544k022m835M985p280J4639P24k4242J4857Q77r548K1193
$$ 2680 5328 -9046 -1502 -3524 -8359 -3374 -10654 3985 4709 -19533 -4676 -3799 -13347 7846
456G846r750p954J7485r216r826N129J5851M307k4471J0115R586k7166J9154R795
$$ 7846 -1904 -9858 7627 -1589 -11415 -6286 9565 13872 -10599 -484 9102 -18064 1090 10885
470A0885k7145K1404Q048l3951J274K4048L714k0873O959K0992l0757J33L0613
$$ 10885 -16260 5144 13192 -20759 -19485 4563 8277 -12596 -5637 15355 -15402 -15269 15344
483A5344k9297P463L6721l6760j9090L1979L335k1904N162K8877k0114k2881L2733
$$ 15344 -13953 -6490 30231 -6529 -25619 6360 9695 -12209 -7047 21830 1716 -21165 11568
496A1568j4410j7471N0147j2810m0025L1643J0568k9719J633L1537j833l0639
$$ 11568 -2842 -20313 29834 17024 -23001 8642 19210 -10509 -8876 22661 20828 -9811
508i811J5345L509l3377L3033J6925m5222J8072K3925l5782q715K7751J1743j6679
$$ -9811 5534 9043 -24334 8699 25624 -19598 -1526 22399 -13383 -22098 5653 17396 717
521G17l96J4295k3915M011K9449k7065K212L4300k7025k1804J5532R297q43p249
$$ 717 321 14616 -9299 -5288 24161 -2904 -692 33608 6583 -15221 311 9608 8765 1516
535A516O386k380j5149J1336n971o021L0408p704k2105P515k056O973K299q608
$$ 1516 7902 5522 -9627 1709 -4262 -10283 20125 12421 -9684 -2169 -4225 2748 5047 -3561
549c561J4946k765j6871r53p23J4539L702j1689N756j0703j167J5223j8725J0432
$$ -3561 11385 8620 -8251 -9204 -9927 4612 8314 -3375 2381 -8322 -9489 5734 -12991 -2559
563b559K8906k5713j5562J3944L273k757J067J1632j0399j3843J9294j8550j5180
$$ -2559 26347 634 -14928 -984 2289 -468 599 12231 1832 -12011 7283 -11267 -26447
576b6447M6407p433l8605K0940Q515k1221L452K1253k001j7222J8325l182l6047
$$ -26447 19960 12527 -26078 -5138 3377 -17844 -14392 6861 4860 -12362 5963 2781 -33266
589c3266L6490K4622m5795J1253K8464l1448j0978K4704M602j6073J0513J2066
$$ -33266 3224 27846 -17949 -6696 21768 -9680 -20658 4046 8648 -7425 3088 15154
601A5154l7257N330M1820l2709j0666M4135j9120k8857K0669Q330j1693L636J7571
$$ 15154 -22103 -16773 25047 -7662 -18328 25807 6687 -22170 -1501 6829 -4864 -1228 16343
614A6343j8399j9326L2971q477k9419L8651P351l5394R709J1148j0158J002J2923
$$ 16343 -2056 -21382 11589 3112 -26307 12344 19695 -15699 -5990 5158 -5000 -3998 8925
627H925J903j8108J0288R894k9154J4706K6664k5780l019J2439j0429j677L407
$$ 8925 10828 -7280 3008 12902 -16252 -1546 25118 -662 -3681 8758 -1671 -3348 59
640E9O679k024p087R469j1821q938K3690m913j0179J0750o104j882j060j623J3499
$$ 59 6738 4714 -2373 7096 -4725 -13663 10027 5114 -5065 5685 -419 -2301 -3361 -4984 8515
655H515n281m105O429j3016M347J0293p716M790j03k284K50j1862J3192Q517j6638
$$ 8515 3234 -871 5558 -7458 -3111 7182 -534 4256 4153 1869 2119 -9743 3449 11966 -4672
670d672R500P03j5067R448K219l051K592o65L058j3740M50K0415j5144k210J7626
$$ -4672 4828 5531 -9536 -88 2131 -920 1672 1007 4065 -9675 -9225 11190 -3954 -6164 11462
685A1462j6955m210J2594m748L31L766L217o962j0864J8424j482j5182K0922k719
$$ 11462 -5493 -9703 2891 -1857 -1526 2240 5457 -1505 -12369 6055 4573 -10609 10313 7594
699G594j8741J3303N78o045O516K714j376j1389M707J0456j6593P911J3250k0707
$$ 7594 -11147 2156 2734 -3311 3205 5919 4543 -6846 -2139 8317 -8276 -365 12885 -7822
713g822K649Q634j0153M536M544m65l532n657J0834n061o220J8688q333q882J2737
$$ -7822 -5173 3461 -6692 -2156 2388 1923 -1609 -7266 3568 -1493 -7713 10975 2642 -6240 6497
728F497p410j646P741k790K039n651P30N427j1551Q574N863j3879P713O50q502
$$ 6497 -913 -2559 5182 2392 4431 -1220 -490 4937 -6614 1960 7823 -6056 1657 2307 -6195
743f195P902k426Q68J991o907P369l627n290J2029p598k176Q630q636K986K262
$$ -6195 1707 -719 149 2140 -4767 2602 -1025 -6315 5714 -1884 -4060 4570 -4066 -1080 1182
758A182m976P245n314j28P327r592N461L456r205P877j525l577O406o817K675
$$ 1182 -3794 3451 -1863 -1991 5336 -4256 1205 4661 -4544 3333 1808 -1769 4637 -2180 495
773D95J674p787Q757k659n751Q796p775m64N896o245O139p98m661O811p396K255
$$ 495 2169 -5618 3139 480 -5271 3525 -4250 -4714 1182 -5063 1076 278 -4383 2428 -4968 -2713
789b713P752q486O271J066q736O961k466m87O808p269L862j186q108R848k834
$$ -2713 5039 -3447 2824 3890 -4846 2115 -351 -838 5970 -1299 2563 1377 -6731 3117 283
804B83k158Q675r160k18L345o269P548o35k532N094r442K290N180p266R412o5
$$ 283 -1875 6800 -2360 -2578 767 -5502 2046 1411 -1121 3973 -5469 -3179 2001 -5265 4147 4082
820D082q387O525n599J96P968m629M283j864o470O759n204K098R168r740K505
$$ 4082 -4305 2220 -3379 -3183 4785 156 4439 2575 -3895 2864 -2340 -242 8926 -814 1691
835A691P50q921Q060Lk240N527p229M33K45m875J0457l151l683P608r954N03P819
$$ 1691 2441 -6480 1580 1583 -657 4870 -2359 -1926 -1681 -6556 3901 750 -2933 4675 -5279 -4776 3043
852C043o732O319J238o275L577m686L567M562o609P112k651q027R739n416j367
$$ 3043 -3689 2630 3868 -2407 1170 -3516 51 4613 -1996 5116 2465 -5562 4177 -1239 -2606
867b606R641p855l21J848m409N503l430N41M816q836N122J048q571J1521j919
$$ -2606 7035 -820 -1141 707 -3702 1801 -1629 -1088 3728 -5108 14 1062 -7509 4012 2093
882B093p337Q531l890j278M279l903M143j939n63M693q742N708N395j3123P808
$$ 2093 -5244 3287 -603 -1881 2398 -1505 2638 699 136 4829 -3913 1795 7190 -5933 1875
897A875M425j0142O838q97m589L568j443K371l838J79Q815j3249R9J3906j1962
$$ 1875 6300 -3842 2996 2099 -2490 1078 -365 2006 -1832 -1653 7162 -6087 -5988 7918 -4044
912d044J662R314j0641J395M578k631k6Q99P554p749q668J5811n265q305J6428
$$ -4044 -2382 6932 -3709 -2314 2264 -367 -393 506 8060 311 -8357 7454 2189 -6116 10312
927A0312p604p841R896n423l312N071M843k695j1472Q864L237j4220J2859M471
$$ 10312 2708 -5133 4763 -660 -3972 1099 5942 3247 -8225 639 3876 -10344 2515 6986
941F986j4262Q809r01j0367Q118N414j258n755O42O815j1220K124J3795j0809
$$ 6986 -7276 1533 632 -9735 -1617 3797 2539 -3216 -2574 4241 -6979 -4855 8940 -1869
955a869K621N598j4454M324Q202l745J181j692J840l462p487J0237l66k586P353
$$ -1869 752 6350 -8104 -3780 4422 677 1858 166 2006 -1456 -8943 1294 928 -1658 5695
970E695j1763k080R639p222L861N283m814K277n587k068P443R9M243m516m608
$$ 5695 -6068 -8148 1491 -5731 -1870 3413 -1401 876 -4711 -6779 664 763 5006 490 -4118
985d118Q630q842j523J3984p232j68M889j2588J712Q745q55k246j475P023p560
$$ -4118 4512 -4330 -5853 8131 899 731 5620 -6968 -5256 3489 2634 388 -1087 5936 -1624
1000a624j0052J6658k130q070J4900r536j1819J3920K81p555M471Q534m716j4543
$$ -1624 -11676 4982 2852 -5218 9682 146 -11673 2247 2528 -5027 -556 7978 3262 -11281
1014a1281J1756N952j4838J4911N700k1071J0245P635j4693L325J3234k100j3782
$$ -11281 475 6427 -8411 6500 12200 -8871 1374 9009 -5684 -2359 10875 8775 -5007
1027e007L559J0409j6069L311J8139j8529j333J6342j6703n610J6900J105r724
$$ -5007 -1448 8961 -7108 -3797 14342 -4187 -5520 10822 -5881 -11491 5409 6514 -3210
1040c210j25J0317q532q906J8732m484j0800J8111p375j5289J3728L917p159K21
$$ -3210 -3335 6982 -1550 -10456 8276 3792 -7008 11103 3728 -11561 2167 6084 -1075 -854
1054h54O015k28j2510O008P378j1590R491N425j6489N357N545p123K257K685K869
$$ -854 5161 4933 -7577 -1569 5809 -5781 3710 9135 -7354 -1997 3548 -3575 -1318 1367 4236
1069D236m396o755P216k987j450R625p230j639N528p134K607K245J27O599p938
$$ 4236 -160 -6915 301 -2686 -4136 5489 -1741 -3380 2148 -4986 -2379 -134 -7 6592 -1346
1084a346k524P191n428J984L636k314K323n542J2L042o514R601Q86j3121R147
$$ -1346 -3870 3321 -2107 -123 3513 1199 3522 -2020 -2008 1034 -5480 4121 5007 -8114 1033
1099A033J137r872N656M370j239l150n7M472q766L362J2517j4266J163J3185j3772
$$ 1033 2170 -7702 -2046 2324 1085 -2065 -2122 2350 -6416 -3054 9463 -4803 -3640 9545 -4227
1114d227k446J1395j985l697J004N028o374n714J4851n656j0258J7234n287j3744
$$ -4227 -6673 4722 2737 -960 44 5072 -1302 -7016 7835 2179 -8079 9155 3868 -9876
1128i876J1937K046p324J881M895j887r143P874M857j4406J0093Q180j7241N014
$$ -9876 2061 4107 -3217 -1336 3559 1672 -7471 403 5260 -9146 947 9127 -8114 -3100
1142c100R005r271N40N360J030n797o32R156q747k559J4483r962n414J2156o139
$$ -3100 5905 -3366 -2826 2534 3564 -2233 -2865 6291 -2456 -5015 9468 -494 -5908 6248 109
1157A09l981N295N32r40m420M842J040r684R148J988j0971Q262P98o786L684K14
$$ 109 -3872 1423 1955 1015 -3405 1437 2477 -7207 1941 3929 -7042 1220 2018 -4768 -1084 -870
1173h70J229j380k241O448n587j732R326o759k84O555n935J085J005p88L151n349
$$ -870 359 -1021 -3262 3186 -2401 -4133 5193 -1566 -1850 4705 -1230 -145 860 72 3223 -2126
1189b126K856K942q621N565J975o783N505p34k485K072k326M142j768l606Q341
$$ -2126 730 3672 -4949 616 2591 -4192 1313 579 -1906 166 -2160 1982 214 -3392 4949
1204D949n601l258Q716n486o40M472l794Q25j359J098L152o652N052K902r218
$$ 4949 -652 -3910 4806 -680 -1320 3152 -642 183 -1176 -78 3074 -3578 1474 4376 -4842
1219d842O715J461n767N394o43j677Q07k257M113l024k375P541p069j772P359
$$ -4842 1873 3334 -2433 2961 2318 641 1448 -809 3304 280 -2095 5446 -1623 -3395 3964
1234C964o569O00M361l936J576j529J333K275n060N859Q21p413P020q46m848O060
$$ 3964 -2605 -2005 2356 -1580 -4 -1533 -200 2075 -2985 2874 3695 -3718 3302 2456 -2392 3668
1250C668k457j134J192l013L456l049j022O196o593P34N021o763L091K567l799
$$ 3668 1211 77 1269 -1744 1712 -1337 -2359 3837 -2756 -2022 2999 -3764 -673 1894 -1905
1265a905L498k325K63K062m514M398j49n021N759l216k243N144m094J237K108
$$ -1905 1593 -732 -469 1593 -2921 1477 1328 -3693 2066 -1150 -3393 1751 -2343 -1106 1002
1280A002m033M236k350r60N147n077K230K361n087M556j136l023M835m381N37
$$ 1002 -3031 1205 -1145 -2105 3042 -2035 195 2556 -2531 2025 889 -2134 2701 -1680 -1143
1295a143K942n369L714j92l469M532l047J41L529m758L974K02m179N759k714j498
$$ -1143 1799 -3570 144 -48 -3517 1015 -2032 -1891 1638 -3120 854 1056 -3123 2636 -78 -1576
1311a576M877m456J143J583l329L764k491n58L524n526K897K069n466N351n05
$$ -1576 3301 -1155 -12 1571 -1758 2006 -485 -1043 2481 -3045 -148 1921 -3545 1806 1301
1326A301m186M588k225j32K373k827K997j816k232M862m735J296M807o865K488
$$ 1301 -2885 1703 -522 -654 1719 -1108 1889 73 -2159 2703 -2032 -736 4071 -2794 -306
1341c06K185m666L654l93n33J997l598K813p21k940O754l968k400N918n408p5
$$ -306 1879 -2787 867 474 -59 1938 -1660 1153 432 -2508 4246 278 -2122 3796 -1612 -1687
1357a687M136l404K038o14j797J896l423L702J372n732O118j466n573O468j852
$$ -1687 2449 -955 1083 469 -1328 568 -2855 847 2219 -3513 2605 1139 -4434 2034 182
1372A82j737M269l080N2P9p48L250l849K315L079p541L877K107n521N516j56m160
$$ 182 -1555 2714 -366 -314 -235 -983 2267 -1582 733 3812 -3729 148 2255 -3266 2250 2094 -2066
1389b066L114j644K60jj009M484m527j128N158n702K564M448o428L088J724m419
$$ -2066 1048 -596 -336 -337 -1346 3138 -1389 -2517 2641 -3061 -497 3951 -2477 611 2335 -2084
1405b084K300L29J032L26l196L473k961j790O765n459n04O494o909l70M392l058
$$ -2084 216 545 1577 1903 -1293 2180 -781 -2571 4194 -1265 -1769 4725 -2184 -2554 1838 -1220
1421a220J542L36J17n03k651M702k092l845Q552l874n746P780l074k982N217j860
$$ -1220 322 658 775 272 -2379 2323 231 -3614 4938 1064 -4682 3098 24 -2958 2259 399
1437C99r06k93J682m18m689P159J349r389P240J700q612O253J739m807J967J161
$$ 399 -507 -800 882 464 -4225 2934 4283 -5106 2134 3834 -4778 1475 3214 -1593 374 1535
1453A535j506l791L190M481q369K419P250j0120J645O864o493J558M561l039j896
$$ 1535 29 -3762 -572 3909 -4460 -2041 5209 -4911 -3266 3598 -2895 -1337 3224 185 -1711
1468a711Q85M205m278k238R084n615m963Q502m856k850O909k804k367J689P58
$$ -1711 -826 3379 -899 -3137 5947 332 -4631 3871 -985 -3835 3074 270 -2097 -408 350
1483C50j003l310N548J486o864N361M4o204O483p36l603M343j347j472o04m11
$$ 350 -653 -3963 1585 3071 -3793 1568 1612 -4592 1891 1155 -2448 1895 548 -924 -1528 -1939
1499a939L807k811J01L338m990J921J857m428N618N04l903L215k747m87L049k223
$$ -1939 1868 -943 -842 2496 -2494 -573 1284 -3144 2474 2978 -925 2290 -457 -944 2105 -118
1515a18J608n47j204P81m547L759L039o200M532O05o931M882J335l073L478J139
$$ -118 1490 943 -261 520 -4027 -268 2771 -3429 1103 1708 -5223 -341 994 -2079 1399 2538
1531B538j413l813J708N152o020J917O749r540K27O314o561J113N842k524m080
$$ 2538 1125 -2688 -980 4172 -1848 69 6818 -2722 -2495 3819 -2742 -1629 4213 1689 -2391
1546b391N77L986l999j938J0089n178o240Q944m402n131Q860k50n067J133K515
$$ -2391 -1814 2172 -1827 -3765 6324 1146 -5094 3850 -552 -5683 3177 2927 -2140 -1007 1508
1561A508k309m684P411K338q997O373J644r639O142M808n534J123K717j614m312
$$ 1508 -801 -5485 1926 4264 -4733 1640 3284 -6355 -213 4595 -939 184 2901 1287 -3025
1576c025J790N922n892j58O869q656r20P289m815k89L661j285k230j570M191j48
$$ -3025 -1235 4687 -1205 -1363 5506 -3150 -4070 3219 -1596 -1885 1776 491 -1739 -3309 882 734
1592G34l867O220j636n648N819j066k588M283j063l32j050r18L690l327O93L922
$$ 734 -3133 3087 1451 -4197 1622 556 -2032 2251 1188 856 -194 -1112 2578 -749 -56 3866
1608C866m980P75J988l321K640l43m71J550l971K191J567m483L779P60l440K045
$$ 3866 -1114 -339 1649 -1672 968 625 154 1704 -2267 -76 1491 -2992 787 1547 -1893 152
1624A52r09N46O92j635L520k347k219N730l857j531N382l114j314J954n23J96
$$ 152 -757 -211 481 -1154 2366 19 -2200 3530 -327 -1858 3524 410 -904 1050 527 723
1640G23j763K454O08n513M801J294o376N123P27m948K491Q20q83p55L63L009m822
$$ 723 -1040 1414 2022 -3491 1310 2604 -3772 1351 2078 -2870 -379 441 -442 -1197 -834 2175 -2647
1657b647J67N897n999L75N646n326k30L365j231k91j24K756j537l905N772j255
$$ -2647 -2480 3417 -2582 -2207 3439 -1887 -2117 1248 17 -274 -398 2358 821 -3084 2688 1433
1673A433m769O369j400m636L598l44j742M03M57J647l956J142L429n268K587L694
$$ 1433 -3336 3033 1633 -3003 595 251 -1491 -1088 -631 1016 -2940 -1798 1631 -3637 -1050 2644
1689B644n034J593J934k260R89j67J626o15k674M036j846k775N266k571j622L196
$$ 2644 -2390 -797 1137 -1123 -134 -301 1325 710 -1964 2072 226 -2549 2717 146 -1476 1720
1705A720k120J08M60m78K400l035P43K607m371K054J721l352K090l30j229J239
$$ 1720 -400 -292 168 -310 2090 -945 -202 2405 -1966 88 1809 -1543 547 217 -1012 227
1721B27j868J945J79k869M200j691j981L894k035n1J981j816J579j002p52K934
$$ 227 -1641 304 483 -2386 1814 123 -1858 2036 1 -50 1931 115 1694 692 -60 2874
1737B874l241P96K479m378J821R77k848J990q70kJ025k399K537l05k624L862j367
$$ 2874 -367 429 2908 -1470 351 1328 -1520 470 -400 -402 623 -1776 761 456 -2168 1694 327
1754C27k012L466j882k85J385j272J740j601j38K466l787J716K226m313K553R44
$$ 327 -1685 1781 -101 -386 999 -273 1467 -134 -272 2194 -1593 123 2349 -1964 589 1533
1770A533k872K301q54M6O50j901K561j564j876L900k820q94L462l363O15J384
$$ 1533 -1339 962 108 154 804 -1097 1464 -100 -1976 1924 -896 -1790 1672 -1691 -1076 308
1786C08j859J411j028N20J508k711K082Q37l234L740p66k183L273j881j67J470
$$ 308 -1551 -140 -1168 -648 860 -1851 231 1068 -2166 1574 808 -1375 1898 17 -150 1320
1802A320j678J384j049j019K337k686P57J918l622K496J87k630K880j167n54J899
$$ 1320 -358 1026 -23 -1042 1295 -1391 -634 1284 -2338 158 345 -2285 595 -572 -1126 773
1818G73j817R72Oj051K410k072K65K407l395J648J627l377K716j89j771J917j390
$$ 773 -1044 -72 -66 -1117 1293 -779 -514 1893 -1502 146 1773 -1604 1112 923 -848 1069 -321
1835c21P76J29j498K730k163r06L419l563K63L012l550J199J316k061J232n72
$$ -321 455 584 -914 1816 -347 -1253 2166 -1397 -1134 1878 -1672 -473 843 -1218 14 -558
1851e58M90O18k234K807p52k472M229k134j629M000k449l77J738j297M52p33N05
$$ -558 -68 550 -1684 1123 371 -2101 2128 -6 -1635 2365 -84 -461 1277 -20 432 -301 204
1868B04J604l485K674M62l999L735k58l393L481q92j447J199n88Q61j297L49K391
$$ 204 1808 -1677 997 1459 -2540 1195 937 -2456 1025 133 -1314 -115 -703 158 -1139 -790 1601
1885A601l734J775K577m405K529J744l626K073M58j142P84o78J466j394j272L536
$$ 1601 -2133 -358 2219 -2186 343 2087 -1539 534 992 -150 634 -44 1422 28 -1244 2292
1901B292l377n56M159l787N2K891k715K91R63p78N51j294K316m53k675L811j421
$$ 2292 -1085 -1641 2518 -1269 -1217 1674 -1041 -750 213 -565 -14 -1308 1008 555 -2120 1691 270
1918B70k400M173j785j760K916j724j52J040m48R53k027J465J200l419K748O18
$$ 270 -2130 2043 258 -1502 1414 -310 -462 578 130 1083 -944 521 1721 -1698 1050 1668
1934A668l767L682q27k371K563j002n47O09m22P62j752N69K090l402K076J902
$$ 1668 -2099 1583 756 -1615 948 -54 -601 8 -414 348 -1404 -835 1255 -2147 -71 1831
1950A831m325K732J177l300K460P91j151K52n21J186j622J11L125l967L11L764
$$ 1831 -2494 238 1415 -1885 575 1366 215 467 -54 1132 -490 -379 2746 -1221 -910 2854
1966B854m781O16L242k911L93P57k97o91n36K940j766k066M805k940k780N371
$$ 2854 -1927 -1311 1931 -980 -587 170 -127 -818 -1354 1586 -180 -2246 2559 -381 -3161 2210
1982B210k060k062L485j197j250L24J146R2k375L390K30n003M170Q21m391L549
$$ 2210 150 -1912 1573 376 -874 -550 596 688 -1687 1703 1933 -3070 1100 1921 -2470 1079
1998A079Q51k904J184K98k20j400R29K214m084R65L360m905J610L032l524J154
$$ 1079 1930 -974 210 508 288 -1112 -183 2031 -2053 -1088 2272 -2633 -1023 2009 -1515 -361
2014c61J061j247M48k47J690p42k023L573k112j608L684j963p57K206k071L90
$$ -361 700 -547 -99 -346 1344 602 -1421 2152 40 -1568 2116 153 -604 1602 -469 -79
2030g9K06r53J781j670O57J089k866J888M45j877K621j492p28J955k145R08J093
$$ -79 127 -826 955 -715 -58 1031 -1835 53 498 -1379 1242 -250 -978 977 -1168 -260 833
2047H33j935J354k1r77J382j184J164J3j856K842j406j896L844k337r48K616j935
$$ 833 -1102 252 231 -746 636 -548 616 629 -1227 1615 209 -1687 2157 -180 -1128 1488 -447
2064d47l24P70j13L99j865K015P40l998L349P97l875L097J56k383J598L73L3r76
$$ -447 -771 -1 -114 285 -1580 435 1175 -2823 526 1323 -2552 545 701 -1682 -84 289 322 -654
2082f54K74K305l371P19L526l975K99L629l725J71J964r16M5p69J730j161k409
$$ -654 -380 1925 -1446 -727 2799 -1176 -877 2752 -973 -802 1162 246 291 -478 1252 91 -2318
2099b318M202j502k869M306j519k518K809k44p37M32K42P07k741J629K072l820
$$ -2318 1884 382 -2487 1819 300 -2218 591 347 -390 42 284 991 -1750 -121 1951 -1869
2115a869K688J409l599J784P17j492Q64k39R33r16j485K958j920j239L517k289
$$ -1869 819 2228 -1371 413 1130 -362 502 263 1196 280 -1205 1753 -167 -1406 2111 -178
2131a78n18J794j995M44N06l92J443k081O82J184k680K163Q58k410K023p15p88
$$ -178 -696 1098 -897 -453 53 -339 1104 -977 -295 889 -1791 372 1230 -1180 843 128 -660
2148f60J168j251J531K5j775K355j235j572K910j556K2R22j602J025j188N2J950
$$ -660 508 -743 788 813 -962 1393 158 -1414 1496 -60 -38 884 -718 307 -881 -829 1121
2165A121k223Q24J352k931J381Q20j713J917q32J61n9j515K473n69j507L275k013
$$ 1121 -1102 -278 1074 -1857 -476 344 -1369 548 -284 -123 -182 -1697 776 207 -1300 1975 -38
2182c8j394K297j477K05J288o59N80j729M68J664l051K386R94l236J889K05j960
$$ -38 -1432 865 -612 -407 881 222 802 -927 -459 1205 -1846 540 1534 -1702 187 392 -1568
2199a568J627k63M11k38j226J818j383p67L532k269m81K134k321N37Q94n50J190
$$ -1568 59 -204 207 -31 -1257 561 -822 -1589 1943 -326 -807 1327 -994 -457 437 -113 1077
2216A077j426Q78M45k564K329N72k319K428p55j881J586q70N63M88r83J183j563
$$ 1077 -349 529 974 -1590 739 1311 -1008 1420 665 -1216 370 -500 63 551 -432 751 -812
2233h12l18K237j925O98J195k089J262N3j000J706j239N54P69k037J668Kj357
$$ -812 -1130 1107 -818 -120 1075 -1014 248 301 -699 1007 -232 322 1091 -946 722 724 -633
2250f33J983j045n33J201j767J157N12j841K135j306o78J546j559O78O06j409
$$ -633 1350 305 -228 973 -794 363 875 -966 1169 -137 -815 731 -828 -150 456 -953
2266i53J413q41m19J642j643P59J026k264J618J14j186J666j014K16O35j591J723
$$ -953 460 -381 -800 842 -801 -42 984 -1280 338 452 -734 932 -82 134 769 -822 901
2283I01q13q32K397j986n31K209k062M14R05j122Q65q73O8J023j954J646L53k402
$$ 901 88 -744 1653 -333 -864 1345 -717 -303 602 -520 345 -528 -460 563 -1391 255 608 -1794
2301a794K465p34j072J951j004k05O79q30J381j198N9J796k418P09J524k290J412
$$ -1794 671 -63 -1135 816 -188 -393 286 -544 837 -361 -302 1494 -924 -215 1309 -981 431
2318D31L93j842J571n92j89M98p27J002n53j252K171j684k54K339k390P08J038
$$ 431 824 -1018 553 -39 -228 270 -457 545 -8 -1260 911 -773 -1027 1312 -1078 -370 668
2335F68j603Q38K98l35Q34j267J113j76j468K209p73j346K690j846m04J506j387
$$ 668 -935 -97 201 -134 700 -567 546 370 -1098 1111 338 -1008 1682 -164 -568 938 -449
2352d49P91L2n08P64j436P75P16j972J681L62k469K292o93j050K002j095r3L11
$$ -449 342 374 -134 630 -806 -31 685 -1287 394 756 -1713 579 -114 -1164 838 -257 -350 -39
2370c9m57J087j113N43J360k379J300J038k387J614K55j480J286n10N3j87l72
$$ -39 -496 591 -522 21 1381 -998 302 1340 -1047 567 822 -658 628 118 171 -16 -388
2387c88J311j292l68K331k537K48J821k302P90J277j516M80k3J70k9p83J791r26
$$ -388 923 -369 -737 1594 -943 -695 1126 -1176 -386 891 -625 -145 -168 2 -27 -810 981 55
2405E5j211K571j424j002K589k002K9J491j046j4k28J80N94j381J274K45k338
$$ 55 -1156 1415 -9 -1011 1578 -424 -395 1096 50 36 -192 -12 582 -799 475 720 -1618
2422a618K227k05j779K054m53j083J122m27O9n73L89J399j949N42J142k356J675
$$ -1618 609 404 -1375 679 226 -857 265 -162 -93 -666 -277 1122 -827 -285 857 -1499 176
2439A76J058k056J032K64j029R46l63N37m92p23J816j742l49K289j847R5J650
$$ 176 1234 -822 210 474 -555 391 28 565 73 -650 1166 -576 -925 1364 -483 -388 1262
2456A262k262Q49M62p94O23n69N61Rj581K072o29r95K228j437n98J518j294L12
$$ 1262 -1000 -151 311 -483 140 -429 132 141 -1440 632 3 -992 1236 -201 -799 719 -575 -263
2474b63J197q86M42p09K58M89j489J629o1j717K030q65j285K190j223k44O72n14
$$ -263 934 48 490 -219 39 528 -961 668 607 -1110 920 55 -1230 960 -263 -507 165 -349
$$ [...]
8191b9
##END NTUPLES=NMR FID
##END=
