##TITLE=1H_83-2021
 CDCl3, 8 sc, 
 24.08.2021
##JCAMPDX= 6.0         $$ Bruker NMR JCAMP-DX V2.0
##DATA TYPE= NMR FID
##DATA CLASS= NTUPLES
##ORIGIN= UXNMR, Bruker Analytische Messtechnik GmbH
##OWNER= root
$$ XWIN-NMR		Version 3.5
$$ Tue Aug 24 10:27:36 2021 Russian Standard Time (UT+4h)  she@DPX200
##.OBSERVE FREQUENCY= 200.131506
##.OBSERVE NUCLEUS= ^1H
##.DELAY= (6, 6)
##.ACQUISITION MODE= SIMULTANEOUS
##.ACQUISITION SCHEME= undefined
##.AVERAGES= 8
##.DIGITISER RES= 18
##SPECTROMETER/DATA SYSTEM= spect
##.PULSE SEQUENCE= zg30
##.SOLVENT NAME= D2O
##.SHIFT REFERENCE= (INTERNAL, D2O, 0, 15.7039)
##AUDIT TRAIL= $$ (NUMBER, WHEN, WHO, WHERE, WHAT)
$$ ##TITLE= Audit trail, XWIN-NMR		Version 3.5
$$ ##JCAMPDX= 5.01
$$ ##ORIGIN= Bruker BioSpin GmbH
$$ ##OWNER= she
$$ F:/spectra/data/she/nmr/H-F/1/audita.txt
$$ ##AUDIT TRAIL=  $$ (NUMBER, WHEN, WHO, WHERE, WHAT)
(   1,<2021-08-24 10:25:56.48 +0400>,<she>,<DPX200>,
      <created by zg, POWCHK disabled, PULCHK disabled
       configuration hash MD5:
       00 E9 B6 7A A2 85 ED C7 34 08 36 98 17 FE 4E 26
       data hash MD5: 16K
       18 98 C0 55 13 3A A5 B2 31 AF 7A C6 8B 1C C6 F1>)
$$ ##END=
$$ 
$$ hash MD5
$$ 97 75 B1 FB F6 58 21 F4 17 4B 6D E6 8B BB 61 7D
##$RELAX= 
##$RELAX= 
##$RELAX= 
##$RELAX= 
##$RELAX= 
##$RELAX= 
$$ Bruker specific parameters
$$ --------------------------
##$DU= <F:/spectra>
##$EXPNO= 1
##$NAME= <H-F>
##$PROCNO= 1
##$TYPE= <nmr>
##$USER= <she>
##$AMP= (0..31)
100 100 100 100 100 100 100 100 100 100 100 100 100 100 100 100 100 100 
100 100 100 100 100 100 100 100 100 100 100 100 100 100 
##$AQSEQ= 0
##$AQ_mod= 1
##$AUNM= <au_zg>
##$AUTOPOS= <>
##$BF1= 200.13
##$BF2= 200.13
##$BF3= 200.13
##$BF4= 200.13
##$BF5= 200.13
##$BF6= 200.13
##$BF7= 200.13
##$BF8= 200.13
##$BYTORDA= 1
##$CFDGTYP= 0
##$CFRGTYP= 5
##$CHEMSTR= <none>
##$CNST= (0..31)
1 1 145 1 1 1 1 1 1 1 1 1 1 1 1 1 1 1 1 1 1 1 1 1 1 1 1 1 1 1 1 1 
##$CPDPRG= <>
##$CPDPRG1= <>
##$CPDPRG2= <>
##$CPDPRG3= <>
##$CPDPRG4= <mlev>
##$CPDPRG5= <mlev>
##$CPDPRG6= <mlev>
##$CPDPRG7= <mlev>
##$CPDPRG8= <mlev>
##$CPDPRGB= <>
##$CPDPRGT= <>
##$D= (0..31)
0 1.2 0 0 0 0 0 0 0 0.06 0 0.03 0 0 0 0 0.0002 0 0 0 0 0 0 0 0 0 0 0 0 
0 0 0 
##$DATE= 1629786355
##$DBL= (0..7)
120 120 120 120 120 120 120 120 
##$DBP= (0..7)
150 150 150 150 150 150 150 150 
##$DBP07= 0
##$DBPNAM0= <>
##$DBPNAM1= <>
##$DBPNAM2= <>
##$DBPNAM3= <>
##$DBPNAM4= <>
##$DBPNAM5= <>
##$DBPNAM6= <>
##$DBPNAM7= <>
##$DBPOAL= (0..7)
0.5 0.5 0.5 0.5 0.5 0.5 0.5 0.5 
##$DBPOFFS= (0..7)
0 0 0 0 0 0 0 0 
##$DE= 6
##$DECBNUC= <off>
##$DECIM= 32
##$DECNUC= <off>
##$DECSTAT= 4
##$DIGMOD= 1
##$DIGTYP= 9
##$DL= (0..7)
0 120 120 120 120 120 120 120 
##$DP= (0..7)
150 150 150 150 150 150 150 150 
##$DP07= 0
##$DPNAME0= <>
##$DPNAME1= <>
##$DPNAME2= <>
##$DPNAME3= <>
##$DPNAME4= <>
##$DPNAME5= <>
##$DPNAME6= <>
##$DPNAME7= <>
##$DPOAL= (0..7)
0.5 0.5 0.5 0.5 0.5 0.5 0.5 0.5 
##$DPOFFS= (0..7)
0 0 0 0 0 0 0 0 
##$DQDMODE= 0
##$DR= 18
##$DS= 0
##$DSLIST= <SSSSSSSSSSSSSSS>
$$ [...]
##$SUBNAM2= <"">
##$SUBNAM3= <"">
##$SUBNAM4= <"">
##$SUBNAM5= <"">
##$SUBNAM6= <"">
##$SUBNAM7= <"">
##$SUBNAM8= <"">
##$SUBNAM9= <"">
##$SW= 20.0188882624521
##$SWIBOX= (0..15)
0 0 2 0 0 0 0 0 0 0 0 0 0 0 0 0 
##$SW_h= 4006.41025641026
##$TD= 16384
##$TD0= 1
##$TE= 0
##$TE2= 300
##$TE3= 300
##$TEG= 300
##$TL= (0..7)
0 120 120 120 120 120 120 120 
##$TP= (0..7)
150 150 150 150 150 150 150 150 
##$TP07= 0
##$TPNAME0= <>
##$TPNAME1= <>
##$TPNAME2= <>
##$TPNAME3= <>
##$TPNAME4= <>
##$TPNAME5= <>
##$TPNAME6= <>
##$TPNAME7= <>
##$TPOAL= (0..7)
0.5 0.5 0.5 0.5 0.5 0.5 0.5 0.5 
##$TPOFFS= (0..7)
0 0 0 0 0 0 0 0 
##$TUNHIN= 0
##$TUNHOUT= 0
##$TUNXOUT= 0
##$USERA1= <user>
##$USERA2= <user>
##$USERA3= <user>
##$USERA4= <user>
##$USERA5= <user>
##$V9= 5
##$VALIST= <valist>
##$VCLIST= <CCCCCCCCCCCCCCC>
##$VD= 0
##$VDLIST= <DDDDDDDDDDDDDDD>
##$VPLIST= <PPPPPPPPPPPPPPP>
##$VTLIST= <TTTTTTTTTTTTTTT>
##$WBST= 1024
##$WBSW= 4
##$XGAIN= (0..3)
0 0 0 0 
##$XL= 0
##$YL= 0
##$YMAX_a= 423120
##$YMIN_a= -507929
##$ZGOPTNS= <>
##$ZL1= 120
##$ZL2= 120
##$ZL3= 120
##$ZL4= 120
##$ABSF1= 10
##$ABSF2= 0
##$ABSG= 5
##$ABSL= 3
##$ALPHA= 0
##$AQORDER= 0
##$ASSFAC= 0
##$ASSFACI= 0
##$ASSFACX= 0
##$ASSWID= 0
##$AUNMP= <proc_1d>
##$AZFE= 0.1
##$AZFW= 0.1
##$BCFW= 1
##$BC_mod= 2
##$BYTORDP= 1
##$COROFFS= 0
##$CY= 11.3945322036743
##$DATMOD= 1
##$DC= 2
##$DFILT= <>
##$DTYPP= 0
##$F1P= 2.36226072786647
##$F2P= -0.459571619588291
##$FCOR= 0.5
##$FTSIZE= 0
##$FT_mod= 4
##$GAMMA= 1
##$GB= 0.15
##$INTBC= 1
##$INTSCL= 1
##$ISEN= 128
##$LB= 0.24
##$LEV0= 0
##$LPBIN= 0
##$MAXI= 10000
##$MC2= 0
##$MEAN= 0
##$ME_mod= 0
##$MI= 1.114404
##$NCOEF= 0
##$NC_proc= 0
##$NLEV= 6
##$NOISF1= 3.799351
##$NOISF2= 2.8
##$NSP= 1
##$NTH_PI= 0
##$NZP= 0
##$OFFSET= 15.70392
##$PC= 1
##$PHC0= -13355.28
##$PHC1= 10.801
##$PH_mod= 1
##$PKNL= yes
##$PPARMOD= 0
##$PSCAL= 0
##$PSIGN= 0
##$REVERSE= no
##$SF= 200.130013532006
##$SI= 16384
##$SIGF1= 3
##$SIGF2= 2
##$SINO= 400
##$SIOLD= 16384
##$SREGLST= <1H.CDCl3>
##$SSB= 0
##$STSI= 0
##$STSR= 0
##$SW_p= 3612.71676300578
##$SYMM= 0
##$S_DEV= 0
##$TDeff= 0
##$TDoff= 0
##$TI= <>
##$TILT= no
##$TM1= 0
##$TM2= 0
##$TOPLEV= 0
##$USERP1= <user>
##$USERP2= <user>
##$USERP3= <user>
##$USERP4= <user>
##$USERP5= <user>
##$WDW= 1
##$XDIM= 8192
##$YMAX_p= 0
##$YMIN_p= 0
$$ End of Bruker specific parameters
$$ ---------------------------------
##NTUPLES= NMR FID
##VAR_NAME=  TIME,          FID/REAL,        FID/IMAG
##SYMBOL=    X,             R,               I
##VAR_TYPE=  INDEPENDENT,   DEPENDENT,       DEPENDENT
##VAR_FORM=  AFFN,          ASDF,            ASDF
##VAR_DIM=   8192,          8192,            8192
##UNITS=     SECONDS,       ARBITRARY UNITS, ARBITRARY UNITS
##FACTOR=    0.0002496,     1,               1
##FIRST=     0,             0,               0
##LAST=      2.0444736,     0,               0
##MIN=       0,             -507929,         0
##MAX=       2.0444736,     423120,          0
$$ Real data points
##PAGE= N=1
##DATA TABLE= (X++(R..R)), XYDATA
0@%%%%%%%%qJ6j6J6k4L2m0M9n7P2r0J14j37J62j94K32k73L21l76M34n02N78o62
31c53P57q63R80j108J249j407J581j768J975k204K450k722L019l341L693m078
47b140M499m960N466o022O634p309Q058q893R833j0893J2100j3493J5116j7038
61i042J9357k2220K5858l0658L7320m7258O3867r8442K93794l90113r5705O76362
73D23120n03592l1744M74058k99580l46905L70466k6483j87594K59025j6065m04013
84b89307J51239K04354r7572R835n9056p6485R4668j03916R9209K00941k62808
95a28898j20402K01317k7554M1490R9410j59308o9887J45427k530j8750J45399
106A05714o5465j88547J26706P8448j433J24591j95288j05272K95198j14110j04631
$$ plain form
0 0 0 0 0 0 0 0 0 0 -8 8 -8 8 -16 16 -24 25 -32 40 -50 64 -73 89 -105 127 -146 175 -201 233 -269 309 -353
31 -353 404 -459 521 -587 662 -745 836 -932 1043 -1161 1289 -1433 1586 -1755 1938 -2140
47 -2140 2359 -2601 2865 -3157 3477 -3832 4226 -4667 5166 -5727 6373 -7120 7996 -9042
61 -9042 10315 -11905 13953 -16705 20615 -26643 37224 -61218 232576 -157537 -253242 423120
73 423120 -80472 -112216 361842 62262 -284643 85823 59340 -128254 130771 114706 -289307
84 -289307 -138068 66286 -31286 -21451 -80507 -156992 -62324 -166240 -67031 133910 -128898
95 -128898 -249300 -47983 -75537 -34047 65363 -93945 -163832 -18405 -20935 -39685 105714
106 105714 40249 -148298 -21592 56856 55423 180014 -15274 -120546 174652 60542 -44089
117d4089L14275j61038k69931K58960O1366j47775J45531k5173k64605J40353
127G874K01594k08082K043J43204k19013k3968J74601m6658K6203q2026j59993
138a84221K02470K3718j74502J72389j5753k57543J55404J52857j94803N5581
148f4403J44580k80666n389L70092j79926j92080K89404j03674j87652K70319
158F0605K4401j55232P4104j6977m7071J11398M5607p6357k9239L7420J982J6422
170D7063M0358j7148j0821n1981j4619J39418k8955j04680P6636m9309m2783J23731
182A06910n4009m9851O0419r0099j5627J11701l2916o7103J9947k2031l0605Q3007
194A9743o994j10429Q3899J287j45068J54646O4300k03384P6876P4255j31158
$$ plain form
117 -44089 270186 109148 -160783 98177 159543 11768 157299 132126 -132479 7874
127 7874 209468 1386 3429 146633 -72380 -96348 78253 31595 57798 -24228 -184221
138 -184221 18249 41967 -132535 39854 24101 -233442 -78038 74819 -119984 -64403
148 -64403 80177 -200489 -205878 164214 -15712 -207792 81612 -22062 -209714 60605
158 60605 85006 -70226 3878 -13099 -60170 51228 96835 20478 -8761 28659 30641 47063
170 47063 87421 70273 59452 7471 -7148 132270 103315 -1365 75271 25962 -16821 106910
182 106910 52901 3050 63469 -26630 -42257 69444 36528 -30575 -10628 -32659 -63264 19743
194 19743 12749 -97680 -13781 -12494 -157562 -2916 61384 -142000 -65124 9131 -122027
205a22027Q3567P6009j18540O263P3966m7424o949R3038l4451p8662P7932J1466
217A4188l0881P3681m6423l2488P9597n0400P588Q1768p1083j8992N0680k2395
229C4840J0842K4424k6573k5718J8327J8955l1765J8841J5244o7269K1634K7035
241C8817m1022L1905k0058m3976M3358k1379j0850L2064m2816l290J6186k3989
253d5050J9206O222k3202r529J2437J7439k7194J5326K5724n4813K7955L7134
265A655m8595L6786J2052m5348M2376P701j7822K7466q588l646J1582M398R619
278B9636j0166J5154l100k0635M1244j2286k5592M0086k6588j0532L3244k8209
290B2256M335P154k5636J5320o849q635P627j9157O424o903j1650J9026k5682
$$ plain form
205 -122027 -38460 37549 -80991 -74728 -762 -48186 -55135 37903 3452 -75210 2722 14188
217 14188 -16693 56988 10565 -21923 57674 7274 14862 96630 25547 6555 57235 34840
229 34840 45682 70106 43533 17815 36142 55097 23332 42173 57417 -9852 11782 38817
241 38817 -2205 29700 9642 -34334 9024 -12355 -23205 8859 -33957 -37247 -21061 -45050
253 -45050 -25844 -19622 -42824 -52353 -39916 -22477 -49671 -34345 -8621 -63434 -35479 1655
265 1655 -46940 -10154 1898 -43450 -1074 6627 -11195 16271 7683 4037 15619 20017 29636
278 29636 19470 34624 31524 10889 52133 39847 14255 54341 27753 17221 50465 22256
290 22256 26591 33745 8109 23429 16580 7945 15572 -3585 2839 -4064 -15714 3312 -22370
303b2370j956J6832l0702J4138N049k3748J9425j2880l747J9300k2707J3147P470
316b2749j9055K1497m895j670J6623j5510J7318M357j3986K8270r581k707K3585
329B1497j7041J4036P634j4613K4156j0440l645K2070k0014R960O629j7648J9307
342D1888j2612n837J7625k3874P004N494k1597J4363j2020p964J3309k4915Q319
355h17K910k4790J7337r820j2342J5190j9639O067M001j9390J8900q479r188J8635
369b1425j5796P313P639j4139K0013p576k869K2157j7950J2028J2696j7890K3331
382G532k251q405K4887j4235L246J7883j3559Q718J997J38P168j4532J7678j412
396C4853k1659K8574j5421j5196L1636k8332n243K4228k7871M19J0776j5791q12
$$ plain form
303 -22370 -24326 -7494 -38196 -24058 -19009 -42757 -23332 -36212 -39959 -20659 -43366 -30219 -22749
316 -22749 -41804 -20307 -25202 -26872 -10249 -25759 -8441 -4084 -18070 10200 619 -2088 21497
329 21497 4456 18492 26126 11513 35669 25229 21584 43654 23640 33600 40229 22581 41888
342 41888 29276 23439 41064 17190 24194 29688 8091 22454 10434 2470 15779 -9136 -817
355 -817 2093 -22697 -5360 -15180 -27522 -12332 -31971 -25904 -21903 -41293 -22393 -30872 -40060 -21425
369 -21425 -37221 -29908 -22269 -36408 -16395 -23971 -26840 -4683 -22633 -10605 2091 -15799 7532
382 7532 5281 -3124 21763 7528 10774 28657 15098 23816 25813 25951 33119 18587 36265 34853
396 34853 13194 41768 26347 11151 42787 14455 9212 33440 5569 5988 16764 973 161
409A61k112L72j0516k728J5042l0111M159K7387m1959R941K6299l9585J5754J2678
423a5218k4800K0278p06j3980J3495L559J285n822R791J0428j7876J7707Q997
436G138j6480K5139r804r830L4141j6402j816J8637j9104J7255J811j9161K9738
449D1262q303k4249K1974K028j0475O76J356j0386m428K1013k5172j1894M4144
462C7546m8367k2536O9608m3966k9902N5073m2745j7192N3225l2283k6143M2730
474d952j1091m4861L9412L1158o0243J3492L7365n1090L2206L1669o5201M0001
486a2135K7669o5426M4133L8764n1425Q587K2964j5978J3816K2256k4782r564
498a121L9304k0900j9304N7918j9749m0120L5066j0840O582K5240m8699R155K7117
$$ plain form
409 161 -1951 -1579 -12095 -14823 219 -29892 -25733 1654 -40305 -30364 -4065 -43650 -27896 -15218
423 -15218 -40018 -19740 -20446 -34426 -20931 -17372 -16087 -21909 -12118 -1690 -19566 -1859 7138
436 7138 -9342 15797 5993 -3837 30304 13902 12086 30723 11619 28874 30685 11524 41262
449 41262 32959 8710 30684 32712 22237 22913 24269 13883 9455 30468 5296 -6598 37546
462 37546 -10821 -33357 36251 -7715 -37617 17456 -25289 -42481 10744 -21539 -47682 -4952
474 -4952 -16043 -60904 -21492 9666 -50577 -37085 280 -50810 -18604 13065 -52136 -12135
486 -12135 15534 -49892 -5759 33005 -18420 -9833 13131 -2847 10969 33225 8443 -1121
498 -1121 38183 17283 -2021 55897 36148 -3972 31094 20254 26836 52076 3377 12532 39649
511C9649m1531J7734K2888l2477k742j351j2831K2685J3752m2539j7496M3358
523I099j9637k6450N0838k4984l5214L6841l0301J5587N3443p8910o374O9164
535A3102n0700K758O0851n5318j9122O3109l5995k2691J00523m0290j09406J17286
547B4107L8065j22829Q7200M5393j31396O1682O6659q8653M5389M6856j02278
558b9805Q273R4876l8538m5628N1031j9175m1290N1180k469j8892K6662n5465
570a9240j1625P0271k4405k1501J1267l3491J6808J4153k1413K7587r337n0523
582e1449J8058L2076m840O8j3825l6467L4726M1473o1470K2421O2512j09018J035
595f4700J26458o8736k9514P9471p8766j5460J16693m3663o1123P8757j5809p7401
$$ plain form
511 39649 -1882 15852 38740 6263 3521 2170 -10661 12024 25776 -16763 -34259 9099
523 9099 -10538 -36988 13850 -11134 -46348 -9507 -39808 -24221 29222 -49688 -56062 13102
535 13102 -37598 -34840 26011 -29307 -48429 14680 -21315 -44006 56517 16227 -93179 24107
547 24107 62172 -60657 26543 71936 -59460 2222 68881 -19772 25617 72473 -29805
558 -29805 -21532 73344 34806 -10822 40209 21034 -20256 30924 28455 9563 36225 -19240
570 -19240 -30865 39406 15001 -6500 4767 -28724 -11916 2237 -19176 8411 -926 -51449
582 -51449 -33391 -1315 -6155 -6087 -19912 -56379 -21653 19820 -41650 -19229 43283 -65735 -64700
595 -64700 61758 -6978 -36492 42979 -35787 -51247 65446 21783 -39340 39417 23608 -53793
607e3793Q0763N1755q3203N261K1678l7610N8601Q957o4575M6579j6858n3720
619c6165Q4420J525o4237M0454k5149m7344Q9935J5107j05375K9803N8042r0903
631d9887J7742J02583q5901m6724P1577m2550N428O9317o5442l1934M7231j3731
643b2291J066K7690j2434j9180j0582O952L6955J6966m2778j7795L6790j0380
655i021K457M5221l8088k0259L2297l0160L3876M9164p4394p813M4369l2112K7284
668B2821L5067o1381n219M2855m0452L927Q1221o2682p8501R5429J43p0345Q6772
681D9655j5936j02852P6814K2813o8658N9266J0867r0425K2225O0893k9534j2260
693a7132K3110l7832p635M5288j6433K530J9726n7923J0323N3907k8508J0652
$$ plain form
607 -53793 26970 78725 -4478 783 22461 -15149 43452 52409 -12166 34413 17555 -36165
619 -36165 48255 49780 -14457 25997 848 -46496 43439 58546 -46829 -17026 41016 -49887
631 -49887 -32145 70438 -15463 -62187 9390 -33160 -27732 41585 -23857 -55791 -8560 -22291
643 -22291 -21225 6465 -5969 -25149 -35731 -28779 8176 25142 -17636 -35431 1359 -9021
655 -9021 -6564 38657 569 -19690 12607 -17553 16323 65487 -8907 -16720 27649 -4463 22821
668 22821 57888 -3493 -8712 34143 -6309 -2382 78839 16157 -62344 33085 33228 -37117 49655
681 49655 33719 -69133 7681 30494 -38164 21102 31969 -58456 -36231 24662 -4872 -17132
693 -17132 5978 -31854 -39489 5799 -10634 -8104 11622 -46301 -35978 17929 -10579 73
705G3R383n0816K5851L5124k4175J2185R525l5221j748L9986P635j8377J566j4521
719c530k934L6580r373p914J6689m1091M744M5421k6189M475R660n0318J9639
732d141M0256l0520m634J6656l0982j1864M2264n21l3314J9222j4808k9005N5297
745A3906k160m5950L3702j3571l0166M9694k12l0003J5999r401j3447L0660J2691
758A1742k7888k466J7443j8195J2199L2370l1585n140K0272k2532K2778K2730
770C1728l4461N511R462j5062K1166R286j7166l640K221K91M380J3346r861k1119
784c918J4749L0o565K0310j7655j3777J4534j4066R676J3950k6899R47N908j1834
798a4610J2689M220j3085o478L690M468n685J0388K28k3684J4796P803j2870J8525
$$ plain form
705 73 9456 -41360 -15509 19615 -4560 7625 17150 -18071 -19819 20167 27802 9425 10991 -3530
719 -3530 -6464 30116 20743 12829 29518 -11573 -6829 38592 12403 16878 26538 -23780 -4141
732 -4141 36115 5595 961 17617 -13365 -25229 17035 16514 -16800 2422 -12386 -41391 13906
745 13906 11746 -34204 -502 -14073 -44239 5455 5243 -24760 -8761 -18162 -31609 -949 11742
758 11742 -16146 -18612 -1169 -19364 -7165 25205 -6380 -11520 8752 -13780 8998 31728
770 31728 -2733 2778 12240 -2822 18344 27630 10464 6824 9045 9336 13716 27062 17201 -3918
784 -3918 10831 10861 4296 24606 6951 -6826 7708 -6358 3318 17268 -9631 -8684 -2776 -14610
798 -14610 -1921 2299 -10786 -17264 -13574 -9106 -14791 -4403 -4175 -27859 -13063 -5260 -18130 395
812C95o856j5143J7762n140K263J4151j4290m13Q002k365O611K905p37p434J416
827A127J5256j0459K631J3429k2448N395J6996j5575O466L079j2810O390q80J704
841A0301J948j0977M784k493m967Q671o691k112j125o363J0094p301m445J1536
855H60j5770N94J3402j3008L240L433p429N291k502L579K938r411R113K42n626
870a1054J1443m572j42M893n090R889l022l376J2802j0167Q01J2777j1171M439
884H450N004p154O048k780J183K843q137P697k628o556R659p884j717O550j0564
899A4N448j423q302R305p848l156P484r838K341J783o440N599n813j82M882q345
915a4491O597J58p781R313m269o90O480o823O932p41n761J3677p092k144J2267
$$ plain form
812 395 -6461 -21604 -3842 -8982 -6719 7432 -6858 -7271 731 -1634 4977 7882 7145 -289 1127
827 1127 16383 5924 8555 21984 -464 4931 21927 6352 12818 15897 3087 9477 8597 10301
841 10301 12249 1272 6056 3563 -1404 7267 576 -1536 -2661 -9024 1070 -6231 -10676 860
855 860 -14910 -14316 -914 -13922 -10682 -7249 -14678 -9387 -11889 -8310 -5372 -14783 -5670 -5428 -11054
870 -11054 389 -4183 -4325 568 -4522 5367 2345 -1031 11771 1604 2405 15182 4011 8450
884 8450 13454 6300 12348 9568 10751 13594 5457 13154 10526 3970 13629 5745 4028 10578 14
899 14 5462 4039 -4263 5042 -2806 -5962 1522 -8316 -5975 -4192 -10632 -5033 -10846 -11028 -6146 -14491
915 -14491 -7894 -7736 -15517 -6204 -10473 -11163 -4683 -11506 -4574 -5315 -11076 2601 -4491 -6635 5632
930E632q985K509P992o929M389J748o15O02j665R034o851l760J4371j2592L53
945E233J3435j6930N270R374j7069P162N950j1311J841K081j124n491K374L439
959D234j2367P617L825j8458J5254K113k1025J6349R35j3689J1499k698m560N744
973e227k075l98j100N325K12q843J1252J482r310R710k213p00O625r071Q392L516
989G577j0260J1275m426m009J4898j2667k177J6276j0758n358J0145m72p511J644
1003D177P036j1377L335J1880k3530P866K0199l2677P164K3831k9925M167J6921
1016I067k0331M687J2260j7459j610J8912j0171j7754K5198L03k7931K5087K441
1029B699k4478K7022n823k3103L2426m353k3778K2880M024j6285P080Q637p030
$$ plain form
930 5632 -3353 -844 7148 219 4608 6356 5741 6343 4678 13712 6861 3101 17472 4880 5233
945 5233 18668 1738 7008 16382 -687 6475 12425 1114 2955 5036 3912 -1579 795 4234
959 4234 -8133 -516 3309 -15149 105 2218 -18807 -2458 -1523 -15212 -3713 -6411 -10971 -5227
973 -5227 -7302 -7700 -8800 -3475 -3263 -12106 -854 628 -8682 1028 -1185 -1885 4740 -4331 4061 7577
989 7577 -2683 8592 4166 157 15055 2388 211 16487 5729 371 10516 10044 2533 4177
1003 4177 11213 -164 3171 15051 -8479 -613 19586 -13091 -5927 17904 -12021 -7854 9067
1016 9067 -11264 -6577 5683 -11776 -13386 5526 -4645 -22399 2799 3102 -24829 258 2699
1029 2699 -21779 5243 -580 -23683 8743 4390 -19388 3492 7516 -8769 -1689 6948 -82
1042h2K02R140j1734K371J9273j9999k864K2550j5789k509J2315r673O998k981
1056G218j0551J5815l886q842P951p197J833P104j2210m92J2580p286j7158J7302
1070B181J1457l0322J0232J8250l2666J7584J7440m1025K1967K2135m5587J5491
1082a2863L4168l5620o433L0866j5823j1758K9754j4371k0654L8213j3090k9905
1094b7516M7518o946l8993L5818J024k3070K7237p584j9353K3603r30j9560J7184
1107H432J1189k5532P59K1029j3510J060R977k2526J1478J2651k5351J4986J0049
1120A4691k5761Q635M986o530J2934j0535j3175J5051K702j1497N271P792j3649
1133i085k772J2641p287P378M105k7690J7382J8581k9744J7148J0882l1820J9342
$$ plain form
1042 -82 120 9260 -2474 -103 19170 -829 -3693 18857 3068 559 12874 3201 10199 7218
1056 7218 -3333 12482 8596 -246 7705 508 2341 9445 -2765 -3257 9323 2037 -15121 2181
1070 2181 13638 -16684 -6452 11798 -20868 -3284 14156 -26869 -4902 17233 -28354 -12863
1082 -12863 21305 -14315 -20748 10118 -5705 -17463 12291 -2080 -22734 15479 2389 -27516
1094 -27516 20002 13056 -25937 9881 10905 -12165 15072 7488 -11865 11738 10808 -8752 8432
1107 8432 19621 -5911 -5152 15877 2367 3427 13404 -9122 2356 15007 -10344 4642 14691
1120 14691 -11070 -2435 2551 -3979 8955 -1580 -14755 296 2998 -8499 -3228 4564 -9085
1133 -9085 -11857 784 -6503 875 4980 -22710 -5328 13253 -16491 657 11539 -20281 -939
1146i39J0260k3536K4412O191l9125J6248L3076l0190o999L6279k8657j7225M8358
1159B8153k1355k1871M5589l1069k7267N7506j2129l5582L1444l394k5756K2884
1171G153R334k2204P071O175k5029J7011K3099l3141Q5J7806k1957J1232J3855
1184A0490k0555P082j133j4264J8779N996j1606k623l603N033Q046k552l097K786
1198a221m378r101J8165J1400k4082P160O429k1824K8173J0083l6754J9922R463
1211A3435l1099K4190K0146l0164j782J5047j2613M422K2691k2210j4552K6743
1223A4254j4712q410L5896k2779k1847K8270j4064k869K8493k4011j5799K2837
1235E259o300q287J9027k745k5151Q656J4394j2723J1375L575k8206J3223J3314
$$ plain form
1146 -939 9321 -14215 10197 16388 -22737 -6489 26587 -3603 -10602 25677 -2980 -20205 28153
1159 28153 6798 -15073 30516 -553 -27820 29686 17557 -18025 13419 10025 -15731 7153
1171 7153 16487 -5717 1354 7529 -17500 -489 22610 -10531 -10446 7360 -14597 -3365 10490
1184 10490 -10065 -2983 -4116 -18380 399 6395 -5211 -7834 -11437 -6404 1642 -910 -4007 -1221
1198 -1221 -5599 -14700 3465 14865 -9217 -2057 4372 -17452 10721 20804 -15950 3972 13435
1211 13435 -17664 6526 26672 -3492 -5274 9773 -2840 1582 24273 2063 -12489 14254
1223 14254 -458 -8868 27028 4249 -17598 10672 -3392 -6261 22232 -1779 -17578 5259
1235 5259 -1041 -9328 9699 6954 -18197 -9541 4853 -7870 3505 7080 -21126 -7903 5411
1248E411j5099J4889j156k0441J2164K967j211J3313j1260j2121R987O198j891
1261A750L854J707j5125J206J6789p477L848N587k3656Q576J6298j3055Q932m61
1275H773j9366J1851N515n490R097n772j4631N676J1869m548l302O428j5320l066
1289a2286K2363j0366n069J4270k2569j27K3693j2893j250Q079j6716J941J5598
1302D668l529n366M253m951q933J7069P643j9224Q356K954j7028J9581P298j8171
1316e380P727j269p030J2041K753m048l906l215N030J978K770o77o436L54j629
1331i37N683O802j2674K123K698j1839J4266M187j5624O326j401o800J0268Q65
1345C943n619k146j043J692N27N209l589p912P246l683J14J1840j1816l214J0367
$$ plain form
1248 5411 -9688 5201 4045 -16396 -4232 -1265 -2476 10837 -423 -12544 -2557 3641 1750
1261 1750 5604 7311 -7814 -6608 10181 2704 6552 12139 -11517 -2941 13357 302 9234 8773
1275 8773 -10593 1258 6773 1283 10380 4608 -10023 -4347 7522 2974 -328 6100 -9220 -12286
1289 -12286 10077 -289 -5358 8912 -13657 -13784 9909 -2984 -4234 3845 -12871 -10930 4668
1302 4668 1139 -4227 26 -4925 -13858 3211 10854 -8370 -14 2940 -14088 5493 12791 -5380
1316 -5380 2347 1078 -5952 6089 8842 4794 888 -2327 2703 4681 7451 6774 338 692 -937
1331 -937 4746 11548 -1126 997 3695 -8144 6122 10309 -5315 1011 -390 -7190 3078 3943
1345 3943 -1676 -3822 -4865 -3173 -2646 2563 -1026 -8938 -1692 -5375 -5261 6579 -5237 -8451 1916
1360A916r702M883R519j0961o02L804j190K566J171J489n684j267Q147l326J577
1375B340L091q696M820J279k805Q242o710m236Q645o585K003O413p663m73J623
1390A288L75N91j602L194n029l343Q923m323k109N365p550K216K915m439N772
1405B244m289l233O733n208J443M761n926N68J130N41J323k852M392k589m105
1420e067R037m072k479O912o399J353M268m988M489j529k849N439l889L44L026
1435C596l261J817j291R88J707n704N601m02p320Q872k800n533P422l902j583
1450a793L740l312J678j491o47L392n344K032K694n627M249l90k562L345l667
1465c703K727J133m744N679l202k199P590o324Q60N321p047L290K650m022L845
$$ plain form
1360 1916 -7786 -2903 6616 -4345 -4947 -1143 -2333 233 1404 2893 -2791 -4058 4089 763 2340
1375 2340 5431 -3265 1555 2834 29 8271 1561 -2675 5970 -615 1388 7801 138 -335 1288
1390 1288 1663 2254 652 3846 -1183 -4526 4397 74 -2035 3330 -4220 -2004 911 -3528 2244
1405 2244 -2045 -5278 1455 -3753 -2310 2451 -3475 -2907 -1777 -1236 87 -2765 1627 -962 -5067
1420 -5067 3970 -102 -2581 4331 -2068 -715 3553 -1435 3054 1525 -1324 4115 226 570 3596
1435 3596 335 2152 861 1849 3556 -2148 3453 3051 -4269 4603 1803 -3730 3692 -210 -1793
1450 -1793 1947 -1365 313 -1178 -1825 1567 -3777 -1745 949 -4678 -429 -819 -3381 -36 -3703
1465 -3703 -976 157 -4587 1092 -2110 -4309 3281 -3043 -2183 3138 -3909 -619 2031 -1991 1854
1480A854j692r10J435M10J873m296L004L355r434P468L667j1328Q625P06r541
1495d804R558J49p998N129J646m080o56M682j111o779O846m77p122R905m129p272
1511f513J1268n295m147P895m514j151J802j732K825j374l58L25k437M803k608
1526a211k222O103m750l87L345k861L978k725k541O700n345R46N246q099M973
1541A150K992r336O740M140q033P88M925j918m126N917l50q828J0724q16j3202
1556i233J5927r84j7211J5785K000j4903J1103J588j0378O400M515r745J569J1582
1570H015j1975n267J8275r782r267J7708q672o738J4852r580l994J2647o684n183
1584e645P295J992o004j23O334m210j434N269n399K637L703q190N031K345m173
$$ plain form
1480 1854 162 -748 687 1097 2970 -1326 1678 5033 -4401 3067 6734 -4594 4031 4737 -4804
1495 -4804 4754 4903 -3095 2034 3680 -400 -1056 3626 2515 -4264 2582 2105 -5017 4888 759 -6513
1511 -6513 4755 -540 -4687 3208 -1306 -2457 -655 -2387 438 -936 -1294 -969 -3406 1397 -1211
1526 -1211 -3433 2670 -2080 -2467 878 -1983 1995 -730 -3271 3429 -1916 -970 4276 -3823 1150
1541 1150 4142 -5194 1546 5686 -2347 -1559 3366 1448 -2678 3239 2889 -5939 4785 3969 -9233
1556 -9233 6694 5710 -11501 4284 6284 -8619 2484 4072 -6306 94 4609 -5136 -3567 8015
1570 8015 -3960 -9227 9048 -734 -10001 7707 -965 -7703 7149 -2431 -6425 6222 -462 -5645
1584 -5645 1650 3642 -2362 -2485 3849 -361 -1795 3474 -1925 712 4415 -3775 1256 3601 -572
1599e72L389m456K310N891j0648L306Q192j0282J984M931n988K526L104n756q46
1614b915Q708n029q987J4057j495j5072J5272n58j4149J6539m421j4345J9452
1627G057l115j6766J5514M000j6020O807R745j3219J924J2329j5711J411J9541
1640A3497k0537k341K3363j8253n507K0100j1641n042J3155p797m722J1694k845
1653C124r984R162N167j3674N678Q447j1533L415L759p022P440j815n798O670
1667C036l189L79K698o390O053J277r814N944O002q353j211O915l632m464R913
1682E164m654r032J5843o297j3456K2008m816j8391J9380j383j4063J4719o56
1695D366j3354J1234L895j4162P561J1333j8187J013J7407j5441k93J5750j7714
$$ plain form
1599 -572 2817 -1639 671 6562 -4086 -780 7412 -2870 -886 4045 -1943 583 3687 -2069 -2915
1614 -2915 5793 764 -8223 5834 4339 -10733 4539 3981 -10168 6371 1950 -12395 7057
1627 7057 3942 -12824 2690 6690 -9330 -2523 7222 -5997 -4073 8256 -7455 -6044 13497
1640 13497 -7040 -9381 13982 -4271 -9778 10322 -1319 -6361 6794 -1003 -5725 5969 3124
1653 3124 -6860 2302 7469 -6205 -527 7920 -3613 -198 3561 -3461 3979 2164 -3634 3036
1667 3036 -153 226 2924 -3466 2587 3864 -5950 -6 5996 -2357 -3568 3347 -285 -4749 5164
1682 5164 510 -8522 7321 1024 -12432 9576 4760 -13631 5749 4366 -9697 5022 4366
1695 4366 -8988 2246 6141 -8021 -460 10873 -7314 -6301 11106 -4335 -4628 11122 -6592
1708f592J770J6230j7101K117J4488j5095k345J3346n867m217P486l727o698J0227
1722D022m98j0253J1478j400j3202J3028J032r104Q190m483l993R122m372j919
1736b352N023n222m69L644p50M54Q20l515k246P518o00p530Q712k519r683J3952
1752E237k155r123J2508p028q286J6063l463r457R603j447q639Q304M623j0114
1766c374L053O439j3027O352J2296j7319K768J1750j5930N399J2184j4385J744
1779b050P376j0346L424R184p453n487P781j920n871J1026k480j0842J0202j965
1793E79p174J3304n167q627Q895k954j508O539l754k827J536l18J228J706j44
1808A314m093M16K783j570L855p89p152O544j471l832J1398o667p324J0218m348
$$ plain form
1708 -6592 -4822 11408 -5693 -3576 10912 -4183 -6528 6818 951 -3266 4220 493 -6205 4022
1722 4022 3524 -6729 4749 3349 -9853 3175 4207 -4897 3293 -1190 -5183 3939 -433 -2352
1736 -2352 2671 -2551 -3020 624 -126 328 1148 -2367 -4613 2905 2305 -5225 3487 968 -8715 5237
1752 5237 3082 -6041 6467 -561 -8847 7216 3753 -5704 3899 2452 -6187 2117 6740 -3374
1766 -3374 -321 6118 -6909 -557 11739 -5580 -2812 8938 -6992 -1593 10591 -3794 -2050
1779 -2050 5326 -5020 -1596 7588 135 -5352 2429 509 -5362 5664 3184 -7658 2544 579
1793 579 -6595 6709 1542 -7085 1810 -1144 -2652 3887 133 -2694 -1158 -1476 -248 1458 1314
1808 1314 -2779 -2363 420 -1150 2705 1916 -5236 1308 -163 -3995 7403 736 -6588 3630 -718
1823g18k276R810n562o698O419J400m800M291L805j1117J976R404q949K810P760
1838G555j3622K652R294q515L346L638q210J118M671j137o8L55k168k878M824
1853H55J760m173M036l549m304Q973l082k174N785p607j43P868n081R48K965o051
1869b974Q56L772L09j918O51n11m084M821L862p003L602K3o471P798M23n434M516
1886B238l247k419N752j211j037K74j581J87O94K852k324j720K363l650K202M889
1902D262o662J211K538o270O131J719o037L446p50k724M032M06j471j595J334
1917d30J42j602M308j278m904N226k005j705O496m445j794L642l402K263K229
1932B741l400R76n90l0J567n98P38j997l84K652k559K488R00n042L904l89k409
$$ plain form
1823 -718 -2994 6816 1254 -5444 975 2375 -2425 1866 5671 -5446 -3470 5934 -3015 -205 7555
1838 7555 -6067 -3415 5879 -2636 710 4348 -3862 -2744 1927 790 722 1077 -1091 -3969 855
1853 855 2615 -1558 2478 -1071 -5375 3598 516 -1658 4127 -3480 -3623 4245 -836 112 3077 -2974
1869 -2974 -2118 1654 1963 45 696 185 -3899 922 4784 -2219 1383 1406 -5065 2733 3156 -2278 2238
1886 2238 -1009 -3428 2324 1113 76 350 -1231 -1044 -350 2502 178 -1542 821 -2829 -627 4262
1902 4262 -2400 -1189 1349 -4921 1210 2929 -3108 338 -412 -3136 896 1302 -169 -1764 -430
1917 -430 -288 -1890 2418 1140 -3764 1462 -543 -2248 4248 -197 -1991 1651 -1751 512 2741
1932 2741 -659 317 -273 -303 1264 666 1404 -593 -977 1675 -884 1604 2504 -2538 1366 977 -1432
1949a432M853l480j459L542l193J685J295k760J289r18N5J348j063J287k346K15
1965a082K874l517K224J778n639L876R90m614N030j301l405L808j138r41J267
1980B10k78K74j680K055O00l240L860j550l060N459k818j467M430m171P78K253
1996A655k725J761m52n89J274j900J749l86k012L255j720r48K547k735J483M48
2012G05k212K741k273L67K179l731K707J174m821M121k5l061K996l53j716J388
2028A86K18j34j734K606l08m367O240j101n590P128k346m611O859k503k493L922
2044A972j713j635J860J674k581j044M488l472j862O804m959k031O023m799j68
2059a443N156m633l00J901m55m9p62J808j359k123M040k100q83L218l505j67K715
$$ plain form
1949 -1432 3421 -59 -1518 2024 -1169 516 1811 -949 340 -578 -523 825 -238 1049 -1297 -1082
1965 -1082 1792 -1725 499 2277 -3362 514 1504 -3110 1920 619 -2786 1022 -116 -1057 210
1980 210 -68 206 -1474 581 1181 -2059 1801 251 -2809 2650 -168 -1635 2795 -1376 -598 1655
1996 1655 -1070 691 239 -350 924 -976 773 387 -1625 1630 -90 -1038 1509 -1226 257 705
2012 705 -1507 1234 -1039 -672 1507 -2224 483 1657 -3164 957 932 -2129 867 514 -1202 186
2028 186 404 270 -1464 1142 834 -3533 2707 1606 -3984 3144 798 -3813 3046 543 -1950 1972
2044 1972 259 -1376 484 2158 -423 -1467 3021 -451 -2313 4491 -468 -2499 3524 -1275 -1443
2059 -1443 3713 -920 -1220 681 226 177 -585 1223 -136 -2259 1781 -319 -1202 2016 -1489 -1656 1059
2076A059j708M97j027Q75R44l881M186P22n172M759j031m187O498j826m317M195
2092E86O92l085P46L893l303k922O302l029l510Q795n616m518J0060m969m438
2107d316R093l496n040N565R0l773K568K741o155J274O649p548K71P789p952m69
2123b709P392o252O17L955m776O22K841j388j384Q33J781l421O85M091m070J13
2139a070K430l070K306L89j941J441j681J388N82l340M940j585m930O438j039
2154A258m193M672r51l171L308J023l761R15M769n714j619Q972o175l598J0264
2169E999o979l412R894o378l330Q887m567m421O948L4o374L397M182p807K745
2184a182O306r505K880O794j0193L620O227q287J849M392m671N43K393j322j470
$$ plain form
2076 1059 -649 -152 -1179 -304 640 -3241 945 1667 -3505 1254 223 -3964 2534 708 -3609 586
2092 586 1278 -1807 -1061 2832 -471 -3393 2909 -120 -3630 5165 -451 -4969 5091 122 -4316
2107 -4316 4777 1281 -3759 1806 1896 -1877 691 3432 -2723 -1449 5200 -2348 -2077 5712 -2240 -2709
2123 -2709 4683 -1569 -952 3003 -1773 -1151 1690 302 -1082 -249 1532 -1889 -1204 2887 -1183 -1070
2139 -1070 1360 -1710 596 985 -956 485 -1196 192 774 -2566 2374 789 -4141 2297 1258
2154 1258 -2935 1737 786 -2385 923 1946 -1815 -900 3869 -1845 -3464 5508 -667 -4265 5999
2169 5999 -980 -4392 5502 -876 -4206 4681 114 -4307 2641 2675 -3699 -302 3880 -3927 -1182
2184 -1182 5124 -4381 -1501 5293 -4900 -1280 4947 -3340 -1491 2901 -1770 -1227 1166 -156 -1626
2199a626K403K18l810L689J309n405M018Q83l563L066j206q10K389k838J725P85
2215A227k562L066j568k329M792k338k034L658n82k600J326K386k980p68N169
2230C863n640n90Q074p878j396R804q291j819R269o431k397O984l330l944N907
2245B185o2o782N170L692r592M806N552j0046M406M960r188M797L331p090L069
2260g92L003l929M31K940j607k343K890L10l149M044j269l493N189k367j566M188
2276B480l416M02K209l158K275P23k995K459n64j126J626n03n26J52M89r29m44
2293h46L136l368j273N606m446j398O689o049m53O270n974M25N259n233p10M662
2309B297j994k774M078K77n697M603K545p454N145K517q343N754K931p349M435
$$ plain form
2199 -1626 777 995 -2815 874 2183 -3222 796 1679 -1884 1182 -24 -834 1555 -1283 442 1227
2215 1227 -1335 1731 163 -2166 2626 288 -1746 1912 1330 -1270 56 2442 -538 -1306 3863
2230 3863 -1777 -2367 5707 -2171 -3567 6237 -2054 -3873 5396 -1035 -3432 3552 222 -3722 2185
2245 2185 2123 -4659 511 4203 -5389 -583 4969 -5077 -671 4289 -4899 -102 3229 -3861 -792
2260 -792 2211 -1718 -1287 1653 46 -2297 593 903 -2246 1798 529 -2964 2225 -142 -1708 2480
2276 2480 -936 -534 1675 -1483 792 1515 -1480 979 415 -711 915 412 -114 38 527 -402 -846
2293 -846 2290 -1078 -2351 3255 -1191 -2589 4100 -1949 -2402 3868 -2106 -1681 3578 -1655 -2365 2297
2309 2297 303 -2471 1607 1884 -3813 790 3335 -4119 1026 3543 -4800 954 3885 -3464 971
2324I71J273m857K975J586j941o41J794j093k045M117j053l278L966k131j487
2339a844M406l081o6K566m258K288K019l781K649k83k934K618L52j100k86R86
2355B51q39j539L626j240l209M621k597j985N999l551j752M585m050K4L793k819
2371f82j22J125j114P2J522N40k773J008J838l712L604J258n240M022J39m336
2387b851N693j134l626L504j139j716L087m23j677k97J658j147q26L407l085j458
2403b030M670l459M17L410n049R14K786l123K034N05k408J247n52J94N47k02M39
2420C40j606J068P20j687K445j474k218M283k501p55M028m388L56L243k765Q54
2436e7J437k306M52O12O25o33J0J076k930J917J914l680K757j76l919M259m02
$$ plain form
2324 971 2244 -2613 362 1948 7 -634 1160 67 -1978 2139 1086 -2192 1774 -357 -1844
2339 -1844 2562 -519 -585 1981 -2277 11 2030 -1751 898 615 -2319 299 651 -449 -735 251
2355 251 -588 -2127 1499 259 -2950 1671 -926 -2911 3088 -463 -2215 2370 -1680 -1656 2137 -682
2371 -682 -804 321 -793 -721 801 1341 -1432 -424 1414 -2298 1306 2564 -2676 1346 1485 -2851
2387 -2851 2842 1708 -1918 1586 447 -1269 1818 1395 -282 -579 1079 -68 -894 2513 -572 -2030
2403 -2030 2640 -819 -402 3008 -2041 -1127 1659 -1464 570 1075 -1333 -86 -638 -444 103 -99 340
2420 340 -1266 -198 522 -1165 1280 -194 -2412 1871 -630 -1385 2643 -1745 -1389 1854 -911 -57
2436 -57 1380 -926 -474 138 763 130 140 1216 -1714 203 2117 -1563 1194 1018 -2901 1358 956
2453I56k558L153j852j166K436r77L1J64k01p6j079K564j031j700K699k424m42
2470a503L689l307P57J617l412K404P99k017J591j023m04J321m06L92l95l71R40
2487F72j691K055j9k476L055j621r78L181k699K19J967k855J867P85k361J770
2503H71o54m89R80m40J99q47O30M78k309K557J60l435L948j311k546L976j920
2520a52j252K692j773m82J549q73k60m79J218n34j138K835k280o17L336k915O
2537a119K834l056Q91J202j992J274r5k71O22r99J426p72r36K108j694K48J507
2554A178j592R48j33o36J611k198J105R39k692K776k00k972L242r45j569K523
2570A385j271p51O77O3r2m13J150o67j884L529k079j617M435k846j377L877k845
$$ plain form
2453 956 -1602 1551 -301 -1467 969 -8 23 187 -14 -90 -1169 1395 364 -1336 1363 -1061 -1503
2470 -1503 2186 -1121 -364 1253 -2159 245 1044 -973 618 -405 -809 512 106 498 103 -268 672
2487 672 -1019 1036 1017 -1459 1596 -25 -1003 2178 -521 -302 1665 -1190 677 1462 -899 871
2503 871 217 -272 708 268 467 -380 250 728 -1581 976 1136 -2299 1649 338 -2208 1768 -152
2520 -152 -1404 1288 -485 -967 582 -291 -551 -1030 188 -346 -1484 1351 -929 -1546 1790 -1125 -1119
2537 -1119 1715 -1341 -450 752 -1240 34 -61 -332 290 -709 717 -55 -991 1117 -577 -329 1178
2554 1178 -414 534 401 -235 1376 -822 283 1222 -1470 1306 1106 -1866 1376 431 -1138 1385
2570 1385 114 -637 40 103 11 -402 748 81 -1803 1726 -353 -1970 2465 -381 -1758 2119 -726
2587g26m64K433j973l14J467J19j158J95J987k769K45L367l556J95L742m239Q17
2604f32K530k760O12J344j319K58j34J090j285o04K583k081n45K643k284j39J729
2621A006j619R29k66j8j40j243K426r26k456M047k305j448L739k218j149K653
2637A012j519p75J652L00j530k40K522k587q17N024m503m71M775m176l8M480m029
2654i20n75L281j796j273K362L22k385P35K022l344J447L133n226J865L307m591
2670a636J833J844k978R64Q73l69p22N98N59k225R80K348l435J161J746l040J160
2687c39J405j212K07m83O12n24m52K505k496p96L281k853k46L566k752j046K429
2704H06n53j086R99P26k372O81L308m148L72M208n081O50M724m726P20L164l567
$$ plain form
2587 -726 -1190 1243 -730 -1044 423 542 -616 -421 1566 -1203 -958 2409 -1147 -952 2790 -1449 -632
2604 -632 1898 -862 -250 1094 -225 33 -101 989 -296 -900 1683 -398 -943 1700 -584 -723 1006
2621 1006 -613 316 50 32 -108 -1351 1075 149 -2307 1740 -565 -2013 1726 -492 -1641 1012
2637 1012 -507 -1282 370 670 -860 -1100 1422 -1165 -1982 3042 -1461 -1932 2843 -1333 -1371 3109 -920
2654 -920 -1495 1786 -10 -1283 1079 1401 -984 -249 1773 -1571 -124 3009 -2217 -352 2955 -1636
2670 -1636 197 2041 -937 27 900 531 -191 407 966 -1259 -279 2069 -1366 -205 1541 -1499 -339
2687 -339 1066 -146 61 -422 190 -334 -786 1719 -777 -1573 1708 -1145 -1391 2175 -577 -1623 806
2704 806 253 -833 166 892 -1480 -799 2509 -1639 -1267 2941 -2140 -1490 3234 -1492 -772 2392 -1175
2721a175J23K741j430j553K206N48l528K394K237n078K762K156n212L240J847
2736B278m264K137J066k377R40J047p77r32J062N43j875J778M66k844K415m6j849
2753a232K262j061l10O22q55J561q69j131K401j967j80K609k569L39K066k304
2769f18k9J589l34j453M97J739k490O81L002m452J083L396m556J395L448m417
2785a519R06K215k394Q2J535m02j958K051O98l366K692J048m380L238J241m296
2801b609L211K84l066K791k00j726J449L1n91l69J405k37j912K350l01k016K704
2818A198j245q11J986j836R28K89j377J671p80q49K007j679M55R05j369M13N05
2835D11o75M94l30P54j193JK268k698O09K419l770J492K205l704J842J235k646
$$ plain form
2721 -1175 -1052 1689 259 -1294 912 1460 -2068 326 2563 -2515 247 2403 -2809 431 2278
2736 2278 -1986 151 1217 -1160 -220 827 50 -882 180 723 -1152 626 1092 -1752 663 617 -1232
2753 -1232 1030 -31 -341 281 -574 987 118 -1013 1388 -579 -759 1850 -719 -380 1686 -618
2769 -618 -647 942 608 -845 -348 1391 -1099 -418 2584 -1868 -785 2611 -1945 -550 2898 -1519
2785 -1519 -613 1602 -792 -710 825 423 -1535 516 1214 -2152 540 1588 -2792 446 1687 -2609
2801 -2609 602 886 -2180 611 411 -1315 134 165 -426 -795 610 373 -1539 811 510 -1506 1198
2818 1198 -47 -858 1128 -708 220 509 -868 803 23 -826 1181 -498 -43 862 -507 -94 411
2835 411 -264 230 -100 654 -539 -538 1730 -968 -359 2060 -1710 -218 1987 -1717 125 1360 -1286
2852a286J014J160j083m77J504l76j606J676N41l092L116p7k966K912l53k152
2868a545K805q67j718J863m02p75P90J75m36l50J351j039n52J857j564m97K247
2885A343k375Q56J380k787J447P00j295J186m25n81J105j023N71M18q69L80n82
2902e51O89j20q03J614j388l16K442k873J124J662l133J543J297k529J554L41
2918E53j475P88L52P0p29J082j6j869K159l8k485K800o28k204K760r41q02J586
2936I63j218l76J085l93j31J64j1K9o36J485j049m05J363j655N12J625k587J429
2954A94M28j779K130q60j118J849j022p5O86l61J12n46K95P9q36J602p56r25J984
2973A081j939L34J683k104Q11Q79j796J407L59j516P35k8j42j36K20Q11j581J245
$$ plain form
2852 -1286 -272 888 -195 -672 832 456 -1150 526 1067 -2025 1091 1014 -1952 960 607 -1545
2868 -1545 1260 393 -1325 538 136 -639 151 326 -110 -460 891 -148 -700 1157 -407 -904 1343
2885 1343 -1032 -176 1204 -1583 -136 564 -731 455 30 -551 554 -469 102 520 -349 31 -551
2902 -551 138 18 -785 829 -559 -875 1567 -1306 -182 1480 -1653 -110 1187 -1342 212 553
2918 553 -922 -134 218 288 -441 641 625 -1244 915 877 -1608 1192 564 -1640 1120 179 -623 963
2936 963 -255 -631 454 61 -70 94 83 112 -524 961 -88 -493 870 -785 -273 1352 -1235 194
2954 194 622 -1157 973 113 -1005 844 -178 -253 433 72 184 -362 -67 12 -824 778 22 -903 1081
2973 1081 -858 -524 1159 -945 -134 745 -1051 356 715 -801 -66 -94 -236 -372 -152 659 -922 323
2991C23L87j810J879j77k074K262r96o60J902j553m0J586j713N57N50n63J54O
3009B0N21r58P6J470j759K7J876k246R69J001j884J269j12r13J450j287L98N90
3027E08q00Q54k36o61N26m10M58k6o41J214j142lJ454j770O29R34j716J274r8
3046C48j091J602j121n60J248o00m5J31K73l35n68J482p84j365K817j800r07K715
3064A440j738p44K014j340j13P85k34l24m11J136o92m60J467j235k12J834j862
3081f89N08J057j733J396k46j233J247ql83L40o03O43n95j02J192j590N76J015
3099G92j597O35O68q61L62j66M90j69j005K037j162j274K467j315j185K346r06
3116A57r10J297l20m39R4J045r94q60K312j625n70K511k404K66K338k564L51J409
$$ plain form
2991 323 710 -1100 779 602 -1472 790 -206 -866 1036 -517 -557 1029 -684 -127 423 -140 14 20
3009 20 541 -417 -341 1129 -630 -603 1273 -973 -4 997 -887 382 270 -643 807 -480 -82 508
3027 508 -292 562 326 -335 191 -219 239 213 -428 786 -356 -359 1095 -675 -46 888 -828 446 348
3046 348 -743 859 -262 -822 426 -174 -219 -88 185 -150 -718 764 -20 -1385 1432 -368 -1275 1440
3064 1440 -298 -1042 972 -368 -481 304 70 -254 -665 471 -221 -681 786 -449 -661 1173 -689
3081 -689 -181 876 -857 539 293 -940 307 299 -84 256 -347 296 -299 -401 791 -799 -223 792
3099 792 -805 -170 498 -363 -1 -167 323 154 -851 1186 24 -1250 1217 -98 -1283 1063 157
3116 157 -753 544 224 -215 -121 924 -70 -930 1382 -243 -813 1698 -706 -440 1898 -666 -315 1094
3134A094j706J94J345r96m1L23N52j679O32J845l143J203K266l101J034J398k214
3151i94P76O14n61j38q2R91r88j25J503j970O16J524k169L62J067j293Q73K68
3169B74n77N07n66P76p35m68K007j866n1K055k113L34J704j872NJ276m04r45N53
3188a06J150k066O09K200k959N95K778l354N74K633l035Q13J267j247m11J074
3204E15Q1j672J233J117k489R41J664k884J531J483k669J371O69j462Q19K86m42
3221I2n13M50O55j369Q15J097j970O93R98j968J383J38j019O14L9j39O4j82J021
3240H99j478K29J514k264O78J705k572J065J050j409N77K97k53j100J023J105
3256A066k622J583J391l387J960J654l205J094J740k686Q80J323j182j99R47k77
$$ plain form
3134 1094 -612 -418 927 -69 -110 213 765 -914 -282 1563 -1580 -377 1889 -1212 -178 1220 -994
3151 -994 -218 396 -165 -303 -385 606 -382 -507 996 -974 -358 1166 -1003 -641 426 -867 6 274
3169 274 -303 204 -362 414 -321 -789 1218 -648 -699 1356 -757 -423 1281 -591 -586 690 286 -659 -106
3188 -106 1044 -1022 -413 1787 -1172 -577 2201 -1153 -579 2054 -981 -168 1099 -148 -559 515
3204 515 596 -1076 157 1274 -1215 -274 1390 -1494 37 1520 -1149 222 891 -571 248 534 92
3221 92 -421 29 684 -685 130 1227 -743 -50 948 -1020 363 501 -518 96 135 -4 60 -122 899
3240 899 -579 -350 1164 -1100 -422 1283 -1289 -224 826 -583 -6 291 38 -1062 -39 1066
3256 1066 -1556 27 1418 -1969 -9 1645 -1560 -466 1274 -1412 -532 791 -391 -590 357 80
3272H0j352J907M79k734J966R90l230K661L92k549J743K81j386R64M39m81q55
3289f85J094L75j631J101N81k223K208J89j818J348n47m41N19l45Q69p22k53J238
3307H57j719N90J271j695O48L86r99Q97J55m04M3k78O34j135O84P87j718J048
3325E2R90k395J653O51k485J934K05j834J506L70r63m18J235j05j568J697Q3k556
3343a948K862j31k202K358o87j282J731l57o35N48k12n1n77R10P4j148J254m75
3361C2r95J818o83o40Q24q90J27N85k63O83j113P1R30j103O38P64j508Q85R0n09
3381b57K77PJ84p78N43J098j684N27J560k772J377J146k339J611J92j634J400
3398D58M0r26M83J68K1p65J156M0j662J493J1j821K255o29j146J760r73n02J217
$$ plain form
3272 80 -1272 635 1114 -1620 346 1336 -1894 767 1159 -1390 353 634 -752 212 651 170 -685
3289 -685 409 784 -847 254 835 -1388 820 1009 -809 539 -8 -449 70 -275 594 -128 -381 857
3307 857 -862 -272 999 -696 -48 338 -661 236 391 -13 30 -248 386 -749 -65 722 -996 52
3325 52 1042 -1353 300 951 -1534 400 605 -1229 277 647 -316 -734 501 396 -1172 525 608 -1948
3343 -1948 914 783 -1419 939 252 -1030 701 344 -291 257 45 -6 -583 327 401 -747 507 32
3361 32 -963 855 172 -468 356 -534 -407 178 -85 598 -515 -444 486 -617 21 785 -723 162 252 -257
3381 -257 20 27 211 -567 -24 1074 -610 -83 1477 -1295 82 1228 -1111 500 692 -942 458
3398 458 498 -428 55 223 244 -521 635 675 -987 506 517 -1304 951 322 -824 936 -37 -539 678
3417F78p75J26p8m4J67p05R44k78o71J030o89k59J138j102N11L41j367J457j93
3436B31r64J473j141l7N71o58M07M74o41M12k48M13%q30R87p97QJ376j494N15
3456E7O00j806J699j23j223J331m97l64P51m91J96Lo6K73q62O61J98j213J703
3475H27r00n71J794j325n50J340j110J53O27o11K17J56o2N7k48O62o39l52J275
3494G40j426M43Q22j323P75L37o93R49p33J40P99j347O84J23n68O20k70n4Q1l95
3514b96Q97q39j82J299j363K57J049j551P59L83j312J192j49p32J042n21O0J5
3532Hm75O65p02L88K12p18J153n10o53J435j529p2J661j396K99O55r81L48J82
3551c0O7N7p81R62m68k50J093r27K13Q63j208P42K20j038R80k38q16J257r17N3
$$ plain form
3417 678 -97 29 -49 -93 74 -631 313 35 -636 394 -295 -554 584 -518 -7 334 -1033 424 231
3436 231 -733 740 -401 -438 133 -525 -118 356 -285 127 -121 292 292 -538 449 -348 -340 1036 -458 57
3456 57 657 -1149 550 427 -796 535 38 -326 425 -66 130 133 67 340 -522 139 337 -876 827
3475 827 -73 -644 1150 -175 -725 615 -495 -342 285 -326 -109 47 -15 42 -206 456 -183 -535 740
3494 740 -686 -243 579 -744 31 368 -325 624 -109 31 830 -517 167 290 -278 342 72 18 99 -296
3514 -296 601 -238 -420 879 -484 -227 822 -729 30 413 -899 293 144 -588 454 -67 -7 8
3532 8 -467 198 -504 -116 96 -622 531 21 -632 803 -726 -798 863 -533 -234 421 -560 -212 -30
3551 -30 37 94 -687 275 -193 -443 650 -277 -64 799 -409 333 553 -485 495 257 -559 698 -219 -166
3571a66M55o49R23n43m06Q12j025R37J98r54O61j98l65P29r86J200m74j128J744
3590G65q34r39J798j004m93J160r43L42K1K63K58j122J203n46n88J554j148m44
3608f97J344j530M65J180j584J019M41r87M26M6J64m84OQ59j180J22J326k016
3626a080R61J171k016R68N66r47K85K5K89m65j25J246j076n32J539j439J08J278
3644G56r97J15L11n05N41q36N20L2m52J002o65k79J409j603L59J324j806L40Q32
3663C98q37L66K93j43k74L18Q28j436K68J503j834L84J823k595Q75J064j167J47
3681a9M50m24n92M24J046j308J27J361k061P81J044j828Q28N52j311J112m1n97
3699d56L66r5Q6n75L83P28j199L78R38j841J390O09j518P00M39p06K96P5M08q74
$$ plain form
3571 -166 289 -360 563 20 -386 426 -599 338 536 -418 243 45 -320 409 -577 623 149 -979 765
3590 765 -69 -1008 790 -214 -707 453 -490 -148 -127 136 394 -728 475 -71 -659 895 -253 -697
3608 -697 647 -883 -418 762 -822 197 638 -349 77 123 287 -197 -191 668 -512 -390 936 -1080
3626 -1080 -119 1052 -964 4 570 -377 -92 -67 222 -243 -368 878 -198 -730 809 -630 -522 756
3644 756 -241 -126 185 -320 221 -615 -95 -63 -515 487 -178 -457 952 -651 -292 1032 -774 -434 398
3663 398 -439 -73 220 77 -197 121 949 -487 -219 1284 -550 -166 1657 -938 -63 1001 -166 -19
3681 -19 431 7 -585 -161 885 -423 -296 1065 -996 -215 829 -999 -171 381 -930 182 141 -456
3699 -456 -90 -185 -99 -674 -291 437 -762 -384 554 -1287 103 712 -806 -106 333 -373 -77 -2 406 -468
3719d68l6J228j379N38J171j980N45J252j647J004J36o27q1M65L79p46M02R12
3737A068j904Q76J160k038J029N28j522R87N11j281P17J3k73j57N18L57j342Q49
3755I6N59k043J870L30j976J453j74j219J175J88m11l53Q62n1j038J076O12k315
3773a359J414P55j954J516K97j362O26O00k51j38J14J08j047O05J167j728Q99
3790B62Q25j815P71N93j391J125l31j2k43O1O77r30M69O38j900J702K50k073J620
3809B98J16j452J213K13p64J57K57qo56J123R0k000J807K65k055J920O1j731J656
3828E10j47o91O96o7j97m79M74N54j016R87k22j162J874m98j169J556j189k6O62
3847D50m27M02l30n7M10j154J093N11j773J290k44p90R97p7o98K05RK26l53M56
$$ plain form
3719 -468 -504 724 -655 -117 1054 -926 -381 871 -776 228 364 -263 -344 121 500 -246 156 1068
3737 1068 -836 40 1200 -838 191 719 -803 184 695 -586 131 144 -129 -286 232 589 -753 96
3755 96 655 -1388 482 812 -1164 289 115 -1104 71 259 -152 -505 357 306 -732 344 956 -1359
3773 -1359 55 810 -1144 372 669 -693 -67 533 282 144 258 366 -681 -76 1091 -637 262
3790 262 1087 -728 43 636 -755 370 39 27 -216 -155 522 -408 61 699 -1201 501 751 -1322 298
3809 298 414 -1038 175 388 -376 -219 38 30 -626 497 587 -1413 394 659 -1396 524 585 -1146 510
3828 510 363 -328 368 301 104 -375 99 653 -363 624 402 -760 1114 616 -553 1003 -186 -212 450
3847 450 23 425 95 38 448 -706 387 898 -875 415 171 -619 378 301 -397 -192 -183 43 -310 146
3867A46K19j586J250N67j785J655j25j352J036m9m71P36q2l47q0J26K55p39J016
3886C90l58r51J775m63q52J374r02o90J344p27oN96l70Qm69M76K60r70R42k29
3906A78p47J491p97m36O84r78Q98o5m95P98r48Q1R31q87M69K75j160P09j65k47
3926d11P92o26K39p5l49J166j104L87L76j150J132K1j053J444q62p56J304j74
3944C01l33K26j44K8k23O03J33r59P97j59r10J463p25o60J423j213K84N14n72
3963a26K78m09m11O24l57P43n19k37O22p45J21J069j151Q3P28j139J019k55p85
3982h47R31m77J28M72j073J103l20r98J304j06k81J35q7L92n83L52N06j397P19
4001a27Q33j221J082r5q03P79n34k52J069n76M7j9M4K02n04O01m21q65J540q43
$$ plain form
3867 146 365 -1221 29 596 -1189 466 341 -1011 25 -24 -495 241 159 -188 -268 -142 113 -626 390
3886 390 32 -919 856 393 -459 915 13 -677 667 -60 -66 530 160 168 -301 175 435 -535 407 178
3906 178 -569 922 125 -311 373 -605 293 228 -267 531 -417 -336 595 -292 177 452 -708 1 -164 -411
3926 -411 381 -245 -6 -81 -430 736 -368 19 395 -755 377 398 -655 789 -73 -829 475 301
3944 301 -32 194 50 78 -145 458 591 -368 429 270 -640 823 98 -562 861 -352 -68 446 -126
3963 -126 152 -257 -668 -44 -401 342 -177 -414 208 -537 -416 653 -498 -415 313 -826 193 -62 -847
3982 -847 84 -393 -265 207 -866 237 -83 -1081 223 117 -164 -29 -116 276 -307 45 551 -846 -127
4001 -127 706 -515 567 472 -331 448 -86 -338 731 155 202 183 227 429 -75 526 105 -760 780 -63
4021f3l94J252j102Q3R22r83L39J47o82O44m72K63j6n80O89j36j78P49j032P25
4041A75K9j147J109j66n89J063n96j63Q22q93M14L8k24N92p09L34N31j052Q59
4060D27k98l87Q05o31L68Jq40J275p04l56J051r12k24J034o96l4J86n81N47j32
4080a01J00j43o21J206p79m87J273r36J23O76q33L78M11n66N58n24J86K11n50
4099d18N90l31n35J285r08J99O69r22L71M54r81P72j49P9M10p52N67j58m65J210
4119I87q17k18Q51j270O64J40m78M21l35R8K63o45P17l93m63R08p00l80J020p46
4139c76J24O56j003M28J40j61J56l07O01q90J97J066j133K47Q59j199M62O02j295
4158h26O70M74o37K73K06K87p34QJ129j272O6J171j455Q46K50q68P66J58q94P98
$$ plain form
4021 -63 -457 795 -307 -224 698 -285 54 201 -481 163 -309 -46 -62 -642 47 -89 -267 482 -550 175
4041 175 204 -943 166 0 -589 474 -122 -285 537 -356 58 96 -128 464 -245 89 620 -432 427
4060 427 129 -258 547 -84 284 285 -555 720 16 -340 711 -201 -425 609 -87 -121 65 -516 31 -101
4080 -101 -1 -144 -765 441 -338 -825 448 -488 -365 311 -522 -144 267 -299 259 -265 -79 132 -418
4099 -418 172 -159 -694 591 -317 -118 551 -371 0 454 -527 245 96 175 585 -167 400 242 -223 987
4119 987 170 -48 803 -467 197 337 -141 280 -55 43 306 -339 378 -15 -478 430 -270 -650 370 -376
4139 -376 -252 404 -599 -171 -31 -192 -36 -343 258 -632 -435 631 -502 -255 604 -595 -133 469 -826
4158 -826 -156 318 -319 -46 160 447 -287 -279 850 -422 -356 815 -640 206 456 -412 354 512 -382 416
4178D16k59l28q0M74L09q43L13N80j389P48P98j645J216Rq01M48m7J03j11j76
4198b65P74j234O18J085j864N55R19j324P15J81l68K92L26j79k98K7O55r51J00
4217b36J086j469Q88M92j405P03Q47j327Q53j95k92l1K91K02p35L43O80j403J114
4236D06O57j843R91M14j457O73K74n93L15Q0J79n63M73N75j694J384R9j599J188
4255d1J87j023J119k06n74N22k67L24k94J08N08j032Q68J50j276J183J22j019
4273f41J194j35n54K85R8K72n98M76L96j566J081N29j280R09K72j821J351L20
4291E88q44M18K03m55j03N83J1r88R58o5j387J535J77j694J624l98j052J276l37
4310E0l74M38k13K87p87Q48K51j421J103J59j090J326m79l65O82m57J62Q4k18
$$ plain form
4178 416 157 -171 -251 223 532 -311 2 582 -807 -59 739 -906 310 319 -482 -34 -81 22 -89 -265
4198 -265 509 -725 -107 978 -886 -331 588 -736 -21 160 -208 84 410 231 -67 -40 615 -336 -236
4217 -236 850 -619 269 761 -644 59 906 -421 432 237 -55 -86 205 407 -328 15 695 -708 406
4236 406 1063 -780 211 625 -832 -159 115 -478 -163 -83 96 -467 6 581 -1113 271 370 -1229 -41
4255 -41 146 -877 242 36 -538 -16 -283 41 -253 -145 363 -669 199 349 -927 256 378 -641
4273 -641 553 418 -136 149 247 519 -79 397 793 -773 308 837 -443 466 738 -1083 268 588
4291 588 -256 162 365 -90 -193 390 401 -587 371 306 -1081 454 631 -1063 561 163 -889 387 50
4310 50 -324 114 -99 188 -599 249 500 -921 182 341 -749 577 98 -267 415 -42 120 204 -14
4329a4P4k14J05P58j098P31j03p03O79k27m82R94o21k38L68p3L46m60L13j21j172
4350a158J580q5j076J202m12r47J333j18p04J15L43k48m72R60M9j147J151j57
4368B09r71J482l62j119J248q46j83J089o52r4K78j06L62n96N76j25o35J242o58
4387A39m75J351j314M0Q17m21K05k34k27J24o73J263m5j470J293l68n48Q27K14
4406D98r66L86n8K92l88M73K09j539J017L77j162J363n31q92J073m92j09J151
4424G02p09k85k67N42K54m65L32k49q50J690o49j86Q27j148P6P78m56M18P1p58
4444c32R0L58L56k10p66R45n38j97J142q30NL16o53J88R4m2L07r91N96O28j038
4465e72R00J01j020P93m73P6M67n12L61k49j83O80p47M76J41q34J095M7q75R63
$$ plain form
4329 -14 60 -154 -49 709 -389 342 239 -464 215 -12 -494 500 -121 -359 9 -64 282 -178 135 14 -1158
4350 -1158 422 337 -739 463 51 -896 437 319 -385 -270 73 -175 -647 313 362 -785 366 209
4368 209 -762 720 358 -761 487 -359 -542 547 -105 -199 79 -27 335 -261 315 190 -445 797 139
4387 139 -336 1015 -299 -259 558 137 342 108 -119 5 -668 595 550 -920 373 5 -543 284 498
4406 498 -468 -82 -140 152 -236 237 446 -1093 -76 301 -861 502 -29 -921 152 -340 -449 702
4424 702 -7 -292 -559 -17 237 -228 104 -145 -995 695 46 -140 687 -461 -385 393 -63 355 426 -332
4444 -332 -242 116 472 262 -504 441 -97 -294 848 18 23 339 -314 -126 -32 -74 233 -758 -162 466 -572
4465 -572 328 429 -591 202 -271 -195 272 -240 121 -128 -311 369 -378 98 239 -595 500 547 -328 635
4485F35j065r4Q48k39J3J26o29L59R1M72k13o67Q83m00n91J623j151m67J265j262
4505d63L79N89o58M79q12J44M33o99Q70m75m36M51l0O7J97n16L91k87m16J307
4525E15q23m20J006j127P25M80r03P87m11j88O79m67L56kk94J32pK06K20m81M84
4546D67l85o42J403n37n81Q93j009L63P98p32N25k88j95N62j019O85m0p94R37
4565D11l35r8M55q94J91N86q65J093l70o68N96l57L53P8m22M59n58N7R66j182
4585e04L56O88j351Q10N5l06N36p19M93k8o41J116l09n04P85p13M8N48n51M78
4605B87l30j45P41r43O52j63q97J391o12r1Q15j100K62N85j125P55M5m85O04n19
4625b73K65j65j15N58n88PR58j092J27O04q97P74j77o04R80m43N0q2l43R23m07
$$ plain form
4485 635 -430 -524 324 85 98 224 -405 -46 45 517 304 -363 520 120 -471 1152 1 -466 799 -463
4505 -463 -84 505 -153 326 -486 -342 91 -608 262 -213 -649 -198 -228 -161 36 -480 -89 -376 -792 515
4525 515 -308 -728 278 -849 -124 356 -547 240 -171 -359 320 -147 209 207 -87 45 38 244 464 -17 467
4546 467 82 -560 843 306 -275 618 -391 -28 770 38 563 275 80 642 -377 308 268 -526 411
4565 411 76 -22 433 -461 -270 316 -549 544 174 -494 102 -255 98 176 -246 213 -345 -288 678 -504
4585 -504 -148 540 -811 -1 54 -252 284 -435 58 30 -611 505 196 -308 477 -236 -188 360 -191 287
4605 287 -43 -188 553 -390 262 99 -798 593 -19 -110 705 -395 -133 452 -673 82 127 -358 246 -273
4625 -273 -8 -173 -288 270 -318 -311 647 -445 -318 286 -611 163 -14 -618 362 -81 -31 -113 -456 467 60
4646F0m06J109j231O75M03j246R09J57q17J067p96J68K95m75O26n77j15P80p95
4665b09N27M01j150Q13Kn88O52q6o62N75n15N75n32m4O21q69K61L76j136R31K21
4686A64q46P59j0n80M84j75L67n26K7R01j039M28N96j446N95M98q75Q09l84o1
4706c14N07m41N32l18J11M98j084P55N08j623J070N10j457J339l72n29N16j56
4724E2j30j01K72J94q18N53N08j498J303J78j219J111or06O76n54O4N62n18M33
4744A56n99N79k1p04Q19J94j260J135l95j96P57n83J42j07J87L47q23N20M16j335
4764g71J074L78j317J211l30m61P69m84n7R6J02J29p38Q08K52j548J155J84j519
4783a067J436j20r93J219m68n77N82J16m56k30O94M9j204J400j95j020J605o67
$$ plain form
4646 60 -346 763 -468 207 610 -636 273 430 -387 680 -116 52 347 -128 498 -79 -194 586 -209
4665 -209 318 719 -431 382 384 -204 448 362 -300 275 -240 335 -197 -241 380 -489 -228 148 -988 -57 164
4686 164 -682 77 67 -513 -29 -204 163 -363 -336 565 -474 -46 550 -896 -301 197 -678 131 -253 -314
4706 -314 193 -248 284 -34 77 575 -509 246 754 -869 201 711 -746 593 221 -308 208 52
4724 52 -78 -179 93 287 -531 22 530 -968 335 513 -706 405 399 -507 169 -385 -321 241 -277 156
4744 156 -443 136 115 -589 230 424 -836 299 -96 -292 465 -118 24 -83 104 451 -372 148 564 -771
4764 -771 303 681 -636 575 245 -216 553 69 12 108 210 339 -399 409 661 -887 268 452 -1067
4783 -1067 369 249 -744 475 7 -570 12 128 -328 -558 136 185 -1019 381 186 -834 771 104
4801A04j273J867p94j70M41l99Q0k6J60L90p83P94Rj089J127n08n01J071n68q4
4821a52K41k53O95o52J63P19j137P76J12j050J035k09j008J296j95p21Q90l77
4839A73j55k72M24K51j151J267l06j294J728m79q18J438q20n40R51l17j88J7L4
4858e7J2k43O16k38p02J036n34m50J298r88k51J279j252J57Q82p40K84l28N88
4877C69L1r00J168l57j175J277k86m44Q25m93k02l2Q7L37m31O05j12j324J671
4896F14l96p93J285j000q6J045m68k86J87l05O9k54P24j25r09J128p24n23J626
4915H09r02n08J186j113K22Q37o98J10l6L17q4k31Q61p12q33J557q91J3O47o64
4935a13P4J05k14Q23p69RN53r09P49J28n29L49l07l82Q57o71J52J12l77L82k31
$$ plain form
4801 104 -1169 698 -96 -266 175 -224 -144 -170 -10 380 -403 391 400 -689 438 -70 -571 500 -68 -152
4821 -152 89 -164 531 -121 42 761 -376 400 512 -538 497 288 -720 576 381 -340 550 173
4839 173 18 -254 170 421 -730 537 231 -1063 665 186 -632 806 -14 -554 397 80 -108 -91 -57
4858 -57 -45 -288 328 90 -612 424 -110 -560 738 -250 -501 778 -474 -317 565 -175 109 -219 369
4877 369 400 -500 668 311 -864 413 127 -317 508 15 -187 -219 -132 205 -226 379 267 -1057 614
4896 614 218 -575 710 -290 -376 669 201 -85 102 -203 -134 -388 336 211 -698 430 -294 -817 809
4915 809 -93 -601 585 -528 -306 531 -167 -57 -93 224 140 -91 770 58 -775 782 -109 -96 551 -113
4935 -113 -39 66 -148 675 -94 -85 468 -441 308 436 -93 256 -51 -433 424 -247 -95 17 -360 22 -209
4956b09J43M79j016N78L4p11J147n19o91J146r97K87L83l72L82l39M58o14R0J046
4976G05r87m71J507j143k7J459j478J66Q79r25M69J79n31K70l88P22J66q58K87
4995Al14K58N28n77L95j97q19R88O6l68L68p50J00L94n12P27k31n60R00p43K73
5016g3N78p45l3K61l48M31q5K89j85j244J855o86m41J472j367q4O57m28O59j75
5036C08m83K11j47K06L40p14N11l33K2P64j046N88l33m39P73j19o98Q77m55m08
5056e75P05k14L35n76M9L46o44Q49K46j159M34J49m79P16n02K99kp07J016l64
5076g8n61J102q76j80O90m66M83P1k49J81l46M12M07r68P22m57j51J158p30j33
5096C1O83j111M48L91o72P26n55k05N69m1J7m66j72P75o24K37M91r41M78J76q17
$$ plain form
4956 -209 -66 413 -603 -25 9 -702 445 -74 -765 381 -616 -329 54 -318 64 -275 183 -431 -341 705
4976 705 -282 -753 754 -389 -416 1043 -435 -269 610 -315 154 333 -198 72 -316 406 572 -286 1
4995 1 -313 -55 473 -104 291 94 -725 263 329 -39 329 -421 -321 73 -439 288 57 -503 397 -346 -73
5016 -73 505 -240 -273 -12 -360 71 -14 275 90 -1154 701 15 -426 1046 -321 -405 252 -176 483 308
5036 308 -175 36 -111 95 435 -279 232 -101 -79 685 -361 227 -106 -545 228 109 -589 288 -167 -575
5056 -575 130 -84 251 -325 -276 70 -574 275 521 -638 -204 -55 -534 182 -320 -21 -23 -730 286 -78
5076 -78 -639 463 -413 -593 97 -369 114 185 -64 117 -229 183 590 -378 344 -113 -264 894 164 31
5096 31 714 -397 51 442 -230 496 -59 -264 305 264 281 -185 -357 418 -206 31 522 -419 59 235 -582
5117e82P14j20j7l50o8M30o2l50O53p25J69Q11q41K50J40n51O09l33Q7K71n82
5138d47L69K3k09R01m91l08L37p55O90J67n68O95m84l19O61m10L39j9l14M17k48
5159B7o4O64j063M12M71r19Q86l23p00N55o51Q51j14j76M32m61K1N26p76M22O2
5180H2n93O93j3o22P39l44Pm8l00R30n43o3N16j029Q39M58j093R74l59l56K67
5201A42J00o1j38J2Or5K60M76j259R33j24n45R22l10r27Q73l34n0M11n41M77l85
5223a57J23J93n04M51m1r68J020k34k65N75m60N2K56l59L99k34j19N66p19K49
5243a76N31q69O36P5o98Q98m25j10J67k17M0R4R5L50q32O08M37j325J118j6o80
5264b99J037q60j21N97k96q4q4L06M5o37N44k74m64J093k89j050J417n99l31J170
$$ plain form
5117 -582 132 12 -5 -355 -423 7 -55 -405 248 -477 -308 503 -338 -88 52 -499 110 -223 -136 135 -447
5138 -447 -78 -55 -264 637 146 -162 175 -580 110 277 -291 404 -80 -399 262 -148 191 172 -142 275 27
5159 27 -37 627 -436 -24 447 -472 414 91 -609 -54 -705 146 32 -144 288 -173 -152 374 -402 20 82
5180 82 -511 182 169 -453 286 -58 -51 -99 -399 531 -12 -75 441 -588 251 709 -384 590 231 -125 142
5201 142 242 181 43 55 61 -34 226 702 -557 376 252 -293 629 319 -608 265 -69 -119 292 -249 228 -157
5223 -157 -34 159 -345 106 65 -903 117 -117 -382 193 -267 -215 41 -318 81 -153 -272 294 -425 -176
5243 -176 355 -514 122 197 -501 397 -28 -138 29 -188 -148 -54 41 391 -441 167 604 -721 397 381 -299
5264 -299 738 -122 -243 354 58 -26 -110 196 241 -396 148 -126 -590 503 214 -836 581 -18 -349 821
5284H21q75l4K4l4J89l67N03k12o30R71n19p1N18m29L1O17q72qN02k25K77m60
5306b83K85J66o74J050k72q41J112o05m05Q20k72j21J09l0m2m17Q16l58p74J110
5326C74p9j205J567o85n96R76n42O7K22k69K29j81M59l31o58J057n68m74J370
5345G33q50k82J018p84k18Q21m49k11M3K22J28l90L95n8n87Q01o01L2P26q48N51
5366A92O5L0J12l89O6K51l60O88l36o01Q20k66n14R46q05J20L49l48n7j64M95
5387B94l77l95R84q67m01J345n88n82J229r86J15P70j049K02K41J39k40r1N50
5406B93n42j5Q97q92o4Q43p63J05L25m83M73j57j90L41l90M57j11m66P94n19l01
5427c65R67q14j55O34l73K33k2m03L84m09M98p5l62O88n84k22R09q84K99N16o63
$$ plain form
5284 821 -54 -88 -64 -98 91 -276 227 15 -615 356 -163 -234 284 -145 -114 503 -369 -377 125 -100 177 -283
5306 -283 2 168 -506 544 272 -569 543 -62 -467 353 81 -40 69 39 -3 -420 396 38 -736 374
5326 374 295 -910 657 -28 -624 352 -190 -123 99 -170 59 -122 337 6 -652 405 -163 -637 733
5345 733 -117 -399 619 -165 -383 438 -11 -222 -179 43 171 -219 176 118 -469 332 -269 -237 489 -359 192
5366 192 257 287 399 10 76 327 -33 655 319 -282 538 272 -242 704 -101 19 368 20 -37 -201 294
5387 294 -83 -478 506 -361 -762 583 -5 -587 642 -344 -229 541 -508 -306 -65 74 -166 -257 293
5406 293 -249 -264 633 -259 -323 520 -243 -138 187 -296 177 20 -170 171 -219 238 127 -339 455 -64 -365
5427 -365 602 -212 -367 267 -106 127 105 -298 86 -323 175 100 -262 426 -158 -380 529 -355 -56 460 -203
5448b03P2L96o51M17k41J60Qk95Q78p04p3R09r45M7Q65r63M69K95n59J96m7p9
5470d8K37k51L42k28j24M83o88M42J38o43Q52l27k68O25o84J23O3j68L24j72k8
5491@N38q58j32R10l61j85P9l66M07N0J5J03p06O24m88l9J073j000m1R87j274
5512f64M36O15q14L66o1K3Kj9N15n26j83J023j133N06O58j238O68K24o96R05l88
5533B19o62O62k88K81r1k52K57l77R3N33n75M85m8m01L26j87k0L89r95R21m45
5554a75l80R70n27j63O87j011L76M18n37L63k89J50K2j92P64m20o01Q70m19K17
5574A23M87j080K34P39j007O61M6n61O03j89j0J98j67K06p13L48L48n15M29M5
5594B25r21Q01O8l59O27o90J95K70o70O71k98l11N51m91M61r8k36L01l61J83M99
$$ plain form
5448 -203 -131 265 -386 31 -210 -50 -42 -337 541 -163 -236 673 -272 -225 640 -323 146 441 -118 78 31 -48
5470 -48 189 -62 280 52 -72 411 -277 165 303 -340 512 185 -83 542 -142 -19 44 -124 200 28 0
5491 0 538 -320 -452 458 97 -88 -9 -375 32 82 97 200 -506 118 -370 -409 664 -336 -377 610 -664
5512 -664 -228 387 -427 -61 -122 -99 -97 -116 399 -127 -310 713 -420 86 744 -494 174 398 -298 607 219
5533 219 -443 219 -69 212 121 -131 126 -251 -158 375 -200 285 237 -164 162 -25 -45 344 -651 270 -175
5554 -175 -555 415 -112 -275 412 -599 -223 195 -342 21 -268 -118 -96 -288 476 56 -545 325 -94 123
5574 123 610 -470 -236 503 -504 157 203 -358 245 56 46 244 77 283 -430 -82 266 -249 180 225
5594 225 -696 105 173 -186 441 -249 -54 216 -454 217 -81 -392 159 -332 129 31 -205 96 -265 -82 417
5615D17p00O00j40r20R99k34l30O70p09J71M00k60K68k74k39N83o04M03J87o43
5635c55N92o36N12M88o97J64J87o56P75Q7o23O52q72M53M04m98M75o95J14J98
5655F9n24O81O7q72O40J1k37N43m38p7K35k31R0P5m5J60p21M06J96l42P64n49
5677i9m99O50j19K74n9n15L32k93J45N51n97N57j72q51J233j98l82L84o47p8P82
5698C99k61O0m9k53K31l23L29J25r07O95O5m98R06n83j8L13o28N14l22J11L22
5719B28n98M78K21o03M72K6o15P72l23j20M53n58j6K13j04N12m93N9L11q28Q01
5740B88J25p68O88j68o20O64k23j11O02l71k03j87P52m55o04R50m00o03J123o37
5760a58r8P53n07j1K97m96N46m96L03L2m04N53k84o22J039o10N8L56o02J87K69
$$ plain form
5615 417 -283 317 177 -743 256 22 -308 362 -347 -176 224 -36 232 -42 -281 302 -302 101 288 -355
5635 -355 237 -399 113 601 -96 68 255 -401 374 461 -162 490 -382 71 475 -23 452 -243 -129 69
5655 69 -455 226 293 -579 61 72 -165 378 -60 -137 98 -133 -43 32 -13 147 -574 -168 28 -314 450 -99
5677 -99 -598 52 -67 207 148 -367 -35 -328 -183 368 -229 328 156 -695 538 340 -42 342 -305 -383 399
5698 399 138 198 149 -104 127 -196 133 258 -649 46 111 -387 519 -64 -82 231 -397 117 -205 -94 228
5719 228 -370 108 329 -274 198 224 -391 381 58 -62 391 -167 -183 30 -74 438 -55 4 315 -513 288
5740 288 413 -355 333 165 -455 209 -14 -125 477 106 -97 -284 468 13 -591 359 -41 -644 479 -158
5760 -158 -256 497 -10 -21 276 -220 326 -170 133 165 -239 314 30 -592 447 -163 -105 251 -351 -164 105
5781A05n73P23n02J20K89p51P34o5p79J110n83l6N70m64K37o7J7Q9K3J2J18q04
5803d77R60m17p70J553p73l73R06q18Q8N80o59J32K37J05l01k27P10m09k36O92
5823E03n92j22O81p63L09M21p01K61J35n22L76l90N97k72k64P94n29k14N92o72
5843c72L49K49o36L53K2K2N7k51N17K9p54O92k46o24R86p36K65O75q16L07o9n
5865A4j63P4K11j21k87P10m96j92J122j281K7P12o31j27P49o05J26O2J45k51L5
5886a67O31r64m7J322j128K18N03p15L59L52p85O64l32J05j13j53N57m07j96R77
5906F81j021K91L78p17N26M2k88K77j05K7J56m10N97m22o25J330r72J01N26r12
5926e40O60J48n82L88J68k35k40N3N78o77j77R08j182M69Q74j244P47Q2o63M67
$$ plain form
5781 105 -468 255 -247 -127 162 -589 145 80 -699 411 -172 -208 362 -102 135 68 85 174 197 209 327 -477
5803 -477 483 66 -704 849 76 -297 609 -209 -121 459 -200 -68 169 274 -27 -254 456 47 -189 503
5823 503 -89 -211 470 -293 16 437 -264 -3 132 -390 -14 -404 193 -79 -343 451 -78 -292 300 -372
5843 -372 -23 226 -410 -57 -35 -13 44 -207 310 339 -415 277 31 -593 393 -343 -78 597 -219 88 19 14
5865 14 -149 -75 136 15 -272 438 -58 -250 872 -409 -382 330 -301 -428 321 -284 -158 -96 49 -202 -167
5886 -167 464 -500 -547 775 -353 -135 368 -347 12 364 -421 243 -89 16 -97 -250 307 -100 -296 681
5906 681 -340 -49 329 -388 138 180 -108 169 64 91 247 -163 434 12 -613 717 -255 -154 372 -540
5926 -540 120 268 -314 74 242 7 -233 -180 398 -279 -456 452 -730 -261 613 -631 116 198 -465 2
5946Bo2j87L27k05J50k61J30L83n03M0O17j096P66L31q78P78m50M7M50o48N76
5967C07m08o9L47l65j61N33n38N05K66n22K99j86J21mq1J29o7m05M76n06J3J075
5989G59j220M68L85j012P86O9o91O09j98J76k95J23M42o86L06L48o42O97l23n04
6009d03O35L2m53N73n06J18r5j3M38k97k7N9j21j6L40o77Q53k83l53N04o86M92
6031A14j15l66Q13o69Q5L30n17K42N13p93O74m13k92L45k12L09Q3n46O12l38k0
6052a61O53q39O67j07o33M42O3m00N82l19o5M46m24M08n50J12K55l15L63r8l86
6073c06P44p83j00Q76p23M85q7k02L93l51j29N54m54J03J67l09M75l31m90N56
6093H8l64M19J05m60L97m54L60M34p90J64M40q84N55J91m88N08k14o6J19j12K97
$$ plain form
5946 2 -60 -247 80 -125 25 -236 -106 277 -226 -186 431 -665 101 432 -446 332 -118 -71 379 -269 307
5967 307 -101 -170 177 -188 -349 184 -354 151 417 -105 194 8 129 125 44 173 106 -299 177 -329 -316 759
5989 759 -461 7 392 -620 166 235 -456 153 -45 131 -164 -41 401 -285 21 369 -273 424 101 -403
6009 -403 232 264 -189 384 -122 -4 -99 -112 326 29 2 61 -60 -76 264 -413 440 157 -196 308 -378 114
6031 114 -1 -367 446 -223 -138 192 -325 -83 430 -363 311 -102 -394 -49 -261 48 131 -415 197 -141 -161
6052 -161 492 -347 320 213 -420 22 85 -315 267 -52 -117 329 -95 313 -237 -125 130 -185 178 80 -306
6073 -306 438 -345 -445 431 -292 193 106 -96 297 -54 -183 371 -83 20 187 -122 353 22 -468 88
6093 88 -276 143 248 -212 185 -269 91 525 -265 -101 339 -545 10 201 -287 221 7 -59 60 -52 245
6114B45n92o2Q84p37M30L34j060P04j37m32N97j46l16L26k05Q9J09l01L10k53
6134b13J72K51o24P94m49l61P98p21J64P09o80J48J69j81J63k93J94P8m82N85
6154B21R9n47L91p48N43L81n09L76r9m26N79n10K94L20n49L75J27n10N16j83m55
6175c14N37m47N11pk14m8m97M93M49q52N09K56q20P58N8o29R69o68q2n2J24N00
6197E34o30j37M51p05O69n5m05N72o34K9P70m27K26l84l37M75m8K1n5m04O41q6
6219H1m44N69k64r9M59m30K0N35n60J73m67P7O99q79R05l21p19J229l68l12M22
6240C06m43j8nj54P49n11J03J57o71Q15j65m75N20l05m21P15j50j7r1q2J95O0
6262A12j13J22o35N72k11k97O63l55o5O86n20K27K10q52M57J30l4r4j82O46m51
$$ plain form
6114 245 -347 -409 475 -262 168 502 -558 146 9 -423 174 28 -288 38 -167 -78 31 -270 40 -213
6134 -213 -41 210 -414 380 -69 -430 368 -353 -189 520 -160 -12 157 -24 139 -154 40 118 -364 221
6154 221 320 -227 164 -584 -41 340 -169 207 108 -318 261 -249 45 365 -184 191 318 -192 324 141 -314
6175 -314 223 -224 287 280 66 18 -479 14 463 -389 120 376 -444 314 372 -257 712 44 -38 -90 34 534
6197 534 -96 -233 218 -487 182 127 -278 294 -340 -311 459 32 258 -126 -463 12 -36 -15 -70 -474 167 81
6219 81 -363 206 -58 -157 302 -128 -108 427 -133 40 -427 -350 349 -530 375 54 -665 564 196 -116 306
6240 306 -137 -155 -160 -314 435 -76 27 184 -487 328 163 -312 208 -97 -518 197 47 30 -61 -143 52 112
6262 112 -1 121 -514 58 -153 -450 213 -142 -207 479 -41 186 396 -456 1 131 97 3 -179 467 16
6283A6m83P81l44l45Q81p78K09M03o38M20k04P0m2l5J75J6l98O02n74J57M66p56
6305d01K86M34p32L80M01r58O53m55J86J50k50N04n77j3O87o22N6P96p52J34L2
6326f1l40K24j77L48m3l68P59l54k07O63m59l13Q32q62L00L44m81J62j87L43k98
6347a75k32R14p03k1Q85p96n8O20q10K23L65j93J47L4k57J29k5M68q57J26Q93
6368F77j178P39K02q44N91j95m47Q35k52l95L64q6K0p3j30M74o70J26N92m14K75
6389B11J60m73R2j42k40M52m09Q09m64m06P03l32j73M29n39K41N54n56J17n9J20
6410I5j06J3L67k65k24L11m94k5O49o58K89M90r94M79J45j99Q8J27J00k60mK32
6432A56q05P14K78p56L69L81p88Q70n43P6O56p33L13p8m43Q12m73k89M86o39Q21
$$ plain form
6283 16 -467 314 -30 -375 506 -272 -63 340 -298 122 -82 -12 -54 -89 86 102 -296 306 -268 -111 355 -401
6305 -401 -115 319 -413 -33 368 -590 63 -392 -206 -56 -306 198 -379 -392 295 -327 -271 525 -227 -93 -61
6326 -61 -401 -177 -354 -6 -49 -417 342 -12 -219 444 -15 -328 504 -358 -58 286 -195 -33 -220 123 -175
6347 -175 -407 507 -196 -217 668 -128 -186 434 -376 -153 212 19 166 200 -57 72 47 515 -342 -216 677
6368 677 -501 238 440 -404 187 -8 -455 380 128 -267 97 11 31 -42 -172 302 -368 -242 350 -64 211
6389 211 371 -102 -10 -152 -392 60 -349 460 -4 -410 293 -39 -212 217 -322 -81 473 -83 34 -25 95
6410 95 -11 2 369 104 -120 191 -303 -328 321 -337 -48 442 -552 -73 72 -127 -39 88 188 -72 -76 156
6432 156 -649 65 343 -413 -44 337 -451 419 -124 -48 608 -125 188 110 -333 479 6 -283 203 -436 385
6453C85k58j77J46p3oK40l51J42k51j09P72p82L18L12o19K89O05q88M43K82k34
6474A86K7k76ok8l9K42l04jL36n11N21K7o44P47j67p13O93j04n3n5n7K72l43N
6498b45N47n75K44M01j143P33K02l80M70n01J70M13m87N87o54k6O55o29L22J9
6518A23n10L45J54m14M17o4k26K60j01L38m84K67L88q52M66km65O37J76r62O76
6539A67k67J00j12j09J76k41L02K61m92J87J87m62Q22l75m20O23k43k31J64j60
6559a23J73j69r0K25n3J16J37n59N54k61J30J87l43J77L07n15J34r4r5L34l87
6580b15P9J02m11L77K04l92N67l32l02K70k63M39k21N3K74m13J80J99o13O50k4
6601B08p05N42o9j15M22l23J95P2l07K98l27K50m44k21Q68n00r5O65n64r5M33
$$ plain form
6453 385 127 -50 96 23 17 257 -94 48 -203 -312 460 -322 -4 308 -311 -22 583 -305 138 420 186
6474 186 213 -63 -69 -97 -136 106 -198 -199 137 -374 147 174 -470 277 110 -603 90 -14 -67 -122 -179 93 -250 -245
6498 -245 302 -273 -29 372 -771 -38 164 -216 254 -247 -77 336 -151 436 -218 -244 411 -218 104 123
6518 123 -387 -42 112 -302 115 51 -175 85 -16 322 -162 105 493 -359 107 105 -360 277 453 -509 167
6539 167 -100 0 -112 -221 -45 -286 16 277 -215 -28 159 -303 519 144 -276 347 104 -127 37 -123
6559 -123 50 -119 -209 16 -37 79 216 -343 211 -50 80 267 -76 101 408 -107 27 -67 -162 172 -215
6580 -215 -136 -34 -445 -68 136 -256 311 -21 -323 -53 -316 123 -98 -45 229 -184 -4 195 -418 232 208
6601 208 -497 45 -24 -139 283 -40 155 227 -80 218 -109 141 -303 -524 344 -156 -251 414 -150 -245 188
6622A88l62L10J45k87K49m41K32K87l29Q7l11r9O08m39K09J89m31K92k11k97P24
6643C13j98l36P43r68N46K27o66N04k33r5m3P1l3P6m3J78k58p3M00n06P48k68
6665H6m02N14l39k20O05l35p4p6J4J47Q7n39O88m14K49J74n53O70l75j82O19o44
6687c00L53L5j13M3N3j38K33m45L68j13l07L77k7n8K35l73J11K01k73M07k40r7
6709f8K13j52J83qo65O52j27m40N66l06j3J93j5P0j34k7J2j78L56p3n64Q99l19
6732E5n19P02j24j10K44k44J27l03OK76o0J16k6k64J19K71n79M20k87qO33q44
6754c99P1N41k72J42l11J90O4j40L44m38j33O97m46k46M71m34K04J36M7n2j97
6775a61N0K38j93L87m27m12O60r8j92M73o01L16J32l30L60k97K14j94l01L16L38
$$ plain form
6622 188 -174 136 281 -6 243 -198 34 321 -8 79 -232 -331 277 -162 47 236 -195 97 -114 -411 313
6643 313 115 -221 522 -446 100 327 -339 165 -68 -163 -206 -135 -168 -92 -135 43 -215 -288 112 -394 354 86
6665 86 -316 198 -141 -361 244 -91 -165 -241 -227 -80 7 -532 156 -258 -9 165 -388 282 -93 -275 344 -300
6687 -300 53 88 -25 18 71 -67 166 -279 89 -24 -331 46 19 -39 196 -177 -66 135 -138 269 29 -68
6709 -68 145 -7 176 168 -497 155 28 -412 154 -152 -165 28 13 83 -51 -78 -66 -244 112 39 -525 374 55
6732 55 -464 238 114 4 248 4 131 -172 -166 110 50 166 140 -124 -5 266 -313 107 -180 -188 445 -399
6754 -399 -328 213 -59 83 -228 -38 26 -114 230 -208 -341 356 -90 -336 135 -299 -95 41 88 36 -161
6775 -161 -111 127 -66 321 -106 -518 142 44 -148 325 -276 40 172 -158 202 -95 119 -75 -376 -60 278
6796B78m13N73p40K91K28l94M60M0m43M18l30J15L4l50L99o8l98M99l54J09M3
6817cr3K84j69j08K71k86p5L96Ll9r0k68O47o73N2P14r19M58J10m67L13k12rL91
6841B28l1k37J6J66K60p02J94L16l37j4J24l15N57p0n18N37j91P1k36J32K86n43
6863c07QO61n71K35R4m54K55k04K45K17j18J45m26k37P94n69J40O19j059N26K44
6884B38n40O46k42r6J47l21K62Q8m57Q18p13K35L80p61N97j73j89J86M81n00J74
6905B60k03j64L75m12L76j75J17J22q24Q01r8l41O47o64j6M79l91K02m2k95K16
6926c0m9RL47l87K31L3o38N11p3l54L00M3j42K58k82K32l02L14L08o85K92P53
6948F89q59J53J54m51j0K33J49j94l45P68l98o3M66q56N42L40o46M64Pl94L91
$$ plain form
6796 278 -135 438 -302 -11 217 -177 283 323 -120 298 -32 83 117 -233 166 98 -300 199 -155 -46 -3
6817 -3 -96 188 19 -89 182 -104 -179 217 220 181 91 -177 470 -203 -151 563 -356 102 212 -255 58 -154 -163 228
6841 228 197 -40 -24 142 402 -300 -106 210 -127 -141 -17 -332 225 155 -363 174 -17 54 -182 -50 236 -307
6863 -307 -299 362 -209 26 120 -334 -79 -283 -38 179 61 206 -220 -457 337 -232 -92 527 -532 -6 238
6884 238 -302 344 102 6 153 -168 94 182 -275 543 -170 65 445 -316 281 108 -81 105 586 86 260
6905 260 57 -107 268 -144 232 57 174 296 -528 273 175 -166 481 -183 -199 280 -111 91 49 -246 -30
6926 -30 -79 -70 277 -110 121 154 -484 27 -46 -400 -100 -57 -199 59 -223 9 -293 21 329 -356 -64 689
6948 689 -170 -17 137 -314 -324 -91 58 -136 -481 287 -111 -174 292 -564 -22 318 -328 136 143 -251 140
6969A40j24p3L47l76J00K49m31M64l91K86J0l99O68m49o5K17k42j29K70l48L08
6990C2q1k8L07k16k11K24l39M29J3j66K0o0L8j37J20L17j79l83N31n04J84J07
7012A8k2j17L06o48P38p3m77M51k66n3J01J19K58m84J16K67l78M04k13m94P10
7033B63l04k37O66m58K55j05k10l0l08N07n4l89L61rj40M17j71j48O9j90J38K37
7055A60k42M10k29l15N61o20M72j17l10K74J17j99K60j98J25j64q8M92k33K2l
7076A75m55O04k21k40M49k13K9J6j53j12J34k72K66j0nJ91m93K78P8j83M87l15
7098C5k31L97j31j19N3K1j99mJ50N8o3J26K5k26J94j37n6L13k39Q8j15q1L87k77
7122c1K0J86l21nK79n36M98M7p3K13m69Q4pJ8K18l84K69K52l04J15K2o68Q68l69
$$ plain form
6969 140 16 -57 290 -86 14 263 -168 296 -95 191 201 -198 470 21 -44 173 -69 -198 72 -276 32
6990 32 -49 -77 230 14 -197 27 -312 117 130 -36 -16 -76 -38 -175 -55 262 83 -300 231 -273 -89 18
7012 18 -4 -121 185 -463 275 202 -275 176 -90 -143 -42 77 335 -149 -33 234 -144 260 47 -447 263
7033 263 -41 -278 388 -70 185 80 -130 -160 -468 39 -15 -404 -43 -52 -192 225 54 -94 -25 -215 -77 160
7055 160 -82 328 99 -216 345 -275 197 80 -230 44 161 -38 222 24 149 -15 -103 389 156 178 175
7076 175 -280 324 103 -137 312 99 128 144 -9 -121 13 -259 7 -3 -8 183 -310 -32 46 -137 350 35
7098 35 -196 201 70 -49 4 25 -174 -178 -28 30 -33 93 118 -108 86 -51 -107 206 -33 55 -60 -141 246 -31
7122 -31 -11 175 -146 -151 128 -408 90 137 64 277 -192 -108 -115 -97 121 -263 6 258 -46 69 91 -577 291 -78
7146g8m53Q92l88j24M13m87K79k6rN4O1j21m8k14L11k41l8L28m04K07J43j13L29
7169B73J67p70M90l22L37J17m22M35k36j82K74k62K5K07m82M40q8k56N83m04K40
7190A64j3l08M96k94k98O35l40j72L69m54M1K10j29J14j91J59J94m60L62n5j99
7211a69M37m01J07J99j79J74k13q1qn0j88O96k45N5j43R4L97q39J86L57l27J93
7233E2k1k32M60l05j68K24k84K67Q8r8J35j73QJ60k07K82j55l5J04n2j45K65o07
7256d37O54j22j59M51k95p1K52l84P5J77l23M65k47o7Q1N4Np2j69K53J00l18K80
7279A83m00R2J87l05M30J1j07L8l74L79R0l06L39n36L22L52l42l9J14k19J07J4
7301C0r6K27l95j0J00j01M04j51k02L37j63J21M5l50K37m7k06M88k93J44k5m24
$$ plain form
7146 -78 -531 361 -27 -151 262 -225 54 28 19 73 134 13 -35 -249 62 -179 -217 111 -293 -86 57 -56 273
7169 273 440 -330 160 -162 175 292 -130 305 69 -113 161 -101 -76 131 -351 89 1 -255 328 -76 164
7190 164 151 -157 339 45 -253 382 42 -130 239 -215 -174 36 -93 21 -170 -11 183 -277 85 30 -169
7211 -169 268 -133 -26 173 -6 168 -45 -126 -134 -184 -372 324 79 134 -9 85 482 -357 -171 186 -141 52
7233 52 31 -201 259 -46 -214 10 -274 -7 81 -17 118 -55 -47 113 -94 188 33 -2 102 50 -95 170 -437
7256 -437 217 95 -64 387 92 21 273 -111 -36 141 -182 283 36 -31 50 104 109 37 -132 121 221 -97 183
7279 183 -217 -125 62 -243 187 198 91 129 -245 134 224 -82 257 -279 43 395 53 14 128 -91 16 30
7301 30 -66 161 -234 -244 -144 -245 159 8 -194 143 -20 101 146 -204 33 -14 -220 268 -25 119 94 -330
7323c30L61m9j36M63l92L17j40j76L01l77J71o3J63J81j1o45M50k27m9M80k85
7344GJ43mk66K53%j50K03k28P7J26K2j09k58r6K74j47L8N18p50N42k75J44K28
7367B92J3j79k02J20L13n72K01J41l83L86l1l31O82j86n31N02n9l17K17l81M11
7388A06l31M4M1k13K28J38j65J93J80m08K12l13M87j61j32M2R7n68K65O1J8M02
7410B23k83N2j21J11J05j15RMq1J64L4j85J77j83j68M15m72K24L47m53O94m12
7432H6j08M71m03j9j97J24L32m06O8J15k6Oj45j61L97l49K76K04k95J36J78l16
7454c2K40k89L25j93j67L61k14n04O08m57R7K67m23L27P2j6q7n8N6L55m22L00
7476A46l2m06J70K09j08l5l89L82p4m6K37M7K2k04j42l9L72n83M53o5r9L35k23
$$ plain form
7323 -330 31 -18 -154 309 -83 234 94 -82 219 -158 13 -50 113 294 283 -362 88 -139 -188 292 7
7344 7 150 146 -120 133 133 -17 186 -42 35 161 183 74 -184 -280 -6 -153 -115 403 -347 195 -80 64 292
7367 292 305 126 -76 44 357 -215 -14 127 -256 130 99 -232 450 264 -267 235 176 -141 76 -305 106
7388 106 -225 -181 -140 -353 -125 13 -152 41 221 -187 25 -288 199 38 -94 -52 45 -523 -258 -197 -179 223
7410 223 -60 -8 -129 -18 87 -28 -19 -15 -96 68 102 -83 94 -89 -257 158 -314 -90 257 -196 498 86
7432 86 -22 449 46 27 -170 -46 286 -120 -52 63 37 43 -102 -263 134 -215 61 265 -30 106 284 -32
7454 -32 208 -81 244 51 -116 245 31 -473 135 -322 -225 42 -381 -54 18 2 -85 -143 -87 268 -154 146
7476 146 114 -292 -122 87 -21 -56 -445 -63 -137 -183 54 101 123 -81 -223 -262 110 -473 -20 -85 -184 151 -72
7499g2K56n52L58J43j21%J23k60J66K56n37L56l4l49P70o19o7k1m3M23j12L47
7521D11k3l02J42j87l10M63k96j17N30m24M9L5l9l7O0K28j18k6M6j2k04M36m42
7544a37j76N05l15P6K42j32j05r6M9J32k87N31k94k32L29n4Kk94N0j29L58Q7k3
7567H7j31j67O72n25K68j41m53M40k26k2M55m46J67J12m89M63j8j68J42k18J97
7588aNn9N1J17j09K74l05j08J83n0P1p9p2K84l12p1L89o10N42q6m8M7kr4M56l01
7614A12j51k9J61Ok85K65m6k83L34J8k18K83j43J07K30n02J44J29o1J7P8k50O3
7637b1k83K86k13K95nk97J15K02m03M83j61j98J72j05P7Jj44J82J39l49Q0R2J08
7660E3J01j40oj99p6K77N9j77K85m29L49M3n86N90k78J52j6n1J55Q4j35m4p9N0
$$ plain form
7499 -72 184 -368 -10 133 12 12 135 -125 41 297 -240 116 82 -267 503 -116 -183 -204 -247 176 64 411
7521 411 388 86 228 41 -269 194 -102 -219 311 -113 -64 -29 -68 -105 -45 183 65 39 85 73 -131 305 -137
7544 -137 -313 192 -123 -47 195 63 -42 -138 -89 43 -244 287 -7 -239 90 36 38 -256 -206 -335 23 110 87
7567 87 -44 -211 461 -64 204 63 -390 50 -176 -198 257 -189 -22 90 -399 64 46 -122 20 -198 -1
7588 -1 4 -55 -4 113 4 278 -27 -135 48 -2 69 -10 -82 202 -110 -181 208 -402 140 54 6 53 51 -43 413 112
7614 112 -39 -68 93 99 -186 79 33 -250 84 102 -116 167 24 131 361 -141 3 132 71 88 166 -84 -21
7637 -21 -304 -18 -231 64 59 -238 -123 79 -324 159 -2 -200 -28 -133 -56 -55 -199 -17 122 -227 -147 -55 53
7660 53 154 14 8 -191 -267 10 69 -108 177 -252 97 140 -446 144 -134 18 2 -49 106 190 55 11 -68 -18
7684a8K0j61K08k35j33M88j0k33J33m22L63J76j47O8j27K7J54k29L9%j14N70n09
7707i2J53K3K5R7Pk88J15k59N1M79k05j57r8j8M8L47l61Q9j08K70J12j17N3j65
7731Ao6k3q0J56L55l10J68j75j54K5J42j76K62n01K63K5M0J30q4L8k67K13O3o2
7755a7j85M89n71O8L04r4J00j11J8J40j62Lj4N4L98l25l58O24n27K04M1J29jj87
7779B0l0K11k06j35M45k44m2rj18J74k03Q1P4j1%k53J31M34n43K01K69k60Q1K00
7803B67m05L81j72k32M21q2j45J9q3K49k23L5N0m16O17m68K10M0j4j04K18m53
7825b90J27P5j7K88l01J7J5J26j53n5L37jl61L49o6n2n6L9l19J51J72l97L43j5
7849d4k26K77n9J38l16Q9M76k96k11J06q1J09j61K71j5k75L14m07K68K28l53M31
$$ plain form
7684 -18 2 -159 49 -186 -319 169 159 -74 59 -363 0 176 29 97 -30 -3 151 -78 -39 -39 -153 417 -92
7707 -92 61 84 109 206 213 -75 40 -219 -168 311 106 -51 -149 -167 -119 228 -133 -44 -152 118 230 113 166 1
7731 1 -65 -88 -168 -12 343 33 201 26 -128 -103 39 -137 125 -376 -113 -88 -48 82 -2 36 -231 -18 45 -17
7755 -17 -202 287 -284 -216 88 -6 94 -17 1 141 -21 -18 -32 22 420 95 -263 361 -166 38 79 208 207 20
7779 20 -10 201 -5 -140 305 61 19 10 -108 66 -137 -56 18 7 7 -246 -115 319 -224 -23 246 -14 67 267
7803 267 -138 243 71 -161 260 178 33 52 -31 218 -5 30 80 -336 281 -187 23 63 49 -55 163 -290
7825 -290 -163 -88 -105 183 -118 -101 -86 40 -113 -168 169 168 -193 156 90 38 -18 21 -298 -147 25 -372 -29 -44
7849 -44 -270 7 -52 86 -230 -141 335 39 -172 -66 -147 -38 -199 72 57 -218 96 -311 -43 185 -168 263
7871B63J5k87J24J42k06K50j46m27M82k77J0J24j57L6j51K95L0l12L49nm31L10
7893C1P0k05m1m7M5J72J56j10m22M01R4k18O2m4q5R7J22l81M59l6k95J10K08j90
7917d7J17q9M8m1j4J69m23M38k08o3L25j69q0j25jM30n43P7L46p6Lk7k24J33P2
7942B8j00Qj74L09p2K6n7J93l11M6K06r8J91j52J21k91L20j6rj01j0M9p5k03L39
7967A67j44M2l22K92N9j07P4j5J19l7k03J52j57n9L26l30N05l75j43M28o88M49
7989C3l2K0J38j46j16M25n17K46J84m55M56j92o5m5l9J46J96l07K84k68j38J41
8011e1J03O5j53J67J01l68j18O37n45K52k92L2J86o2p1JM2j56J66o4K95l10l9
8034a82K14m77N98r7r7J68j16k14K61j74Q1J56j78K17k05k9J57j88j01J62n4L84
$$ plain form
7871 263 278 -9 115 257 51 301 155 -272 210 -67 -57 67 -90 -54 -205 90 120 -192 157 152 -279 31
7893 31 101 -104 -145 -192 -147 25 181 71 -351 50 144 -74 -12 -56 -141 -44 78 -303 156 120 -175 -65 143 -47
7917 -47 70 -19 29 -12 -26 143 -280 158 -50 -113 212 43 -37 -162 -163 267 -276 -199 147 71 74 47 -177 -44 28
7942 28 -72 -64 -238 71 -1 25 -32 161 -150 -104 102 4 195 43 164 -127 193 177 168 67 57 106 31 -172 167
7967 167 23 65 -257 35 94 -13 61 46 165 128 -75 77 -80 -139 187 -143 362 -13 -156 272 -416 33
7989 33 1 21 159 13 -103 322 -195 51 235 -220 236 44 -21 -66 -105 41 237 -70 214 -54 -192 -51
8011 -51 52 117 -36 131 232 -136 -254 383 -162 90 -202 -170 16 -46 -117 -116 -74 -230 -64 -128 167 -143 -182
8034 -182 32 -445 153 56 -41 127 11 -203 58 -116 -35 121 -57 160 -45 -74 83 -105 -206 -44 -98 286
8056B86k85m6L17m17oR2j83J30J48J51l14N7lj1j14R9k66L04M71m34r1K6o9L07
8080A49J01n35M53j96p4J14k47K12L21k76k73N2J0K31r6k2K01l77M62j00j75K56
8102A91m03N40k60k89L83l42J70L8j01M1j35k3l1K78j2P2j61K5MK2J14m17L41
8125D5k6j20J21j29k0K04j34J24j67j15L72j60j36L17k48J75j59QK61j71j06L53
8147B89N2n66P0mK57O4l50O44k78k14Q1l44M17n3j39j35J3K5J99j14L01j49J3
8170G9J6o0P1m1j86j18N7k9l1K03k63L37j21K69k08j37K23k89k7J76k16
$$ plain form
8056 286 1 -45 272 -145 -151 -59 -242 -112 36 187 -127 -70 -73 -84 -198 -99 -365 -61 410 -24 -115 -89 -158 149
8080 149 250 -285 168 -28 -102 12 -235 -23 298 22 -251 -199 -189 42 -54 -76 125 -252 210 110 -65 191
8102 191 -212 328 68 -221 162 -180 -10 28 -73 -32 -167 -190 -221 57 45 117 -44 -19 -15 7 121 -296 45
8125 45 19 -101 20 -109 -129 75 -59 65 -102 -217 155 -5 -141 176 -72 103 -56 -48 213 42 -64 289
8147 289 341 -225 -155 -159 98 162 -188 456 178 -36 45 -299 118 65 -74 -209 -196 -171 28 -86 215 66 79
8170 79 95 35 106 65 -121 -239 -182 -211 -242 -39 -302 35 -86 183 -25 -162 61 -228 -255 -79 -295
8191b95
$$ Imaginary data points
##PAGE= N=2
##DATA TABLE= (X++(I..I)), XYDATA
0@%%%%%%%%%%Qj6J6j6K4l2L3m1N6o4P2q8J04j22J46j71J96k27K61k96L38l86M37
33B32m95N59o30P06p87Q77r79J090j209J339j481J635j805J992k196K420k663
50a395K930l227L560l931M347m819N357n978O706p570Q614r905J1551j3726J6730
65I244k1155K8291m1554P3739k77361k79133Q08099k94795l35315N06181j62262
76A3979m50750L82357J53957k84637J48935R1661l66911J11044L32581j38102
86e886q4845K9324p3797J17328L297n179J81399j93107j74187K74839M8395p4104
98D3477Q2230j15700q8510J74424M4760q1430P4704k4613j86125J09570J53516
109A86303q6754K9310r9589j54178K71207M872k35490K30474m3398l30109K34360
$$ plain form
0 0 0 0 0 0 0 0 0 0 0 0 8 -8 8 -8 16 -16 17 -24 32 -32 40 -48 56 -66 80 -91 105 -122 139 -157 181 -205 232
33 232 -263 296 -334 372 -415 462 -517 573 -636 703 -778 857 -948 1044 -1152 1268 -1395
50 -1395 1535 -1692 1868 -2063 2284 -2535 2822 -3156 3550 -4020 4594 -5311 6240 -7486 9244
65 9244 -11911 16380 -25174 48565 -228796 -507929 300170 5375 -329940 176241 13979
76 13979 -436771 -54414 99543 -185094 -36159 55502 -311409 -200365 132216 -5886
86 -5886 -90731 -61407 -135204 -17876 -14579 -19758 161641 -31466 -205653 69186 117581 43477
98 43477 125707 10007 -78503 95921 140681 59251 133955 109342 -76783 32787 186303
109 186303 99549 128859 29270 -124908 146299 151171 -84319 146155 102757 -227352 7008
120G008J67911k28364M2838N2457k28708Q3961K51570j89738j17640J87514j32024
131a03215q7696K30202l2222q1110K12j20169J57481J20780k10317Q4036R1115
142D9097k33362J04370K29879j81524n1246J85389j68212q0498L59886q1244l07204
153a74669K61047M7554k57086K23771J06367k36349M2804O4657o6891Q1010M1393
164A33608j03228m2299N3721J6257j3429K0800l0993l7331j3015j3960R7374m302
176F3203j47974N4858K6752p7644J02518j2613j07224O6876k8823m3257J14918
187A1590j5917r6279K8806K3788k3478N6977K1376j05047M4271P4869j22710Q4177
199a7577J26755j97546J3064J59711j16099J8609J17070j13055k7123J04998k5456
$$ plain form
120 7008 174919 -53445 -10607 41850 -186858 -102897 148673 -41065 -158705 28809 -103215
131 -103215 -190911 39291 7069 -74041 -73829 -193998 -36517 84263 -126054 -42018 49097
142 49097 -184265 -79895 149984 -31540 -82786 102603 -65609 -146107 213779 132535 -174669
153 -174669 86378 133932 -123154 100617 206984 -29365 13439 78096 11205 92215 133608
164 133608 30380 -11919 41802 58059 44630 65430 34437 -2894 -15909 -29869 67505 63203
176 63203 -84771 -29913 -3161 -80805 21713 9100 -98124 -31248 -60071 -103328 11590
187 11590 -4327 -100606 -71800 -48012 -71490 -14513 6863 -98184 -53913 20956 -101754 -17577
199 -17577 109178 -88368 -75304 84407 -31692 -13083 103987 -9068 -36191 68807 43351
210D3351l5917P4561j1876r2785O2360N3388o5120L8912q669o8523P5606j2502
222E2786m7194P5962n2636n9098O8157j2496k1257K1784k9711k7500J6635K1413
234F845k7845q404K5399n1551m77N5053m2298L837J4009n0107M1070J2883l3458
247e5044L7572k0580j8205L9854j2822P467K0196k2647p96J9166J9880j4123l253
260c335L6283l5206J171N9124m3773L222L9476n0268K2476L0843l7266J6912J207
273D0866j9059J4308j721q6j0135k743O042k6658K1405M755m4948K8586m267l4936
287b8591L5300j6837j9056K0690k4520N385Q873j8965J1531r381j737J0282j4776
300d1802J7776n836j3836K9233j6632Q09K5903k3266J4391R773j4130K6037r535
$$ plain form
210 43351 7434 81995 70119 -22666 39694 93082 27962 66874 58205 -10318 65288 52786
222 52786 5592 81554 28918 -30180 37977 25481 4224 26008 -3703 -31203 -14568 6845
234 6845 -21000 -29404 -4005 -55556 -56033 -980 -43278 -39441 -25432 -75539 -34469 -21586 -55044
247 -55044 -17472 -38052 -56257 -16403 -29225 -21758 -1562 -24209 -25005 -5839 14041 -82 -3335
260 -3335 32948 -2258 -1087 58037 14264 17486 56962 6694 29170 60013 22747 39659 40866
273 40866 21807 36115 34394 34308 24173 21430 27472 814 22219 26974 -17974 10612 6345 -28591
287 -28591 6709 -10128 -29184 -8494 -33014 -27629 -18756 -37721 -26190 -35571 -37308 -27026 -41802
300 -41802 -24026 -29862 -43698 -14465 -31097 -30288 -4385 -27651 -13260 -3487 -17617 8420 -1115
313a115j008K3310j8461J3155J1241j4063J9237q264J229J6591k0831J5927L812
326D0760k1014K2802j0969q048J6333k2157R350J512k2254J9161j4241j0842J5527
339A5920k2744N442J305k1299J7812j4796r914J7757k2323N271N046j8008J7468
352b3063j1716m726J9708k1939J0573J0923j8668J9616l690m480J9909j5579J2708
365a0424J0781j6134K2010k318m589J9648j3211J1474Q248j4549K2281q119n713
378A9385K1991j9747P386J0903k1433J8104n418j5092J9688j4817n093P693j1260
391A2290M309j2461Q91Q539k8367J5132K387l1156K6991j0474k4790L0937j7145
404b2917j4203K2329j3880l722O685j340l40m595J6000j1235q669L6848k3689
$$ plain form
313 -1115 -2123 21187 2726 15881 27122 13059 32296 24032 25261 41852 21021 36948 40760
326 40760 19746 42548 31579 23531 39864 17707 27057 28569 6315 25476 11235 393 15920
339 15920 -6824 -1382 -77 -21376 -3564 -18360 -28274 -10517 -32840 -27569 -22523 -40531 -23063
352 -23063 -34779 -39505 -19797 -41736 -31163 -20240 -38908 -19292 -22982 -27462 -7553 -23132 -10424
365 -10424 357 -15777 6233 3915 -674 18974 5763 17237 25485 10936 33217 25098 19385
378 19385 41376 21629 29015 39918 18485 36589 31171 16079 35767 20950 15857 23550 12290
391 12290 16599 4138 5029 13568 -14799 333 2720 -28436 -1445 -11919 -36709 -5772 -22917
404 -22917 -37120 -14791 -28671 -32393 -25708 -27048 -27388 -31983 -15983 -27218 -35887 961 -22728
417b2728r473M3568k8064j887L4135k4298J0270J6097j8914J3816R295m307q91
430A6619K849J3022j4331L405J8544k1956R952N313k4025K6595n295k3594K1934
443B9032j5299k913J2904k7049J4707M060l4491J6818R338j9873j568J486o019
456a8867o410J4135q864k3528L7351j7125m1368O7468j1536n7144N9673q785l9294
469e4294N7801r029m0093M2934Q976m1819K7987M3596n0048r499N9078l4558k231
482a199N2881n5131N100N6648o0027J2594N8328n5690j2023L9464j5884k809J8712
495D0964k1309j9823L1772m093l6152M1044k180n8973L2054J2009k2042K3736
507A7007l5596j4229M3545l2391n460L5121l3442j3210J6926o786J2983J3352
$$ plain form
417 -22728 -32201 11367 -16697 -18584 15551 -8747 1523 17620 -1294 12522 21817 17510 16619
430 16619 19468 32490 18159 21564 40108 18152 28104 33417 9392 35987 30692 7098 29032
443 29032 13733 10820 23724 -3325 11382 15442 -19049 -2231 7107 -12766 -14334 -12848 -18867
456 -18867 -25277 -11142 -20006 -43534 -6183 -23308 -64676 2792 -8744 -65888 -6215 -15000 -54294
469 -54294 3507 -5522 -45615 -2681 6295 -35524 -7537 36059 -13989 -23488 35590 1032 -1199
482 -1199 51682 -3449 1651 58299 -1728 10866 69194 13504 1481 40945 25061 22252 40964
495 40964 19655 -168 31604 27511 -8641 32403 30223 -28750 3304 15313 -6729 17007
507 17007 -18589 -32818 10727 -21664 -27124 7997 -25445 -38655 -21729 -28515 -15532 -2180
519b180l3649j7906M5404L316l8208M0046K882m9643M1354N022j5067N3812n0368
532a5185l4501Q7319k3700l3860O5135l2608m2256O7071n684m5784P1107n063
544E1991j14083Q2555Q4752j32409K5807R2651j25069J1515J09511q8967r872
555a1618P1215q5426j8724J03267k8360p5795M4744J0646n2259M0647J9701m5431
567b7393J8244k0503k5721P2906r194n1904K3344j1648M092L2275k3762Q296Q147
580b821m2938J9534M6261j1282j5889k678j7502K4577M8506m6583j6319P0839
592E3705o7108l5572J33449l7607q7383Q5327k9479n1714J10907j7614r7058O4683
604B4536K2166q2380N2175O7683r2585k6284N8432l0486K0772K8982p6773J9417
$$ plain form
519 -2180 -35829 -53735 -8331 -5015 -43223 -3177 -295 -49938 -8584 -3562 -18629 35183 -15185
532 -15185 -49686 37633 13933 -19927 45208 12600 -29656 37415 31731 -14053 57054 51991
544 51991 -62092 20463 105215 -27194 -1387 91264 -33805 -22290 87221 -1746 -11618
555 -11618 59597 -25829 -44553 58714 30354 -45441 -697 9949 -42310 -1663 18038 -27393
567 -27393 -9149 -29652 -55373 17533 8339 -43565 -20221 -31869 -27777 4498 -19264 -10968 -2821
580 -2821 -45759 -26225 20036 8754 -7135 -9813 -27315 -2738 45768 -815 -17134 53705
592 53705 -13403 -48975 84474 46867 -40516 44811 15332 -36382 74525 56911 -40147 24536
604 24536 46702 -35678 16497 84180 -8405 -34689 23743 -6743 14029 43011 -33762 -14345
616a4345K8261o0879N7416K9902q8290K2710K0749n0218O3295L3720j05750M251
628e9178Q8472o1350k2209J05921n7404q2091R1481R87l5679O8028m2089n4398
640e9509O6834P510k0108K6593j1695k2674M927J5280K6885O627m1016k0943M3588
653B2299P715j9922L2165k3239m0588M3323n594l477M6933o3131l3910O7035j7371
666A2238r615L7556n2877k4875N6620j8789k2852O2058l5282q9520Q3380M5494
678D3536r2896M7064L0330j08672N3724P0498q2431K3497M1055q2509J0831Q1321
690C5348k7501l6254K7852j3770j5294M9878l514k5609K3948l2895n861O7169
702D3497k2780k3296K4656l6515J0475N0300k8999j1365J7063k6952l942L9601
$$ plain form
616 -14345 13916 -46963 10453 40355 -47935 -25225 -4476 -54694 8601 42321 -63429 -59178
628 -59178 29294 -32056 -54265 51656 -5748 -87839 3642 4629 -31050 36978 -5111 -59509
640 -59509 7325 14835 -5273 21320 9625 -13049 -8122 7158 34043 40670 -346 -21289 22299
653 22299 30014 10092 42257 19018 -21570 21753 16159 12682 59615 -3516 -37426 29609 12238
666 12238 2623 40179 -12698 -37573 19047 258 -22594 39464 4182 -85338 -1958 43536
678 43536 -49360 -2296 28034 -80638 -26914 43584 -38847 -15350 25705 -56804 -45973 35348
690 35348 7847 -28407 -555 -14325 -29619 20259 16745 -8864 15084 -17811 -23672 43497
702 43497 20717 -2579 22077 -14438 -3963 46337 17338 5973 23036 -3916 -7858 31743
714C1743N198l2636n089J500n196K9028k866k9536J5061k0085j0149N0223j9790
727G406k5443K1360l4084M689N1109k9489k4442K3605j5274j3853L9195P019m1709
740b9911R714J3009k7632L9634J7887n7903K2217J9311l6259L9947J6846m4557
752a7697J2342J1182j4441K4652J3718k9437q394K5134o606l326K9609k4528k2485
765a0277L1665j1305J079K7565l5881r155K4815j5020Q131J2130k4315o562P725
778E95J787Q44M331p930k1110J1688J2632j4625J1644o822k2297J9774j063m304
792a4856J7904k2415o794J9726q449O322Q891j4439l636Q613P968k627K447N782
806D437j8331Q376K0688j5975Q181M956k0127J6760O144q894J3231j0526p697
$$ plain form
714 31743 36941 4305 -784 716 -4480 24548 21682 -7854 7207 -12878 -23027 27196 7406
727 7406 -18037 3323 -30761 -26072 25037 -4452 -28894 -5289 -20563 -34416 4779 11798 -29911
740 -29911 -20197 -7188 -34820 4814 22701 -35202 -12985 6326 -29933 10014 26860 -17697
752 -17697 -5355 5827 -8614 16038 29756 319 -8075 17059 10453 7127 36736 12208 -10277
765 -10277 21388 10083 11162 38727 2846 -6309 18506 3486 11617 23747 -568 -7130 595
778 595 2382 3226 7557 -373 -21483 -9795 2837 -11788 -144 -6966 -29263 -9489 -10552 -14856
792 -14856 3048 -19367 -26161 -6435 -14884 -8562 329 -14110 -17746 -9133 -1165 -3792 -1345 4437
806 4437 -13894 -5518 15170 -805 7376 12332 -7795 8965 15109 6215 19446 8920 1223
819A223J3711k691R80K136n641m448j053J2389o003r690J3547j5125o281K2496
833A5550j4441o561J0190j3838K272N789m883K491r373R96N579p208P022j808
847h223o771M659l537O877J314r899J2813n958o411J8881p753m281J1372p453
861d370L776M369j822O252p451L868P459r120Q580P89p346P717m169K897K841
876A4270r794R695l740q431J3678q616n440R426r396J317J534n602M536p414J313
891b664L219j0684P360j804q379R415p047j209O438r959O934M90q428J0474m374
906a0218k793Q689o492M077J600m126Q601m306J755O922q627P359K881o081Q671
921G912l722Q26N744q478R532L60j0061J2655m391o099J0884p307q76M258m727
$$ plain form
819 1223 14934 12243 13223 15359 9718 5270 4217 16606 10603 913 14460 -665 -6946 15550
833 15550 1109 -5452 4738 -9100 -6828 -1039 -5922 -3431 -12804 -11808 -6229 -13437 -6415 -8223
847 -8223 -14994 -10335 -13872 -6995 -5681 -15580 -2767 -8725 -15136 3745 -4008 -8289 3083 -4370
861 -4370 -594 3775 1953 8205 754 4622 12081 2961 11541 12330 4984 12701 8532 11429 14270
876 14270 4476 14171 10431 2000 15678 7062 1622 11048 1652 2969 4503 -1099 3437 -3977 -2664
891 -2664 555 -10129 -2769 -4573 -12952 -3537 -10584 -11793 -5355 -15314 -8380 -7890 -16318 -5844 -10218
906 -10218 -13011 -4322 -10814 -6737 -5137 -9263 -662 -4968 -3213 3709 -4918 2441 5322 -759 7912
921 7912 4190 5016 10760 2282 11814 12174 2113 14768 10377 4278 15162 7855 6979 11237 6510
936F510J078k657L561j837r705J1475n145j0192J4865j0997n765J5211j4726j036
950i360J2322j2698r52O371k773k782L64N166p424J158J0674j4877O308J3451
964D948k0720Q844J3307j7700Q597O189r036P026P12k125K133J987L074p491N318
979E063P688j2244O253L745p156P148n686K34Q559j2854N133L867j1310J1958
993A0398n782j1053J6813o670j1678J1143L85r191o0P045o290m660J3149j3965
1007a0416m887K5647k2915q319L2771k1767j0081K6999j5696n014J9015j2528
1019g191o525J9300k692j9219J7967J2094k8669J4211J8117k8417J5340J2266
1031A6582k9714K2691J0971l1518J6971J3753k1062L338J2406p782m997Q873n895
$$ plain form
936 6510 7588 4931 8492 6655 -3050 8425 3280 -6912 7953 -3044 -8809 6402 -8324 -9360
950 -9360 2962 -9736 -10688 -4317 -7090 -9872 -9508 -4342 -11766 -10608 66 -14811 -8503 4948
964 4948 -15772 -6928 6379 -11321 -2724 3465 -5571 1455 2167 42 2175 4162 7236 -255 5063
979 5063 12751 507 6760 10505 3349 10497 4811 5045 13604 750 5883 9750 -1560 10398
993 10398 4616 -6437 10376 3706 -7972 3171 3556 -5635 -5695 1350 -4940 -9600 3549 -10416
1007 -10416 -15303 10344 -12571 -20890 11881 -9886 -19967 7032 -8664 -13678 5337 -7191
1019 -7191 -13716 5584 2892 -16327 1640 13734 -14935 -724 17393 -11024 4316 16582
1031 16582 -13132 9559 20530 -10988 5983 19736 -1326 2012 14418 6636 1639 10512 4617
1044D617n704J7224j1846j3798K3747q498j4772J7062o941l396M807j2117J0610
1057I95L307j5479P853l63m914Q953q221l775J2276l505j5120J1600J6941k5024
1071a4476k629K9109k4141j111L1124l3557J966L6959l7502k139M3780k8617j9557
1084b0791L5393m839k1397K4437m05k8219K8556O353l8527L3611J3613m9789K5820
1097C816K1248l4528J6888P563k7435J8261Q544k2987R112J5309k3151o148K5303
1110A1795q577j2063J4056j4419p41K1665k2013R24J9952k4316J022J6880j0294
1123f129O389j871j5322J4575Q479j3323J649R846r176n882J6014j884m628Q992
1137G729j9114N702K8459k6590q80K4366k9120N861K4707k5283Q299J6600l4865
$$ plain form
1044 4617 -1087 16137 4291 -9507 14240 5742 -9030 8032 1091 -2305 2502 -9615 995
1057 995 4302 -11177 -3324 -3687 -8601 352 -7869 -11644 632 -2873 -17993 -6393 10548 -14476
1071 -14476 -17105 12004 -12137 -13248 17876 -15681 -13715 23244 -14258 -16397 27383 -1234 -20791
1084 -20791 14602 9763 -11634 12803 12398 -15821 12735 19088 -19439 14172 27785 -22004 3816
1097 3816 25064 -9464 7424 14987 -12448 5813 14357 -8630 482 15791 -7360 -13508 11795
1110 11795 3218 -8845 5211 -9208 -9949 11716 -10297 -9373 10579 -13737 -12715 4165 -6129
1123 -6129 260 -1611 -16933 -2358 6121 -7202 -5553 4293 -4883 -10765 5249 3365 -1263 7729
1137 7729 -11385 -5683 22776 -3814 -4694 19672 -9448 -3587 21120 -4163 4136 20736 -14129
1150a4129N809L8295k4373k2270L4680j0843l0608M2726j639m1535L7706m888
1162H931m1995M9676O727n1412K5068J4734l1118J6039J7545k4838k070J5885
1174C172j7195N124K7476k7928j3593K9366j3472k305K1840k0110k462J2362j3509
1187a1234J3191J1394j7043l259M012M021Q073l798n538J629O21m900J0514J3107
1201B0790k3348m073J9152j6992J1463J9697l7966M780K6342k9379R300K7213
1213B6979l1059j1392K3389n871n479J7993j4204k1841K6526P41k1143K8265q402
1226D502l3281K9653L630j8096K5350j3193k4727K6764M540j5557J3336K254k2992
1239a7817O521K2012j1195j856J0613k2968N348K5141j6859J974Q591k1414R620
$$ plain form
1150 -14129 -8320 29975 5602 -16668 18012 7169 -23439 19287 17648 -23887 13819 8931
1162 8931 -33064 16612 23339 -28073 -3005 11729 -19389 -3350 14195 -10643 -12713 3172
1174 3172 -14023 -8899 18577 -9351 -22944 6422 -7050 -9355 12485 -7625 -10087 2275 -11234
1187 -11234 1957 13351 -3692 -6951 -2939 1082 9155 5357 -181 1448 2069 -2831 7683 20790
1201 20790 -2558 -6631 12521 -4471 6992 26689 -11277 -6497 19845 -9534 -234 26979
1213 26979 -4080 -15472 7917 2046 -3433 14560 356 -21485 5041 5782 -15361 12904 4502
1226 4502 -28779 874 4504 -13592 11758 -1435 -26162 602 5142 -10415 2921 5175 -17817
1239 -17817 -11296 10716 -479 -2335 8278 -14690 -9342 15799 -1060 914 9505 -11909 -2289
1252b289J3573q486P299o304j4255J2467R712n787j485J067r910j389J8137m573
1266G777q892Q454j6257N07K3934j3853m188P459j8064P886J4058j1159K872r71
1280d37j3511O681J3801m633q842M910n211o247K1708l288j6728J4786r677q451
1294a5139K7940p670j4013J2841r452k398J8735l583j0389L423P73o037J1041
1307F072J0467j9747k68J3175j5048J0067J3942k2255J185Q855r160Q764M198
1320A0247r691k731j031N316K829k071q23o944R52K924J177N620j0398m220R781
1335I37q679N906J0295j8138J624Q220q287P615L699q986k63J281L156J360J114
1350H54p74q044O452L632n002R697n958r475J4083m095k954J1624r646m721Q558
$$ plain form
1252 -2289 11284 2798 10097 3793 -10462 2005 11717 5930 4445 5512 -4398 -5787 12350 7777
1266 7777 -1115 7339 -8918 -8411 15523 1670 -2518 4941 -13123 -5237 8821 -2338 534 -437
1280 -437 -13948 -7267 6534 1901 -6941 -2031 -7242 -13489 8219 4931 -11797 2989 -6688 -15139
1294 -15139 12801 5131 -8882 3959 -5493 -7891 10844 7261 -3128 295 1068 -4969 6072
1307 6072 16539 -3208 -3476 9699 -5349 4718 18660 -3595 -2410 6445 -2715 6049 10247
1320 10247 556 -2175 -3206 2110 4939 2868 2045 -4899 -3947 -1023 154 5774 -4624 -8844 937
1335 937 -7742 -1836 8459 -9679 -8055 165 -8122 -507 3192 -5794 -6057 -4776 -1620 -260 854
1350 854 80 -7964 -1512 2120 -2882 6815 857 -8618 5465 1370 -1584 10040 394 -4327 4231
1365D231j423R10M63p32k634k802Q502j614m483M382o419M41O933n872M228j944
1381B167q550R600k191l968P802o600l480M999m57N44j947R51o67m905Q242l76
1397A164o946O998m320j834P174m781K350M63o094P895j441l423O619m709j464
1412b349M342j143J344k349J604J171n591P216J68p187P484l125l467P345m865
1427E98J87K565n570M652m70l406M016l274LJ230j847K850m523J768L940q277
1443e558N244K653q993O677K28n477N888k428j063K046k043L367k891j080N303
1458A873m665J230L475m643L285p61n92L852n102L184J158n025P135k474l952
1473b022P399n320p91O068n451J520J633l156K235J55J42k080m12N151p262J541
$$ plain form
1365 4231 2808 3718 4181 3449 815 -1987 6515 4901 418 4800 -1619 -1178 5755 -117 4111 2167
1381 2167 -6383 3217 1026 -2942 4860 -1740 -5220 -221 -678 -134 -2081 -1130 -1797 -6702 1540 1164
1397 1164 -5782 1216 -3104 -4938 2236 -2545 -195 268 -5826 2069 628 -2795 3824 -885 -2349
1412 -2349 1993 850 2194 -155 1449 2620 -2971 4245 4413 -2774 4710 1585 -1882 5463 598
1427 598 785 3350 -2220 2432 1962 -1444 2572 -702 -699 531 -1316 1534 -2989 -1221 2719 -5558
1443 -5558 -314 2339 -6654 23 251 -5226 662 -1766 -2829 -783 -2826 541 -2350 -3430 1873
1458 1873 -2792 -1562 1913 -2730 555 -206 -798 3054 -2048 1136 2294 -2731 4404 1930 -2022
1473 -2022 5377 57 -734 5334 -117 1403 3036 -120 2115 2270 2412 332 -80 5071 -2191 -650
1489f50P671j1104K531P389j1337N487N429j0942L992M212m898q35L857N35o668
1504e331L494M792q384N475K535j0642R352R93q859Q226j107m429M210j180P88
1519f7M96k077J709j534K798L03m776N963j556m126N650k231O52Q32m905O142
1535C273j642l824P089o302l04P364r175K548P438q750p25O084j657l944K770
1550B43L350q540N066N686j3977Q829P944j9812J0107J0499j7472O095Q172j1705
1564e515L038P754q713j219J1114o520r444J6537k069j5828J6273k01j4081J4176
1578E302j880j0537J2843k169r344P975K847o277j173O133j889m435N562k167
1592G91k332O077o490J03O607o160J483K40k273O601o991k322J1331q572l265
$$ plain form
1489 -650 7021 -4083 -1552 5837 -5500 -13 5416 -5526 -1534 2678 -2220 -3055 802 1337 -5331
1504 -5331 -1837 2955 -5429 46 2581 -8061 1291 2284 -6575 1651 544 -3885 325 -855 -67
1519 -67 429 -1648 61 -1473 1325 1628 -3148 2815 1259 -2867 2783 552 1204 2036 -2869 3273
1535 3273 1631 -2193 4896 -1406 -1710 5654 -3521 -973 6465 -2285 -3010 3074 1417 -2527 243
1550 243 3593 -4947 119 5805 -8172 657 8601 -11211 -1104 9395 -8077 -1982 6190 -5515
1564 -5515 -2477 5277 -3436 -4655 6459 -61 -9505 7032 4963 -10865 5408 5207 -8874 5302
1578 5302 3422 -7115 5728 3559 -5785 2190 5037 -1240 -2413 3720 1831 -2604 2958 791
1592 791 -1541 4536 -1954 -1851 4756 -1404 79 319 -1954 4647 -2344 -4666 6665 -1907 -5172
1607e172R057n610p58M641m881j549P015j262r735R445N262j6707R012R299j7709
1622i652R926O525j8127J3636O442k0072J0710J0496j6672J842J3811j0422m598
1635f155J4364r209p176K0565j2022j2703K5024r104j6506K2624m638j3728J4489
1648E825k489r315J0493P87j1366N858Q305j2069kJ2660j0591k095Q698p186K886
$$ plain form
1607 -5172 3885 -1725 -2483 2158 -2723 -4272 2743 1481 -8254 1191 6453 -10254 -1242 8057 -9652
1622 -9652 274 6799 -11328 2308 8750 -11322 -612 9884 -6788 -4946 8865 -1557 -6155
1635 -6155 8209 -1000 -8176 12389 367 -12336 12688 3584 -12922 9702 5064 -8664 5825
1648 5825 3336 -5979 4514 5301 -6065 -207 8098 -3971 -3973 8687 -1904 -3999 4699 -2487 399
$$ [...]
8191B84
##END NTUPLES=NMR FID
##END=
