##TITLE=1H_82-2021
 CDCl3, 8 sc, 
 23.08.2021
##JCAMPDX= 6.0         $$ Bruker NMR JCAMP-DX V2.0
##DATA TYPE= NMR FID
##DATA CLASS= NTUPLES
##ORIGIN= UXNMR, Bruker Analytische Messtechnik GmbH
##OWNER= root
$$ XWIN-NMR		Version 3.5
$$ Mon Aug 23 10:38:09 2021 Russian Standard Time (UT+4h)  she@DPX200
##.OBSERVE FREQUENCY= 200.131506
##.OBSERVE NUCLEUS= ^1H
##.DELAY= (6, 6)
##.ACQUISITION MODE= SIMULTANEOUS
##.ACQUISITION SCHEME= undefined
##.AVERAGES= 8
##.DIGITISER RES= 18
##SPECTROMETER/DATA SYSTEM= spect
##.PULSE SEQUENCE= zg30
##.SOLVENT NAME= CDCl3
##.SHIFT REFERENCE= (INTERNAL, CDCl3, 0, 15.7039)
##AUDIT TRAIL= $$ (NUMBER, WHEN, WHO, WHERE, WHAT)
$$ ##TITLE= Audit trail, XWIN-NMR		Version 3.5
$$ ##JCAMPDX= 5.01
$$ ##ORIGIN= Bruker BioSpin GmbH
$$ ##OWNER= she
$$ F:/spectra/data/she/nmr/H-F/1/audita.txt
$$ ##AUDIT TRAIL=  $$ (NUMBER, WHEN, WHO, WHERE, WHAT)
(   1,<2021-08-23 10:37:04.56 +0400>,<she>,<DPX200>,
      <created by zg, POWCHK disabled, PULCHK disabled
       configuration hash MD5:
       00 E9 B6 7A A2 85 ED C7 34 08 36 98 17 FE 4E 26
       data hash MD5: 16K
       C7 09 44 D5 D3 80 09 2C DE E1 74 8B 10 F4 7C CF>)
$$ ##END=
$$ 
$$ hash MD5
$$ 54 20 5F 06 92 9C 6A 0F 6D D2 F9 D2 33 D3 F1 EE
##$RELAX= 
##$RELAX= 
##$RELAX= 
##$RELAX= 
##$RELAX= 
##$RELAX= 
$$ Bruker specific parameters
$$ --------------------------
##$DU= <F:/spectra>
##$EXPNO= 1
##$NAME= <H-F>
##$PROCNO= 1
##$TYPE= <nmr>
##$USER= <she>
##$AMP= (0..31)
100 100 100 100 100 100 100 100 100 100 100 100 100 100 100 100 100 100 
100 100 100 100 100 100 100 100 100 100 100 100 100 100 
##$AQSEQ= 0
##$AQ_mod= 1
##$AUNM= <au_zg>
##$AUTOPOS= <>
##$BF1= 200.13
##$BF2= 200.13
##$BF3= 200.13
##$BF4= 200.13
##$BF5= 200.13
##$BF6= 200.13
##$BF7= 200.13
##$BF8= 200.13
##$BYTORDA= 1
##$CFDGTYP= 0
##$CFRGTYP= 5
##$CHEMSTR= <none>
##$CNST= (0..31)
1 1 145 1 1 1 1 1 1 1 1 1 1 1 1 1 1 1 1 1 1 1 1 1 1 1 1 1 1 1 1 1 
##$CPDPRG= <>
##$CPDPRG1= <>
##$CPDPRG2= <>
##$CPDPRG3= <>
##$CPDPRG4= <mlev>
##$CPDPRG5= <mlev>
##$CPDPRG6= <mlev>
##$CPDPRG7= <mlev>
##$CPDPRG8= <mlev>
##$CPDPRGB= <>
##$CPDPRGT= <>
##$D= (0..31)
0 1.2 0 0 0 0 0 0 0 0.06 0 0.03 0 0 0 0 0.0002 0 0 0 0 0 0 0 0 0 0 0 0 
0 0 0 
##$DATE= 1629700623
##$DBL= (0..7)
120 120 120 120 120 120 120 120 
##$DBP= (0..7)
150 150 150 150 150 150 150 150 
##$DBP07= 0
##$DBPNAM0= <>
##$DBPNAM1= <>
##$DBPNAM2= <>
##$DBPNAM3= <>
##$DBPNAM4= <>
##$DBPNAM5= <>
##$DBPNAM6= <>
##$DBPNAM7= <>
##$DBPOAL= (0..7)
0.5 0.5 0.5 0.5 0.5 0.5 0.5 0.5 
##$DBPOFFS= (0..7)
0 0 0 0 0 0 0 0 
##$DE= 6
##$DECBNUC= <off>
##$DECIM= 32
##$DECNUC= <off>
##$DECSTAT= 4
##$DIGMOD= 1
##$DIGTYP= 9
##$DL= (0..7)
0 120 120 120 120 120 120 120 
##$DP= (0..7)
150 150 150 150 150 150 150 150 
##$DP07= 0
##$DPNAME0= <>
##$DPNAME1= <>
##$DPNAME2= <>
##$DPNAME3= <>
##$DPNAME4= <>
##$DPNAME5= <>
##$DPNAME6= <>
##$DPNAME7= <>
##$DPOAL= (0..7)
0.5 0.5 0.5 0.5 0.5 0.5 0.5 0.5 
##$DPOFFS= (0..7)
0 0 0 0 0 0 0 0 
##$DQDMODE= 0
##$DR= 18
##$DS= 0
##$DSLIST= <SSSSSSSSSSSSSSS>
$$ [...]
##$SUBNAM2= <"">
##$SUBNAM3= <"">
##$SUBNAM4= <"">
##$SUBNAM5= <"">
##$SUBNAM6= <"">
##$SUBNAM7= <"">
##$SUBNAM8= <"">
##$SUBNAM9= <"">
##$SW= 20.0188882624521
##$SWIBOX= (0..15)
0 0 2 0 0 0 0 0 0 0 0 0 0 0 0 0 
##$SW_h= 4006.41025641026
##$TD= 16384
##$TD0= 1
##$TE= 0
##$TE2= 300
##$TE3= 300
##$TEG= 300
##$TL= (0..7)
0 120 120 120 120 120 120 120 
##$TP= (0..7)
150 150 150 150 150 150 150 150 
##$TP07= 0
##$TPNAME0= <>
##$TPNAME1= <>
##$TPNAME2= <>
##$TPNAME3= <>
##$TPNAME4= <>
##$TPNAME5= <>
##$TPNAME6= <>
##$TPNAME7= <>
##$TPOAL= (0..7)
0.5 0.5 0.5 0.5 0.5 0.5 0.5 0.5 
##$TPOFFS= (0..7)
0 0 0 0 0 0 0 0 
##$TUNHIN= 0
##$TUNHOUT= 0
##$TUNXOUT= 0
##$USERA1= <user>
##$USERA2= <user>
##$USERA3= <user>
##$USERA4= <user>
##$USERA5= <user>
##$V9= 5
##$VALIST= <valist>
##$VCLIST= <CCCCCCCCCCCCCCC>
##$VD= 0
##$VDLIST= <DDDDDDDDDDDDDDD>
##$VPLIST= <PPPPPPPPPPPPPPP>
##$VTLIST= <TTTTTTTTTTTTTTT>
##$WBST= 1024
##$WBSW= 4
##$XGAIN= (0..3)
0 0 0 0 
##$XL= 0
##$YL= 0
##$YMAX_a= 456591
##$YMIN_a= -245269
##$ZGOPTNS= <>
##$ZL1= 120
##$ZL2= 120
##$ZL3= 120
##$ZL4= 120
##$ABSF1= 10
##$ABSF2= 0
##$ABSG= 5
##$ABSL= 3
##$ALPHA= 0
##$AQORDER= 0
##$ASSFAC= 0
##$ASSFACI= 0
##$ASSFACX= 0
##$ASSWID= 0
##$AUNMP= <proc_1d>
##$AZFE= 0.1
##$AZFW= 0.1
##$BCFW= 1
##$BC_mod= 2
##$BYTORDP= 1
##$COROFFS= 0
##$CY= 11.3945322036743
##$DATMOD= 1
##$DC= 2
##$DFILT= <>
##$DTYPP= 0
##$F1P= 2.36226072786647
##$F2P= -0.459571619588291
##$FCOR= 0.5
##$FTSIZE= 0
##$FT_mod= 4
##$GAMMA= 1
##$GB= 0.15
##$INTBC= 1
##$INTSCL= 1
##$ISEN= 128
##$LB= 0.24
##$LEV0= 0
##$LPBIN= 0
##$MAXI= 10000
##$MC2= 0
##$MEAN= 0
##$ME_mod= 0
##$MI= 1.114404
##$NCOEF= 0
##$NC_proc= 0
##$NLEV= 6
##$NOISF1= 3.799351
##$NOISF2= 2.8
##$NSP= 1
##$NTH_PI= 0
##$NZP= 0
##$OFFSET= 15.70392
##$PC= 1
##$PHC0= -13354.66
##$PHC1= 11.00099
##$PH_mod= 1
##$PKNL= yes
##$PPARMOD= 0
##$PSCAL= 0
##$PSIGN= 0
##$REVERSE= no
##$SF= 200.130013532006
##$SI= 16384
##$SIGF1= 3
##$SIGF2= 2
##$SINO= 400
##$SIOLD= 16384
##$SREGLST= <1H.CDCl3>
##$SSB= 0
##$STSI= 0
##$STSR= 0
##$SW_p= 3612.71676300578
##$SYMM= 0
##$S_DEV= 0
##$TDeff= 0
##$TDoff= 0
##$TI= <>
##$TILT= no
##$TM1= 0
##$TM2= 0
##$TOPLEV= 0
##$USERP1= <user>
##$USERP2= <user>
##$USERP3= <user>
##$USERP4= <user>
##$USERP5= <user>
##$WDW= 1
##$XDIM= 8192
##$YMAX_p= 0
##$YMIN_p= 0
$$ End of Bruker specific parameters
$$ ---------------------------------
##NTUPLES= NMR FID
##VAR_NAME=  TIME,          FID/REAL,        FID/IMAG
##SYMBOL=    X,             R,               I
##VAR_TYPE=  INDEPENDENT,   DEPENDENT,       DEPENDENT
##VAR_FORM=  AFFN,          ASDF,            ASDF
##VAR_DIM=   8192,          8192,            8192
##UNITS=     SECONDS,       ARBITRARY UNITS, ARBITRARY UNITS
##FACTOR=    0.0002496,     1,               1
##FIRST=     0,             0,               0
##LAST=      2.0444736,     0,               0
##MIN=       0,             -245269,         0
##MAX=       2.0444736,     456591,          0
$$ Real data points
##PAGE= N=1
##DATA TABLE= (X++(R..R)), XYDATA
0@%%%%%%%%%%qJ6j6J6k4L2l3M1n4O2p2Q8j05J22j45J71j96K27k65L06l50M02m58
$$ 0 0 0 0 0 0 0 0 0 0 0 -8 8 -8 8 -16 16 -17 24 -30 32 -40 48 -57 65 -80 91 -105 122 -143 163 -187 215 -243
33b43N18n86O62p44Q34r32J038j158J290j432J586j755J940k141K361k602K866
$$ -243 275 -311 351 -393 441 -491 547 -611 679 -753 833 -922 1018 -1123 1238 -1364 1502
50A502l159L482l838M233m675N172n735O378p122P993r032J0297j1874J3907j6638
$$ 1502 -1657 1825 -2013 2220 -2455 2717 -3018 3360 -3762 4231 -4801 5496 -6378 7529 -9109
65i109K0532k6585L7389o2773K40112K57025n2157L4886n8442L3037n7695q561
$$ -9109 11423 -15162 22227 -40546 199566 456591 404434 439320 380878 413915 356220 347659
77C47659r442m4845k0863j7851n7138O352n5766l0538q778n0741j5732j8421m9202
$$ 347659 338217 293372 272509 254658 197520 203872 148106 117568 108790 58049 42317 23896 -25306
90b5306J1072l6008k1216P357l3674O273K883k7702K9429q578K57L0525j3418
$$ -25306 -14234 -50242 -71458 -64101 -97775 -91502 -88619 -116321 -86892 -95470 -95213 -64688 -78106
103g8106K5896K5167q117M1682P923J1952M2480n012K9150K8877n181L9247N136
$$ -78106 -52210 -27043 -35160 6522 14445 26397 68877 63865 93015 121892 116711 155958 161094
116A61094M171L5949j2324J6125J6890j7884K5010p398j2415K0545k4666J392
$$ 161094 165265 201214 188890 205015 221905 204021 229031 221633 209218 229763 205097 206489
128B06489M315l0924J2781j5147k2248J2555k9546m446K577l2564J0201j2044
$$ 206489 210804 179880 192661 177514 155266 167821 138275 133829 136406 103842 114043 101999
140A01999k0599J4831k4982j732Q949k6369J3884n567j5324K0512j8634Q40J3832
$$ 101999 81400 96231 71249 69517 78466 52097 65981 60414 45090 65602 46968 47808 61640
153F1640k1403J5730k233j4595K0719j6450j233J2372k2733J2180l501j8468J6269
$$ 61640 40237 55967 53734 39139 59858 43408 42175 54547 31814 43994 40493 22025 38294
166C8294j8391n678Q859k5455Q080m621k1053J4121j8221o610J0430k3896Q640
$$ 38294 19903 14225 23084 -2371 5709 1088 -19965 -5844 -24065 -30675 -20245 -44141 -35501
179c5501j84j7622J7538j2398k506J6953j7149J3742O816j1299K3815n456K455
$$ -35501 -35685 -53307 -35769 -48167 -50673 -33720 -50869 -37127 -30311 -41610 -17795 -23251 -20796
192b0796K2571j1188J6939J1794q249K5794k180K365K3361j1588J5135J0769j1738
$$ -20796 1775 -9413 7526 19320 11071 36865 34685 37050 60411 48823 63958 74727 62989
205F2989K2000m741l330J8398j6675Q178N857j8028J4625r995j0297J2358k1224
$$ 62989 84989 80248 76918 95316 78641 86819 92676 74648 89273 79278 68981 81339 60115
218F0115J147J797k2390R662j2255j3933J0180k1833r77K177k2098R321r748j3163
$$ 60115 61262 63059 40669 50331 38076 24143 34323 12490 11513 13690 -8408 913 -8835 -21998
232b1998J1952j8299L00N768j8938J1740n332j0593J4988j4288K522R246j6048
$$ -21998 -10046 -28345 -28045 -22277 -41215 -29475 -34807 -45400 -30412 -44700 -42178 -32932 -48980
245d8980J3560j725r082J6984j1510L198J1685j4734J4047O94q721J7710r908
$$ -48980 -35420 -37145 -46227 -29243 -40753 -37555 -25870 -40604 -26557 -25863 -34584 -16874 -26782
258b6782K973J3212j3794J4025K167q274J8355q234K819J4557j2461J3651M089
$$ -26782 -23809 -10597 -24391 -10366 -8199 -16473 1882 -6352 -3533 11024 -1437 12214 16303
271A6303q436J9096o783K133J5107j2162J2750M571r356J7617p119j41J3868j3818
$$ 16303 7867 26963 20180 22313 37420 25258 38008 42579 33223 50840 43721 43580 57448 43630
285D3630R585L300j2421J4252r189m024J0440j6338N454N27j5601J0434j1151
$$ 43630 53215 56515 44094 58346 49157 45133 55573 39235 44689 45216 29615 40049 28898
298B8898p756Q127j8375K274l30j7176Q659j0856q743Q088j7292K401R87j5685
$$ 28898 21142 29269 10894 13168 12838 -4338 4321 -6535 -15278 -7190 -24482 -22081 -21094 -36779
312c6779J0098p766p198J1011j3717M366M990j2355J2949l704m283J4806j0430
$$ -36779 -26681 -34447 -41645 -30634 -44351 -39985 -34995 -47350 -34401 -38105 -42388 -27582 -38012
325c8012O967Q936r784J5233p13k813J6182p910P300J0197r484J5592J79l897
$$ -38012 -31045 -22109 -31893 -16660 -17373 -20186 -4004 -11914 -4614 5583 -3901 11691 11870 7973
339G973J6378q130N778R706j0017J2890J96n575J4453q888K506Q704j1910J0907
$$ 7973 24351 16221 21999 31705 21688 34578 34774 29199 43652 34764 37270 45974 34064 44971
353D4971j810p811J2564j0208J86P840j4150Q073j975r932J0235j0850k226O239
$$ 44971 43161 35350 47914 37706 37892 45732 31582 39655 37680 27748 37983 27133 24907 31146
367C1146j5202O457k621j1927R397j1294m024O418j4915M947j869j2599R504j0060
$$ 31146 15944 22401 19780 7853 17250 5956 1932 8350 -6565 -1618 -3487 -16086 -6582 -16642
381a6642l111O976j3562N637J39j0943J0930o902k818J0160j0803P426L548q504
$$ -16642 -19753 -12777 -26339 -20702 -20563 -31506 -20576 -27478 -30296 -20136 -30939 -23513 -19965 -28469
395b8469J3207m199n79J2147q552Q432O770p152J3828k089j073J3767q328Q031
$$ -28469 -15262 -19461 -20040 -7893 -16445 -8013 -1243 -8395 5433 3344 2271 16038 7710 15741
409A5741O932r170J3517k511k531J1709q977N198N351j0874R894l438n788R892
$$ 15741 22673 13503 27020 24509 21978 33687 24710 29908 35259 24385 34279 30841 25053 34945
423C4945j1341J955L546j2292P625m665p266Q000j1334M89M219j2286P117l864
$$ 34945 23604 25559 29105 16813 24438 19773 12507 20507 9173 9662 13881 1595 8712 4848
437D848p616R321r865L75O093j1164P963j374o420J0407p893J178P182r624Q322
$$ 4848 -2768 6553 -3312 -2937 3156 -8008 -45 -1419 -7839 2568 -5325 -4147 3035 -6589 1733
452A733M60o404J0951o756R86P572r994P521M24o883R935o903p06O935j0715N994
$$ 1733 2193 -4211 6740 -16 970 8542 -1452 6069 6493 -390 9545 2642 1936 8871 -1844 4150
468D150O76q556R299p134k101P451j0810N613Q59q204R654o322j698Q889r941
$$ 4150 4826 -3730 5569 -1565 -3666 3785 -7025 -1412 -553 -8757 897 -5425 -7123 1766 -8175
483h175O041K423p646J0681m036j085R341q490O172L690o981J0478l771j118R588
$$ -8175 -2134 289 -7357 3324 -712 -1797 7544 -946 5226 8916 1935 12413 8642 7524 17112
498A7112q289N703L118p816R290l686l238Q418q986L295K605r492P809m671m940
$$ 17112 8823 14526 17644 9828 19118 15432 12194 20612 11626 14921 17526 8034 15843 11172 6232
513F232P253j0025J463K500j0578O601m303o192P321r362J389L008r768O774l045
$$ 6232 13485 3460 4923 7423 -3155 3446 -857 -7049 272 -9090 -7701 -4693 -14461 -7687 -10732
528a0732n255Q307p799J607N529q972Q061j297m339J0156o675J584O448q071Q877
$$ -10732 -15987 -7680 -15479 -13872 -8343 -17315 -9254 -10551 -14890 -4734 -11409 -9825 -3377 -11448 -2571
543b571J8n087R942n195J120P110q719P832O22n885R274o523J409O324q646O687
$$ -2571 -2553 -7640 2302 -2893 -1773 5337 -3382 4450 5072 -813 8461 1938 3347 9671 1025 7712
559G712K50o412Q087n102p50O627q253N181J202o702Q520n705j079O989r106M935
$$ 7712 7962 1550 9637 4535 3785 10412 2159 7340 8542 1840 10360 4655 3576 10565 1459 6394
575F394J074p306Q452n444j782O475q989M161Q92q236P466n400l005O211q797
$$ 6394 7468 162 8614 3170 1388 7863 -1126 3035 3927 -4309 3157 -2243 -5248 963 -7834
590g834K626J003q577P087n055l631O523q828K803K426q483P345l601l681P839
$$ -7834 -5208 -4205 -12782 -5695 -10750 -14381 -7858 -16686 -13883 -11457 -19940 -12595 -16196 -19877 -12038
605a2038p008L451M191o907Q486j438j522R175n313M851N707n582R965J77j530
$$ -12038 -19046 -15595 -11404 -18311 -9825 -11263 -12785 -3610 -8923 -4072 1635 -3947 6018 6195 4665
620D665J0418m615M277O467n644Q755L26k680Q695n542K393M490p549O170j334
$$ 4665 15083 10468 14745 21212 15568 24323 24649 21969 30664 25122 27515 32005 24456 30626 29292
635B9292n651O332p491n81K256r642L747l108p623M403p815l149K383j0270L038
$$ 29292 23641 29973 22482 21901 24157 14515 18262 15154 7531 11934 4119 970 3353 -6917 -3879
650c879l209p289N365o927j897M017q323L762J00n917P264m149j33O611o008N665
$$ -3879 -7088 -14377 -9012 -15939 -17836 -13819 -22142 -18380 -18280 -24197 -16933 -21082 -21215 -14604 -20612 -14947
666a4947K573l604Q811j542R30P788m763O313L611l610R332j993R1Q023n371M875
$$ -14947 -12374 -15978 -7167 -8709 -7779 9 -4754 1559 5170 1560 10892 8899 8990 17013 11642 16517
682A6517L243n064P163l292j027O095o574L109K092o218N816l216l541O090p557
$$ 16517 19760 14696 21859 18567 17540 23635 17061 20170 22262 16044 21860 18644 15103 21193 13636
697A3636J863J966p194N549l275l726O059p083J952K159p075O145k643l321O488
$$ 13636 15499 17465 10271 15820 12545 8819 14878 7795 9747 11906 4831 10976 8333 5012 11500
712A1500o209K011L113o760N983j767l528O611o130J275L426p122N159j942m394
$$ 11500 5291 7302 10415 3655 9638 7871 4343 10954 4824 6099 9525 2403 7562 5620 1226
727A226O093o431J83L237p762M441j842n451N825o142n69L731p562M393j186m858
$$ 1226 7319 888 1071 4308 -3454 987 -855 -6306 -481 -6623 -7192 -3461 -11023 -6630 -7816 -12674
743a2674O422n100O8M710o465N298O78m165P955l661Q04O466n217N987K350l475
$$ -12674 -6252 -11352 -11284 -6574 -13039 -7741 -7063 -11228 -3273 -6934 -6130 336 -4881 1106 3456 -19
759a9Q251k390J255P023m932N964K452l564P988k595L6O266n479M252J668n180
$$ -19 8232 5842 7097 14120 9188 15152 17604 14040 22028 19433 19469 25735 20256 24508 26176 20996
775B0996O540l601j822M912o945K246O30o842M605m205l482L974p786R53J80p602
$$ 20996 27536 23935 22113 27025 20080 22326 22956 16114 20719 16514 13032 17006 9220 10173 10353 2751
791B751L831m343m159L861p577N52Q02p113M040l344l996M705o452J036K510o940
$$ 2751 6582 2239 -1920 1941 -5636 -5084 -4282 -11395 -7355 -10699 -14695 -9990 -16442 -15406 -12896 -19836
807a9836N178j926k888N858n261K128L450n305N979n51k298P171m056K356M850
$$ -19836 -14658 -16584 -19472 -13614 -18875 -16747 -13297 -18602 -12623 -13174 -15472 -8301 -12357 -10001 -5151
822e151m629O409L44j760P294l287K537N145m242O089P04k369P293l244J744M904
$$ -5151 -9780 -3371 -3027 -4787 2507 -780 1757 6902 2660 8749 9453 7084 14377 11133 12877 17781
838A7781m974N453L72l324O340l564K41M026n829L885l50m625N214m918j087L243
$$ 17781 12807 18260 18632 15308 21648 18084 18325 22351 16522 20407 20057 15432 20646 15728 14641 17884
854A7884o924K425r07n810M131n137k412K780p056J724m65o377L997m587k547
$$ 17884 10960 13385 12478 6668 10799 5662 3250 6030 -1026 698 233 -6144 -2147 -6734 -9281
869i281L619p426K017L3n476M845l652k407M772n751L142P94m874O027j912r83
$$ -9281 -5662 -13088 -11071 -11038 -16514 -11669 -15321 -17728 -12956 -18707 -15565 -14771 -19645 -13618 -15530 -16513
885a6513N037l929K643K999m702P075j359q01N975m214L634L344l749O064p79
$$ -16513 -11476 -15405 -12762 -9763 -14465 -7390 -8749 -9550 -3575 -7789 -4155 -811 -4560 1504 725
900G25o87O298l943L224L540m026N972p15j844O112l929K203L349m862N154p82
$$ 725 38 6336 2393 5617 9157 5131 11103 10388 8544 14656 10727 12930 16279 11417 16571 15789
916A5789k605N629m598J089L232n622M133j123l570M651m878O9K503o371L279
$$ 15789 13184 18813 14215 15304 18536 12914 17047 15924 12354 17005 12127 12196 14699 8328 11607
931A1607j502m776M221n454r23K344o784K652j734m990L809m963j349K156o456
$$ 11607 10105 5329 9550 4096 3173 5517 -1267 1385 -349 -5339 -1530 -6493 -7842 -5686 -12142
946a2142K611r67m861M435m331r68L555n633L414K91l776N347k651j22M758m357
$$ -12142 -9531 -10498 -15359 -10924 -15255 -16223 -12668 -18301 -14887 -14596 -18372 -13025 -15676 -15798 -11040 -15397
962a5397M318J798l007O332j478N85N640l367M258K810k558O554j164L17N727
$$ -15397 -11079 -9281 -12288 -5956 -7434 -6849 -1209 -4576 -318 2492 -66 6488 5324 5641 11368
977A1368l350L759K507l268N730j567r79N338m457K446J917m482M554j632k891
$$ 11368 8018 11777 14284 11016 16746 15179 14200 19538 15081 17527 19444 14962 19516 17884 14993
992A4993L576m605Q63J228n433L632k723l204L630n598K93J154n680L136k814
$$ 14993 18569 13964 14827 16055 10622 14254 11531 8327 11957 6359 6652 7806 2126 5262 2448
1007B448l292L554n033J38J664n648L429j870l425M214m544M24K299n181L685
$$ 2448 -844 2710 -2323 -2185 -521 -6169 -2740 -4610 -8035 -3821 -8365 -7941 -5642 -10823 -7138
1022g138j019l068M799l973O63L152m781L912k51k729N080l247P44L628m130M252
$$ -7138 -8157 -11225 -6426 -10399 -9736 -6584 -11365 -7453 -7704 -10433 -5353 -8600 -7856 -4228 -8358 -4106
1038d106K38k363N467k920R61M336m031M142J041k652N734k480P29M428l710L780
$$ -4106 -3868 -6231 -764 -3684 -2723 1613 -2418 1724 2765 113 5847 3367 4096 8524 4814 8594
1054H594J337k962N607k338K2M313m224L246R63l493M627k421p40L651m984K350
$$ 8594 9931 6969 12576 10238 10260 14573 10349 13595 14558 11065 15692 13271 12531 16182 11198 13548
1070A3548L62m483L926k993k056L162n498J250K43n038L206l263k775L112n674
$$ 13548 13910 9427 13353 10360 8304 11466 5968 7218 7461 2423 5629 2366 -409 2703 -2971
1085b971Q85M07n291L170k845k639L221n118J325J016m859L791j757k264M035
$$ -2971 -2086 -1679 -6970 -3800 -6645 -9284 -6063 -11181 -9856 -8840 -13699 -9908 -11665 -13929 -9894
1100i894m090J659K195l955M506r58j414M843l304K135K861l379M952kj342N295
$$ -9894 -13984 -12325 -10130 -14085 -9579 -10537 -11951 -7108 -10412 -8277 -5416 -8795 -3843 -3845 -5187 108
1116A08k565K074L378l330M474J42j482N325k593J316L251l696L773L52k524M706
$$ 108 -2457 -383 2995 -335 4139 4281 2799 8124 5531 6847 10098 6402 10175 10527 8003 12709
1132A2709l322O00K827m206K641m50k947M026l754m05K478n384K391n53l915L453
$$ 12709 9387 9987 12814 8608 11249 10799 7852 11878 8124 7719 10197 4813 7204 6651 2736 6189
1148F189l957j245K419n345J908n57m349L490l798j261K429m760K092k06m037
$$ 6189 2232 987 3406 -1939 -31 -588 -4937 -1447 -5245 -6506 -4077 -8837 -6745 -6951 -10988
1163a0988L368k872r60L322m568K120P62l264L895j825p48L849l691K687J381
$$ -10988 -7620 -10492 -11452 -8130 -12698 -10578 -9816 -13080 -9185 -11010 -11758 -7909 -11600 -8913 -7532
1178g532k988M241j048n19M289l050K210K253l012M642r32p03M344l047K173K272
$$ -7532 -10520 -6279 -7327 -7846 -3557 -6607 -4397 -2144 -5156 -514 -1446 -2149 2195 -852 1321 3593
1194C593l317M211r20j142M198l423J788J585k937L202r61j419L481l716R27J353
$$ 3593 276 4487 3567 2425 6623 3200 4988 6573 3636 6838 5877 4458 7939 4223 5150 6503
1210F503l608L309j470k453L682l158k70J784n028L179r00k860K735l294l60J774
$$ 6503 2895 6204 4734 2281 5963 2805 2535 4319 -709 2470 1570 -1290 1445 -1849 -2209 -435
1226d35m635K654j208k928L354l680l08K118m421K164m40l139L648l182k76K682
$$ -435 -5070 -2416 -3624 -6552 -3198 -6878 -7186 -5068 -9489 -7325 -7765 -10904 -7256 -10438 -10714 -8032
1242h032l982K387K87k864M209k717L23L129l394K877Q67k536M474j690J87L650
$$ -8032 -12014 -9627 -9340 -12204 -7995 -10712 -10389 -7260 -10654 -7777 -6910 -9446 -4972 -6662 -6475 -2825
1258b825l081K919J358k304M520j601J55L679k826K445J403k612M064j603n84
$$ -2825 -5906 -2987 -1629 -3933 587 -1014 -859 2820 -6 2439 3842 1230 5294 3691 3107
1273C107L468l540K028R54l220L454k129j144K880m142J265O85l735K897k308
$$ 3107 6575 3035 5063 6017 2797 6251 4122 2978 5858 1716 2981 3666 -69 2828 520
1288E20j868K812m201R51M93l923K591j918j970K738l433O30J075l635K865j434
$$ 520 -1348 1464 -2737 -1786 -1293 -5216 -2625 -4543 -6513 -3775 -7208 -6578 -5503 -9138 -6273 -7707
1304g707j804L451l317Q56J741l227L270p17j530L623k607J018K089k909L417
$$ -7707 -9511 -6060 -9377 -8521 -6780 -10007 -6737 -7454 -8984 -5361 -7968 -6950 -4861 -7770 -4353
1319d353l17j611L845k429J224K283k869L051Mj879M014k264M68K578l121K801
$$ -4353 -4670 -6281 -2436 -4865 -3641 -1358 -4227 -1176 -1172 -3051 963 -1301 -833 1745 -1376 1425
1335A425L52k076L581k213L67K376l136K762M8k344L570k242n3K420l179K210
$$ 1425 1777 -299 3282 1069 1436 3812 676 3438 3486 1142 4712 2470 2417 4837 1658 3868
1351C868M9k441L042k274l05K319l449J789R2k831K818k192j042K542l730J277
$$ 3868 3917 1476 4518 2244 1939 4258 809 2598 2690 -141 2677 485 -557 1985 -1745 -468
1367d68L41l048K588k288j050K338l576J295N23l008K541j615j314K720l090J408
$$ -468 -127 -3175 -587 -2875 -3925 -1587 -5163 -3868 -3345 -6353 -3812 -5427 -6741 -4021 -7111 -5703
1383e703J146l079L312j482p51K865k723J904J275k186L091m01q77L762k678J798
$$ -5703 -4557 -7636 -4324 -5806 -6557 -3692 -6415 -4511 -3236 -5422 -2331 -2732 -3609 153 -2525 -727
1399g27J883k377L571o28k23L500k307J515J767k742L293o39r51L172k546J056
$$ -727 1156 -1221 2350 1722 1499 4999 2692 4207 5974 3232 6525 5886 4935 8107 5561 6617
1415F617J503k901K483p57j752K997k807J43J532l599K206r38k234K281k839k76
$$ 6617 8120 5219 7702 6945 5193 8190 5383 5526 7058 3459 5665 4727 2493 4774 1935 1659
1431A659J612l968J789p80k377K413k936l03J660l532J705k97k548K670k387k57
$$ 1659 3271 -697 1092 312 -2065 348 -2588 -2891 -1231 -4763 -3058 -3355 -5903 -3233 -5620 -5877
1447e877J752l149K136j10k266L163k024j00K422k736K124O44j883K814j178J13
$$ -5877 -4125 -7274 -5138 -5248 -7514 -4351 -6375 -6475 -4053 -6789 -4665 -4021 -5904 -3090 -4268 -4155
1463d155K719k501K257Q42j462K879q96J38K869k194J984J168k015L157q70m24
$$ -4155 -1436 -3937 -1680 -838 -2300 579 -317 -179 2690 496 2480 3648 1633 4790 3920 3496
1479C496K614k139J553J055k255K681j134p42K614k892J281R09l013K374j386
$$ 3496 6110 3971 5524 6579 4324 7005 5871 5129 7743 4851 6132 7041 4028 6402 5016
1494E016j353K320k967O33L86k899K006j467j792J967k981M3Q84l107J489j135
$$ 5016 3663 5983 3016 3649 4035 1136 3142 1675 -117 1850 -1131 -1088 -204 -3311 -1822 -2957
1510b957j634J846k661K76R59l123K008p10j843K516k301J33J629k625K232k18
$$ -2957 -4591 -2745 -5406 -5130 -4171 -7294 -5286 -5996 -7839 -5323 -7624 -7491 -5862 -8487 -6255 -6473
1526f473j519K651j414K29K207k405K667p3j049K983j421O46K271j796K747L60
$$ -6473 -7992 -5341 -6755 -6526 -4319 -6724 -4057 -4130 -5179 -2196 -3617 -2971 -700 -2496 251 611
1542F11j603L489j184N49K152k239K136P13j661K877j270o12K505k287J825K68
$$ 611 -992 2497 1313 1862 4014 1775 3911 4624 2963 5840 4570 3958 6463 4176 6001 6269
1558F269k158K721j984m70J917k937Q77J56k391K006j950j007J490l066P90n2
$$ 6269 4111 6832 4848 4378 6295 3358 4235 4391 2000 4006 2056 1049 2539 -527 263 211
1574B11k669J829j919j092J868k988O43N41k528J873j228j225K101k356R24P62
$$ 211 -2458 -629 -2548 -3640 -1772 -4760 -4117 -3576 -6104 -4231 -5459 -6684 -4583 -6939 -6015 -5253
1590e253k147K418q85o55K290j838R39J520k203K769m06p47K821j869J294J402
$$ -5253 -7400 -4982 -5867 -6522 -4232 -6070 -5131 -3611 -5814 -3045 -3451 -4198 -1377 -3246 -1952 -550
1606e50j745K514k57j029K850j988Q70J593k074K281j93j118K414j787N16J392
$$ -550 -2295 219 -38 -1067 1783 -205 665 2258 184 2465 2272 1154 3568 1781 2297 3689
1622C689k270J951j61j528K370j803N27J270k253J812l23j653K392j834K78J905
$$ 3689 1419 3370 3209 1681 4051 2248 2775 4045 1792 3604 3281 1628 4020 2186 2464 4369
1638D369l366J976r8j915K534j532k10J281k463J262j19k056K158j837n78J450
$$ 4369 1003 2979 2881 966 3500 1968 1758 3039 576 1838 1719 -337 1821 -16 -594 856
1654H56k670J126j33k114J862j785p59J659k911J457o4k773J980q23q47J632j867
$$ 856 -1814 -688 -821 -2935 -1073 -2858 -3617 -1958 -4869 -3412 -3476 -6249 -4269 -5092 -5939 -4307 -6174
1671f174J073N27j773K458j121j10K084j852J582R44j336K865n00k38K679j452
$$ -6174 -5101 -4574 -6347 -3889 -5010 -5120 -3036 -4888 -3306 -2362 -3698 -833 -1333 -1571 1108 -344
1687c44J681J361j483K712k50j54K415j426J083J315j641K132m92o86K292k022
$$ -344 1337 2698 1215 3927 3677 3523 5938 4512 5595 6910 5269 7401 6909 6223 8515 6493
1703F493L35J158k434J849j224r94J789k244n86Q22k914J732j855j580K070k528
$$ 6493 6828 7986 5552 7401 6177 5183 6972 4728 4142 4964 2050 3782 1927 347 2417 -111
1719a11j71P42k567J179j234j749J537j766n53J862k395J577n32j465K103k194
$$ -111 -282 460 -2107 -928 -2162 -3911 -2374 -4140 -4693 -2831 -5226 -3649 -4181 -5646 -3543 -5737
1735e737N80J521j548J270n4p70K125j067J44K235j972J778N15j229K684j009
$$ -5737 -5157 -3636 -5184 -3914 -3968 -4738 -2613 -3680 -3536 -1301 -3273 -1495 -980 -2209 475 -534
1751e34L77J921j835J893K85r78K495j056L35J661j710J480P77j563K235j052
$$ -534 -157 1764 -71 1822 2107 1129 3624 2568 2903 4564 2854 4334 5111 3548 5783 4731
1767D731j83J943k079J241N81j756J965j134n92J604k275J019K54j942J643j054
$$ 4731 4548 6491 4412 5653 6234 4478 6443 5309 4717 6321 4046 5065 5319 3377 5020 3966
1783C966q47J453k294M65L46k178J588j175j256J475k306J34O28k332J468r39
$$ 3966 3119 4572 2278 2743 3089 911 2499 1324 68 1543 -763 -629 -1 -2333 -865 -1804
1799a804j031J494k110M20O58k044J637n48j079J853j773N09J047j522J619j71
$$ -1804 -2835 -1341 -3451 -3031 -2373 -4417 -2780 -3328 -4407 -2554 -4327 -3818 -2771 -4293 -2674 -2845
1815b845p35J976j410Q77J216j426J864J43q56K296j109M05J690j587J823O5p51
$$ -2845 -3580 -1604 -3014 -2137 -921 -2347 -483 -340 -1196 1100 -9 396 2086 499 2322 2387 1636
1832A636K132j278N51J569j865J617l3j045J777j123R3J142j991J286J83j734
$$ 1636 3768 2490 3041 4610 2745 4362 4329 3284 5061 3938 4031 5173 3182 4468 4651 2917
1848B917J920j376k93J256k140R77j04j753J430j555l75J179j978Q72j76j811
$$ 2917 4837 3461 3168 4424 2284 3261 3157 1404 2834 1279 904 2083 105 977 801 -1010
1864a010J345j316m56J061j856Q18Q6j596J599j181m62J349j616O94N78j665J859
$$ -1010 335 -981 -1437 -376 -2232 -1414 -1328 -2924 -1325 -2506 -2968 -1619 -3235 -2541 -1963 -3628 -1769
1881a769q18m23J564j327R39P47j325J617m42n26J964j434Q87Q42j272J649k65
$$ -1769 -2587 -3010 -1446 -2773 -1834 -1087 -2412 -795 -1237 -1763 201 -1233 -346 496 -776 873 608
1898F08n59J908j410O74J028j549J638k13p15J715j425L27J314j784J510m59p25
$$ 608 49 1957 547 1221 2249 700 2338 2125 1410 3125 1700 2027 3341 1557 3067 2608 1883
1915A883J665j356K08J105j722J268k8j137J525j159J26J072j575J133k12j075
$$ 1883 3548 2192 2400 3505 1783 3051 3023 1886 3411 2252 2378 3450 1875 3008 2796 1721
1931A721J413j169L2J048j798J347j89j412J547j265k25Q30j843J057l34j556
$$ 1721 3134 1965 1997 3045 1247 2594 2405 993 2540 1275 1050 1880 37 1094 760 -796
1947g96J625j274o31J084j843P14L4j557J672j220l87J331j924J041K70j442J946
$$ -796 829 -445 -1076 8 -1835 -1121 -1087 -2644 -972 -2192 -2579 -1248 -3172 -2131 -1861 -3303 -1357
1964a357r73j2J579j174J703K49q76K080n98j1J688j129J592Q99q01J924l28j67
$$ -1357 -2330 -2342 -763 -1937 -234 15 -861 1219 621 610 2298 1169 2761 3660 2859 4783 4455 4288
1982D288J930j063J016P42j460J758m98n99J450j532M52M29j873J188r07j267
$$ 4288 6218 5155 6171 6913 5453 7211 6713 6114 7564 6032 6484 6913 5040 6228 5321 4054
1998D054J028j853j30L36k271Q63r83j607J255j981j47M10k055J192n70j341J341
$$ 4054 5082 3229 3099 3435 1164 2027 1044 -563 692 -1289 -1436 -1026 -3081 -1889 -2459 -3800 -2459
2015b459j276Q2Q87j577J581j24q17J918p53R4J640j193J549M75p17K180p19M35
$$ -2459 -3735 -3653 -2766 -4343 -2762 -2886 -3703 -1785 -2538 -2444 -804 -1997 -448 27 -690 1490 771 1206
2033A206J602j083J459K53q91J917q46K4J328j615J097K64j189J438j280j53R16
$$ 1206 2808 1725 3184 3437 2546 4463 3617 3641 4969 3354 4451 4715 3526 4964 3684 3531 4447
2050D447j526O08Oj477J373j194n08J030j844O52L37j782J507r47n96J331j749
$$ 4447 2921 3529 3535 2058 3431 2237 1729 2759 915 1567 1904 122 1629 682 86 1417 -332
2067c32Q02L78j453J502p27n32J553j531P48N60j537J286m10p04J524j579O52
$$ -332 470 848 -605 897 170 -362 1191 -340 408 968 -569 717 307 -397 1127 -452 200
2084B00K92j465J223n85p56J298j382K92N40j755J302m79r11J576j367K55Q13
$$ 200 492 -973 250 -335 -1091 207 -1175 -883 -343 -2098 -796 -1275 -2186 -610 -1977 -1722 -909
2101i09j553J395l11o84J610j279N41Q20j032J571j58m95J532q12M33J123j215
$$ -909 -2462 -1067 -1378 -2062 -452 -1731 -1190 -370 -1402 169 11 -484 1048 236 669 1792 577
2118E77J306K17q69J729q70J5J345j472J193k36r55J506j230j39Q06j522P80k5
$$ 577 1883 2100 1231 2960 2090 2105 3450 1978 3171 2935 1980 3486 2256 2117 2923 1401 2181 2156
2136B156j484J532j537m02J088j823P43l4j310J262j206m13J022j515P93J79j178
$$ 2156 672 2204 667 265 1353 -470 273 239 -1071 191 -1015 -1428 -406 -1921 -1128 -949 -2127
2153b127J241p30l50J264j373Q36L30j271J669q99l45J469j445P56O87j365J381
$$ -2127 -886 -1616 -1966 -702 -2075 -1239 -909 -2180 -511 -1410 -1755 -286 -1731 -975 -288 -1653 -272
2170b72o26m58J327j346P26N33j431J469n75l99J306j326O60O34j304J401m14
$$ -272 -898 -1356 -29 -1375 -649 -116 -1547 -78 -653 -1052 254 -1072 -412 222 -1082 319 -95
2187i5n98J564j087O35Q17j006J567k69n69J620j035O01R01j173J342j38o72J476
$$ -95 -693 871 -216 419 1236 230 1797 1528 959 2579 1544 2145 3046 1873 3215 3077 2405 3881
2205C881j063M56N76j477J112k10j093J246j227j62M87j694P24n37j411J271j483
$$ 3881 2818 3274 3850 2373 3485 3275 2182 3428 2201 2039 2526 832 1556 1019 -392 879 -604
2222f04m49O96j946Q18l19j336J136j298j75R42j576R08j07q64J640j017k0J422
$$ -604 -1053 -357 -2303 -1485 -1804 -3140 -2004 -3302 -3477 -2535 -4111 -3203 -3310 -4174 -2534 -3551 -3571 -2149
2240b149j214J254O86r04J679m69K49J477q66J184P68p31J550l91p8J548j052
$$ -2149 -3363 -2109 -1423 -2327 -648 -1117 -868 609 -257 927 1695 964 2514 2123 2045 3593 2541
2257B541J028M20j049J333l77o14J111j303N07K64j340R36n90q28J003j483J40
$$ 2541 3569 3989 2940 4273 3896 3282 4393 3090 3597 3861 2521 3457 2867 2039 3042 1559 1699
2274A699L42j640J159p36r10J294j715K50M54j470J173k38q41J156j289L98Q50
$$ 1699 2041 401 1560 824 -86 1208 -507 -257 197 -1273 -100 -338 -1179 -23 -1312 -914 -64
2291f4j488J353l26o91J419j287N81M74j211J307M1r02J252j245L96R92j579J581
$$ -64 -1552 -199 -525 -1216 203 -1084 -503 -29 -1240 67 108 -794 458 -787 -391 601 -978 603
2309F03k54o89J091j037K17Q71j210Q02J67r19J705r33l93J272r87J095K03j297
$$ 603 349 -340 751 -286 -69 802 -408 394 561 -358 1347 414 21 1293 306 1401 1604 307
2327C07J603r07M69J320j426J315L20j036J086j14k45J299j318R24J18q97J042
$$ 307 1910 1003 1472 2792 1366 2681 3001 1965 3051 2937 2692 3991 2673 3597 3715 2818 3860
2344C860m31l85J030j476M08P48j473J133r81m81R91j393O7L94j582J050p04o80
$$ 3860 3429 3044 4074 2598 3006 3754 2281 3414 2433 1952 2943 1550 1617 2011 429 1479 775 95
2362I5Q94j538N72J50j277J000n65n07J008j147N08N52j205J142k27n45J285r85
$$ 95 989 -549 23 173 -1104 -104 -669 -1176 -168 -1315 -807 -255 -1460 -318 -545 -1090 195 -790
2380g90M47R22r88J236j82m40J297q09L72R89j148J270k25m95J510j117L65R20
$$ -790 -343 579 -409 827 645 205 1502 693 1065 2054 906 2176 1951 1456 2966 1849 2214 3134
2398C134j192J065j70n98J142q03K49P79j323R71j11q21J048p10L4Q07j245P37
$$ 3134 1942 3007 2837 2239 3381 2578 2827 3606 2283 3254 3143 2322 3370 2660 2694 3501 2256 2993
2416B993j96q33J371j121P5Q74j649P93j31p00Q42q20j76P50j402Q40l3j238R97
$$ 2993 2797 1964 3335 2214 2289 3163 1514 2307 2176 1476 2318 1498 1322 2072 670 1510 1477 239 1236
2435A236r02l70J006j399N51M1j118J232r47l98J036j200M25M91j179J009m39
$$ 1236 334 -36 970 -429 122 163 -955 277 -670 -1068 -32 -1232 -807 -316 -1495 -486 -925
2452i25m47J114r38N73M64j141J365m68n7J277j288Q34N38j038J359k06m34J251
$$ -925 -1372 -258 -1196 -623 -159 -1300 65 -403 -460 817 -471 363 901 -137 1222 1016 582 1833
2470A833p53M60Q41j168J133j25m64J209r11M12P51j208R70j36o40J216j003K52
$$ 1833 1080 1540 2381 1213 2346 2221 1757 2966 2055 2467 3218 2010 2980 2844 2204 3420 2417 2669
2488B669N83j343R18k38r41J330j027k5L77j167Q30j93j058J081j140o6N99j426
$$ 2669 3252 1909 2827 2589 1648 2978 1951 1926 2303 1136 1966 1773 715 1796 656 590 1189 -237
2506b37O30k73q86R65j097o5P47j233N00j25r05R85q21l04Q67j318R63k2n08R70
$$ -237 393 120 -766 199 -898 -963 -216 -1449 -949 -1074 -1979 -994 -1815 -2119 -1252 -2570 -1607 -1629 -2137 -1167
2526a167o91j61J258j317J128M76p34J291l60KJ394j057R78L84r16J322j14K08
$$ -1167 -1858 -2019 -761 -2078 -950 -474 -1208 83 -277 -275 1119 62 1040 1424 508 1830 1716 1924
2544A924J019j050O85P09p00J337m21n79J577k041P02J14r50J383j081k78R91
$$ 1924 2943 1893 2578 3287 2587 3924 3503 2924 4501 2460 3162 3276 2326 3709 2628 2350 3341
2561C341j076m8L4j228N17n75p37J557j763j49M73q90L53O6r70P42j328P98n6
$$ 3341 2265 2217 2251 1023 1540 965 228 1785 22 -127 346 -544 -191 -125 -1095 -353 -1681 -883 -939
2580i39r67J251j97j411K113j522N25J292j216J084m37L0J242r55j56J110o47
$$ -939 -1906 -655 -852 -2263 -150 -1672 -1147 145 -1071 13 -424 -394 848 -107 -263 847 200
2597B00O68R0n73J086p39K54L96q37R88k77p08R20l07p5N57j201Q70k09j034J206
$$ 200 868 958 385 1471 732 986 1382 545 1533 1256 548 1468 1161 1086 1643 442 1312 1103 69 1275
2617A275p18l59J324j234N31L78j030J247m73l12J066r17Q24J90o16R96n90l0
$$ 1275 557 198 1522 288 819 1197 167 1414 941 629 1695 778 1602 1792 1176 2172 1582 1552
2635A552J245j423Q44M20j106J125m02m30P34r07K67M92j396J107q53o90R52j181
$$ 1552 2797 1374 2218 2638 1532 2657 2255 1825 2559 1652 1919 2411 1015 2122 1269 579 1531 350
2653C50K65l0j114P56n54o58O87j087J58K92j260R31l46o52J019o58R5O05r77
$$ 350 615 585 -529 227 -327 -985 -298 -1385 -1227 -935 -2195 -1264 -1610 -2262 -1243 -1901 -1806 -1201 -2178
2672b178R21k5m34J046n64L66J088p90R51q6l79J334n91M07P80p31Q17J93m73
$$ -2178 -1257 -1282 -1716 -670 -1234 -868 220 -570 381 295 -84 1250 659 1066 1846 1115 1932 2125 1652
2691A652J073q33K6Q94r63P16j09o68R45p49j72N66j231P55j22p53N91p58l02
$$ 1652 2725 1892 1918 2812 1849 2565 2456 1788 2733 1984 1812 2378 1147 1902 1780 1027 1618 860 558
2710E58P06j149L52P9j132Q71o92j56O64j120N90op89Q64o18k63R40j119N35M16
$$ 558 1264 115 467 546 -586 285 -407 -563 101 -1019 -429 -435 -1224 -360 -978 -1241 -301 -1420 -885 -469
2730d69j036R22n21j47R26j124N19L86q97J152n12l91J207r97O01M69r28J077
$$ -469 -1505 -583 -1104 -1251 -325 -1449 -930 -544 -1441 -289 -801 -1192 15 -982 -381 88 -840 237
2748B37n56l62J162r89K49Q00r49J008r6n04J209q51L12P35r29R10k93l31J102
$$ 237 -319 -681 481 -508 -259 541 -408 600 504 0 1209 358 670 1405 476 1386 1093 762 1864
2767A864q94L19M61q24P69j82n55R23q04j15O58j018P65k14p19P91p26k00O12
$$ 1864 970 1289 1750 926 1695 1513 958 1881 1077 962 1620 602 1367 1153 434 1225 499 299 911
2786I11r88M03m9q01R52q28k72Q12j293O50M3q54R95q21n9Q29j088N80K80p85
$$ 911 -77 326 277 -524 428 -400 -672 140 -1153 -503 -460 -1314 -319 -1140 -1199 -370 -1458 -878 -598 -1383
2806a383R26n69r7Q76r61N44K79q55J068m82p2R35r64N52L58q32R43l40l80R00
$$ -1383 -457 -1026 -1123 -247 -1208 -664 -385 -1240 -172 -654 -726 209 -755 -203 155 -677 266 -74 -454 446
2826D46p93N57J71p27J010l88k31J082q10K37M04p79R18j41k86P33q98L45O40
$$ 446 -347 210 381 -346 664 276 45 1127 317 554 958 179 1097 956 670 1403 505 850 1490
2845A490j086J113l65n87J001r82J44N80j020P22j49n12P91r16L15K49j175N81
$$ 1490 404 1517 1152 565 1566 584 728 1308 288 1010 861 349 1140 224 539 788 -387 194
2863A94k68p03Q63q49k7N36j070P12k27o25P50q35L16M39r03Q30j13m84R03o62
$$ 194 -74 -777 86 -763 -790 -254 -1324 -612 -839 -1464 -714 -1549 -1233 -794 -1697 -867 -980 -1464 -561 -1223
2883a223R7P96r72P38L25o60J135o38j20J058q27P96q3l61Q64l02k70R37q94M23
$$ -1223 -1126 -330 -1302 -564 -239 -899 236 -402 -522 536 -291 505 422 61 925 623 353 1290 396 819
2903H19L11q06P67n65k02P81r08L80J60r57R52o41k18O41o94M7M20q33R16n94
$$ 819 1130 324 1091 526 324 1105 197 577 737 -220 732 91 -127 514 -180 -133 287 -546 370 -224
2923b24k64P43r39O47L25p74P74k22m59J072j018M26M67r39Q37l59k61J053j030
$$ -224 -488 255 -684 -37 288 -486 288 66 -393 679 -339 87 554 -385 452 93 -168 885 -145
2942a45J37O23j054O42j4p68R95j023K76L35j197P99j79o93R46q91LN56r21N45
$$ -145 -8 615 -439 203 189 -579 416 -607 -331 4 -1193 -394 -573 -1266 -320 -1211 -1208 -652 -1573 -1028
2962a028j27m87Q16m36J30M43q43Q93O9n56R49o87L12Q88p87P54J57n51J077k75
$$ -1028 -1155 -1642 -826 -1262 -1132 -689 -1532 -639 -570 -1126 -177 -864 -552 336 -451 303 460 -91 986 711
2982G11j99P95o99N38ln32Q20l86l23P78q75L74O5r64R00n77m15P05j202L46N5
$$ 711 512 1307 608 1146 1143 611 1431 1045 722 1500 625 999 1064 100 1000 423 8 713 -489 -143 -88
3003h8j027O86n74l99Q50q66K45P4r26P83l83l48P69p03O78J27o20R00m33j61
$$ -88 -1115 -429 -1003 -1402 -552 -1418 -1173 -1099 -2025 -1242 -1625 -1973 -1204 -1907 -1229 -1102 -1722 -822 -1255 -1416
3023a416J122j032P12N70p64Q88k04k05R29q20M33L38o45R19j46n97R46q24L95
$$ -1416 -294 -1326 -614 -44 -808 80 -124 -329 600 -220 213 551 -94 825 679 82 1028 204 599
3042E99M62j065P00n0n29O91o54J22L04q21P80j79n83Q82p68K9M48n96M70K6n34
$$ 599 1061 -4 696 646 117 808 154 276 580 -241 539 360 -223 659 -109 -80 368 -228 242 268 -266
3063b66Q28n01J35L60q48P00j11n18Q85n66L9N62q64L25K28q12P85l33k57N34
$$ -266 562 61 196 556 -292 408 297 -221 664 98 137 699 -165 160 388 -424 361 28 -229 305
3083C05q37N15N7p41Q38m97l31Q69r48M45J80n68P40n50j59Q36p68K98M14n88
$$ 305 -532 -17 40 -701 137 -360 -691 178 -770 -325 -145 -713 27 -523 -682 154 -614 -316 98 -490
3103d90P53l92n6Q33o42M71L52p36Q04l30p0R02q96L67K65m71Q51l96l50Q16q31
$$ -490 263 -129 -185 648 6 477 829 93 897 567 497 1399 503 870 1135 664 1515 1119 769 1585 754
3124G54N11J42o47N87j20n96P28r16K13K65p68O34j78l26M50o56J73N91r70O70
$$ 754 1265 1407 760 1347 1227 631 1359 443 656 921 153 787 609 283 733 77 250 841 -129 541
3144E41j39o73J051p39K55K31p69O15J3m96P56o37q6P31r34M81L02q56R96p21
$$ 541 402 -271 780 41 296 527 -242 373 386 -110 646 9 -77 654 -280 201 503 -353 643 -78
3164g8L0M22r06P77p9o13P49n53l8M15p40N31jo37J050o45k55Q37r23N91K93n76
$$ -78 -48 374 -532 245 166 -447 302 -251 -289 126 -614 -83 -84 -721 329 -316 -571 266 -657 -66 227 -349
3186c49Q90m22m5P39p34L76N16j049J108r6m33R44p09K55L01p86R88l79l51P77
$$ -349 541 119 74 813 79 455 971 -78 1030 934 501 1445 736 991 1292 506 1494 1115 764 1541
3206A541r06K65L02p22O63m75m87P50q43J30J64q16N74m91l35P60j138L07K62
$$ 1541 635 900 1202 480 1143 668 181 931 88 218 382 -434 140 -351 -686 74 -1064 -757 -495
3225d95p53O46k88k97P91p98K39L14p64P24j99m12R65p72K93M87p05Q42j2n75
$$ -495 -1248 -602 -890 -1187 -396 -1194 -955 -641 -1405 -681 -880 -1292 -327 -1099 -806 -319 -1024 -182 -194 -769
3245g69J019q10J39O88q11Q06k76n02R10o19J13O39j011O94j35m74Q04o64J56
$$ -769 250 -560 -421 267 -544 262 -14 -516 394 -225 -112 527 -484 210 75 -399 405 -259 -103
3264a03N35j027Q23q2o92Q05n45O5O68q29M53J7o91Q95m93N8M85o96M71J20n92
$$ -103 432 -595 228 146 -546 259 -286 -221 447 -382 71 88 -603 292 -201 -143 342 -354 117 237 -355
3285c55O99l81l37P64r20M74J53o18O46l61l63O06q99M78J82q90R25l84m75P35
$$ -355 344 -37 -374 390 -530 -56 97 -521 125 -236 -599 7 -892 -414 -232 -1122 -197 -581 -1056 -321
3305c21p38L73K16p30Q49k82n33R21o80J54N01p40Q93l03l25Q98m82J76O28q18
$$ -321 -1059 -686 -470 -1200 -351 -633 -1166 -245 -925 -771 -270 -1010 -117 -420 -745 153 -329 -153 475 -343
3325c43P64j06m72J080q31K83N08q55Q80j21p23J148p94K68L27p40O51k51m51
$$ -343 421 315 -157 923 92 375 883 28 908 787 64 1212 418 686 1013 273 924 673 222
3344B22N76o71J96P34j114L87j57o13R06j005M03O28j190P52j30o80R67n68j44
$$ 222 798 127 323 1057 -57 330 173 -440 466 -539 -136 492 -698 54 -76 -756 211 -357 -501
3363e01N76o20N03o8r24J033j66j09J176j335p1N21q50J294k34l94P64r06N52
$$ -501 75 -545 -42 -110 -1034 -1 -167 -276 900 -435 -506 15 -835 459 225 -169 595 -311 241
3382B41J83o54Q57m74k50P57o99L96K11r28R01m34j58P26p07M67J97n20N21k28
$$ 241 424 -230 627 153 -97 660 -39 357 568 -360 541 107 -51 675 -32 435 632 112 633 405
3402D05l69Q56p73M88K52p41P51l16l58Q30q65N22K67q68P67l09m06P03p46L04
$$ 405 36 892 119 607 859 118 869 553 195 1025 160 682 949 81 848 539 133 836 90 394
3422C94K47q05Q04o18l51R81r10K11M30q64O13k18o01O13n56K11K85q82Q25j65
$$ 394 641 -164 640 22 -329 652 -258 -47 383 -481 132 -86 -687 -74 -630 -419 -134 -1016 -191 -356
3442c56m09R26o53nN18p22O04Km87R60o96K19M30p03N99R4p84R77m66n1O19o15
$$ -356 -765 161 -492 -497 21 -701 -97 -95 -582 378 -318 -99 331 -372 227 321 -463 514 48 -3 616 1
3464AL88J85o84Q22m73o3N35q47O14J78o69P16n90k25Q11p30K40J41n15P64k91
$$ 1 389 574 -110 712 239 176 711 -136 478 656 -13 703 113 -112 699 -31 209 350 -165 599 308
3485C08k30O59p62K51K95o60P07l80k94Q14p19L17M30j051P81k12m42Q21p84L45
$$ 308 78 737 -25 226 521 -139 568 188 -106 708 -11 306 736 -315 466 254 -188 633 -151 194
3505A94K48r40P10k56o58Q43q11K17K76p85P35k95m67P52q15K65L65n67O29j36
$$ 194 442 -498 212 -44 -702 141 -670 -453 -177 -962 -227 -522 -989 -237 -1052 -787 -422 -989 -360 -496
3525d96m51R08q92L86P27q71N82k20m8P48o24L26M21p00P67J09n25R59o56J72
$$ -496 -947 -39 -931 -545 182 -689 -107 -327 -375 373 -251 75 496 -204 563 672 147 1106 450 622
3545F22N40q26O10j3o05P93n19KL99o75M20j01n95O78m86k70P75j106L31j05o98
$$ 622 1162 336 946 933 328 1121 602 604 1003 328 748 647 52 730 244 -26 749 -357 -26 -131 -829
3566h29Q24p24J11M88j083P34j9p39R29o05j53P19p71O12J75p91R16l52k64P09
$$ -829 -5 -729 -618 -130 -1213 -479 -498 -1237 -308 -913 -1066 -347 -1118 -506 -331 -1122 -206 -558 -822 -113
3586a13o75M18M98q36Q36m36j19P54o74N20K28p71R11m28k35P09p83K12M70r24
$$ -113 -788 -370 128 -708 128 -308 -427 327 -347 173 401 -370 541 113 -122 587 -196 16 486 -438
3606d38P05l33k98Q21q71L71K88p73O81k48n52J116r43J24M04q06O80j1l83Q21
$$ -438 267 -66 -364 457 -414 -43 245 -528 153 -95 -647 469 -474 -350 54 -752 -72 -83 -466 355
3626C55q50M65K40n80O07j02n10J070j169K70N44j078R18N3m85O53n78l64O54
$$ 355 -495 -30 210 -370 237 135 -375 695 -474 -204 340 -738 180 233 -252 401 -177 -541 113
3645A13r43P84m23l48N66m74MM07r77Q01k28o15O84m43j1O25r99P51L0o55J008
$$ 113 -830 -46 -469 -817 -251 -725 -721 -314 -1291 -490 -718 -1333 -649 -1092 -1103 -478 -1477 -726 -696 -1351 -343
3666c43m94j24O03p39O03K14m54Q15m26j68R99r73N24Q5m52J015p64k02J034p47
$$ -343 -837 -961 -358 -1097 -494 -280 -734 81 -345 -513 486 -487 37 122 -330 685 -79 -281 753 6
3686FK17L59k81L57k51n4M97o09K8J59p81Q80o66mM35n24R8R0o16O08k59l71N41
$$ 6 223 582 301 658 407 353 850 241 269 428 -353 527 -139 -143 292 -232 -134 -44 -660 -52 -311 -682 -141
3709a41o80J97J18o48R52k72o91P39q91M94L13q87O06j38n87J074k36q0L80o47
$$ -141 -821 -624 -506 -1154 -202 -474 -1165 -426 -1317 -823 -510 -1397 -791 -929 -1516 -442 -678 -758 -378 -1025
3729a025P13k48m13Q81p14K08O32o99M27l9k97P60m86J82M01p16O60J6m22P04
$$ -1025 -312 -560 -973 -92 -806 -598 34 -665 -238 -277 -574 186 -300 -118 283 -433 227 243 -179 525
3749E25m69J09K26n53N81P5l71O69r15J93O76j089N55J23l48J93O7M9J82k02L55
$$ 525 56 165 391 -162 419 494 123 792 -123 70 746 -343 212 335 -13 180 247 296 478 276 631
3770F31l34m60P22q06J73O41r86L94K23n34Q08n41k10M37p01L65K37o71O66n15
$$ 631 297 -163 559 -247 -74 567 -419 -25 198 -336 472 -69 -279 158 -543 -178 59 -612 54 -461
3790d61l4M98n95K71L51p86O30l56j47P11p55L53m8m72N02p2l04M75n06N15K13
$$ -461 -495 3 -592 -321 30 -756 -126 -482 -629 82 -673 -320 -368 -840 -338 -410 -714 -239 -745 -230 -17
3811a7r53M60k58M7J309j608M92O07r53J066l01l32O22k17J1L60p63P46j41j45
$$ -17 -970 -510 -768 -721 588 -1020 -528 79 -874 192 -109 -441 181 -36 -25 335 -428 318 177 32
3831C2O46m59j9O92o78M12M7m88Q85m28m2N10r01N09R5l23O35p60j2M99q88M74
$$ 32 678 219 200 892 214 626 673 185 1070 642 600 1110 209 718 813 490 1125 365 353 852 -36 438
3853D38J22o51O01o24R0M47j109O09m3o24O72n37j55L75q64M57K55o80Q00p26
$$ 438 560 -91 510 -114 -24 423 -686 -77 -120 -744 -72 -609 -764 -389 -1253 -796 -541 -1221 -421 -1147
3873a147NO24q43L63K43m93Q17l54m0P18o87L79M56p35R91m49k44J058p42N05
$$ -1147 -1142 -518 -1361 -998 -755 -1248 -431 -785 -825 -107 -794 -415 41 -694 297 -152 -396 662 -80 425
3893D25J54l25N13k63j65Q44p40J36M37o63N65j02k30O96r06J63O05q58N57m74
$$ 425 579 254 767 504 339 1183 443 579 1016 353 918 816 586 1282 376 539 1144 286 843 369
3913C69j98O31o26p8M32p51N47l13l67O92p25J51L17p47O70k14l22P33p76K16
$$ 369 171 802 176 98 530 -221 326 13 -354 338 -387 -236 81 -666 4 -210 -532 201 -575 -359
3933c59M99q97N37J22m90O90n21J74N69p98N34l6m98Q87n70N0M65n82M59n9n40
$$ -359 140 -757 -220 -98 -588 102 -419 -245 324 -474 60 24 -474 413 -157 -107 358 -224 235 176 -364
3954c64P44m06j30N91o55L27R0l59M05m33L3M07o82N77l4n79R00m37k03N40n61
$$ -364 380 -26 -156 435 -220 107 197 -162 243 -190 -157 250 -432 145 111 -468 432 -5 -208 332 -229
3975b29M21J65m92N76j53r3M56p38N00K11m83O32l93J4M59o28L21K07p16O54k42
$$ -229 192 357 -135 441 288 195 651 -87 413 624 141 773 380 394 853 225 546 753 37 691 449
3996D49k39N95p41K35K47n84O93o38k4M66p96L66R4o51L72k14m0J83n04R6L75
$$ 449 210 805 64 299 546 -38 655 17 -7 459 -337 29 123 -528 -156 -370 -410 -227 -731 -635 -260
4017b60o39N23l35j79N56m01R3M95p37Q52l82l74Q73n13K35M63o71O74k22k03
$$ -260 -899 -376 -711 -890 -334 -735 -642 -147 -884 -32 -414 -788 85 -428 -193 270 -401 273 51 -152
4037a52P61o75K47N59j018Q96j06l83N86m69p5O05m79K50L0n85P97n90J17M14
$$ -152 609 -66 181 740 -278 618 512 129 715 246 171 776 297 547 577 -8 789 199 316 730
4057G30o25L37J65p40P38n10K8M46p65M50mm90P52n56j06L60n31L83K64n85M78
$$ 730 105 442 607 -133 605 95 123 569 -196 254 250 -240 512 -44 -150 210 -321 62 326 -259 219
4078B19l71j96N92n61K04m1l47M75k50q9M63o76K51N97p95L09k98j50O30q87L21
$$ 219 -152 -348 244 -317 -113 -154 -501 -26 -276 -365 98 -578 -327 270 -525 -216 -514 -664 -34 -921 -600
4099f00N57q27Q75m97j14O25o91L11L01n91O17j44l78N74k40K26L86o75Q22k78
$$ -600 -43 -870 5 -492 -606 19 -672 -361 -60 -651 -34 -178 -556 18 -222 4 390 -285 537 259
4119B59O3J40JJ13j7l23M54J30n15J253j230N0O68q29J031p36l15O17l67l84N86
$$ 259 322 462 463 576 559 236 690 820 305 1558 328 378 1046 217 1248 512 197 814 447 63 649
4140F49r01Q64k71l31R8j64j50L07o11L16K1n93N18n48k33M86j30P9L03q45J053
$$ 649 -252 612 341 10 108 -56 -206 101 -510 -194 -173 -766 -248 -796 -1029 -543 -673 -594 -291 -1136 -83
4161h3p49J13R11n68K11O0l83N17j13k2P36r93L90L85k47K50o55N73L16m91M26
$$ -83 -832 -719 192 -376 -165 -105 -488 29 -84 -106 630 -363 27 412 165 415 -240 333 649 158 584
4182E84L7p10R08n30K16M82j035N36j76o27R33l93k32N21r12N18J43k87O8L87
$$ 584 621 -89 819 289 505 987 -48 488 312 -315 618 225 -7 514 -398 120 263 -24 44 431
4202D31q43J061q69j14M84p08O31J4l34L87m54N03M33n92O27m64k86R68n72J17
$$ 431 -412 649 -220 -334 150 -558 73 87 -247 140 -314 189 622 30 657 193 -93 875 303 420
4222D20K32m19O15l58j47L83l91r2M99p46N17j63j83M90m47k74L59o32M91l8o19
$$ 420 652 233 848 490 343 726 335 243 742 -4 513 350 167 657 210 -64 295 -337 154 116 -503
4243e03P23n95qL80o42N67k9m73M72l55m6M81n64L22K69n61P48o54L00M54m68
$$ -503 220 -375 -383 -3 -645 -78 -107 -580 -108 -463 -509 -28 -592 -270 -1 -562 186 -468 -168 286 -182
4264a82M74q5n17Q86l55J15K94n79M83P3m45O53k92j34M88n70L40L5l78M55k87
$$ -182 292 207 -310 576 221 336 630 51 534 607 162 815 523 389 877 307 647 682 304 759 472
4285D72j29M14n83J48J29l87M51l93j00M07p40M49K12q64Q61n29m9O21p15L40
$$ 472 343 757 174 322 451 64 515 122 22 429 -311 138 350 -514 347 -182 -231 390 -325 15
4305A5J32m14N44l06k30N09m40J3N00o41M74k31k10O45n84J01L39m15M09j34k93
$$ 15 147 -267 277 -29 -259 250 -190 -177 323 -318 156 -75 -285 360 -224 -123 216 -199 210 76 -217
4326b17N22n51J74N51q57P33k71l61N77l43J8L75p46P00L6o38Q39o37J58M06n62
$$ -217 305 -246 -72 479 -378 355 84 -277 300 -43 -25 350 -396 304 340 -298 541 -96 62 468 -94
4347i4M13j30l35O53l54R3M85p26L95J29n01N88l45N0K04m92L89J7o98O83k20
$$ -94 319 189 -146 507 153 246 731 5 400 529 28 616 271 321 525 33 422 439 -259 424 204
4368B04j32N35q04N68k6n27N89n31l1O00p73M18j46o1K40k69m1M39m46J74J03
$$ 204 72 607 -197 371 345 -182 407 -124 -155 445 -328 90 -56 -117 123 -146 -187 252 -194 -20 83
4389H3l93O44k78j29M40n93J98L47n35O61l40k73O32n90L29K25n33N84j88k02
$$ 83 -310 334 56 -73 367 -226 -28 319 -216 445 105 -168 464 -126 203 428 -105 479 291 89
4409H9N30m47J39J45o72Q13l72l35M92m89M4N78o44K38J54l84M31n78K26J78n59
$$ 89 619 172 311 456 -216 597 225 -110 382 -107 -63 515 -129 109 263 -121 310 -268 -42 136 -423
4430d23M81N3l71N22l67j34N95p92Q62k16l70P25m23p2L20n18O06k65Q4K67K87
$$ -423 58 111 -260 262 -105 -239 356 -436 426 210 -160 565 142 70 390 -128 478 213 297 564 851
4451H51n28J266j430O75j3j028J124n18J34N17m38J39J56o94M84l56J52m2l59
$$ 851 323 1589 159 834 821 -207 917 399 533 1050 612 751 907 213 697 341 493 451 92
4470I2L47l4o30J171r73K08R30j100K72L46p54L07m3p30O42j84O48k32q79Q05
$$ 92 439 405 -225 946 -27 181 1111 11 283 629 -125 182 139 -591 51 -133 515 283 -596 209
4490B09l78l09J035p91R3M78m34M89N2n78P44m83L15P7k99M81k85JM23n67L85
$$ 209 -169 -478 557 -234 -141 337 -97 392 444 -134 610 127 442 519 220 701 416 417 840 273 658
4511F58J90m73N08j59l57N72m31J04L65p73O81k07n69P15n70J8L91m33L57k98
$$ 658 848 375 883 724 367 939 508 612 977 204 885 678 109 824 254 272 663 230 587 289
4531B89n54P60n91j6L70n37M19j07m12N29m36NN02o51M35K11n75N62n02J91M58
$$ 289 -265 495 -96 -112 258 -279 140 33 -379 150 -286 -281 221 -430 5 216 -359 203 -299 -108 350
4552C50n59M91J96l28L69k05K01J67o02N24O9m29P61q68J9N99m47N02l55o10J011
$$ 350 -209 282 478 150 519 314 515 682 80 604 673 244 1005 137 156 755 308 810 455 -155 856
4573H56r89K76K5j01k06N03L64n17j41K90j59q02M17J81m04L17k47j06N70n86
$$ 856 -133 143 168 67 -139 364 728 211 70 360 201 -601 -184 -3 -407 -90 -337 -443 127 -459
4593d59K39P3n20L65K89k68M38o42M77K22k70P73m11j16L64m26K98R3l80L96k46
$$ -459 -220 -147 -667 -302 -13 -281 157 -485 -8 214 -56 717 306 190 554 128 426 519 139 535 289
4614B89j32P26o09PK21l82N10m10j87N07n65K58J20o79N73o0m98P18n53q7M30
$$ 289 157 883 274 281 502 120 630 220 33 540 -25 233 353 -326 247 187 -311 407 -146 -233 197
4635A97n60L43j76l85N66m70j54L87l84L61K00m60M06n18K63L04m82K50L17o08
$$ 197 -363 -20 -196 -581 -15 -485 -639 -252 -636 -275 -75 -535 -129 -647 -384 -80 -562 -312 5 -603
4655f03P37m16L36J45n05K85J81o51Q94j40J67J44p51P04r3m61P12n73K28L05
$$ -603 134 -282 54 199 -306 -21 160 -491 403 263 430 574 -177 527 434 -27 685 112 340 645
4675F45o71L66L03o21M28m08J71O03j153Q07j57o85P18r7o55P44l84k96L58m17
$$ 645 -26 340 643 22 450 42 213 816 -337 470 313 -372 346 249 -406 338 -46 -342 16 -401
4695d01N54m97J30M86p36J74L7L6J64k36m37J340r05j53j34L09l00M02j97L13
$$ -401 153 -344 -214 272 -464 -290 -253 -217 -53 -289 -726 614 -291 -444 -578 -269 -569 -167 -364 -51
4715e1m82N38K45p25N40n21J98K81k16J26K37n55N55j00l77P85o08J36L11o83
$$ -51 -533 5 250 -475 65 -456 -258 23 -193 -67 170 -385 170 70 -307 478 -130 6 317 -366
4735c66P43l63k11N44m86J90K46n88N78p9m14M86m54R3K28l06L47M2l88M46m68
$$ -366 377 14 -197 347 -139 51 297 -291 287 208 -206 280 -174 -81 147 -159 188 230 -158 288 -180
4756a80J01L79o03L82j28l76O11l42nM32n80L13K25n44N13l63j42N31n55J80J20
$$ -180 -79 300 -303 79 -49 -425 186 -156 -161 271 -309 4 229 -315 198 -165 -307 224 -331 -151 -31
4777c1n62O94k59r5N80p01J75K81q15R76m13n40R03p14M95K06j203O49j07K35
$$ -31 -593 101 -158 -253 327 -374 -199 82 -733 243 -170 -710 193 -521 -26 180 -1023 -374 -481 -246
4797b46N92q01M70j08l36K54q7m8L03k58RK60l35N25j99r6L51l49K73J41n51O70
$$ -246 346 -455 15 -93 -429 -175 -262 -310 -7 -265 -256 4 -331 194 -5 -101 250 -99 174 315 -236 434
4819D34k85j92N48m52J70J38n34L65j51k43O58n58J3N38o30L31j65j89L71k04
$$ 434 149 -43 505 53 223 361 -173 192 41 -202 456 -102 -89 449 -181 150 -15 -204 167 -37
4839c7j91L02n15M93j74k94O30m55J05K14l46K70l8n35O86k35l7K79n49M90l73
$$ -37 -228 74 -441 52 -122 -416 214 -241 -136 78 -268 2 -36 -571 115 -120 -157 122 -427 63 -310
4860c10J01K19k48M7M05p94M01Q8k47M35m23j40M45l71M0Q4k19M61m88l3O37q37
$$ -310 -209 10 -238 -191 214 -580 -179 -91 -338 97 -326 -466 -21 -392 -352 -268 -487 -26 -514 -547 90 -747
4882g47M93Pk22L83k70NM50l60J28L95o52M61n2J1L55l74L07J62m05M68k41j98
$$ -747 -254 -247 -469 -86 -356 -351 99 -261 -133 262 -390 71 19 30 385 11 318 480 75 543 302 104
4904A04O41n22J92K79n97M29j74k1M97p26J31J96o25N51k69l02L59m25J62J41
$$ 104 745 223 415 694 97 526 352 331 828 102 233 429 -196 355 86 -216 143 -282 -120 21
4924B1o59N66m04j45M54p49L05L47o24N37l8l81N25m72K02K76n89N50rl34Q13
$$ 21 -638 -72 -476 -621 -167 -916 -611 -264 -888 -351 -389 -770 -245 -717 -515 -239 -828 -278 -287 -621 192
4945A92m89J18L89m81M00Q9l72O92n37K07L28m80J70J18k53N85r82L95K19k04
$$ 192 -297 -179 210 -271 129 218 -154 538 1 208 536 56 226 344 91 676 -306 89 308 104
4965A04K36J32p42P10p62L81p6o7n3j74R5M38o23j12Q73p46K44Q9q72R04m23m7
$$ 104 340 472 -270 440 -322 59 -17 -84 -137 -311 -216 222 -401 -513 360 -386 -142 -53 -925 -21 -444 -491
4987d91L68o28J49L96l30N88l80K46k09j83M14m71J22J58l27L42L83r87J88Q4
$$ -491 -123 -751 -602 -206 -536 52 -328 -82 -291 -474 -60 -531 -409 -251 -578 -236 147 -840 -652 -568
5007e68M66J75L3j55J03r3j41K25o82Q53r5o89R67o28K31j82n54M93L17o2K73
$$ -568 -102 73 106 -49 54 -39 -180 45 -637 216 121 -568 399 -229 2 -180 -734 -241 76 14 287
5028B87m98o14R16k47J12N6J8k8q94Q39m53n04J213l45l93M74J8m29N66m90P5
$$ 287 -211 -825 91 -156 -44 12 30 2 -892 -53 -506 -1010 203 -142 -535 -61 -43 -472 94 -396 -321
5049c21O28m46L59k18l74N11o66O89m96L9K50lj82J27N7LL34o64O86n09k89J080
$$ -321 307 -139 220 2 -372 139 -527 162 -334 -295 -45 -48 -230 -103 -46 -43 291 -373 313 -196 -485 595
5071E95n74L58l9k65L16j73j02L12l21K53L9m57M02j46j74K77l06J32N8m36L47
$$ 595 21 379 340 75 391 218 116 428 107 360 399 -58 344 198 24 301 -5 127 185 -251 96
5092I6l05K4K31m45K80J46m47K99j47j38M24n02M34r0k27N44j42j43M74l95J24
$$ 96 -209 -185 46 -399 -119 27 -420 -121 -268 -406 18 -484 -50 -140 -367 177 35 -108 366 -29 95
5113I5K63l16M13k7l23N12k91J85K91n73M46p0LL14l48k87L10k35K80l35j06L27
$$ 95 358 42 455 428 105 617 326 511 802 229 675 605 608 922 574 287 597 362 642 307 201 528
5135E28m93L5P1j40K27j68l96N35m50M3K86m68L54r6k72O34p22P3L15l51N14j80
$$ 528 35 70 141 1 228 60 -336 199 -251 -208 78 -390 -36 -132 -404 230 -492 -419 -104 -455 59 -121
5157a21k76N57m30J93K99l06L52jm28O60k12n9M02l83K95q9l39L57r9R8K02m27
$$ -121 -397 160 -270 -77 222 -84 268 267 -161 499 287 228 630 247 542 453 114 471 372 470 672 245
5179B45P3K31n47N08m03n5L14l38K15p7l22K73j61j22M40m90J74j4j98M79j86
$$ 245 318 549 2 510 107 52 366 28 243 166 -156 117 -44 -166 274 -216 -42 -56 -254 225 39
5200C9l06L55m41L72L29o85N62j90j84L77l50K99M6k27L51j70j83L53k40j35M99
$$ 39 -267 88 -353 19 348 -337 225 35 -149 228 -122 177 223 -4 347 177 -6 347 107 -28 471
5221D71m63K84j58k81L99k44r0L44l36J24J13n47N02m35J92L70n41K41o0j63K05
$$ 471 8 292 134 -147 252 8 -82 262 -74 50 163 -384 118 -317 -125 245 -296 -55 -115 -278 -73
5242g3l01L39J67l66K12j47q9M40l88J03M41m52M26j19j94L40k83k7K65k59J92
$$ -73 -374 -35 132 -234 -22 -169 -258 182 -206 -103 338 -114 312 193 -1 339 56 29 294 35 227
5263B27M6m10M39m31J51K45m48K71J39n03M14l19J68K98n22Q8J98j98K84l44O8
$$ 227 273 -137 302 -129 22 267 -181 90 229 -274 140 -179 -11 287 -235 -147 51 -147 137 -207 -139
5284a39K44m07M72o0m82N29j36j77L09k41M1K42m11L58o0j42M81n60P9K20k72
$$ -139 105 -302 170 110 -372 157 21 -156 153 -88 -47 195 -216 142 82 -60 421 -139 -60 160 -112
5305a12N23m97kQ2k44o5K30L76k80k1J14j25j57k01M31p84N02J60q14J529j577
$$ -112 411 -86 -88 -6 -250 -315 -85 291 11 -10 104 -21 -178 -379 52 -732 -230 -70 -884 645 -932
5326i32P34K81o62N63J54l1l75q5N1K31J56K70p20M01K77o3k56K45j44K19j30
$$ -932 -198 83 -579 -16 138 107 -268 -353 -302 -71 85 355 -365 36 313 250 -6 239 95 314 184
5347A84L1n0k10K81j37l51O6M56m30M85m32lM75n50L46k50J80L33n68OQ4L4K25
$$ 184 215 165 -45 236 99 -252 -186 270 -160 325 -107 -110 365 -185 161 -89 91 424 -144 -138 -54 -20 205
5370B05j66k72O15n43j01L19k10J36J27j68mr2q8L67O0L1l00r7k00L39l56N29
$$ 205 39 -233 382 -161 -262 57 -153 -17 110 -58 -62 -154 -242 125 185 216 -84 -181 -381 -42 -398 131
5392A31o63M05p9l92O64j46m21M10k56J94M07r62Q74m13k7K49k96K43J58k95L81
$$ 131 -532 -127 -206 -598 66 -80 -501 -91 -347 -153 254 -708 166 -247 -274 -25 -321 -78 80 -215 166
5413A66k37j56N37j27j4l7l26M58k91L4M49n30K75N9k64J10l1j85L95l21J7K70
$$ 166 -71 -227 310 183 169 132 -194 264 -27 7 456 -74 201 260 -4 106 75 -110 285 -36 -19 251
5435B51p28O17j45m84L31k75K96L9l74L72j50k48K08l15K29J97j58M84l17l24
$$ 251 -477 140 -5 -489 -158 -433 -137 -98 -472 -100 -250 -498 -290 -605 -376 -179 -337 147 -170 -494
5455d94N41p8L5N4k47K80r8j18J58J02QL54m82K63j77r3K89n8j39K89m32K80j63
$$ -494 47 -31 4 58 -189 91 -7 -125 33 135 143 497 15 278 101 8 297 239 100 389 -43 237 74
5478G4k87N30k66k21M30o63j66O00l63O0QJ49R2o85M16J64r02Q63l30L6K34J22
$$ 74 -213 317 51 -170 260 -403 -569 31 -332 -272 -264 -115 -23 -708 -292 -128 -1030 -167 -497 -461 -227 -105
5500a05l41M97q99J254m10l74M74l42k35M79o8P38j61o06P11n94L7L56k12J60
$$ -105 -446 51 -848 406 -4 -378 96 -246 -481 -2 -70 668 507 -99 612 18 55 411 199 359
5520C59jk5K83o46J38K98n04K18l4j74K85l99N2J13m29K70o5o4J20l39K4J77l58
$$ 359 358 333 616 -30 108 406 -98 120 86 -88 197 -202 -150 -37 -466 -196 -261 -325 -205 -544 -520 -343 -701
5543g01N35l3k93L04k72l4M44m10K79J01j88N06k72l5J74l38J10J93k70N87l33
$$ -701 -166 -199 -492 -188 -460 -494 -50 -460 -181 -80 -268 238 -34 -69 105 -233 -123 70 -200 387 54
5564E4p9L61m15L67j15k34K70l24l4L09m23K92j8l67M81l57m4L16m79L72J6k26
$$ 54 -25 336 -79 288 173 -61 209 -115 -149 160 -263 29 11 -356 125 -232 -276 40 -439 -67 -51 -277
5586b77p9J6q2L04k48O1j3k24L33j00j36L83k46J89q5r6K32p3j51J15l14K61J80
$$ -277 -356 -340 -422 -118 -366 -305 -318 -542 -209 -309 -445 -62 -308 -119 -204 -300 -68 -141 -292 -177 -491 -230 -50
5609e0J2J44p87N91J29m60j57P52l34J15l28P6K68l81M19J34m83K10k91O7L35
$$ -50 -38 106 -681 -90 39 -421 -578 174 -160 -45 -373 -297 -29 -410 9 143 -340 -130 -421 -354 -19
5630a9k85P7K41n30L23Q4l07M27l77j1J46j54M25l11K9K25l13J73K41m21K94N0
$$ -19 -304 -227 14 -516 -193 -109 -416 11 -366 -377 -231 -385 40 -271 -242 -17 -330 -157 84 -337 -43 7
5652Gj80L15m71K51O3m92N38O8k43J56l14L75K0m69K59q2o1J88k09J40R3l03K46
$$ 7 -173 142 -329 -78 -15 -507 31 99 -144 12 -302 73 93 -376 -117 -199 -260 -72 -281 -141 -48 -351 -105
5675a05J14l22J22L4k32M63n64K87q3J5L62k59q6J30l12L82n1r5J82m2j88J34
$$ -105 9 -313 -191 -157 -389 74 -490 -203 -286 -271 91 -168 -254 -124 -436 -54 -105 -200 -18 -60 -248 -114
5697a14o3j05K7k78M34l42Q0K59k70K94j73k20K26q0r4M29l18M5J94j93K97j57
$$ -114 -177 -282 -255 -533 -99 -441 -361 -102 -372 -78 -251 -471 -245 -325 -419 10 -308 -263 -69 -262 35 -122
5719a22lK39k96J12K79l12K93l07L5M32k79j07L10l50K67q7k97L69k94J3K43k27
$$ -122 -125 114 -182 -70 209 -103 190 -117 -82 350 71 -36 274 -76 191 104 -193 176 -118 -105 138 -89
5741h9J48J02k74K38l31kL11l82K92Q0m18Q7p0L6J08k10Q2m7K1N57o19J65J57
$$ -89 59 161 -113 125 -206 -208 103 -279 13 93 -325 -238 -308 -272 -164 -374 -292 -339 -318 239 -380 -215 -58
5764e8j42K86q3k80L80o1M7k3l28K42J84l83M35k69O0J96n58O28m19O8M49o44
$$ -58 -200 86 3 -277 103 42 89 66 -262 -20 164 -219 216 -53 7 203 -355 273 -146 -78 371 -273
5786b73l61Q76n34j09J72k46K99l46N39l42l11Q0J13k2R3K69J98j96P2n4O0j89
$$ -273 -634 242 -292 -401 -229 -475 -176 -522 17 -325 -636 -556 -443 -465 -372 -103 95 -101 -29 -83 -23 -212
5808b12M35j31j73L40l57K96J08k33M22j05k94K22m15J94J43l22L83j22l13N07
$$ -212 223 92 -81 259 -98 198 306 73 495 390 96 318 -97 97 240 -82 301 179 -134 373
5828C73m11n5K48n67M48l43J71j45J47Rk43n0r0M97o89O95k01K27J69n81l6M5
$$ 373 -38 -93 155 -412 36 -307 -136 -281 -134 -125 -368 -418 -508 -11 -700 -5 -206 21 190 -391 -427 -382
5850c82n21J273o56L96K49p80O71l62J86L76k66m71O08j98O4K58k30j14P62j202
$$ -382 -903 370 -286 110 359 -421 250 -112 74 450 184 -287 321 123 187 445 215 101 863 -339
5870c39M85M79k61J79n88L86l60P15m28j01n56M72N9J57o04N19o46m2k38K65N26
$$ -339 146 625 364 543 -45 341 -19 696 268 167 -389 83 142 299 -305 214 -432 -474 -712 -447 79
5891G9L25q67o4N60p52Q47m10m99J007m93L6L05j95K29K49o75M54J29k78M93o39
$$ 79 404 -463 -527 33 -719 128 -282 -781 226 -267 -231 74 -121 108 357 -318 136 265 -13 480 -159
5912a59L22o5OJ98j17k99L54k62J03Kj99L35j87j77K65j69J2M7l72M13k1j59Q4
$$ -159 163 98 104 302 185 -114 240 -22 81 83 -116 219 32 -145 120 -49 -37 10 -362 51 30 -129 -45
5935d5l18J94K5j14K08k11J55J60k88l4K46k52L71k60J79J82l06k8K02k15L23
$$ -45 -363 -169 -144 -258 -50 -261 -106 54 -234 -268 -22 -274 97 -163 16 198 -108 -136 66 -149 174
5956A74pj85L60n27K2L55k30j2K55j06K45k65j6L04m18J85%k47J32j14lJ53o2
$$ 174 167 -18 342 -185 -163 192 -38 -50 205 99 344 79 63 367 -51 134 134 -113 19 -95 -98 55 -7
5979gj46J11k22K86o9N9L6k85K17j2rK22m31m0M40l76K19j3j89K01KJ1J82l65
$$ -7 -153 -42 -264 22 -47 12 48 -237 -20 -32 -41 181 -250 -290 150 -226 -7 -20 -209 -8 -6 5 187 -178
6003a78K07R7k66L0l9mL42m81J79O7k18L73k03j84M61l71K1K60n55N28j05k85
$$ -178 29 126 -140 -110 -149 -153 189 -292 -113 -46 -264 109 -94 -278 183 -188 -167 93 -462 66 -39 -324
6025c24K07L01J79j80k09K37p2l64L26n79O97K40l58J96k54r54J445o81J58O2
$$ -324 -117 184 363 183 -26 211 139 -225 101 -478 219 459 101 297 43 -911 534 -147 11 73
6045G3J02j74M07m06k06L96K6j90Jj44M90Q2n42k18j56M98n22N96j29j71K55k75
$$ 73 175 1 408 2 -204 192 218 28 29 -115 375 457 -85 -303 -459 39 -483 113 -16 -187 68 -207
6067b07NK70k36J82r1r7J54K1j50J75j72L31m7j98J11q2j43L18j60J05l6r4K69
$$ -207 -202 68 -168 14 -77 -174 -20 1 -149 26 -146 185 138 -60 51 -31 -174 144 -16 89 53 -41 228
6090B28k93J44K92m56L15p3l69L52k93M9J77k25J39J4k24K47j87n3J43j10K11
$$ 228 -65 79 371 -85 230 157 -212 140 -153 -104 73 -152 -13 1 -223 24 -163 -216 -73 -183 28
6111B8q2k39L30o0k59L73l40J95O6j87J48J10l39L22k18O7J78l24L99j82j13K64
$$ 28 -54 -293 37 -23 -282 91 -249 -54 12 -175 -27 83 -256 66 -152 -85 93 -231 168 -14 -127 137
6133A37k12J37j2l13L73k9j31J67k45J52J39k11K19k14k34K22k22J25%j9J78q8
$$ 137 -75 62 50 -263 110 81 -50 117 -128 24 163 -48 171 -43 -277 -55 -277 -152 -152 -171 7 -81
6155h1j75K47j59K31j4j46J69J1l9P5k84N2J94k09K30k43k2L17o4j25K50m84N25
$$ -81 -256 -9 -168 63 49 -97 72 83 44 119 -165 -113 81 -128 102 -141 -163 154 90 -35 215 -269 256
6178B56j41j00J88j88j79O13m34K9j79q3L28Rn1P4j61J28q2o4J79m23J02L63k42
$$ 256 115 15 203 15 -164 449 15 44 -135 -218 110 119 68 142 -19 109 27 -37 142 -281 -179 184 -58
6201e8M53j90l16L10l16J1M61n53K70J19k40j13J17K16J00p51O66l4n33N31l10
$$ -58 395 205 -111 199 -117 -106 355 -198 72 191 -49 -162 -45 171 271 -480 186 152 -381 150 -160
6222a60L20j81j17l34L20J0J1l62M21N93p86N1N20l08J74o33r3P37r74Q39l78
$$ -160 160 -21 -138 -472 -152 -142 -131 -493 -72 521 -265 -214 306 -2 172 -461 -554 183 -791 48 -330
6243c30nM5N15k80L70o89M13L44l72K86l98j02R54q79L14j31o4k29L19k01j44
$$ -330 -335 -290 225 -55 315 -374 39 383 11 297 -101 -203 751 -128 186 55 -9 -238 81 -120 -264
6264b64K18Q2J66m36L13m7l19L91k15J21J17l24J52m9Q8K5j56P4N7j71K28l1L1
$$ -264 -46 36 202 -234 79 32 -287 104 -111 10 127 -197 -45 -94 -6 19 -137 -63 -6 -177 51 20 51
6287E1L8j60k3j3q5K58r1j33J72j93k0L50l99J55R2k38K52k49N0J40j10k0n5j8
$$ 51 89 -71 -94 -107 -192 66 -25 -158 14 -179 -199 151 -248 -93 -1 -239 13 -236 -186 -46 -156 -176 -231 -249
6311b49L38k97J4J61q9r6J66oQ7j20q4L10l06P7O9l81M08j99J02L9k79L48n6j43
$$ -249 89 -208 -194 -33 -122 -218 -52 -58 29 -91 -175 135 -171 -94 -25 -406 2 -197 -95 -56 -335 13 -43 -186
6335a86K42j65PJ75n3r2m6n3L39p0l11J90k14Q8r0q4K42J19k42J14k2K9Q0j40
$$ -186 56 -109 -102 73 20 -72 -118 -171 168 98 -213 -23 -237 -149 -239 -323 -81 38 -204 -90 -112 -83 -3 -143
6359a43K28j75m6J60n4n3J49l49L83j47j14K20j92J27R7j83L5J70m00L17k38K20
$$ -143 85 -90 -136 24 -30 -83 66 -283 100 -47 -161 59 -133 -6 91 -92 -57 113 -287 30 -208 12
6381A2p8m5n4K38j46k3M8l17K44j11J6J76m14N18m03N6K45k58K08j68j53K68k03
$$ 12 -66 -111 -165 73 -73 -96 -48 -365 -121 -232 -216 -40 -454 64 -339 -283 -38 -296 -88 -256 -409 -141 -344
6404c44N3J92k73K89K7m5J3j59K36N0j84J83n3j29L62j65r0J44j24K1Q2j26J08
$$ -344 -291 -99 -372 -83 -56 -101 -88 -247 -11 39 -145 38 -15 -144 218 53 -37 107 -17 4 86 -40 68
6427F8K44l50L09k64J33J12j60L5j82K9K65l70J77K2l30J73Q6j70J11l9q3L12
$$ 68 312 -38 271 7 140 252 92 127 -55 -26 239 -131 46 68 -262 -89 -3 -173 -62 -101 -184 128
6449A28j96o7K7k47J37J0pK61k88J09L3L4M3j92K6K81l41j3L39k70K49r9R3O5
$$ 128 -68 -135 -108 -355 -218 -208 -215 46 -242 -133 -100 -66 -23 -215 -189 92 -249 -262 77 -193 56 -43 50 115
6473A15k99L24N8j18L8n9j9J19l46K08K14k10K62k45j71J88j40J44l8k38L09q
$$ 115 -184 140 198 80 118 59 40 159 -187 21 235 25 287 42 -129 59 -81 63 25 -213 96 88
6495H8j81J97k70K09r2o7M3M5J4l9j90J98Q5m4J09j43j97L82k62J24R2k95R6J08
$$ 88 -93 104 -166 43 -49 -116 -73 -28 -14 -53 -243 -45 40 -4 105 -38 -235 147 -115 9 101 -194 -98 10
6519A0r9J11j23J09o6j00K80n7j74J72j89J48j32j12M36k87J7K7j48J60P9k02
$$ 10 -89 22 -101 8 -58 -158 122 65 -109 63 -126 22 -110 -222 214 -73 -56 -29 -177 -17 62 -140
6541a40L6k2j8jj32K35P5k61L70j84r2J7J9k6j29K6J62M5j11J16k52K35o6j35
$$ -140 -104 -126 -144 -145 -277 -42 33 -228 142 -42 -134 -117 -98 -124 -253 -227 -65 -20 -131 -15 -267 -32 -98 -233
6565b33K41k30O5K65j52K01j17j34Q6j4R9oo8L8K9k59J97P6m08L38k8M0k2m0j11
$$ -233 8 -222 -157 108 -44 157 40 -94 -8 -22 77 71 3 41 70 -189 8 84 -324 14 -14 26 4 -36 -147
6590a47M1k12K83j81j19L57k51N1J16j18L10l78p3K98k02J08K3j68J69o4rJ0k51
$$ -147 -106 -318 -35 -216 -335 22 -229 -178 -62 -180 130 -248 -321 -23 -225 -117 -94 -262 -93 -157 -166 -156 -407
6613d07K67o1J1K10j30J78l59O8J82q1q3R1J37l17L09j7p0j59J52J30m8l01L26
$$ -407 -140 -201 -190 20 -110 68 -291 -223 -41 -122 -205 -114 23 -294 15 -2 -72 -231 -79 51 3 -298 28
6636B8k37Q7J42j54J85j39l6J16k96K21Rj20L19k13J84P6k44J63o2r8J98k19m3
$$ 28 -209 -122 20 -134 51 -88 -124 -8 -304 -83 -74 -194 125 -88 96 172 -72 91 29 -69 129 -90 -133
6659a33K43k06J32O1j36J0j12O9j24R5M8J70m03R0J14k22K02j10j32K43k57K45
$$ -133 110 -96 36 97 -39 -29 -141 -72 -196 -101 -53 117 -286 -196 -82 -304 -102 -212 -344 -101 -358 -113
6681a13o6j76K87r6p9K14p4q6J26j5Q4j87J92%j69P0K6K0J20q1j89L03k74K14
$$ -113 -179 -355 -68 -164 -243 -29 -103 -189 -63 -78 6 -181 11 11 -158 -88 -62 -42 78 -3 -192 111 -163 51
6705E1p3j61L20j65j18O3L6p1J58j39J8R3j9J02l42K27N2k11N5J69k23J24j30
$$ 51 -22 -183 137 -28 -146 -83 -47 -118 40 -99 -81 12 -7 95 -247 -20 32 -179 -124 45 -178 -54 -184
6728a84J94J74l07J16n2J2J83k46N3Mj16J81J02j10k65J96P0o2j29K41j60j7J3
$$ -184 10 184 -123 -7 -59 -47 136 -110 -57 -53 -169 12 114 4 -261 -65 5 -57 -186 55 -105 -122 -109
6751a09J08k68L73k88K26jn5Q7j18o7J37k05R9J81j17J9l7j28R9M1p3J40r4P9
$$ -109 -1 -269 104 -184 42 41 -14 73 -45 -112 25 -180 -81 100 -17 2 -35 -163 -64 -23 -96 44 -50 29
6775B9j40J1K54k21R1J13j21O4j71L5K31k64J68q9j79M36k03l8j5j23P7N5k1L9
$$ 29 -111 -100 154 -67 24 137 16 80 -91 -56 175 -89 79 -10 -189 247 44 6 -9 -132 -55 0 -21 18
6799A8RPJ27j27o1J79k75L03j48K0M1j05J68j42j11L47p3j09L52l93P9j44m5J92
$$ 18 27 34 161 34 -27 152 -123 180 32 52 93 -12 156 14 -97 250 177 68 420 27 106 -38 -83 109
6823A09n2rQ9k17R2R7k07P0%l9K08m15K05K8o6J89Q3j27m0k34K27R6k23J14J61
$$ 109 57 48 137 -80 12 109 -98 -28 -28 -67 141 -274 -69 -41 -107 82 165 38 -2 -236 -9 87 -136 -22 139
6848A39j63J02k8J15K2m7j32kO8J02r5m2J64k93J54J72k67P1r1J56J18j02Q5N2
$$ 139 -24 78 50 165 187 140 8 6 74 176 81 39 203 -90 64 236 -31 40 -51 105 223 121 206 258
6872B58k40J42n5m7J94k78K19j82j19J94q8N9%n0j03K15q9J09j54p4K76j66J60
$$ 258 18 160 105 58 252 -26 193 11 -108 86 -2 57 57 7 -96 119 30 139 -15 -89 187 21 181
6895A81n8j95J79j70J31J9k22R7J9k56L79j30J46J4j25k7l7N3O9j74J96r7q4J5
$$ 181 123 -72 107 -63 68 87 -135 -38 -19 -275 104 -26 120 134 9 -18 -55 -2 67 -107 89 -8 -92 -77
6919g7L6n2J62o7Pn4l2J35J5k91K09M2o1J15k54J39J36l15P2K64k48O6Q5m0J83
$$ -77 -41 -93 69 2 9 -45 -77 58 73 -218 -9 33 -28 87 -167 -28 108 -207 -135 129 -119 -53 32 -8 175
6944A75l49K57ok77K67kj29J48j68N6n6j24L06k95J34K89l44K26q5MO7j95l2J12
$$ 175 -174 83 77 -200 67 65 -64 84 -84 -28 -84 -208 98 -197 -63 226 -118 108 23 27 94 -101 -133 -21
6968b1j75jM05l16N1N6k2J09k22J06q9j4J53j15K7R7j81J46q2j8n0J39M4O3Pq0
$$ -21 -196 -197 208 -108 -57 -1 -23 86 -136 -30 -119 -133 20 -95 -68 29 -152 -6 -88 -106 -156 -17 27 90 97 17
6994A7J10k66K16K8j48K96k08o4J49p1K6J8j41K79l02Q6J66k90J81k40J23P8j85
$$ 17 127 -139 77 105 -43 253 45 -19 130 59 85 103 -38 241 -61 25 191 -99 82 -158 -35 43 -142
7017a42J13J39j12J0j24P5q8j27L01k63K6P5J26r8J83k59N4R6q0O5m7j5K52l3
$$ -142 -29 110 -2 8 -116 -41 -129 -256 45 -218 -192 -117 9 -89 94 -165 -111 -15 -95 -30 -77 -92 160 127
7041A27j72J19o4J43o1p8P3j56J82R1k79K80K9k89K98Jj71R8n1J29j10q0K44m31
$$ 127 -45 74 10 153 92 14 87 -69 113 204 -75 205 234 -55 243 244 73 171 120 249 139 59 303 -128
7065a28K09j95J63nRj52Q4J02j58J12p9P8j7j29Q4l3k9O9q2J23J27j52Q0Nj2M0
$$ -128 81 -114 49 44 53 -99 -15 87 -71 41 -38 40 23 -106 -22 -55 -84 -15 -97 26 153 1 81 86 74 114
7091A14m2K7R9j69J46R9j27q6k01L00J9q2k2m4O1K48l36J87q5n6o6r5L6J35K8
$$ 114 72 99 198 29 175 274 147 61 -140 160 179 97 75 31 92 340 4 191 106 50 -16 -111 -75 60 88
7116H8m1j31O0J66k96K37P0k94K65J39k87J50j90j01K88j35J23j27n6K64J7n3
$$ 88 47 -84 -24 142 -154 83 153 -141 124 263 -24 126 -64 -165 123 -12 111 -16 -72 192 209 156
7138A56M9j67L7K59k58nJ10k30K97l13J50J38l26K45m4j66K49j73M2P2r6Rl1j63
$$ 156 205 38 75 334 76 71 181 -49 248 -65 85 223 -103 142 98 -68 181 8 50 122 26 35 4 -159
7162a59K28m5q8K51p8o7o2M9OQj38M3N4J33j16q0J00j6N1N3j69J34q5J12Q3L8
$$ -159 69 24 -64 187 109 42 -20 29 35 43 -95 -52 2 135 19 -61 39 23 74 127 -42 92 7 119 202 240
7188B40j29R5j78J58j27Qn9JQ3K44k69K1m9p5R9R8j51K10n9m6J75j55N8j94j3
$$ 240 111 206 28 186 59 67 8 9 92 336 67 88 39 -36 63 161 10 220 161 115 290 135 193 -1 -14
7213a4L5J6R9p3j11J87L9j16K6j82QP1L8J90j80Mm5j6J95j5j64K9R2n6N0j92J87
$$ -14 21 37 136 63 -48 139 178 62 88 -94 -86 -15 23 213 33 37 -8 -24 171 156 -8 21 113 57 107 -85 102
7240A02n4k4J07j3j08O3m5r7J84j97K70p6k28K12J70j33o3k1Q2J18q1N0j65o5
$$ 102 48 24 131 118 10 73 28 -69 115 -82 188 112 -116 96 266 133 70 49 131 249 168 218 53 -12
7264a2M19l96J56M6J9o5M2j01J56j22k7J61jK5j90J11m3j42K71k09J2J21J5j73
$$ -12 407 11 167 213 232 167 209 108 264 142 115 276 275 300 110 221 178 36 307 98 110 231 246 73
7288G3N5rm3K5l4J68j23k46K58q0P1j27j28L69j99%J21q0J5N4j97K87k66J05J55
$$ 73 128 119 76 101 67 235 112 -134 124 44 115 -12 -140 229 30 30 151 71 86 140 -57 230 -36 69 224
7313B24k32J45J1j80K7r4J95J41k55J76j81J51J01j26j90K66o6K3K00m25R0J00
$$ 224 -8 137 148 -32 -5 -99 96 237 -18 158 -23 128 229 103 -87 179 113 136 336 -89 1 101
7335A01JQ5j46O7J95j71J87j56nL8p8J07q2j9J2M8J9J78m08K42J6k2j80J34j72
$$ 101 102 187 41 108 303 132 319 163 158 196 118 225 143 124 136 184 203 381 -27 215 231 209 29 163 -9
7360iK54r4RJ15l47J09j25J44R5j16r3K18k11O1J75k70K48mk39Rl9K35m8k37L08
$$ -9 245 151 160 275 -72 37 -88 56 151 35 -58 160 -51 10 185 -85 163 159 -80 -71 -110 125 77 -160 148
7385A48k74J43J7o7J26J02j63K9j10J52J44k36R4q1J44J6J7j0o7k84O4K32m3J22
$$ 148 -126 17 34 -33 93 195 32 61 -49 103 247 11 105 24 168 184 201 191 124 -160 -96 136 93 215
7409B15j82nK87l03k1l9OJ32j93R0J14k21K60r1n4K4Qn8R8L9n1k6qQ4J2k0J64
$$ 215 33 28 315 12 -9 -48 -42 90 -103 -13 101 -120 140 49 -5 19 27 -31 67 106 55 29 21 105 117 97 261
7436B61k86J51q9r7J64np0O3k4O4J69k78K2J13j10Q9j54R5L1j81J91p9j21j28
$$ 261 -25 126 37 -60 104 99 29 92 68 132 301 23 45 158 48 137 -17 78 109 -72 119 40 -81 -209
7460b09M6M26n20J82KL8q4J43j36p6J56J3n9kk21L79k21N2K27n3j15J69j54J31
$$ -209 -163 263 -257 -75 -73 -35 -119 24 -112 -188 -32 -19 -78 -80 -301 78 -143 -91 136 83 -32 137 -17 114
7484A14L6K9o5%n3m9r8K50L9p7nj29M4R3j34R3k05K57M1j21j10J48j46J64j26
$$ 114 150 179 114 114 61 12 -86 164 203 126 121 -8 36 129 -5 88 -117 140 181 60 -50 98 -48 116 -10
7509a0j90K65l13K55l4o7K7J39k4R9r0N7n5r8J98k49K4L40k60P2K6j48p0J66o4
$$ -10 -200 65 -248 7 -27 -94 -67 72 48 147 57 114 59 -39 159 -90 -66 274 14 86 112 -36 -106 60 -4
7534dpj8j2L3p3J61Mj03j26J83j39J46k41J57j22J94l8j50J49l7j19M0J90j00
$$ -4 -11 -29 -41 -8 -81 80 84 -19 -145 38 -101 45 -196 -39 -161 33 -5 -155 -6 -43 -162 -122 68 -32
7558c2l0p8J12J62k79K53j49LR3j39P1%N9p3R1j48K21j75J1K87l83P4J32j19j1
$$ -32 -62 -140 -28 134 -145 108 -41 -38 55 -84 -13 -13 46 -27 64 -84 137 -38 -27 260 -123 -49 83 -36 -47
7583d7nO4q0Q6J16j26j92L85k83N1J4O3L0l31J58J52r2o5J37p5N9N7l46J40P8
$$ -47 -52 12 -68 18 134 8 -184 201 -82 -31 -17 46 76 -255 -97 55 -37 -102 35 -40 19 76 -270 -130 -52
7608e2K63k22n2J3J03r9q0l9J56L6j47Q5p7k0K07j92J32j25J32k9m0mJ34J00r0
$$ -52 211 -11 -63 -50 53 -46 -126 -165 -9 27 -120 -35 -112 -132 75 -117 15 -110 22 -7 -47 -51 83 183 93
7633I3q7p6O2J8r7O5j05P7J02j75O3J37q3pJ49j17Q1j27O7qj27L06q0j81K73k67
$$ 93 6 -70 -8 10 -87 -22 -127 -50 52 -123 -60 77 -6 -13 136 19 100 -27 40 32 -95 211 131 -50 223 -44
7659d4M8P5n8J08j94R0L04m74J92J04J52j49k66M3P5l8M1J29o1p0m7O9O5n9K0
$$ -44 4 79 21 129 -65 25 329 -145 47 151 303 154 -112 -69 6 -32 9 138 77 7 -40 29 94 35 55
7684E5j11J42k7J5k07K5J41l5Q6l2j6Q8k45K82l5j28K78k95P5J78k17O9J0J8L1
$$ 55 -56 86 59 74 -133 -108 33 -2 84 52 36 124 -121 161 126 -2 276 -19 56 234 17 86 96 114 145
7709A45k02K26j09j35jJ31lm8M4J81r7p3j14O9n0R8M0M1k1j14J21J15j73K9j25
$$ 145 -57 169 60 -75 -76 55 52 4 48 229 132 59 -55 14 -36 62 102 143 122 8 129 244 71 100 -25
7734b5M9rL7l2pr5J94K2J19j83K5j57J45j42K74k35l2R9K3p4rJ67lk28J05K4k64
$$ -25 24 15 52 20 13 -82 112 134 253 70 95 -62 83 -59 215 -20 -52 47 70 -4 -13 154 151 -77 28 52 -212
7761b12M5K25j31N0J94j25j2k22L37p7j3j33pr1L26o0j97K33j32M38l63l2J22
$$ -212 -167 58 -73 -23 171 46 34 -188 149 72 59 -74 -81 -172 154 94 -103 130 -2 436 73 41 163
7784A63j06m6n3j1J25J9j24L03q0j12M7j17R9K6p8J69j86L9J66k99k9L9P3R0k14
$$ 163 57 11 -42 -53 72 91 -33 270 190 78 125 8 107 133 55 224 38 77 243 -56 -85 -46 27 117 -97
7809i7L8J26l0O7j8l9J42k97J92K5j42J82j17k5K70l65P0J07nK1P5k44K40j86
$$ -97 -59 67 37 104 86 47 189 -108 84 109 -33 149 32 7 277 -88 -18 89 84 105 180 -64 176 -10
7833a0l5K17n7P3k1r2j3o4K03j39O2R0j91r0K13r0q5K14l34K74j36k18K56l5M3
$$ -10 -45 172 115 188 167 75 62 -2 201 62 124 214 23 -67 146 56 -29 185 -149 125 -11 -229 27 -8 35
7858C5j15J18l9j24K21j89MJ51n0p1l9J33n5J90n2j86K75j70RP9j92R0o9J09j6
$$ 35 -80 38 -1 -125 96 -93 -89 62 12 -59 -98 35 -20 170 118 -68 207 37 46 125 -67 23 -46 63 47
7883D7O0j78J15n3k3M2J51J61j20k27R3l5o3jPO3l1J8j30J03R3j87j93L30l6q9
$$ 47 107 -71 44 -9 -32 10 161 322 202 -25 68 33 -30 -31 -24 39 8 26 -104 -1 92 -95 -288 42 6 -83
7909h3J71k20K52j27JJ16j25j48J29J3q5KJ06R6k8k17J89r2J39n0K3l6j24O5J77
$$ -83 88 -132 120 -7 -6 110 -15 -163 -34 -21 -106 -104 2 98 70 -147 42 -50 89 39 62 26 -98 -33 144
7934A44k26R9O7n6k3q6l0J54r3o6J55j38O3K2j19Q8J85k29P8k0J26l3r5q5O4J48
$$ 144 -82 17 84 28 5 -81 -111 43 -50 -116 39 -99 -36 -14 -133 -45 140 -89 -11 -31 95 62 -33 -118 -54 94
7960I4q4N9L2j84j05K18p3N8Q3r3L8p3l6J42j15R2q7Q2j2Rj05O2n6J09j9k26J97
$$ 94 10 69 101 -83 -188 30 -43 15 98 5 43 -30 -66 76 -39 53 -34 48 36 45 -60 2 -54 55 36 -190 7
7987GJ63j95J56j46K9j08nJ18N5j31O5j89J02R4r5k9Nk1K85k97K48j62m9J50P8
$$ 7 170 -25 131 -15 14 -94 -99 19 74 -57 8 -181 -79 15 -80 -109 -104 -125 160 -137 111 -51 -100 50 128
8012A28j39M7k05J63Mj33Q1L9j02Q1q8O1J18j29O8j04r0K35L9k09K51l84K36Q4
$$ 128 -11 36 -169 -6 -2 -135 -54 -15 -117 -36 -124 -63 55 -74 -6 -110 -200 35 74 -135 116 -268 -32 52
8036E2o0J06j33OJ97j71q2J13k2j54J14K15Qj09K6o0RQ1M2oj66O2N2n7k5N8j78
$$ 52 -8 98 -35 -29 168 -3 -85 28 6 -148 -34 181 189 80 106 46 55 136 178 172 6 68 120 63 38 96 -82
8063h2q7K42j66J36q7j8Mj10K32L7j57N6J39m21J69K14j91N2p2J21l5j59K54j50
$$ -82 -169 73 -93 43 -44 -62 -58 -168 64 101 -56 0 139 -282 -113 101 -90 -38 -110 11 -24 -183 71 -79
8087g9k07L44o0q9N1L5k0Nm6K45j28pO0l25K58r8J04R0k22K21j70m3J03j5k8R6
$$ -79 -286 58 -2 -91 -40 -5 -25 -20 -66 179 51 44 104 -221 37 -61 43 133 -89 132 -38 -81 22 7 -21 75
8113G5j03n4N6l3q5K52r7M6j27L9J88m06J50P7J11L4O3l0p9M9J04j48j66J79l23
$$ 75 -28 -82 -26 -59 -144 108 11 57 -70 -31 157 -249 -99 -22 89 123 186 156 77 126 230 82 -84 95 -228
8138b28K19J48j67M9Q6k28J00K02j09P4k04K50n0j82L28j28k27N5l5L5J56j86
$$ -228 -9 139 -28 21 107 -121 -21 181 72 146 -58 192 142 -40 288 160 -67 -12 -47 -12 144 -42
8160d2J0J18j4L8k33P3j19J97J01m7kj17k1L1J09q1Q0j5p9J85j31rR0k13L06r2
$$ -42 -32 86 72 110 -123 -50 -169 28 129 82 80 -37 -58 -27 82 1 81 66 -13 172 41 32 122 -91 215 123
8186A23n0j40pJ48Q0
$$ 123 73 -67 -74 74 154
8191A54
$$ Imaginary data points
##PAGE= N=2
##DATA TABLE= (X++(I..I)), XYDATA
0@%%%%%%%%%%%%Qj6J6j6J6j7K5l2M0m8N6o5P3q8J04j20J38j57J80k06K33k64K99
$$ 0 0 0 0 0 0 0 0 0 0 0 0 0 8 -8 8 -8 8 -9 16 -16 24 -24 32 -33 40 -48 56 -64 74 -83 97 -109 124 -140 159
35A59l38L81m25M76n33N93o59P32q13Q98r90J094j208J330j464J612j777J959
$$ 159 -179 202 -223 253 -280 313 -346 386 -427 471 -519 575 -633 697 -767 845 -932 1027
53A027k160K387k642K930l259L643m095M633n290O111p174Q610j0671J3895j9697
$$ 1027 -1133 1254 -1388 1542 -1717 1926 -2169 2464 -2826 3285 -3889 4721 -5950 7945 -11752
68a1752L3424j28048j38893O1818m1430L5198m677n806L3690n525k650L5571k1749
$$ -11752 21672 -106376 -245269 -183451 -224881 -189683 -194360 -200166 -166476 -172001 -174651 -139080 -160829
81a60829L0263N904j4519L4209p452l837K7473k6394K0914N095k3532K4536j3548
$$ -160829 -130566 -124662 -139181 -104972 -112424 -116261 -88788 -115182 -94268 -89173 -112705 -88169 -101717
94a01717q295K0407l1078J2015M772k5903K0872j4624q849K3065k6916J1028J0260
$$ -101717 -110012 -89605 -120683 -108668 -103896 -129799 -108927 -123551 -132400 -109335 -136251 -125223 -114963
107a14963k0218K6523p770m193K9793j6874J6707J7018j4292L2843nj589L2770
$$ -114963 -135181 -108658 -116428 -120621 -90828 -107702 -90995 -73977 -88269 -55426 -55431 -57020 -24250
120b4250j2453J7100J8452j5757K8872o08o743K6058j8638Q409J1654k5007J6784
$$ -24250 -36703 -19603 -1151 -16908 11964 11356 4613 30671 12033 20442 32096 7089 23873
133B3873r281j7544J5511k8181m195L079l3439O817j6279k5520R885l0998j0177
$$ 23873 14592 -2952 12559 -15622 -19817 -16738 -50177 -43360 -59639 -85159 -75274 -106272 -116449
146a16449R69l3361O113j3732k3729J3107k3951n024Q363k5040J4020k076j4448
$$ -116449 -115480 -148841 -142728 -156460 -180189 -167082 -191033 -196057 -187694 -212734 -198714 -200790 -215238
159b15238K2919j1511N048K0206j4051K3020R794m491L0569j979J1466K7121p659
$$ -215238 -192319 -203830 -198782 -178576 -192627 -169607 -159813 -164304 -133735 -135714 -124248 -97127 -104786
172a04786K5845J4052k407L1308j069Q842K5740r424K0426J0510q377K5670o282
$$ -104786 -78941 -64889 -67296 -35988 -37057 -28215 -2475 -11899 8527 19037 10660 36330 30048
185C0048J112J9108j6084J2113M276j5916J7857j1701o487J2952k1812O148o0
$$ 30048 31160 50268 34184 46297 50573 34657 52514 40813 34326 47278 25466 31614 31554
198C1554k0949J3140j4477j0721J0593k3390K578l6k2224J1637j3651j1342J1371
$$ 31554 10605 23745 9268 -1453 9140 -14250 -11672 -11708 -33932 -22295 -35946 -47288 -35917
211c5917k2166K411K244k0583J2757j0345j0394J3808j8627L683N804j8024J4817
$$ -35917 -58083 -55672 -53428 -74011 -61254 -71599 -81993 -68185 -86812 -83129 -77325 -95349 -80532
224h0532o168q042J6611j4522N914R702j4712J6842j566n726J9693j0739P742
$$ -80532 -86700 -94742 -78131 -92653 -86739 -77037 -91749 -74907 -76473 -82199 -62506 -73245 -65503
237f5503J3160j1663J8484J838m181K1361q089Q089J5191j0919J8468L006m745
$$ -65503 -52343 -64006 -45522 -43684 -47865 -26504 -34593 -26504 -11313 -22232 -3764 -758 -5503
250e503K0764p895N635J4596j2387J5479J695p886J8175j0489J716J1452j5430
$$ -5503 15261 7366 13001 27597 15210 30689 32384 24498 42673 32184 33900 45352 29922
263B9922J0743o85j2547J4111j2656k981Q764j8543P271k467j5195J1657j3807
$$ 29922 40665 39980 27433 41544 28888 25907 34671 16128 23399 20932 5737 17394 3587
276C587n053P928j8940N601j630j5710J1626j2204n011R298j7293O373O51j3869
$$ 3587 -1466 6462 -12478 -6877 -8507 -24217 -12591 -24795 -29806 -20508 -37801 -31428 -30777 -44646
290d4646J2633r010m287J1387j4600P347L413j2295J4207o441l078J3037j2331
$$ -44646 -32013 -41023 -45310 -33923 -48523 -41176 -37763 -50058 -35851 -42292 -45370 -32333 -44664
303d4664P697N543j1033J4792m451k886J4222j1019P614O982j0465J4862l350
$$ -44664 -36967 -31424 -42457 -27665 -32116 -35002 -20780 -31799 -24185 -17203 -27668 -12806 -16156
316a6156l051J4920j0291P231P714j0400J4371k102m030J4823r792N810Q242j1402
$$ -16156 -19207 -4287 -14578 -7347 367 -10033 4338 2236 -1794 13029 3237 9047 17289 5887
330E887J3384k091n382J3865j0401L637P472j2921J1677l650p568J2360j2095
$$ 5887 19271 17180 11798 25663 15262 18899 26371 13450 25127 21477 13909 26269 14174
343A4174J407O181j4089Q509l665r880J0801j2595r16N658j5018P405l563j0436
$$ 14174 15581 21762 7673 16182 12517 2637 13438 843 -73 5585 -9433 -2028 -5591 -16027
357a6027J0253j1767j307O589j4584P292j822j0162J1501r712q69Q365j3475Q125
$$ -16027 -5774 -17541 -18848 -12259 -26843 -19551 -21373 -31535 -20034 -29746 -30615 -22250 -35725 -27600
371b7600J033r461J2434p059q11J0225j0921P803K172q448J3023o219r52J1264
$$ -27600 -26567 -36028 -23594 -30653 -31464 -21239 -32160 -24357 -22185 -30633 -17610 -23829 -24781 -13517
385a3517j0688Q158L669r179J3002n438j375J1372r603O866L575q425J2394m792
$$ -13517 -24205 -16047 -12378 -21557 -8555 -13993 -15368 -3996 -13599 -6733 -3158 -11583 811 -3981
399c981k075J1805r549O256N143r205J2464l566l219J1618q863N324N738j0113
$$ -3981 -6056 5749 -3800 2456 7599 -1606 10858 7292 4073 15691 6828 12152 17890 7777
413G777J1809l927l663J0447r915L662M899j1523R097m166o621R005j1276J053
$$ 7777 19586 15659 11996 22443 12528 16190 21089 9566 18663 14497 7876 16881 5605 6658
427F658K808j2767O816n364q532P730j1783j442L489j3531O064m657q501P929
$$ 6658 9466 -3301 3515 -1849 -10381 -2651 -14434 -15876 -12387 -25918 -19854 -24511 -33012 -25083
441b5083j0333j57M754j1379O901j511o567J0445p337J937P627q908Q886J761
$$ -25083 -35416 -35573 -30819 -42198 -35297 -36808 -43375 -32930 -40267 -38330 -30703 -39611 -30725 -28964
455b8964m966J2809m372K780J0309p299J0037L759m678J3486m267K192R726p688
$$ -28964 -33930 -21121 -25493 -22713 -12404 -19703 -9666 -5907 -10585 2901 -1366 826 10552 2864
469B864Q928K737o623J0983n643m65P947j0349N524P57q763Q256p480l281N975
$$ 2864 11792 14529 7906 18889 13246 12781 20728 10379 15903 16660 7897 16153 8673 5392 11367
484A1367j1689L294l21j0398P359p478m848N746j1336L020P10j0363P909n866
$$ 11367 -322 2972 2651 -7747 -388 -7866 -12714 -6968 -18304 -15284 -14574 -24937 -17028 -22894
498b2894l945P448r559L501K587q485Q546l674k807Q563p456M370M069p763R234
$$ -22894 -26839 -19391 -28950 -25449 -22862 -31347 -22801 -26475 -29282 -20719 -28175 -23805 -19736 -27499 -18265
513a8265k165l240R456o817L569N307p921Q817k070l397R529p281L277M635p824
$$ -18265 -20430 -23670 -14214 -21031 -17462 -12155 -20076 -11259 -13329 -16726 -7197 -14478 -11201 -6566 -14390
528a4390Q498j595m561R827p367K985M981q283P902j192m773R036o295K045N026
$$ -14390 -5892 -7487 -12048 -2221 -9588 -6603 -1622 -9905 -2003 -3195 -7968 1068 -5227 -3182 1844
543A844q586P713r46n798R228p225J458M703r125O057q70o297P871p397r37N738
$$ 1844 -6742 971 25 -5773 3455 -3770 -2312 2391 -6734 -677 -1547 -7844 27 -7370 -8307 -2569
559b569j0106N088o77p746O825o881j694N387r319L971l49p211P467n943j716
$$ -2569 -12675 -7587 -8264 -16010 -9185 -16066 -17760 -12373 -21692 -17721 -18070 -25281 -17814 -23757 -25473
574b5473O503q781N146J688o599R186l883o84Q288o993O298L242n324R992k691
$$ -25473 -18970 -27751 -22605 -20917 -27516 -18330 -22213 -22897 -14609 -21602 -15304 -12062 -17386 -7394 -10085
589a0085l25R260o155N604M449o095R527k678j205Q433p251M189L085p225P933
$$ -10085 -10410 -1150 -7305 -1701 2748 -3347 6180 3502 2297 10730 3479 7668 10753 3528 11461
604A1461l665l372O759p720J848K185q444O086l841m550O169q428J642K292q551
$$ 11461 7796 4424 11183 3463 5311 7496 -948 5138 1297 -3253 2916 -5512 -3870 -1578 -10129
619a0129N950k856m932P240p232J708L919q020O614j452l593Q079n911J461N652
$$ -10129 -4179 -7035 -11967 -4727 -11959 -10251 -6332 -14352 -7738 -9190 -12783 -4704 -10615 -9154 -3502
634c502o783O344l09m044Q153n981J336M652o007M922k88n537P372n653o44M334
$$ -3502 -10285 -3941 -4250 -8294 -141 -6122 -4786 -134 -6141 -1219 -1507 -7044 328 -5325 -5969 -1635
650a635p872M467j473n535O258o573p09M122q230M646l56n676O848n104q13O204
$$ -1635 -9507 -5040 -6513 -12048 -5790 -12363 -13072 -8950 -17180 -12534 -12890 -18566 -11718 -16822 -17635 -11431
666a1431o969N568J690m248Q384k765J51P937n027N933L707l757R511j763K52
$$ -11431 -18400 -12832 -11142 -15390 -7006 -9771 -9620 -1683 -6710 -777 2930 -827 8684 6921 7173
681G173Q234n202N702L209m998Q256k307j605O157o434L481J652p112N500m559
$$ 7173 15407 10205 15907 19116 14118 22374 20067 18462 24619 18185 21666 23318 16206 21706 17147
696A7147l800M485q383K65k1r165L718n311n678L600r289o29N69r244L836m055
$$ 17147 13347 17832 9449 9714 9693 528 4246 -1065 -6743 -3143 -12432 -13061 -12492 -21736 -17900 -21955
712b1955n220M714p520R81K379p209N664j462l222P261m658K556N300n209P470
$$ -21955 -27175 -22461 -29981 -29000 -26621 -33830 -28166 -29628 -32850 -25589 -30247 -27691 -22391 -27600 -20130
727b0130J080j810Q926l047L493O731m247P805J508k178R169l144K428O439n338
$$ -20130 -19050 -20860 -11934 -14981 -11488 -4757 -9004 -1199 309 -1869 7300 4156 6584 13023 7685
742G685O534Q96l492P598m176M95M974o611M607k13n350O118n323j076L947p604
$$ 7685 14219 15115 11623 19221 15045 15540 20514 13903 18510 18297 12947 19065 13742 12666 16613 9009
758I009L234o14o443N503n379k188L926p586K470r2o453N221m676k319M183o937
$$ 9009 12243 11629 5186 10689 5310 3122 7048 -538 1932 1840 -4613 608 -4068 -6387 -2204 -9141
774i141K320N29o208N179l777k349M806o833K418J242o314N646l180k514N317
$$ -9141 -6821 -6292 -12500 -7321 -11098 -13447 -8641 -15474 -13056 -11814 -18128 -12482 -15662 -18176 -12859
789a2859o129K492J947n616N883k497k125O086n529K782L173n209O327j324j566
$$ -12859 -18988 -16496 -14549 -20165 -14282 -16779 -18904 -12818 -18347 -15565 -12392 -17601 -11274 -12598 -14164
804a4164O852m526L083M031m436O664k73j710P448l717K982M626m539O495J58
$$ -14164 -7312 -11838 -8755 -4724 -9160 -2496 -2769 -4479 2969 -748 2234 6860 2321 8816 8974
819H974k239P319m262K381M352n343N597n85l060N941m686O92L503o475M103j208
$$ 8974 6735 14054 9792 12173 16525 11182 16779 16194 13134 19075 14389 15081 18584 12109 16212 15004
835A5004m573M716n617p14K523p374L055j725n541L976n717j353K252p290K433
$$ 15004 10431 15147 9530 8816 11339 3965 7020 5295 -246 3730 -1987 -3340 -1088 -8378 -5945
850e945j542n576M337n112j270K812o545K986l91m754N110l773o93M641n450L535
$$ -5945 -7487 -13063 -8726 -13838 -15108 -12296 -18841 -15855 -16246 -21000 -15890 -19663 -20356 -15715 -21165 -17630
866a7630J264l694O453k660J7N930m615M366K484l485P049j853O34O313l890M060
$$ -17630 -16366 -20060 -13607 -16267 -16250 -10320 -14935 -10569 -8085 -11570 -4521 -6374 -5740 573 -3317 743
882G43L441l489O872j581MO145m601L902K461l950N348j248j478N713n037K353
$$ 743 4184 695 7567 5986 5990 12135 7534 11436 13897 9947 15295 14047 12569 18282 13245 15598
898A5598K004n005M914j956l203M806n429J071J733n984L912k715l538M241n877
$$ 15598 17602 12597 17511 15555 12352 17158 11729 12800 14533 8549 12461 9746 6208 10449 4572
913D572K72J528o228L298k397m124M184n738l0K080o265L353j603m264M473n057
$$ 4572 4844 6372 144 3442 1045 -3079 1105 -4633 -4663 -2583 -8848 -5495 -7098 -11362 -6889 -11946
929a1946L2K792n860L664o97l767N100m069J78L683n291M291Q6l305N480l040
$$ -11946 -11914 -9122 -14982 -11318 -12015 -15782 -10682 -14751 -14573 -10890 -16181 -11890 -11804 -15109 -9629 -12669
945a2669P19M542m833M505J167k739O100k431P58M997l930M507J608k739O486
$$ -12669 -11950 -7408 -12241 -7736 -6569 -9308 -3208 -5639 -4881 116 -3814 693 2301 -438 6048
960F048k138O23N302m010L854K131l312N937j904m30M960m405L146J455m031M768
$$ 6048 3910 4533 9835 5825 9679 11810 8498 14435 12531 12101 17061 12656 15802 17257 13226 17994
976A7994k775j589M111n103J448P66n325L871l338l014L428o214M01M05o349L229
$$ 17994 15219 13630 17741 12638 14086 14852 9527 13398 10060 7046 10474 4260 4661 5066 -1283 1946
992A946l481l520K985o008K10L88o020L151k874l163L639n337O99J702m966L840
$$ 1946 -1535 -5055 -2070 -8078 -7868 -7480 -13500 -10349 -13223 -16386 -12747 -18084 -17385 -15683 -20649 -16809
1008a6809j394k327M861l953J727L108m068N310k43j500N941k644K107M142l317
$$ -16809 -18203 -20530 -15669 -19622 -17895 -14787 -18855 -13545 -13788 -15288 -9347 -11991 -9884 -5742 -9059
1023i059N282R69j579O213k510J996M516l703N078M66k098N739k794O37L911m344
$$ -9059 -3777 -2808 -4387 1826 -684 1312 5828 2125 7203 7669 5571 11310 8516 9153 13064 8720
1039H720L801J11l301M671l491k98L105n224K576l09m151L584l933j170K632n597
$$ 8720 12521 12632 9331 14002 10511 10213 13318 8094 10670 10361 6210 9794 5861 4691 7323 1726
1055A726J981p39m607L617m093j487K755n601J675Om702L614l387j604L408n447
$$ 1726 3707 2968 -1639 1978 -2115 -3602 -847 -6448 -4773 -4767 -9469 -5855 -9242 -10846 -7438 -12885
1071a2885J834O38m365M120k913j130L790m787K240J310m111M577j987j174M334
$$ -12885 -11051 -10413 -14778 -10658 -13571 -14701 -10911 -15698 -13458 -12148 -16259 -11682 -13669 -14843 -10509
1086a0509l996K400J964l628N056j497q62M823l505K484K568l360M851n95j328
$$ -10509 -14505 -12105 -10141 -13769 -8713 -10210 -11072 -6249 -9754 -7270 -4702 -8062 -3211 -3806 -5134
1101e134N151l024K173K763l343M504m88j498M716l126J541K779l659L940p64
$$ -5134 17 -3007 -834 1929 -1414 3090 2602 1104 5820 2694 4235 7014 3355 7295 6531
1116F531k256M571l694P36K680m619L009r12k787L740l959j75K229n216K572r83
$$ 6531 4275 8846 5152 5888 8568 3949 6958 6046 3259 6999 3040 2865 5094 -122 2450 1467
1132A467l941L350l592j156K021m863J920r60l808L306l465q25K338n066K412
$$ 1467 -2474 876 -2716 -3872 -1851 -6714 -4794 -5754 -9562 -6256 -9721 -10546 -8208 -13274 -10862
1147a0862n9l614L674l468k78K879l889K823L98l517M435j616l95L831l527K943
$$ -10862 -10921 -14535 -10861 -14329 -14607 -11728 -15617 -12794 -12396 -15913 -11478 -13094 -13489 -9658 -13185 -10242
1163a0242J444k698M838q81p60M378k769K989K218k921M726j306r7M268k978K728
$$ -10242 -8798 -11496 -6658 -7539 -8299 -3921 -6690 -3701 -1483 -4404 322 -984 -1081 3187 209 2937
1179B937J525k888M471j840k50L619l177J545J618l563L716j632j775L278l516
$$ 2937 4462 1574 6045 4205 3955 7574 4397 5942 7560 3997 7713 6081 4306 7584 4068
1194D068P54J213m177K692j607k404K909m328N40J323m636K917k617j810K403
$$ 4068 4822 6035 1858 4550 2943 539 3448 -880 -340 983 -3653 -736 -3353 -5163 -2760
1209b760m025Q71J661n157L029j223k509L800m049O21J582l366K813j057k118
$$ -2760 -6785 -5914 -4253 -9410 -6381 -7604 -10113 -6313 -10362 -9741 -8159 -11525 -8712 -9769 -11887
1224a1887M170l533J026K334k961L331k61k027M441k385Q18L147l577L617L09
$$ -11887 -7717 -11250 -10224 -7890 -10851 -7520 -7781 -9808 -5367 -7752 -6934 -3787 -7364 -3747 -3438
1239c438k225M683k376P04L135l173L392M17k348M141j956K07L276l475K766O96
$$ -3438 -5663 -980 -3356 -2652 483 -2690 702 1119 -1229 2912 956 1163 4439 964 3730 4426
1255D426k884L979k202k36L045l620K271O60l214L474k201n79K697l804J761N38
$$ 4426 1542 5521 3319 3083 6128 2508 4779 5439 2225 5699 3498 2919 5616 1812 3573 4111
1271D111l496L136k219j310K735l844J176O10l706L158k281j662K666l899J204
$$ 4111 615 3751 1532 222 2957 -887 289 899 -2807 351 -1930 -3592 -926 -4825 -3621
1286c621O28l562L006j904j753K910l435J190J167l577L447j388j429L639l108
$$ -3621 -2993 -6555 -3549 -5453 -7206 -4296 -7731 -6541 -5374 -8951 -5504 -6892 -8321 -4682 -7790
1301g790J231J942l116L682o07j299L861k329J483K485k771L605J26j027L887
$$ -7790 -6559 -4617 -7733 -4051 -4658 -5957 -2096 -4425 -2942 -457 -3228 377 503 -524 3363
1316C363k099J474K676k676L504k07j561L917k312R56K273l071K726l09k164L261
$$ 3363 1264 2738 5414 2738 6242 6035 4474 8391 6079 7035 9308 6237 8963 8654 6490 9751
1332I751k673j14K009l795K212o11k944K760l111n73J719l995J696o75l032K433
$$ 9751 7078 6964 8973 5178 7390 6779 3835 6595 3484 2911 4630 635 2331 1656 -1376 1057
1348A057k781p98J627l736J528lk961K781k590n82K395l246J784L87k438L346
$$ 1057 -1724 -2522 -895 -4631 -3103 -3106 -6067 -3286 -5876 -6458 -4063 -7309 -5525 -5138 -7576 -4230
1364d230j838l25L062l073K452J148k630L752j365J7L373k814K444J262k357L617
$$ -4230 -6068 -6393 -3331 -6404 -3952 -2804 -5434 -1682 -3047 -3030 343 -2471 -27 1235 -1122 2495
1380B495r63m60L407k306J657J322k708L148p47j040L273k573J622M81k450K448
$$ 2495 1532 1072 4479 2173 3830 5152 2444 5592 4845 3805 7078 4505 6127 6608 4158 6606
1396F606j375q24K648k722N61J520k902J594j377j534K191k034J06J429l819K341
$$ 6606 5231 4407 7055 4333 4894 6414 3512 5106 3729 2195 4386 2352 2458 3887 68 2409
1412B409j538j763K923l058N2J428l430K010r11k168K728k977M14J569l463K210
$$ 2409 871 -892 2031 -1027 -975 453 -2977 -967 -1878 -4046 -1318 -4295 -3881 -2312 -5775 -3565
1428c565n78k031K760k531K98J937l181K158j07j995L383k212K95K206k803K418
$$ -3565 -4143 -6174 -3414 -5945 -5647 -3710 -6891 -4733 -4840 -6835 -3452 -5664 -5369 -3163 -5966 -3548
1444c548M34j839L294j628L4K914k688K524P88j920L568j558K22K732k401K119
$$ -3548 -3114 -4953 -1659 -3287 -3253 -339 -3027 -503 285 -1635 1933 375 597 3329 928 3047
1460C047Q26j900K922j039n74K534k442K283M48k393K928j483r03K549k990J073
$$ 3047 3873 1973 4895 3856 3282 5816 3374 5657 6105 3712 6640 5157 4254 6803 3813 4886
1476D886N48k711K193j722j155J894l038O93M17l183K077j783j696K118l375O06
$$ 4886 5434 2723 4916 3194 2039 3933 895 1588 2005 -1178 899 -884 -2580 -462 -3837 -3231
1492c231O96l188J970j515j632K344k768N88R32k807K249q63j255K738k395J209
$$ -3231 -2535 -5723 -3753 -5268 -6900 -4556 -7324 -6736 -5804 -8611 -6362 -7225 -8480 -5742 -8137 -6928
1508f928J428k338K517j66q23K874j763R69K190k213K847J83r76L136j472R08
$$ -6928 -5500 -7838 -5321 -5487 -6310 -3436 -5199 -4230 -2040 -4253 -1406 -1223 -2199 937 -535 373
1524C73J955k130K740J2r61K804j850P14J955k593K038r9j816K835j738k29J802
$$ 373 2328 198 2938 2950 1989 4793 2943 3657 5612 3019 5057 4958 3142 5977 4239 4010 5812
1541E812l142J953j31j822K651k609J37J347k564Q88K10k088K489k235o53J826
$$ 5812 2670 4623 4492 2670 5321 2712 2849 4196 1632 2520 2730 642 3131 896 243 2069
1557B069k979J284M2k376K459j692j021J929l072J594L0k200K135j554r16K145
$$ 2069 -910 374 416 -1960 499 -1193 -2214 -285 -3357 -1763 -1733 -3933 -1798 -3352 -4268 -2123
1573b123k810R79O75k269K268j353r15K061k172J036R59k311K457q63q03K536
$$ -2123 -4933 -3954 -3279 -5548 -3280 -4633 -5548 -3487 -5659 -4623 -3664 -5975 -3518 -4381 -5184 -2648
1589b648j995J287J235j774K730m99o22L010j754J327J759j788L010l95k99K929
$$ -2648 -4643 -3356 -2121 -3895 -1165 -1664 -2286 724 -1030 297 2056 268 3278 2883 2584 5513
1605E513j697J406J630k020K595k54j008K613j822N77J429k415J835o73j783K120
$$ 5513 3816 5222 6852 4832 7427 7173 6165 8778 6956 7533 8962 6547 8382 7709 5926 8046
1621H046k424m7Q41k961J102q90k232J683k642p39R09l319J098p44k352J815k495
$$ 8046 5622 5575 6416 3455 4557 3667 1435 3118 476 -263 646 -2673 -1575 -2319 -4671 -2856 -5351
1638e351l16J448l264J343j48j954K313j775R7J701k018J841O87j461K833j040
$$ -5351 -5667 -4219 -7483 -6140 -6288 -8242 -5929 -7704 -7607 -5906 -7924 -6083 -5396 -6857 -4024 -5064
1654e064M64K340j633J987J148j057K674k07M60K190j707J853J178j625K595p23
$$ -5064 -4600 -2260 -3893 -1906 -758 -1815 859 652 1112 3302 1595 3448 4626 3001 5596 4873
1670D873n33K346k024J333Q33k020K043j104p92J934k422O96M63k204J507q76
$$ 4873 4340 6686 4662 5995 6828 4808 6851 5747 4955 6889 4467 5163 5626 3422 4929 4053
1686D053j332J684k571P75L93k206J604q10j281J498k016M07M32k111K319j241
$$ 4053 2721 4405 1834 2609 3002 796 2400 1590 309 1807 -209 198 630 -1481 838 -403
1702d03j254J856k021O08O48k188J938l45j375K727k777K29R88k169K529q90j298
$$ -403 -1657 199 -1822 -1214 -566 -2754 -816 -1161 -2536 191 -2586 -2357 -1369 -3538 -1009 -1899 -3197
1719c197K162j737k71J490k454J841Q3j973K860j527L85J641j939J712j65j620
$$ -3197 -1035 -2772 -3043 -1553 -4007 -2166 -2083 -4056 -1196 -2723 -2338 -697 -2636 -924 -1089 -2709
1735b709K855j253Q70J513k020J830O87j220K482j181N47J789j541J458P43j326
$$ -2709 146 -1107 -237 1276 -744 1086 1773 553 3035 1854 2401 4190 2649 4107 4850 3524
1751C524K362j165J84J713k119J446K68j626J875j392m70J638k278Q01j95j883
$$ 3524 5886 4721 4905 6618 4499 5945 6213 4587 6462 5070 4600 6238 3960 4761 4566 2683
1767B683J728j710q56J137k325O26k7k395J559j496o35J123k532P07J28j983J677
$$ 2683 4411 2701 1845 2982 657 1283 1256 -1139 420 -1076 -1711 -588 -3120 -2413 -2285 -4268 -2591
1784b591j173r96J719j890P19P11j876J957o42p35K057j922R04J082j667K195
$$ -2591 -3764 -4760 -3041 -4931 -4212 -3501 -5377 -3420 -4062 -4797 -2740 -4662 -3758 -2676 -4343 -2148
1800b148l38m78J974j317P72J477j565J922k49m44K136j242O22J342j622J976
$$ -2148 -2486 -2964 -990 -2307 -1535 -58 -1623 299 50 -394 1742 500 1122 2464 842 2818
1816B818j50o94J991j340M67J229j665J585k72r20J964j595M12J096j814J376
$$ 2818 2668 1974 3965 2625 3092 4321 2656 4241 3969 3049 5013 3418 3830 4926 3112 4488
1832D488k85j280J783j392m71J298k170J068j91j404J391j498n61J365k458J217
$$ 4488 4203 2923 4706 3314 2843 4141 1971 3039 2848 1444 2835 1337 776 2141 -317 900
1848I00k93j917J941j774m59R61j826P74j4j656J498j340m48J326j731Q21O0j367
$$ 900 607 -1310 631 -1143 -1602 -641 -2467 -1693 -1707 -3363 -1865 -3205 -3653 -2327 -4058 -3237 -3177 -4544
1866d544J791q55m82J778j686J238O84j336J902o26j20J958j323J193J167j533
$$ -4544 -2753 -3608 -4090 -2312 -3998 -2760 -2076 -3412 -1510 -2136 -2256 -298 -1621 -428 739 -794
1882g94K349m25k54K123j392J246R81j166K029n21l36J943j522Q73P43j260J585
$$ -794 1555 1130 876 2999 1607 2853 3834 2668 4697 4176 3840 5783 4261 5134 5877 4617 6202
1899F202n73q12J673j825M97O01j818J267p65j251J355j969k3M55k149J087p30
$$ 6202 5629 4817 6490 4665 5162 5763 3945 5212 4447 3196 4551 2582 2559 3014 865 1952 1222
1916A222j530J428k060r4M51j919J163o53j469J640j487j04J031j783J321k4j229
$$ 1222 -308 1120 -940 -1034 -583 -2502 -1339 -1992 -3461 -1821 -3308 -3412 -2381 -4164 -2843 -2867 -4096
1933d096J817r99J32J251j101J413K60n74J894p71K50J880j451J464O85r63K018
$$ -4096 -2279 -3278 -3146 -1895 -2996 -1583 -1323 -1897 -3 -774 -524 1356 -95 1369 2054 1091 3109
1950C109p81J55J654j508J113Q22j631J895j005l35J401j750J015j44j295J695
$$ 3109 2328 2483 4137 2629 3742 4564 2933 4828 3823 3488 4889 3139 4154 4010 2715 4410
1966D410j346j369K250k380N80q8j363J355j232o44J097j897O38L14j675J528
$$ 4410 3064 1695 3945 1565 2145 2057 694 2049 817 173 1270 -627 11 325 -1350 178
1982A78q59n66J462j514N87Q63j645J550o96o05J955j547P19P35j618J690n71
$$ 178 -681 -1247 215 -1299 -712 151 -1494 56 -640 -1245 710 -837 -118 617 -1001 689 118
1999A18p13J681j467M51O94j625J241k87q90J371j384N1P86j844J427o08j015
$$ 118 -595 1086 -381 70 764 -861 380 93 -797 574 -810 -759 27 -1817 -390 -998 -2013
2016b013J505j597L51Q03j533J160j84p88J625j243L13J237j594J433J92p09J804
$$ -2013 -508 -2105 -1754 -951 -2484 -1324 -1508 -2296 -671 -1914 -1601 -364 -1958 -525 -333 -1042 762
2033G62j096N38J544j521J573L22r78J861p75J70J332j540J228J61r21J419j221
$$ 762 -334 204 1748 227 1800 2122 1144 3005 2230 2400 3732 2192 3420 3581 2660 4079 2858
2050B858k64J073j750O94r4j596J139j140n03R81k160M07Oj875J030j052r39J070
$$ 2858 2594 3667 1917 2611 2517 921 2060 920 417 1398 -762 -355 -349 -2224 -1194 -2246 -3185 -2115
2068b115j809N70J83j716J433q81k42J253j649Q31O94j316J481j83j90J522j143
$$ -2115 -3924 -3354 -3171 -4887 -3454 -4335 -4577 -3324 -4973 -4142 -3448 -4764 -3283 -3466 -3656 -2134 -3277
2085c277Q80R79j301K160j66m07K007j267R91J047j236J693O8q15J888j220N61
$$ -3277 -2397 -1418 -2719 -559 -725 -1132 875 -392 599 1646 410 2103 2171 1356 3244 2024 2585
2102B585R96j436J196k47q14J570j345J58P70j619J147m98r46J312j389k2R20
$$ 2585 3581 2145 3341 3094 2280 3850 2505 2663 3433 1814 2961 2463 1517 2829 1440 1418 2338
2119B338j650Q44m99r83J312j319j74R03j769R43k00j330J498j309k04R52j597
$$ 2338 688 1532 1033 50 1362 43 -131 772 -997 -54 -254 -1584 -86 -1395 -1599 -647 -2244
2136b244Q29J26j323J392r71l49R66j551J232L1j240J703r68j27J217j302J026
$$ -2244 -1415 -1289 -2612 -1220 -2191 -2540 -1574 -3125 -1893 -1862 -3102 -1399 -2367 -2494 -1277 -2579 -1553
2153a553L13q63J439n95j17J688j337J104N87r00J537k99l43J611j048R33P29
$$ -1553 -1240 -2103 -664 -1259 -1376 312 -1025 79 666 -234 1303 1004 661 2272 1224 2157 2886
2170B886j189J618m15l94J402j134N12O27j256J135n34p16J302j578K37M44j609
$$ 2886 1697 3315 2900 2506 3908 2774 3286 3913 2657 3792 3258 2542 3844 2266 2503 2947 1338
$$ [...]
8191h6
##END NTUPLES=NMR FID
##END=
