##TITLE=1H_81-2021
 CDCl3, 8 sc, 
 23.08.2021
##JCAMPDX= 6.0         $$ Bruker NMR JCAMP-DX V2.0
##DATA TYPE= NMR FID
##DATA CLASS= NTUPLES
##ORIGIN= UXNMR, Bruker Analytische Messtechnik GmbH
##OWNER= root
$$ XWIN-NMR		Version 3.5
$$ Mon Aug 23 10:27:00 2021 Russian Standard Time (UT+4h)  she@DPX200
##.OBSERVE FREQUENCY= 200.131506
##.OBSERVE NUCLEUS= ^1H
##.DELAY= (6, 6)
##.ACQUISITION MODE= SIMULTANEOUS
##.ACQUISITION SCHEME= undefined
##.AVERAGES= 8
##.DIGITISER RES= 18
##SPECTROMETER/DATA SYSTEM= spect
##.PULSE SEQUENCE= zg30
##.SOLVENT NAME= CDCl3
##.SHIFT REFERENCE= (INTERNAL, CDCl3, 0, 15.7039)
##AUDIT TRAIL= $$ (NUMBER, WHEN, WHO, WHERE, WHAT)
$$ ##TITLE= Audit trail, XWIN-NMR		Version 3.5
$$ ##JCAMPDX= 5.01
$$ ##ORIGIN= Bruker BioSpin GmbH
$$ ##OWNER= she
$$ F:/spectra/data/she/nmr/H-F/1/audita.txt
$$ ##AUDIT TRAIL=  $$ (NUMBER, WHEN, WHO, WHERE, WHAT)
(   1,<2021-08-23 10:25:15.70 +0400>,<she>,<DPX200>,
      <created by zg, POWCHK disabled, PULCHK disabled
       configuration hash MD5:
       00 E9 B6 7A A2 85 ED C7 34 08 36 98 17 FE 4E 26
       data hash MD5: 16K
       D2 71 7C C7 20 ED BE C6 EC AB 52 63 9D 86 C3 FE>)
$$ ##END=
$$ 
$$ hash MD5
$$ FC 74 27 32 97 CE 88 BC 06 BA 84 97 CC 9F 74 E9
##$RELAX= 
##$RELAX= 
##$RELAX= 
##$RELAX= 
##$RELAX= 
##$RELAX= 
$$ Bruker specific parameters
$$ --------------------------
##$DU= <F:/spectra>
##$EXPNO= 1
##$NAME= <H-F>
##$PROCNO= 1
##$TYPE= <nmr>
##$USER= <she>
##$AMP= (0..31)
100 100 100 100 100 100 100 100 100 100 100 100 100 100 100 100 100 100 
100 100 100 100 100 100 100 100 100 100 100 100 100 100 
##$AQSEQ= 0
##$AQ_mod= 1
##$AUNM= <au_zg>
##$AUTOPOS= <>
##$BF1= 200.13
##$BF2= 200.13
##$BF3= 200.13
##$BF4= 200.13
##$BF5= 200.13
##$BF6= 200.13
##$BF7= 200.13
##$BF8= 200.13
##$BYTORDA= 1
##$CFDGTYP= 0
##$CFRGTYP= 5
##$CHEMSTR= <none>
##$CNST= (0..31)
1 1 145 1 1 1 1 1 1 1 1 1 1 1 1 1 1 1 1 1 1 1 1 1 1 1 1 1 1 1 1 1 
##$CPDPRG= <>
##$CPDPRG1= <>
##$CPDPRG2= <>
##$CPDPRG3= <>
##$CPDPRG4= <mlev>
##$CPDPRG5= <mlev>
##$CPDPRG6= <mlev>
##$CPDPRG7= <mlev>
##$CPDPRG8= <mlev>
##$CPDPRGB= <>
##$CPDPRGT= <>
##$D= (0..31)
0 1.2 0 0 0 0 0 0 0 0.06 0 0.03 0 0 0 0 0.0002 0 0 0 0 0 0 0 0 0 0 0 0 
0 0 0 
##$DATE= 1629699915
##$DBL= (0..7)
120 120 120 120 120 120 120 120 
##$DBP= (0..7)
150 150 150 150 150 150 150 150 
##$DBP07= 0
##$DBPNAM0= <>
##$DBPNAM1= <>
##$DBPNAM2= <>
##$DBPNAM3= <>
##$DBPNAM4= <>
##$DBPNAM5= <>
##$DBPNAM6= <>
##$DBPNAM7= <>
##$DBPOAL= (0..7)
0.5 0.5 0.5 0.5 0.5 0.5 0.5 0.5 
##$DBPOFFS= (0..7)
0 0 0 0 0 0 0 0 
##$DE= 6
##$DECBNUC= <off>
##$DECIM= 32
##$DECNUC= <off>
##$DECSTAT= 4
##$DIGMOD= 1
##$DIGTYP= 9
##$DL= (0..7)
0 120 120 120 120 120 120 120 
##$DP= (0..7)
150 150 150 150 150 150 150 150 
##$DP07= 0
##$DPNAME0= <>
##$DPNAME1= <>
##$DPNAME2= <>
##$DPNAME3= <>
##$DPNAME4= <>
##$DPNAME5= <>
##$DPNAME6= <>
##$DPNAME7= <>
##$DPOAL= (0..7)
0.5 0.5 0.5 0.5 0.5 0.5 0.5 0.5 
##$DPOFFS= (0..7)
0 0 0 0 0 0 0 0 
##$DQDMODE= 0
##$DR= 18
##$DS= 0
##$DSLIST= <SSSSSSSSSSSSSSS>
$$ [...]
##$SUBNAM2= <"">
##$SUBNAM3= <"">
##$SUBNAM4= <"">
##$SUBNAM5= <"">
##$SUBNAM6= <"">
##$SUBNAM7= <"">
##$SUBNAM8= <"">
##$SUBNAM9= <"">
##$SW= 20.0188882624521
##$SWIBOX= (0..15)
0 0 2 0 0 0 0 0 0 0 0 0 0 0 0 0 
##$SW_h= 4006.41025641026
##$TD= 16384
##$TD0= 1
##$TE= 0
##$TE2= 300
##$TE3= 300
##$TEG= 300
##$TL= (0..7)
0 120 120 120 120 120 120 120 
##$TP= (0..7)
150 150 150 150 150 150 150 150 
##$TP07= 0
##$TPNAME0= <>
##$TPNAME1= <>
##$TPNAME2= <>
##$TPNAME3= <>
##$TPNAME4= <>
##$TPNAME5= <>
##$TPNAME6= <>
##$TPNAME7= <>
##$TPOAL= (0..7)
0.5 0.5 0.5 0.5 0.5 0.5 0.5 0.5 
##$TPOFFS= (0..7)
0 0 0 0 0 0 0 0 
##$TUNHIN= 0
##$TUNHOUT= 0
##$TUNXOUT= 0
##$USERA1= <user>
##$USERA2= <user>
##$USERA3= <user>
##$USERA4= <user>
##$USERA5= <user>
##$V9= 5
##$VALIST= <valist>
##$VCLIST= <CCCCCCCCCCCCCCC>
##$VD= 0
##$VDLIST= <DDDDDDDDDDDDDDD>
##$VPLIST= <PPPPPPPPPPPPPPP>
##$VTLIST= <TTTTTTTTTTTTTTT>
##$WBST= 1024
##$WBSW= 4
##$XGAIN= (0..3)
0 0 0 0 
##$XL= 0
##$YL= 0
##$YMAX_a= 611431
##$YMIN_a= -879290
##$ZGOPTNS= <>
##$ZL1= 120
##$ZL2= 120
##$ZL3= 120
##$ZL4= 120
##$ABSF1= 10
##$ABSF2= 0
##$ABSG= 5
##$ABSL= 3
##$ALPHA= 0
##$AQORDER= 0
##$ASSFAC= 0
##$ASSFACI= 0
##$ASSFACX= 0
##$ASSWID= 0
##$AUNMP= <proc_1d>
##$AZFE= 0.1
##$AZFW= 0.1
##$BCFW= 1
##$BC_mod= 2
##$BYTORDP= 1
##$COROFFS= 0
##$CY= 11.3945322036743
##$DATMOD= 1
##$DC= 2
##$DFILT= <>
##$DTYPP= 0
##$F1P= 2.36226072786647
##$F2P= -0.459571619588291
##$FCOR= 0.5
##$FTSIZE= 0
##$FT_mod= 4
##$GAMMA= 1
##$GB= 0.15
##$INTBC= 1
##$INTSCL= 1
##$ISEN= 128
##$LB= 0.24
##$LEV0= 0
##$LPBIN= 0
##$MAXI= 10000
##$MC2= 0
##$MEAN= 0
##$ME_mod= 0
##$MI= 1.114404
##$NCOEF= 0
##$NC_proc= 0
##$NLEV= 6
##$NOISF1= 3.799351
##$NOISF2= 2.8
##$NSP= 1
##$NTH_PI= 0
##$NZP= 0
##$OFFSET= 15.70392
##$PC= 1
##$PHC0= -13355.04
##$PHC1= 11.00099
##$PH_mod= 1
##$PKNL= yes
##$PPARMOD= 0
##$PSCAL= 0
##$PSIGN= 0
##$REVERSE= no
##$SF= 200.130013532006
##$SI= 16384
##$SIGF1= 3
##$SIGF2= 2
##$SINO= 400
##$SIOLD= 16384
##$SREGLST= <1H.CDCl3>
##$SSB= 0
##$STSI= 0
##$STSR= 0
##$SW_p= 3612.71676300578
##$SYMM= 0
##$S_DEV= 0
##$TDeff= 0
##$TDoff= 0
##$TI= <>
##$TILT= no
##$TM1= 0
##$TM2= 0
##$TOPLEV= 0
##$USERP1= <user>
##$USERP2= <user>
##$USERP3= <user>
##$USERP4= <user>
##$USERP5= <user>
##$WDW= 1
##$XDIM= 8192
##$YMAX_p= 0
##$YMIN_p= 0
$$ End of Bruker specific parameters
$$ ---------------------------------
##NTUPLES= NMR FID
##VAR_NAME=  TIME,          FID/REAL,        FID/IMAG
##SYMBOL=    X,             R,               I
##VAR_TYPE=  INDEPENDENT,   DEPENDENT,       DEPENDENT
##VAR_FORM=  AFFN,          ASDF,            ASDF
##VAR_DIM=   8192,          8192,            8192
##UNITS=     SECONDS,       ARBITRARY UNITS, ARBITRARY UNITS
##FACTOR=    0.0002496,     1,               1
##FIRST=     0,             0,               0
##LAST=      2.0444736,     0,               0
##MIN=       0,             -879290,         0
##MAX=       2.0444736,     611431,          0
$$ Real data points
##PAGE= N=1
##DATA TABLE= (X++(R..R)), XYDATA
$$ [...]
2404H35j561L34R56j380J229j388N18k44m05O52N24l8J482j361M06K82j523p4
$$ 835 -726 -392 564 -816 413 -975 -457 -701 -1106 -454 70 32 1514 153 559 841 -682 -756
2422g56L013k279J77K36M4j496N55n11M25l39J051r64m8O05n18o49Q10j51K01
$$ -756 2257 -22 155 391 435 -1061 -506 -1017 -592 -931 120 -844 -892 -287 -805 -1454 -644 -795 -594
2441e94J00O9K94P99k17n7J059p53O77p37O57K67j459J030k97K38m23N6J13o71
$$ -594 -494 -425 -131 668 451 394 1453 700 1377 640 1297 1564 105 1135 838 1076 653 709 822 151
2461A51j10q3n03M92l79n87J018n84k44K38j27Q6O77l44M62j2k15M89J61J124
$$ 151 41 -42 -545 -53 -432 -1019 -1 -585 -829 -591 -718 -632 45 -299 163 151 -64 425 586 1710
2481A710o56j210J049j449J098M08k07k063K627k37k565J339m53r65J272m48m41
$$ 1710 1054 -156 893 -556 542 950 743 -1320 1307 1070 -1495 -156 -609 -1574 -302 -750 -1191
2498a191r3M79n98P5J760o81l4J261J00j639J952m28o7m8M84m63Q6M02j344j43
$$ -1191 -1284 -805 -1403 -1328 432 -249 -283 978 1078 -561 1391 963 896 848 1332 869 955 1357 13 -130
2518a30J316o30j351K067j937q70J541n58j710J924j31j126Q12O04o41n85J877
$$ -130 1186 556 -795 1272 -665 -1535 6 -552 -2262 -338 -469 -1595 -783 -179 -820 -1405 472
2535D72l93j447J952j17j526K313P1k057J316Q01j615O72Q60j437l44J820r43
$$ 472 79 -1368 584 467 -1059 1254 1325 -732 584 1385 -230 442 1302 -135 -479 1341 398
2552C98j486J690P18l041K170J18k611J760J241k162K56K268j684r07K838j248
$$ 398 -1088 602 1320 -1721 449 567 -2044 -284 957 -1205 -949 1319 -365 -1272 1566 318
2568C18j257K000M02k511K182N28k688J417J933l292L78K451k714o21K590p26
$$ 318 -939 1061 1463 -1048 1134 1662 -1026 391 2324 -968 -590 1861 -853 -1474 1116 390
2584C90k538K063J026l507K274J673l714J612K715l397K73L608k811j105L156
$$ 390 -2148 -85 941 -2566 -292 1381 -2333 -721 1994 -1403 -1130 2478 -333 -1438 1718
2599A718m77l070L364O2k947J360K844m227P75M251m324k74K977k317k037M044
$$ 1718 1241 -1829 1535 1597 -1350 10 2854 -1373 -598 3653 -671 -945 2032 -285 -2322 1722
2615A722j158l305L235J204l504J136L069m391P15L810l103j691M462j880k812
$$ 1722 564 -2741 494 1698 -1806 -670 2399 -1992 -1277 2533 -570 -2261 2201 321 -2491
2630b491M197o00k826K054J817l821R30L574l790q96N061l445k305M862j459l634
$$ -2491 1706 1106 -1720 334 2151 -1670 -740 2834 -956 -1852 3209 -236 -2541 2321 862 -2772
2646b772L953K55l670K278J969l925P39L625l500j311M630k219k749N119j286
$$ -2772 1181 1436 -2234 44 2013 -1912 -1173 2452 -1048 -2359 2271 52 -2697 2422 1136
2661A136l828M080K54l963K641K290m384P64L960l438j961M859k197k974M677
$$ 1136 -2692 1388 1642 -2321 320 2610 -1774 -1010 2950 -488 -2449 2410 213 -2761 1916
2676A916o44m416M123J304n026K670K762m436L98M210l485j955M899j960l697
$$ 1916 1272 -3144 979 2283 -2743 -73 2689 -1747 -1349 2861 -624 -2579 2320 360 -3337
2691c337M567O0m352L814J689n165K294L115m214J93M079k315k824M325p75l898
$$ -3337 1230 1290 -3062 752 2441 -2724 -430 2685 -1529 -1336 2743 428 -2396 1929 1154 -2744
2707b744M246M82m979L354J955m803J803L198l902o26M151k082k751M253p69l741
$$ -2744 1502 1984 -2995 359 2314 -2489 -686 2512 -1390 -2016 2135 53 -2698 1555 786 -2955
2723b955L715J395n025K649L270n264Q88M224l725j001M242j986k303L399K54
$$ -2955 760 2155 -2870 -221 3049 -2215 -1327 2897 -828 -1829 2413 427 -1876 1523 1777
2738A777m100L301J814m913J908L028m328K53L927l505j357L600j065k727L223
$$ 1777 -2323 978 2792 -2121 -213 2815 -1513 -1260 2667 -838 -2195 1405 340 -2387 836
2753H36L48l558K700J934m439J263L685l844m70M141k679j445L653j575k715L566
$$ 836 1184 -2374 326 2260 -2179 -916 2769 -1075 -1545 2596 -83 -1528 2125 550 -2165 1401
2769A401L07l469J926J846l342L15L349l460q41L873k475j585L542j171k716K949
$$ 1401 1708 -1761 165 2011 -1331 -1016 2333 -1127 -1968 1905 -570 -2155 1387 216 -2500 449
2785D49P91l292J752K048k907J4L343k480j284L873j811k246L540p66k471K290
$$ 449 1240 -2052 -300 1748 -1159 -1145 2198 -282 -1566 2307 496 -1750 1790 1024 -1447 843
2801H43R23l091J056J932k439n31K883j667k153L223j168k267L131j01k577J999
$$ 843 1766 -1325 -269 1663 -776 -1307 1576 -91 -2244 979 -189 -2456 675 574 -2003 -4
2817dP00j877N13K050k005j93K318j044j769K883m45k344K609J71k635J422J046
$$ -4 696 -1181 -668 1382 -623 -816 1502 458 -1311 1572 1127 -1217 1392 1563 -1072 350 1396
2834A396k307O61J330j600l04J653q46j773K067J30k163J868O72k249J434R87
$$ 1396 -911 -250 1080 -520 -824 829 -17 -1790 277 407 -1756 112 784 -1465 -31 956
2850I56j642N54J166q97o78J578j11j932J858O86k386J532O39j848N42Q45j481
$$ 956 -686 -132 1034 137 -541 1037 926 -1006 852 1538 -848 684 1323 -525 17 862 -619
2867f19Q1P11m93p01P94N7j157J085K75j318O75J299j665O63J020j163N87N72
$$ -619 -538 173 -320 -1021 -227 -170 -1327 -242 33 -1285 -610 689 -976 -313 707 -456 131 703
2885G03l92m04M64K29p29J81P96j235K60J243j658J82N79n72p1N65r54p3P68J99
$$ 703 311 -93 371 600 -129 52 848 -387 -127 1116 -542 -360 219 -353 -424 141 -813 -886 -118 81
2905H1q22J06J080j184M04P85m97j37O39n26M08L14m77j96L53m9O7j03q1J51m76
$$ 81 -741 -635 445 -739 -335 450 -47 -184 455 -71 337 651 174 -22 331 282 349 246 165 316 -160
2926a60R04j030K77Q14j265o2L52m7p6M84m43j49K48J95j89O80M0k26m72Q87m11
$$ -160 744 -286 -9 805 -460 -522 -170 -217 -293 191 -252 -401 -153 42 -147 533 573 347 -125 762 351
2947C51n00N60K36k14J30l55K04m8j10l57K54K6j44n43O81p78L24j27j97j08Q17
$$ 351 -149 411 647 433 563 208 412 364 254 -103 151 177 33 -510 171 -607 -283 -410 -607 -715 102
2968A02om34L14n39P21l67R28n74l17L4Q3k60P70q16k71J162o1l17j89K73l98
$$ 102 96 -338 -24 -563 158 -209 719 145 -172 -138 -55 -315 455 -361 -632 530 469 152 -37 236 -162
2989a62j88o73J447j392J192o98m63P82L80j9m60J97l60R16j31r3l42J48J71n91
$$ -162 -350 -1023 424 -968 224 -474 -937 -155 225 206 -254 -57 -417 499 368 275 -67 81 252 -339
3009c39K15L94o03j79Q36p91k43J305j10l52M2L09q83O31l39O5m78O67o05K39
$$ -339 -124 270 -333 -512 324 -467 -710 595 485 133 175 484 -399 232 -107 -42 -520 147 -458 -219
3029b19R05j509O30J070q12n04Q19n39q6L13L39m36j89N33n69N84J49p74L10Q52
$$ -219 686 -823 -193 877 65 -439 380 -159 -245 68 407 -29 -218 315 -254 330 479 -295 15 867
3049H67j520O59N63p81j00M12n9o70O81q2n12J26R29j142j71J103j025O0J324
$$ 867 -653 6 569 -212 -312 100 41 -629 52 -30 -542 -416 513 -629 -800 303 -722 -662 662
3068F62n69q24J025j10p61M45P85j025L00R31j203p6J853j460m84J568j240l44
$$ 662 93 -731 294 184 -577 -132 653 -372 -72 859 -344 -420 1433 -27 -511 1057 -183 -527
3086e27J535p88q99Q63N22j475P2J288j264k65J901j394p13J983r23o98J411k93
$$ -527 1008 220 -679 184 706 -769 -697 591 -673 -938 963 -431 -1144 839 -84 -782 629 336
3104C36j323J450L54j423N80J229j233m72K147j566r46K227j092j204J708j47
$$ 336 -987 463 817 -606 -26 1203 -30 -502 1645 79 -867 1360 268 -936 772 625
3120F25j970J238M07j409N49J291j464l97J933q89j518K475m30k081K481j42j890
$$ 625 -1345 -107 300 -1109 -560 731 -733 -1130 803 -86 -1604 871 441 -1640 841 699 -1191
3137a191J734P06j932M47J748j477p84K021p72j952K623m90k024J848M68k525
$$ -1191 543 1249 -683 -236 1512 35 -749 1272 500 -1452 1171 681 -1343 505 973 -1552
3153a552J359J335k387K81J669j262p70K409r60j816K106N01k578K226R81k670
$$ -1552 -193 1142 -1245 -964 705 -557 -1327 1082 122 -1694 412 913 -1665 561 1542 -1128
3169a128J169J510k222P4K319j456j280K193n17k270K402L69l120J934J216k915
$$ -1128 41 1551 -671 -597 1722 266 -1014 1179 662 -1608 794 1163 -1957 -23 1193 -1722
3185a722R74K053k585k04K612j413j065K244k05k367K312P25k484J539J743l120
$$ -1722 -748 1305 -1280 -1484 1128 -285 -1350 894 689 -1678 634 1359 -1125 414 2157 -963
3201i63P03K169k432j52K480j547j631K563l19k430J949J023l248Q78K611l395
$$ -963 -260 1909 -523 -675 1805 258 -1373 1190 871 -1559 390 1413 -1835 -957 1654 -1741
3217a741M35K871k652m71K841j351j640K516J44k208J357J540k754Q93K375k931
$$ -1741 -1306 1565 -1087 -1558 1283 -68 -1708 808 952 -1256 101 1641 -1113 -220 2155 -776
3233g76J54K643k179p74K826j594j961K144L35k340J193J353k410M70K331k661
$$ -776 -622 2021 -158 -932 1894 300 -1661 483 818 -1522 -329 1024 -1386 -916 1415 -1246
3249a246m71L407k100j606L727j293k030K416L57k537J919J486k208k82K431j676
$$ -1246 -1717 1690 -410 -2016 1711 418 -1612 804 1161 -1376 543 2029 -179 -461 1970 294
3265B94j507L071j365k066L073o16k021J327Q21k984J916J168k778k3K416r67
$$ 294 -1213 1858 493 -1573 1500 884 -1137 190 1011 -1973 -57 1111 -1667 -1690 726 -241
3281b41j633L036j510j430K886j75k317K309J08j712J125J382k080k43K161j473
$$ -241 -1874 1162 -348 -1778 1108 933 -1384 925 1033 -679 446 1828 -252 -495 1666 193
3297A93j233K319m73k420K305n6k004J570J520l087J99J887j373p41K555j176
$$ 193 -1040 1279 806 -1614 691 635 -1369 201 1721 -1366 -1167 720 -653 -1394 1161 -15
3313a5j424K127jj880J743O85k515J986P01k112P51J219j278n68J654n21j710
$$ -15 -1439 688 687 -1193 550 1235 -1280 706 1407 -705 46 1265 -13 -581 1073 552 -1158
3330a158J702O4j789J355O84k542J203J311j924L33J467j266l01J369j91j407
$$ -1158 544 608 -1181 174 858 -1684 -481 830 -1094 -761 706 -560 -861 508 317 -1090
3346a090J354L95j821J540J084k420J015J753k109K80J328j109n21Q30l45j180
$$ -1090 264 659 -1162 378 1462 -958 57 1810 -299 -19 1309 200 -321 509 164 -1016
3362a016Q79N75j500N70J262j819N35J275j432J52J080j066k13J091K13q48Q1
$$ -1016 -137 438 -1062 -492 770 -1049 -514 761 -671 -519 561 -505 -718 373 586 -262 -181
3379a81R95q28k2J381j530L0J118j015m74J191p99m13J120n15l51K18L94o15m70
$$ -181 814 -14 -36 1345 -185 -155 963 -52 -526 665 -134 -547 573 58 -293 -75 319 -296 -766
3398g66J271q83l96J294p92k86R81l68p15P31R3k53O3N75n59j71R25p22k26R44
$$ -766 505 -378 -774 520 -272 -558 423 55 -660 71 164 -89 -26 549 -10 -181 744 22 -204 740
3418G40p10k80J101n52j132Q00J31k53o8K50j99l52P18j04o90O62m9o11P74j8
$$ 740 30 -250 851 299 -833 -33 98 -155 -223 27 -172 -524 194 90 -600 62 13 -598 176 158
3438A58n96R00m39P7K57j4J20n70L12R2m51k1K77m14M95j70l78J67L93p19O71
$$ 158 -438 462 23 100 357 343 463 -107 205 297 -154 -175 102 -312 183 13 -365 -198 195 -524 147
3459A47m5k00l92L52L59n41M36N6o71N58M97r15K85L92n79K33J66k86L59l21M06
$$ 147 102 -98 -490 -138 221 -320 116 172 -499 59 556 -359 -74 318 -261 -28 138 -148 211 -110 296
3480B96m47p1Q01j021M21K84n09K47J91n02R2J95k03M83k69j98l9K95K4m43K4
$$ 296 -151 -222 579 -442 -21 263 -246 1 192 -310 -218 -23 -226 257 -12 -210 -249 46 70 -373 -349
3501c49O27n25k2P41n40K3J66k48L81k22o2m06L26K49o0j75N46n50k80O39m34
$$ -349 278 -247 -269 472 -68 -45 121 -127 254 32 -30 -436 -110 139 79 -96 450 -100 -380 259 -175
3522a75j56L56k79L42k74n5J74k09L53m8j28O26p94n06J388o59j95P69o91J33
$$ -175 -331 25 -254 88 -186 -241 -67 -276 77 29 -99 527 -267 -773 615 -44 -239 530 -161 -28
3542b8K60M6j52oK4j78o1M86l26m18P78n57n33J046m95k19P54k70k07L08j31k86
$$ -28 232 278 126 120 144 -34 -95 391 65 -353 425 -132 -665 381 -114 -333 421 151 -56 252 121 -165
3564a65l20O87n31n4Q62k00o90R35j80k80J37jl71L72L04p74L85j15j98k76J031
$$ -165 -485 202 -329 -383 479 279 -411 524 344 64 201 200 -171 201 505 -269 116 1 -197 -473 558
3585E58l17o29R08o56o63J245p12m00Q66k93j23j75P51n02j48P06k8j018R64k50
$$ 558 241 -388 520 -136 -799 446 -266 -666 200 -93 -216 -391 360 -142 -290 416 388 -630 334 84
3605H4p66J196k4j262J175rr85N57N84o03m74Q47l73o47J003k05j323J044O79
$$ 84 -682 514 490 -772 403 394 -591 -34 550 -53 -527 320 -53 -700 303 98 -1225 -181 498
3624D98j511J482j05j214P38P08p15j55R62l47r34J415k55j034R32M85j342N71
$$ 498 -1013 469 364 -850 -112 596 -119 -274 688 341 -593 822 567 -467 465 950 -392 179
3642A79Q93j498J90J078p46o39J116m71q67J075Kj375Q18J149j782P98R66j709
$$ 179 1072 -426 -236 842 96 -543 573 102 -765 310 312 -1063 -245 904 -878 -80 886 -823
3660h23N04R01p70l56J762o75j452J191O30j389M34J510k432O51J487k182P64
$$ -823 -319 582 -188 -544 1218 543 -909 282 912 -477 -43 1467 -965 -314 1173 -1009 -245
3677b45J019j201q82J672p45p29J158N66j592P46J493k439R89J026q77m04J567
$$ -245 774 -427 -1309 363 -382 -1111 47 613 -979 -233 1260 -1179 -190 836 -41 -445 1122
3694A122j231k5J598p81j306Q64Q75j838K78J691j990j14K119j756j84J474j282
$$ 1122 -109 -134 1464 683 -623 241 1116 -722 -444 1247 -743 -857 1262 -494 -678 796 -486
3711d86o64J755l74j473J104N74j299N00J629j888l90J830j196m34J679l09j244
$$ -486 -1150 605 231 -1242 -138 436 -863 -363 1266 -622 -1012 818 -378 -812 867 558 -686
3728f86J542k18j559J368N19j147Q0J263j493m01J591j423p24K079j030j146K148
$$ -686 856 638 -921 447 966 -181 -101 1162 -331 -732 859 -564 -1288 791 -239 -1385 763
3745G63n46j546J208R18j427K93J549j316o97K036p63j599K066j099p50J931l0
$$ 763 217 -1329 -121 797 -630 -337 1212 -104 -801 1235 472 -1127 939 -160 -910 1021 991
3762I91j787P26J035j548p3J301r35q18J968q88j351J634k38j671J465P28j824
$$ 991 -796 -70 965 -583 -656 645 -290 -1108 860 -28 -1379 255 17 -1654 -189 539 -1285
3779a285R66J212j620K51J358r47n64J485l81j830J673M76j582J159M85j447N75
$$ -1285 -319 893 -727 -476 882 -65 -629 856 475 -1355 318 794 -788 371 856 -591 -16
3796a6P70j409M53R30q27q14J278J37j645J688N01k436J181J378j988M79R72j305
$$ -16 754 -655 -202 728 -99 -913 365 502 -1143 545 1046 -1390 -209 1169 -819 -340 632 -673
3814f73K94J337o74o62R95M82j630Q38Q68k315P48J113j687N41J140q84l26Q85
$$ -673 -379 958 284 -378 617 1099 -531 307 1175 -1140 -392 721 -966 -425 715 -169 -495 390
3832C90o31q88J201M06j106N24R52j555N39J353j503k6J831j218n76J221p47p61
$$ 390 -241 -1129 72 478 -628 -104 848 -707 -168 1185 -318 -344 1487 269 -307 914 167 -594
3850e94J221j71j149R64P27j932N01J192j160n47J833j163k41R42m66p98N27O82
$$ -594 627 456 -693 271 998 -934 -433 759 -401 -948 885 -278 -519 423 -43 -841 -314 368
3868C68j114L29O44o30J40J379j427k71J666j116l60P69j81n69Q12K13j280N67
$$ 368 -746 -417 227 -403 -263 1116 -311 -582 1084 -32 -392 377 196 -373 439 652 -628 -61
3886f1N17o71l61R75o13p96J347m00n76P85J57r49J064o5r80L31Q68q46j87R24
$$ -61 456 -215 -576 399 -214 -1010 337 -63 -639 146 303 -646 418 353 -627 -296 572 -274 -461 463
3906D63k48m72Q98m60r31J223p8q44J47O07l62k66Q67k33p16O89k93p31J193o43
$$ 463 215 -257 641 181 -750 473 395 -449 -302 305 -57 -323 544 311 -405 284 -9 -740 453 -190
3926a90m71N17J18m3l6L27l59NO12k50k88J04L97m34J46N5p44P86K5j60j41M9
$$ -190 -661 -144 -26 -69 -105 222 -137 -132 480 230 -58 46 443 9 155 210 -534 252 277 117 -24 25
3948B5k99m06P82j45j80J81j42N0M5J90o30N48J03k84K89M8o65J63J002n50K16
$$ 25 -274 -680 102 -43 -223 -42 -184 -134 -89 101 -529 19 122 -162 127 175 -490 -327 675 125 341
3969C41o61J03N8j16J90k81P58J47j051L10N79n57P0j93M89J2l62J66ml96P78
$$ 341 -320 -217 -159 -275 -85 -366 392 539 -512 -202 377 -180 -110 -303 186 198 -164 2 -2 -398 380
3990C80n92k0J06K4L04l08J68q9M11n81L55n95M32K32k08o4l90M90O7n79J046
$$ 380 -212 -232 -126 -102 202 -106 62 -27 384 -197 158 -437 -5 227 19 -45 -435 55 122 -457 589
4011E89j91n60M53m18O94j263Q22P1k58l44J173p91q57J211k33m90R39l91N3K10
$$ 589 398 -162 291 -127 567 -696 126 197 -61 -405 768 -23 -880 331 98 -392 547 156 209 419
4031D19o22J20J93m6K18oj82n03O04J5R3L00j86o51J34R5L07JJ81j90l07J27p9
$$ 419 -203 -83 110 64 282 276 94 -409 195 210 303 603 417 -234 -100 -5 302 303 484 294 -13 114 35
4054C5p9o4n0j6p26J164k16n50N93k94R7J51rP6j03l92N96l63N23j024O47L14
$$ 35 -44 -108 -158 -174 -900 264 48 -502 91 -203 -106 45 36 112 9 -383 213 -150 373 -651 -4 310
4076C10o72M33n91R94j012P25K22o65J50K87K7m27O75m95m47N29j03q1O4M08n18
$$ 310 -362 71 -520 474 -538 187 409 -256 -106 181 208 -219 456 -39 -486 43 -60 -141 -77 331 -187
4097a87L30P1k12K88k3O9q7r6n51O34M8k90P8n7K99m10J23K43o57J10K80o6j17
$$ -187 143 214 2 290 267 336 249 153 -398 236 284 -6 72 15 314 -96 27 270 -387 -277 3 -63 -180
4120a80N56p63N4J14M36p47K39L34l26L36O72o94J96r4p97O74l28R20m78K45J52
$$ -180 376 -387 -333 -219 217 -530 -291 43 -283 53 725 31 227 133 -664 10 -318 602 124 369 521
4141E21p68O32k41n61N61L13r11m7Q85m08m64O47p7k00j03O25r22Q52J4q90J11
$$ 521 -247 385 144 -417 144 457 -454 -501 384 -24 -488 159 82 -118 -221 404 -518 334 348 -542 -431
4162d31R01j207k2J138l21l34R61j1p38p07R60q16K13L63m17M97N83q88j81J266
$$ -431 470 -737 -759 379 58 -276 685 674 -64 -771 189 -627 -414 -51 -468 29 612 -276 -457 809
4182H09j253j65R14m5n12N34J54p05M80M74p87m52J726j059o17J150p83j57J88
$$ 809 -444 -609 305 260 -252 282 436 -269 211 685 -102 -554 1172 113 -504 646 -137 -294 -106
4201a06K44p49P01j06o35P04N13q24P20k28o26o67K117p89q06P97p19m30J238
$$ -106 138 -611 90 -16 -651 53 566 -258 462 234 -392 -1059 1058 269 -537 260 -459 -889 349
4220C49K48p66O99j92J6p93J094q07n10J997m17k092J416Rj144R64k7j148Q42
$$ 349 597 -169 530 338 354 -439 655 -152 -662 1335 918 -1174 242 251 -893 71 44 -1104 -262
4239b62K79N97p91J625j780J58N00R7o10M65O83j355p4J388j249P57j63j077R66
$$ -262 17 614 -177 1448 -332 -174 326 423 -187 278 961 -394 -468 920 -329 428 265 -812 154
4258A54J01l6k11P91j320n22J974r44r18J274o03m49J402r70l28M00K01L04k7
$$ 154 255 219 8 799 -521 -1043 931 -13 -931 343 -260 -709 693 -277 -605 -205 -4 300 273
4277B73j09P25j450Q82m8k49m23R92j731Q82P61n82K60Q9J15r95N86L55q59P49
$$ 273 164 889 -561 321 273 24 -399 593 -1138 -256 505 -77 183 272 387 -608 -22 333 -526 223
4297B23M13r85M84J89j251N85Q68r31q0P55j25l74N85k55q59J222o17L98q15R59
$$ 223 636 -349 135 324 -927 -342 526 -405 -485 270 145 -229 356 101 -758 464 -153 245 -570 389
4317C89j026O82N21r50Q0O79o08m11J124l21m83N73k69k19J66K54l96r0M00l4
$$ 389 -637 45 566 -384 -304 375 -233 -644 480 159 -324 249 -20 -239 -73 181 -215 -305 95 61
4337F1k53Q74r21p0P16m12J36l47R17r67M27L49j042M62L70k59k89O85k59L9o1
$$ 61 -192 682 -239 -309 407 -5 131 -216 701 -266 161 510 -532 -70 300 41 -248 437 178 217 156
4358A56k8m02k73P80j067J079M5o91P2P77p50j86O50K65j176N49N99o29P8L54
$$ 156 128 -274 -547 233 -834 245 290 -401 -329 448 -302 -488 162 427 -749 -200 399 -230 -152 202
4378B02j66n48N77N5j061J013J53o65Q09j81j58o7J69n61K82P41o86m40N59q7
$$ 202 36 -512 65 120 -941 72 225 -440 369 188 30 -37 132 -429 -147 594 -92 -532 27 -60
4398f0r74J095P4o41L30K73j125J153J90m87l93N47j55K4K27N6q96N48O63o08
$$ -60 -1034 61 135 -506 -176 97 -1028 125 315 -172 -565 -18 -173 -149 78 134 -762 -214 449 -159
4418a59M11p49O81K71r01J01J13P44m30j07O75o83l87L70q9n39N32k91q2K85O14
$$ -159 252 -497 184 455 -446 -345 -232 512 82 -25 650 -33 -420 -50 -139 -678 -146 -437 -519 -234 380
4439C80m24%N92o33L88l36k10J93K28J61o44l92P64Rk05L78r14P35L47p89n33
$$ 380 -44 -44 548 -85 303 -33 -243 -50 178 339 -305 -697 67 76 -129 249 -665 70 417 -372 -905
4460i05O58K03k87L08L7j13J096J65o41o52p6J64p26Q69n51M39k67J175j459P46
$$ -905 -247 -44 -331 -23 14 -99 997 1162 521 -131 -207 -43 -769 100 -451 -12 -279 896 -563 183
4480A83l97m08k9P01q14O05N97q20M09nN95j165oO70m46k12O43j96M4K79p17L8
$$ 183 -214 -622 -651 50 -764 -159 438 -382 27 22 617 -548 -554 116 -330 -542 101 -95 -51 228 -489 -451
4502d51J99M79k8J80l18n21L20R27q98l3L15l21k16j68J62P18K17o45m6L33n96
$$ -451 -252 227 199 379 61 -460 -140 787 -111 -144 171 -150 -366 -534 -372 346 563 -82 -128 205 -391
4523c91N62j54j14o3k4N8M2K83K89l93l86L00k32J82J34r7P7J82M4m9KJ7L0m87
$$ -391 171 17 -97 -160 -184 -126 -84 199 488 95 -291 9 -223 -41 93 -4 73 255 299 250 252 269 299 -188
4547a88M24j40l05K69j27j28L45r0l45K7L86L4Lj70O9n0n9J58m91N12n4r1j19
$$ -188 236 96 -209 60 -67 -195 150 60 -285 -258 128 162 165 -5 64 14 -45 113 -378 134 80 -11 -130
4570a30L31j96j78L54r7r1K29k13k90J35P3K0m9K72j01j50K23o4k0l3k61J18L57
$$ -130 201 5 -173 181 84 -7 222 9 -281 -146 -73 -53 -102 170 69 -81 142 78 58 25 -236 -118 239
4593B39q9k21O0K32j89n10J244o4o73L5Q19m21o44k08l8M60j84N7M75R8n3o25
$$ 239 150 -71 -11 221 32 -478 766 702 29 64 883 462 -182 -390 -428 32 -152 -95 380 478 425 -200
4615b00K95n71M48P5m57R4O18m95j66M03l45K15K72J56l00k54M02o2k67N10k37
$$ -200 95 -476 -28 47 -410 -316 302 -193 -359 44 -301 -86 186 342 42 -212 190 128 -139 371 134
4636A34j05K3J22M3m3k48j69K49J68J09k97N6j51n3J50j9k91L71l58J26L08K29
$$ 134 29 52 174 217 174 -74 -243 6 174 283 -14 42 -109 -162 -12 -31 -322 49 -309 -183 125 354
4658C54l64K59k36j52J39k9J50j05O7j54J06l5k2j08K11l02J93o4K51j11p8J88
$$ 354 -10 249 13 -139 0 -29 121 16 83 -71 35 0 -22 -130 81 -221 -28 -92 159 48 -30 158
4680A58j78n4K64j2m69M03Q9j04K17j23l81O09k97j88r1N2J66k48J36R1K3q0l5
$$ 158 -20 -74 190 178 -291 112 201 97 314 191 -190 419 122 -66 -157 -105 61 -187 -51 40 63 -17 -52
4703e2LJ79j79j64J66J03l10L59J18k41p6J30l04R6M46k23l96M89J0o08L57L89
$$ -52 -49 130 -49 -213 -47 56 -254 105 223 -18 -94 36 -268 -172 274 51 -345 144 154 -454 -97 292
4725B92l02q0M09k93R2K43k82j01j0M7j82J25R7k99J39L33j99j83P47o34j12L80
$$ 292 -10 -90 319 26 118 361 79 -22 -32 15 -167 -42 55 -244 -105 228 29 -154 593 -41 -153 227
4747B27p0k35P0K56r9r2L12l65l0Q3o7k12L67k17k45K88J35j26J29K53q26J72
$$ 227 157 -78 -8 248 149 57 369 4 -26 57 -10 -222 145 -72 -317 -29 106 -20 109 362 -464 -292
4769b92N01l39P1K41l68n8K45p6R9o7K50k35j92K81k4k56J64r6j31N57m11L5M35
$$ -292 209 -130 -59 182 -186 -244 1 -75 24 -43 207 -28 -220 61 37 -219 -55 -151 -282 275 -136 -101 334
4792C34k02k97K0Q0J06K0R3k12p2J38K2NJ41k26k90L95j55L0K53N7k71J55k65
$$ 334 132 -165 -145 -65 41 61 154 -58 -130 8 30 35 176 -50 -340 55 -100 -70 183 240 -31 124 -141
4815a41P9l8J95j10l19N43o5n46L17J16k95J54L39l52K27K17o92O88lm59J6L76
$$ -141 -62 -100 95 -15 -334 209 144 -402 -85 31 -264 -110 229 -123 104 321 -371 317 314 -145 -129 247
4837B47m38j61P26j47m27K20J48k30o7M89m67J32k55K79k94M26j11j59J18J13
$$ 247 -191 -352 374 227 -200 20 168 -62 -129 360 -107 25 -230 49 -245 181 70 -89 29 142
4857A42o18M82ll08L17K29m55P0N16j72p28Q93l52L3o04N78l9m7K85l84O5J51
$$ 142 -476 6 3 -305 12 241 -214 -144 372 200 -528 365 13 46 -558 20 -19 -66 219 -165 -100 51
4879E1q3j88M15k90K1k03M36n35N89K29n70j99M30k41r0N56j66q3r7j63r7L42
$$ 51 -32 -220 195 -95 -74 -277 159 -376 213 442 -128 -327 103 -138 -228 328 162 79 -18 -181 -278 64
4901F4j14J84j57M58k79j32m2K5M6J50o9m40P35p49K99J10j68Q8k39L85J64m41
$$ 64 -50 134 -23 435 156 24 -18 7 53 203 134 -306 429 -320 -21 89 -79 9 -230 155 319 -122
4923a22J33K3j80K2m4J53J0O1q0J43L7k30l00M64j54J6O7j12j94M28l02K27j40
$$ -122 11 34 -146 -124 -168 -15 -5 56 -24 119 156 -74 -374 90 -64 -48 19 -93 -287 141 -161 66 -74
4946g4L39k75J5p4M44k06P5l84k42M16k75j47M75k17j67K14P7j68L57N9l87J40
$$ -74 265 -10 5 -69 375 169 244 -140 -382 34 -241 -388 87 -130 -297 -83 -6 -174 183 242 -145 -5
4968eJ66K87m63o1J84k77O43j11l41K25m08l9L73m47L41L4l52Q5R5J80J97m72
$$ -5 161 448 -15 -76 108 -169 474 363 22 247 -161 -200 173 -274 67 101 -251 -166 -71 109 306 -166
4990a66K79K39k44j78J19KM6q1J6J80k56J34Q1l59K77r9l2L75l03n5K30n1r5m3
$$ -166 113 352 108 -70 49 51 97 16 32 212 -44 90 171 -188 89 -10 -42 333 30 -25 205 154 59 16
5014A6l65K56P7j38J04L34m80m8L39j43r5J93R5l34L3Q6k14K53L87m81L57m56
$$ 16 -349 -93 -16 -154 -50 284 -196 -244 95 -48 -143 50 145 -189 -156 -70 -284 -31 356 -125 232 -224
5036b24O11k17J%l3l62J89j60K55J99N8m10J07k32P0P0k46L23q5l2K1j3N2N5K1
$$ -224 387 170 171 171 138 -224 -35 -195 60 259 317 -93 14 -218 -148 -78 -324 -1 -86 -118 -97 -110 -58 -3 18
5061A8J67j22J09k13n8J70O0k60N05n49M82k44j51N3j9k50O70k42l20L19j70J82
$$ 18 185 63 172 -41 -99 71 131 -129 376 -173 309 65 -86 -33 -52 -302 368 126 -194 125 -45 137
5083A37O6j20j9M4n8k44J58L22k82PJ92Mk28L59k39J17j94Q3p5m2J74j53R1l6
$$ 137 203 83 64 108 50 -194 -36 286 4 11 203 207 -21 338 99 216 22 105 30 -12 162 9 100 64
5107F4K07m06N5L54p80L86J71o9k95K74K5k85K88J1m04M88L04l47j9K8P0K9P5
$$ 64 271 -135 -80 274 -506 -120 51 -18 -313 -39 -14 -299 -11 0 -404 84 388 41 22 50 120 149 224
5130B24j69K84j23j29Jj51M09k20p9R7k58NJ97j18Q7Rl58K52K04k20K96o8k12
$$ 224 55 339 216 87 88 -63 346 126 47 144 -114 -109 88 -30 57 66 -292 -40 164 -56 240 172 -40
5153d0n2O3K33j90L6n2N5l34L75J6k11J43j93J08j37J85j67m7L16k36J44j78Q2
$$ -40 -92 -29 204 14 50 -2 53 -281 94 110 -101 42 -151 -43 -180 5 -162 -209 107 -129 15 -163 -81
5176h1J22Q9k17J01k21m3M28L5j9J17l08L26q7j80J24O2k99L37k29j38J09k5Q5
$$ -81 41 130 -87 14 -207 -250 178 213 194 311 3 329 242 62 186 248 -51 286 57 -81 28 3 88
5199H8J1p0k90QN08l39M04n81J86J08R9j16r3J70l15K18K70k78k24L11L3O2k16
$$ 88 99 29 -261 -253 255 -84 320 -261 -75 33 132 16 -77 93 -222 -4 266 -12 -236 75 108 170 -46
5222d6K81l24m1N10k06k31J28j59K1P9j81M7L9L95l18J86m3k02j66J84J49n6K49
$$ -46 235 -89 -130 380 174 -57 71 -88 -67 12 -169 -122 -83 312 -6 180 137 -65 -231 -47 102 46 295
5245B95j23k90L74p3l55J28R5K7k93J19J51l1k32K19m88P72k68m34M92r3j94J84
$$ 295 172 -118 256 183 -172 -44 51 78 -215 -96 55 24 -208 11 -477 295 27 -407 85 -8 -202 -18
5267a8Q5j59K15l89O30k18Pj83k04j87Q97p6k23k87k31J39J02K25R3j37j06k56
$$ -18 67 -92 123 -266 364 146 153 -30 -234 -421 476 400 177 -110 -341 -202 -100 125 218 81 -25 -281
5289b81N89j86o1l0J98n06M7O14q58K57N93l32p8J1J96o6l14M14j53k63L41l52
$$ -281 308 122 61 31 229 -277 -230 384 -474 -217 376 44 -34 -23 173 107 -207 207 54 -209 132 -220
5311b20K95K70o50L6M95k39O8Rj30k68K63M22l90r8L26k88k4L78m93K54J81j44
$$ -220 75 345 -305 -269 226 -13 55 64 -66 -334 -71 351 -39 -137 189 -99 -123 255 -238 16 197 53
5333E3k60K02K33l74K56l79k11K4M7P72q96N25m3l93M00L12n39K46r0K56J25p0
$$ 53 -207 -5 228 -146 110 -269 -480 -456 -409 363 -533 -8 -51 -444 -44 268 -271 -25 -115 141 266 196
5355A96l13j68M97m9l52J34K68l24J52o6n5M11k16o5n0K26k97K99k9j54l65P78
$$ 196 -117 -285 212 163 -189 -55 213 -111 41 -25 -80 331 115 50 0 226 -71 228 199 45 -320 458
5377D58p32M34N1k78J53j09M17o62L36R5l13P6J26k5q4J73J32m08M93l01l66K87
$$ 458 -274 160 211 -67 86 -23 394 -268 68 163 -150 -74 52 27 -57 116 248 -160 333 32 -334 -47
5399d7O6l72K17j14L23k19J24J73j21PJ0j10J38K39o57K48J28j42O7K08k95J83
$$ -47 19 -353 -136 -250 73 -146 -22 151 30 37 47 -63 75 314 -343 -95 33 -109 -42 166 -129 54
5421E4o6j4K3J42K14m69L2P8k03K53J15j2M3k20Q1l30K33K67k34L6J48n61L09
$$ 54 -12 -26 -3 139 353 -116 -84 -6 -209 44 159 147 190 -30 51 -279 -46 221 -13 23 171 -390 -81
5444h1L82l02j65M07n42J36J23R1j60K94l35J25J26Mk84P3K47m37J06l2M53m72
$$ -81 301 -1 -166 241 -301 -165 -42 49 -111 183 -152 -27 99 103 -181 -108 139 -298 -192 -224 229 -243
5466b43R38j063L08L23l4l40j00N33l69k26N85l07k3K16r8N9j74k06L34l90K82
$$ -243 695 -368 -60 263 229 -111 -211 322 -47 -273 312 5 -18 198 100 159 -15 -221 113 -277 5
5487EL65r38L70k22n52R72O71l97n2k44p3J05J6L7l32L61j29k01N78k56K09p31
$$ 5 370 -568 -198 -420 -972 0 671 274 222 -22 -95 10 26 63 -269 92 -37 -238 340 84 293 -438
5509d38N75j73j57M64j73j02k71p6N61p15J060q2q39O49o42O88k04m91O3j95P05
$$ -438 137 -36 -193 271 98 -4 -275 -351 210 -505 555 473 -366 283 -359 329 125 -366 -303 -498 207
5530B07l15Q86r39j88L93l11N31q47L36j82N15On1n72J40k94J9O40L40r1o4j04
$$ 207 -108 778 -161 -349 44 -267 264 -583 -247 -429 86 92 41 -531 -391 -685 -666 -26 314 223 159 55
5552E5R1N3k28J33N3J64n97J10J0j62L78l10J08L9J19j46J82m46j038R25R6L86
$$ 55 146 199 -29 104 157 321 -276 -166 -156 -318 60 -250 -142 -103 16 -130 52 -394 -1432 -507 -411 -25
5574b5J55k12j240R67K79O9q78P33O4m77L13o3M91M10l51J03j82j10mP3J7j35
$$ -25 130 -82 -1322 -355 -76 -7 -885 -152 -88 -565 -252 -315 176 586 235 338 156 46 42 115 132 -3
5596cP61o30l40K30o91M47L72Kj59n29O40l84M85k18J2j96K34k92N83m45L36J4
$$ -3 758 128 -212 18 -673 -226 146 148 -11 -540 100 -284 201 -17 -5 -201 33 -259 324 -121 215 229
5618B29n81M42J9N00n08m38K09J17k31L16n6J97p54N86j97M46l98j65J39M85l27
$$ 229 -352 90 109 609 101 -337 -128 -11 -242 74 18 215 -539 47 -150 296 -102 -267 -128 357 30
5639C0n1j96K85n30J98N42j25n3k45L41K75k25q4j65J71j51o40M66Q44j178J094
$$ 30 -21 -217 68 -462 -264 278 153 100 -145 196 471 246 162 -3 168 17 -623 -157 687 -491 603
5660F03m40j39K28J62n64L34L0o9j32Q0J07m01N97m86k79M03Q3n43N24R5m44O25
$$ 603 163 24 252 414 -150 184 214 145 13 93 200 -201 396 -90 -369 34 117 -426 98 193 -251 374
5682C74j22p09P38p8k74M89o4l66p1J93P0m50M03K79l27j77N37q96L63J72j12
$$ 374 252 -457 281 203 -71 418 354 -12 -83 110 180 -270 133 412 85 -92 445 -451 -88 84 -28
5703b8K02j75j37K95j10L8l10M08O9l43m9M56o25L71L21n89L14J57k48l88L59
$$ -28 174 -1 -138 157 47 85 -225 183 252 -91 -140 316 -309 62 383 -206 108 265 17 -371 -12
5724a2k67K01K01r3K0k09K33o8o1K56n06O31J29r43R95m7k61J05j71P2o2n82O93
$$ -12 -279 -78 123 30 50 -159 74 6 -55 201 -305 326 455 -488 507 460 199 304 133 205 143 -439 254
5747B54K06m40N9n14M47J09N40q21Q12q71K12j30j03L98j77P20p38p91Q03J56
$$ 254 460 20 79 -435 12 121 661 -160 652 -219 -7 -137 -240 158 -19 701 -37 -828 -25 131
5767A31J22J88j49k57M02l42K31n65N04Q4o03P80m68J7N07j347O10M05P1M0Q89
$$ 131 253 441 292 35 437 95 326 -239 265 349 -254 526 58 75 582 -765 -155 250 321 361 1250
5788A250j207j195J338j486J794o68J95o34M00m74J419r81M9O7Q71j51P4l79m38
$$ 1250 43 -1152 186 -1300 494 -174 21 -613 -213 -687 732 -249 -200 -133 738 587 661 282 -156
5807a56K39o30J200o64J73k91K48j21l46k70R98L2M3n80k59j13R55q58j46J015
$$ -156 83 -547 653 -11 162 -129 119 -2 -348 -618 380 412 455 -125 -384 -497 458 -400 -546 469
5827D69l90q31N63K90n11L41J37l54j3L98m07O61l61L84j45m22M13j71M94l33
$$ 469 79 -752 -189 101 -410 -69 68 -286 -299 99 -308 353 -8 376 231 -191 222 51 545 212
5847B12l16M32p6n71N48O1q76J70R55n88m75R18l65m03L06K49n20N05k4l02N88
$$ 212 -104 328 252 -319 229 290 -586 -416 539 -49 -524 394 29 -374 -68 181 -339 166 142 -160 428
5868D28l49m87J92M15j74l38M12j71j27K22J99m48J63M45m82Q2L02o87K40P21
$$ 428 79 -408 -216 199 25 -313 99 -72 -199 23 222 -226 -63 382 -100 -18 284 -403 -163 558
5888E58q64M7L00j37j37L53J38o36L62M13m89J55J90k26k73P57m06j39L76l58
$$ 558 -306 -259 41 -96 -233 120 258 -378 -16 397 -92 63 253 27 -246 511 105 -34 342 -16
5908a6o2K85L9m25J83P9o2N5J77l14L6J44k07k00O11o26j9L12K6j56J77Q4l18
$$ -16 -78 207 246 -179 4 83 21 76 253 -61 -25 119 -88 -288 323 -303 -322 -10 16 -140 37 121 -197
5931a97j09M84k47j20N00j18m26L89J7l75J31L23l05K97K34k74l52K70l44p3O38
$$ -197 -306 178 -69 -189 311 193 -233 156 173 -202 -71 252 -53 244 478 204 -148 122 -222 -295 343
5952C43k18k63N27k79k34L53k2m06L70K46m10k38O48n92j21K92K37k95L18k91
$$ 343 125 -138 389 110 -124 229 207 -199 171 417 7 -231 417 -175 -296 -4 233 -62 256 -35
5972c5k07L39q0l57J17J17J30j80r6N5K9K67j57j79m0K01j09L9J93J41j70J36
$$ -35 -242 97 17 -340 -223 -106 24 -156 -252 -197 -168 99 -58 -237 -277 -76 -185 -146 47 188 18 154
5994A54j82J12q3K10k88M83j08m41K39L51m03K8R2l16J69K39l38j48K75M6j3Q1
$$ 154 -28 84 1 211 -77 406 298 -143 96 447 44 72 164 -152 17 256 -82 -230 45 91 78 159
6016A59L54p67J01l9K7o4M16m08l4J39J11Q1Q0J63m68K6K13j92J49M9k89K7J35
$$ 159 513 -254 -153 -192 -165 -229 187 -221 -255 -116 -5 76 156 319 -149 -123 90 -102 47 96 -193 -166 -31
6039c1j88N5P4J45M7L0M6j53l34O79m89J66L14k51k21K79L6N5k51J20j65K26j11
$$ -31 -219 -164 -90 55 102 132 178 25 -309 370 -119 47 361 110 -111 168 204 259 8 128 -37 189 78
6062G8J10l34M11m05J20O5n73M29J80r5j99M32l30q0O0O9R2r6J8K0j99J25K7j42
$$ 78 188 -146 265 -140 -20 45 -528 -99 81 -14 -213 219 -111 -191 -131 -62 30 -66 -48 -28 -227 -102 -75 -217
6086b17K12pj32J19j86K38k9k29L05k87J95J50m92N66J23p60O15J72k77J95k78
$$ -217 -5 -12 -144 -25 -211 27 -2 -231 74 -213 -18 132 -360 206 329 -431 184 356 79 274 -4
6107dJ9L5K8j15M28m14J33j89L62k25qL69l13j15R7K6j52j00L92n65K82K03j35
$$ -4 15 50 78 -37 391 -23 110 -79 283 58 50 419 106 -9 88 114 -38 -138 254 -311 -29 174 39
6130C9l41M74k57N%J32l71K01j47MN20l37J27k84J52J41p5q5M25n22K97J11j87
$$ 39 -302 172 -85 -80 -80 52 -319 -118 -265 -261 259 -78 49 -235 -83 58 -17 -102 323 -199 98 209 22
6153B2j37K84k03P1L6jj13J37k27R2m8K43k95Q9K29n95M48J87l82K56K80k87q2
$$ 22 -115 169 -34 37 73 72 -41 96 -131 -39 -87 156 -139 -50 179 -416 32 219 -163 93 373 86 4
6176Dr6J53l37K09L15k80k12L46j08j97P6O2j67K33k01r2J15K21l16LL26k39R4
$$ 4 -92 61 -276 -67 248 -32 -244 102 -6 -203 -127 -65 -232 1 -200 -292 -177 44 -272 -269 57 -182 -88
6199h8M41l89K18P9k89l9L66l73j82L49mJ85j39k68K38p9K24k15J9J26j51l7K77
$$ -88 353 -36 182 261 -28 -67 299 -74 -256 93 89 274 135 -133 105 26 250 35 54 180 29 -8 269
6222B69m45p0N19m08j95K55K23j70j29M8q1K09l2L87j187Q24N1q40R74l38K45
$$ 269 -176 -246 273 -135 -330 -75 148 -22 -151 -103 -184 25 -7 380 -807 17 68 -772 202 -136 109
6243A09J127j118m55N65k18j17M49l10j94K0L34l0l12N40r9n41J39L0J99l8k84
$$ 109 1236 118 -337 228 10 -107 342 32 -162 -142 192 162 -150 390 291 -250 -111 -81 118 80 -204
6264b04L84j99L99l29R4m4L4l42K34J32n01M39J12m02Q1L81m32K56J76j52k83
$$ -204 180 -19 380 51 145 101 135 -207 27 159 -342 97 209 -193 -112 269 -163 93 269 117 -166
6285a66K4L1l39M86O8l00K14R5l86M33R1m69K10K44k51p9K05K02o08M30j38k62
$$ -166 -142 -111 -450 36 104 -196 18 113 -273 160 251 -218 -8 236 -15 -94 111 313 -295 135 -3 -265
6307b65L09q4k32L57Q5l60N3N57n11k37L13k48K06L1J58n42L76J89o00M94K80
$$ -265 44 -40 -272 85 170 -190 -137 420 -91 -328 -15 -263 -57 -26 132 -410 -34 155 -445 49 329
6328C29m77PL23l38N3L29n2n60K85L23o42K97K02l60K16J0k92M97j30k10J32J84
$$ 329 -148 -141 182 -156 -103 226 174 -386 -101 222 -420 -123 79 -281 -65 -55 -347 150 20 -190 -58 126
6350A26J32m62K66J77n23M15J87l38J3L83n13K26N7l82J7K99J92m20J68L29l42
$$ 126 258 -204 62 239 -284 131 318 -20 -7 376 -137 89 146 -236 -219 80 272 -148 20 349 7
6371Gk73O04m31j16O01n11K3P6q0k91L24K79n08K95Q3o0L39r01K44M01j24l92
$$ 7 -266 338 -93 -209 392 -119 -96 -20 -100 -391 -67 212 -296 -1 82 22 361 -540 -296 105 -19 -411
6393d11M89O12j074j95L4J019o63J85M38P9k20K05l93k63O39j94o09N51r0m39
$$ -411 78 690 -384 -579 -545 474 -189 -4 434 513 293 498 105 -158 481 287 -322 229 139 -300
6413c00L90J79n79J45J94l38j2M01l22p5L24J06l21N32n7p46N07K13k69k08M77
$$ -300 90 269 -310 -165 29 -309 -321 80 -242 -317 7 113 -208 324 267 -479 28 241 -28 -236 241
6434B41m16P5K17k47K02J02m4n60N03M3l94N88r7p9m5J64l66K3N12j13m53L05
$$ 241 -175 -100 117 -130 72 174 130 -430 73 116 -278 310 213 134 89 253 -113 -90 422 309 -144 161
6456A61j18j74N59q8o41L72K66m47L43k51j69K40OLk21L92Q7o01J84K09o65O90
$$ 161 43 -131 428 340 -301 71 337 -110 233 -18 -187 53 59 62 -159 233 320 -281 -97 112 -553 137
6478A37J36m30n1K56l0m42Q65n90l6L60p7l30K77L6m46M27L11n80L90J98m24Q2
$$ 137 273 -157 -208 48 18 -424 441 -149 -185 175 98 -232 45 81 -365 62 373 -207 183 381 -43 39
6500C9j86M33j95j1J09j68K57k15m28N04Q0l44O2L7l03M56K54m45k2j76L88m72
$$ 39 -147 286 91 80 189 21 278 63 -365 139 219 -125 -63 -26 -329 127 381 -64 -86 -262 126 -346
6522c46K66L67o12K35J99j98P9m31J54j41L25M1m2k9K86k22k31L72j66J50J96
$$ -346 -80 287 -325 -90 109 -89 -10 -441 -287 -428 -103 -62 -104 -133 153 -69 -300 72 -94 56 252
6543B52l76Q8M13K1p47N35J70p0n35O23j11m44N33k98n21M08Q19j584J039k42
$$ 252 -124 -36 377 398 -349 186 356 286 -249 374 263 -181 352 54 -467 -59 760 -824 215 -27
6563b7N61l37J83j131kK94n34N73K94k4l04J64k05L29M52k63m39L71l20p0L08
$$ -27 534 197 380 -751 -753 -459 -993 -420 -126 -150 -454 -290 -495 -166 286 23 -416 -45 -365 -435 -127
6584a27L56j92L5j60L84o73M37j64J05M47l20m21L17M13o91K30M31l71M03l04
$$ -127 229 37 72 -88 296 -377 60 -104 1 448 128 -293 24 437 -254 -24 407 36 439 135
6604A35k84j24L68M73n91k01L01K93j86rj27J45l0j9j38k21L02k62M11l62m97
$$ 135 -149 -273 95 568 -23 -224 77 370 184 175 48 193 163 144 6 -215 87 -175 236 -126 -623
6625f23P14N0j100R32K88l20m07J61J21m7l3L66j95Q8K83l40j46L32m44M39L41
$$ -623 91 141 -959 -27 261 -59 -466 -305 -184 -231 -264 102 -93 -5 278 -62 -208 124 -320 119 460
6646D60q5l23K36j316J552l92j5n65J02M36L34r93J13N31l72O48O8j050J544k73
$$ 460 375 52 288 -1028 524 132 117 -448 -346 90 424 -569 -456 75 -297 351 419 -631 913 640
6666F40l77p53L23j49M50j04m89N28k10N16j86l43r1M24k54J45l37L81k83j59
$$ 640 263 -490 -167 -316 134 30 -459 69 -141 375 189 -154 -245 179 -75 70 -267 114 -169 -328
6686c28J85J69k94J86k9j59J26J24J16k94K86R1l75n4J28q9L09k7n7J86j2m46
$$ -328 -143 26 -268 -82 -111 -270 -144 -20 96 -198 88 179 -196 -250 -122 -211 98 71 14 200 188 -258
6708b58J31K58j97K20L79n29r5J2J25j85L1M4J36k17L53k61JJ47J93l98L34k61
$$ -258 -127 131 -66 154 533 4 -91 -79 46 -139 -108 -64 72 -145 208 -53 -52 95 288 -110 224 -37
6730c7j99M90l57M2P9J64m58J00J33K5l01M50j60j26K69j03k0J71k79K82R6j70
$$ -37 -236 254 -103 -61 18 182 -276 -176 -43 -18 -319 131 -29 -155 114 11 -9 162 -117 165 261 91
6752I1k79L34j52M6m3K0j98M34k7k81PJ65Q3j67p8J80Q8m46Q8O1J56l0L7l28L49
$$ 91 -188 146 -6 40 -3 17 -181 253 226 -55 -48 117 200 33 -45 135 223 -223 -135 -74 82 52 89 -239 110
6777A10l9l33J54J58m51M16k1J98k67K66l83J11L01j00J24j43j63j56K07M2r9
$$ 110 71 -262 -108 50 -401 15 -6 192 -75 191 -192 -81 220 120 244 101 -62 -218 -11 31 -68
6798f8L57j39l09J96J01l71R8J35J37q2R1m30M64pk70j35L67K56l87J48j42k12
$$ -68 289 150 -159 37 138 -233 -135 0 137 55 146 -284 180 173 -97 -232 135 391 4 152 10 -202
6820b02KK46K18l93K27j43k01K82n4k87M43j85l51L45J40J54m04K08k59M47k81
$$ -202 -200 46 264 -129 98 -45 -246 36 -18 -305 138 -47 -398 -53 87 241 -163 45 -214 233 -48
6841d8R7l24J88J01j18J81J04k79J20P6k27J00K43j7l30L52k77M8j40J96j62m2
$$ -48 49 -275 -87 14 -104 77 181 -98 22 98 -129 -29 214 197 -133 219 -58 -10 -150 46 -116 -158
6863a58K70j36l7j6K18k14rJ72l24n8M86m05oM27l41J2K24k09m2L28l77J94M6
$$ -158 112 -24 -61 -77 141 -73 -82 90 -234 -292 194 -211 -217 210 -131 -119 105 -104 -146 182 -195 -1 45
6886D5J28Q7k85L10l72J47J07p7j03K51j20k26O79n06j23K90n6k05k7N23o81L39
$$ 45 173 260 -25 285 -87 60 167 90 -13 238 118 -108 571 65 -58 232 176 -29 -56 467 -214 125
6908A25J4j88l0J90j26q7J52J36m05J21J45j46K0J18l65J46L51m55j42M83l60
$$ 125 139 -49 -79 111 -15 -102 50 186 -219 -98 47 -99 -79 39 -326 -180 171 -284 -426 57 -303
6929c03j30L93j76l7K95j9k98K55l9p7J31K62l58J66L68l83j58K62j99k75K68
$$ -303 -433 -40 -216 -253 42 23 -275 -20 -59 -136 -5 257 -101 65 433 50 -108 154 -45 -320 -52
6950e2L84n31K38M12m55J94k24r4R2L06j26k01Q3J55l02J38K4l92L23J26l10J92
$$ -52 332 -199 39 451 -4 190 -34 -128 -36 270 144 -57 26 181 -121 17 41 -351 -28 98 -212 -20
6972b0j08J07j47Q0J67l32K40K89m56k5Kk23L30O6J98n39L91k90j12M36K5K69
$$ -20 -128 -21 -168 -88 79 -253 -13 276 -180 -205 -203 -426 -96 -30 168 -371 20 -270 -382 54 79 348
6994C48l37J82m20L88J76m41M16M03l22K69n13L77m00J79J32l77J41k22M31n3
$$ 348 11 193 -227 161 337 -104 312 715 393 662 149 526 126 305 437 60 201 -21 410 357
7014C57K77j133N32O48p57r17Q77L76K00J59r14k92J275o62m80N15m65M86j16
$$ 357 634 -499 33 681 -76 -993 -116 260 460 619 -295 -587 688 26 -454 61 -404 82 -34
7033c4q9O09j128J324j220N42o69J732j626K11m37J593k77n31L0m07Q56k26N95
$$ -34 -123 486 -642 682 -538 4 -665 1067 -559 -348 -785 808 531 0 30 -377 479 253 848
7052H48j032J85K68o76P35K98j030J073k232J259Q63q10J22l72N66L34j170M24
$$ 848 -184 1 269 -407 328 626 -404 669 -1563 -304 559 -251 -129 -501 65 399 -771 -347
7070c47R88l75ln14l58R72k42j32l00P2m40N88k75j26M82m66M4J18k34O02n9O27
$$ -347 641 266 263 -251 -609 363 121 -11 -311 -239 -679 -91 -366 -492 -10 -476 -432 -314 -548 54 -5 622
7092F22p05j12k19R00m44J55k75q6N21K67r76M12M15p77m44J042l73J36L29j27
$$ 622 -83 -195 -414 486 42 197 -78 -164 357 624 -352 60 475 -302 -746 296 -77 59 388 261
7112B61k46j37J89rqL41l38l63k00M1R33n36l81k86L68M40k0m4m28K10Q1j83N49
$$ 261 15 -122 67 58 50 391 53 -310 -510 -469 464 -72 -453 -739 -371 69 49 5 -423 -213 -132 -315 234
7135B34m08l8J44j83M75q21Q57K34q26M58K62n79K40K29N44l25n56R0k0Q8k45
$$ 234 -174 -212 -68 -251 224 -597 260 494 -332 126 388 -191 49 278 822 497 -59 31 11 99 -146
7156a46M51O9k21R5k90J41K31j34l15J58l39N30k73J1K42K07m16J5J1L83n53j68
$$ -146 305 374 153 248 -42 99 330 196 -119 39 -300 230 -43 -32 210 417 1 16 27 410 -143 -311
7178c11L27L77l90L89n58k60N77j95K6J84q0l91M60l8m9l86J49J45K43k35L4k76
$$ -311 16 393 3 392 -166 -426 151 -44 -18 166 86 -305 155 117 68 -318 -169 -24 219 -16 18 -258
7200b58K64k60J07J67L6j73J54n8j33K82k20J73q5Q6r7J73kok59L2P4o4J1R5J98
$$ -258 6 -254 -147 20 56 -117 37 -21 -154 128 -92 81 -4 82 -15 158 156 150 -109 -77 -3 -67 -56 39 237
7225B37l34L7j45L0R8pR6l1o1l3K12k05j20L31Rk65j08J73J73j25L93q6j69L9
$$ 237 -97 -60 -205 -175 -77 -84 12 -19 -80 -113 99 -106 -226 105 114 -151 -259 -86 87 -38 355 269 100 139
7249A39m05K62j26O7RL59k32M1j71P7R0k17J95k4j77N8P0j09J66j42m0J54K35
$$ 139 -266 -4 -130 -63 -54 305 73 114 -57 20 110 -107 88 64 -113 -55 15 -94 72 -70 -110 44 279
7272B79k48j28J35j89j14L53m4LL8k65J64j63J62J8J06LR0n18O38j81Rm8k23K12
$$ 279 31 -97 38 -151 -265 88 44 47 85 -180 -16 -179 -17 1 107 110 200 -318 320 139 148 100 -123 89
7296H9oN46p24J15J9J05n70J87L40q5j25k18N26m69R60l00m78N17j368J198j76
$$ 89 83 629 -95 20 39 144 -426 -239 101 16 -109 -327 199 -270 690 390 -88 429 -939 259 83
7317H3l61R17j202L82j214J081M54l66M01m14R52j469K89R74N92j651N52L54j064
$$ 83 -278 639 -563 -181 -1395 -314 140 -226 175 -239 713 -756 -467 507 1099 -552 0 354 -710
7336g10M79O8qM43l11j1n07O70m07N5k23O46J00j93R51j647M51MP13m12l87l1
$$ -710 -231 -163 -171 272 -39 -50 -557 113 -294 -239 -462 184 284 91 1042 -605 -154 -150 563 151 -236 -267
7358b67P72o28r7M87q50q4N68L30p53M10k19N51J74k41o98M40K16l33J011o06
$$ -267 505 -123 -220 267 -583 -667 -99 231 -522 -112 -331 220 394 153 -545 -105 111 -222 789 183
7378A83p68J92N72o0n8n71K33L50K26o97O25o45O41o59M42J72m60K74k47O53m41
$$ 183 -585 -393 179 119 61 -510 -277 73 299 -398 227 -418 223 -436 6 178 -282 -8 -255 398 -43
7399d3m3J4L40m43N80p89p1N98J57q18l6Q63l65k29K00j57K15m55J72K8L71k71
$$ -43 -86 -72 268 -175 405 -384 -455 143 300 -518 -554 309 -56 -285 -85 -242 -27 -482 -310 -282 89 -182
7421a82m0l0r1K09J95k21j43L30k08L5K00J51k60M19m44K28j09J32k01J10j2j2
$$ -182 -222 -252 -343 -134 61 -160 -303 27 -181 -146 54 205 -55 364 -80 148 39 171 -30 80 68 56
7443E6J13J73k90j24K87k37PJ81ol04K51j00K68m07L43j22o2J38J39l85K69j24
$$ 56 169 342 52 -72 215 -22 -15 166 160 -144 107 7 275 -132 211 89 27 165 304 -81 188 64
7465F4l07K03K08k81K48j41j18K49j90Lk71O5k55J28K87L1j25R7L54l17LJ65l79
$$ 64 -243 -40 168 -113 135 -6 -124 125 -65 -62 -333 -268 -523 -395 -108 -77 -202 -105 249 -68 -65 100 -279
7488b79M06M8k43k96N32m03j2N88m65M7j55L09j93J93k30K11p2L46j37j41j02
$$ -279 127 175 -68 -364 168 -235 -247 341 -124 -77 -232 77 -116 77 -153 58 -14 332 195 54 -48
7509d8K95k30k72Q91p10L24n71M19N6kn96L85J16m19J59L7r9J34J15j10k28L63
$$ -48 247 17 -255 636 -74 250 -321 98 154 152 -444 -59 57 -362 -203 -166 -265 -131 -16 -126 -354 9
7531IL9l78K83J91N4j79j64L56k27J90k77K14Qk80p2L24j36j10R4K09p9j30L06
$$ 9 48 -330 -47 144 198 19 -145 211 -16 174 -103 111 119 -161 -233 91 -45 -155 -61 148 69 -61 245
7554B45k83L04k43J53j8J73L7m05K43k49J68N9l42M1j76K31N06n84J91q5j32n2
$$ 245 -38 266 23 176 158 331 368 -37 206 -43 125 184 -158 -117 -293 -62 444 -140 51 -34 -166 -218
7576b18K27r0k65K64p1K16J65m24J51K62j89J14l34N16n62L94k81L97K2n64O47
$$ -218 9 -81 -346 -82 -153 63 228 -196 -45 217 28 142 -192 324 -238 156 -125 272 294 -270 377
7597C77n77L79m33N6L40K65l23O3N10m44o89L45J84R0J43r49J135n25N47n41n76
$$ 377 -200 179 -254 -198 142 407 84 147 657 213 -476 -131 53 143 286 -663 472 -53 494 -47 -623
7618f23Q26j8j81J19J22l07K06k28L79N63p29k74L44j91j49O22m67j24j48O46
$$ -623 203 185 4 123 245 -62 144 -84 295 858 129 -145 199 8 -141 481 14 -110 -258 388
7638C88J32j021R6L75o40J46R52J87j9r4m12j98L44J40l42k2mj07J35N2k20J38
$$ 388 520 -501 -405 -30 -670 -524 428 615 596 502 90 -108 236 376 34 12 8 -99 36 88 -132 6
7660Fk16J90J28J1j93O3m3k27J67K07k60p4K26p4J2K16L6j10J38k3l94l7K29J
$$ 6 -210 -20 108 119 -74 -11 -54 -281 -114 93 -167 -241 -15 -89 -77 139 175 65 203 180 -214 -251 -22 -21
7684b1M3j57k05L37J21m34J38K32r5K12m0m0N5j50N7o8R5q1j3j64L53m8l0qj65
$$ -21 22 -135 -340 -3 118 -316 -178 54 -41 171 131 91 146 -4 53 -15 80 -1 -14 -178 175 127 97 89 -76
7709g6L47M0l63J02p3J34l57J39J93k33L0k3j65J09K91oj46m1P2J1N9q2Q2k11
$$ -76 271 311 -52 50 -23 111 -246 -107 86 -147 -117 -140 -305 -196 95 89 -57 -98 -26 -15 44 -38 44 -167
7733a67J64j50J59L42k66k32O07p22J04m6J25j86J2K87j51k6J91P9l72L24k25
$$ -167 -3 -153 6 348 82 -150 457 -265 -161 -207 -82 -268 -256 31 -120 -146 45 124 -248 76 -149
7754a49M05j78P2m99N42r8k21M21j68p4j87O4j29N00m93K9r5J01M4N4J11N1k70
$$ -149 256 78 150 -349 193 95 -126 295 127 53 -134 -70 -199 301 -192 -163 -258 -157 -113 -59 52 103 -167
7777a67J99N2l2k2K47l14J71m0j11p1N1K72l92K65l10K13j14J95j55K51L08o64
$$ -167 32 84 52 30 277 -37 134 94 -17 -88 -37 235 -157 108 -202 11 -103 92 -63 188 496 -168
7799a68R8M1L25n36L78o81K41n1k51J110q00P83n6l76l26K91m75M22K25k03j61
$$ -168 -70 -29 296 -240 138 -543 -302 -353 -604 506 -294 489 433 57 -269 22 -453 -31 194 -9 -170
7820a70K23k60L04K59m18Q5k13K03RK00l29K71JL9k64J7K26k69J79K85m86M8M4
$$ -170 53 -207 97 356 -62 23 -190 13 22 222 -107 164 165 204 -60 -43 183 -86 93 378 -108 -60 -16
7843a6J68j94J66Oj98L49o32K29J62J54j69l17L72k32J15n2p3J31q0m3J36j19
$$ -16 152 -42 124 130 -68 281 -351 -122 40 194 25 -292 80 -152 -37 -89 -162 -31 -111 -154 -18 -137
7865a37J72m0O8K0j20R2j40j46K88j75k2K20k79K96n3K0J00R3j63k73J84J14K36
$$ -137 35 -5 63 83 -37 55 -85 -231 57 -118 -140 80 -199 97 44 64 164 257 94 -179 5 119 355
7888C55k26j9l9l4M7j22o5J00R8p4N8k5k2p6k94L64R7l20K08P5o2n5p3o4J68m7
$$ 355 129 110 71 37 84 -38 -103 -3 95 21 79 54 32 -44 -338 26 123 -197 11 86 24 -31 -104 -168 0 -47
7914d7k01J77qk78L82K65j81m8r9j02J35j03p9K27Pk11J09O7J51j18j76J96j46
$$ -47 -248 -71 -79 -357 25 290 109 61 -38 -140 -5 -108 -187 40 47 -164 -55 12 163 45 -131 65 -81
7937h1p0P1J15M6K54m80L4K92k78P7jP9k31L46j60K07m30J53M1j10R0L5R1Q2N
$$ -81 -151 -80 35 81 335 -145 -111 181 -97 -20 -21 58 -173 173 13 220 -210 -57 -16 -126 -36 -1 90 172 177
7962A77l25K1R3j44J65J17O4r6k42L16m32M23J65o10K95j67K58j15J85l8k67J90
$$ 177 -148 -127 -34 -178 -13 104 168 72 -170 146 -286 137 302 -308 -13 -180 78 -37 148 110 -157 33
7984C3R5l93K92Q6R1q12Q54m9l55M49k00J31M9l16O3J05j40j55J40N7k54L74K57
$$ 33 128 -265 27 113 204 -608 246 197 -158 291 91 222 271 -45 18 123 -17 -172 -32 25 -229 145 402
8007D02m72o5J75Pj92J93J15%j19J17l61O4L7j28M38k75K0rK19n0j86K6J91m8
$$ 402 -70 -135 40 47 -145 48 163 163 44 161 -200 -136 -99 -227 211 -64 -44 -53 166 116 -70 -44 147 99
8031I9j52nK56J03m67Q6K54j53k50J71K02J9m31M21j75K17l30L41r8k73j42K5
$$ 99 -53 -58 198 301 -166 -80 174 21 -229 -58 144 163 -268 153 -22 195 -135 206 108 -165 -307 -282
8053b82N49K31n62lK02j39J09p6l30M59n05M9K95j15K5K73q3k56J12k94n57P74
$$ -282 267 498 -64 -67 135 -4 105 29 -301 158 -347 -298 -3 -118 -93 180 97 -159 -47 -341 -898 -124
8075a24j7L04q88K52P29N74j435L23j7L09j32q59R75l33N78p69K06M97L3r6k08
$$ -124 -141 163 -725 -473 256 830 -605 -282 -299 10 -122 -981 -6 -339 239 -530 -324 173 206 110 -98
8096i8K89n96R6N76l81M25k54j5k20L39q5n4m4K52l41P2j15j09q3L28k43K71M3
$$ -98 191 -405 -309 267 -114 311 57 42 -178 161 76 22 -22 230 -111 -39 -154 -263 -346 -18 -261 10 53
8119E3Q6k28K89j40j74M94m81L57j42n9o1n2N2j35J45k11L33O05j207J05k28P42
$$ 53 139 -89 200 60 -114 380 -101 256 114 55 -6 -58 -6 -141 4 -207 126 731 -476 -371 -599 143
8141A43k43M17k57J3p6j85Q1K3J5Pj2n5K85k49R7K9K43l09K01l4j71J20k37J40
$$ 143 -100 317 60 73 -3 -188 -107 -84 -69 -62 -74 -129 156 -93 4 33 276 -33 168 134 -37 83 -154 -14
8165a4K99l76K03j43L00o8m15N01l13J4m26M97ko1j25L6L97l42j22J40P0L7j85
$$ -14 285 -91 112 -31 269 201 -214 287 -26 -12 -438 59 57 -4 -129 -93 304 -38 -160 -20 50 87 -98
8188i8l52N12j74
$$ -98 -450 62 -112
8191a12
$$ Imaginary data points
##PAGE= N=2
##DATA TABLE= (X++(I..I)), XYDATA
0@%%%%%%QqKkQj6K0k8L2l7M8n9P2q8J04j25J51j78K06k39K79l24L73m27M86n52
$$ 0 0 0 0 0 0 0 8 0 2 0 8 -8 12 -16 16 -21 27 -32 40 -48 56 -69 82 -96 110 -129 150 -174 199 -228 258 -294
32b94O28p13Q04r01J010j134J270j415J572j744J932k139K368k616K884l178L503
$$ -294 334 -379 425 -476 534 -600 670 -745 827 -917 1015 -1124 1244 -1372 1512 -1666 1837
49A837l862M253m683N161n700O303o979P753q646R686j0917J2401j4226J6536
$$ 1837 -2025 2228 -2455 2706 -2994 3309 -3670 4083 -4563 5123 -5794 6607 -7619 8917
63H917j9571K3746k9855L9649n7785J01971l95469n04549Q26339k37083m92288
$$ 8917 -10654 13092 -16763 22886 -34899 67072 -328397 -832946 -6607 -243690 -735978
74g35978L92591J81376k25478J78405j17929k98207M17136K03207o38575K78736
$$ -735978 -343387 -162011 -387489 -209084 -327013 -625220 -208084 -4877 -643452 -364716
84c64716Q39616m33972l66112O83034j3439m22509J99283r955j24611L47290q4667
$$ -364716 474900 40928 -325184 357850 344411 -78098 121185 111230 -13381 333909 249242
95B49242l87006M17077L11249p09746j40683O36588k96117m69826M29967Q6857
$$ 249242 -137764 279313 590562 -119184 -259867 376721 80604 -389222 40745 127602
105A27602k03011K41707j09301j94332M02382m7025n32526K96131M99331m39707
$$ 127602 -75409 166298 56997 -137335 265047 218022 -314504 -18373 480958 41251
115D1251k03692N78235m5664l83300K05630n1279k06234K45054j85302l25131
$$ 41251 -162441 415794 370130 -13170 192460 141181 -65053 180001 -5301 -330432
125c30432M28903J07760n73560O2320M28070l38055l41894L24246K3950k09193
$$ -330432 98471 206231 -367329 -305009 123061 -214994 -556888 -232642 -208692 -417885
135d17885K17494l3726j17938L89365o5015l90993L70263K82731m03876J1980
$$ -417885 -200391 -234117 -352055 37310 -27705 -418698 -48435 234296 -169580 -157600
145a57600M45795n9095j82293K16985J8165j24792J73293j25338k31331L42303
$$ -157600 288195 229100 46807 263792 281957 157165 330458 205120 -26211 316092
155C16092K6332m33273J87729K75941l31402j41750K06644q0581j51798R4059
$$ 316092 342424 -90849 96880 372821 41419 -100331 106313 25732 -126066 -32007
165c2007m9488p6545K25710o1036k63296K75738J36208l69797O6030K75724j60988
$$ -32007 -81495 -158040 67670 6634 -256662 19076 155284 -214513 -148483 127241 -33747
176c3747p1433J64032k7761l9253R6190r9027j20029J92655j9091k90000J62222
$$ -33747 -105180 58852 31091 -8162 88028 -10999 -131028 61627 42536 -247464 -85242
187h5242J92571k67520j9107J96099j18003n9501Q6306p0993j436J37664n0783
$$ -85242 107329 -160191 -179298 16801 -101202 -160703 -74397 -145390 -146826 -9162 -59945
198e9945r2787K01115Q8492k12684Q0072J99910j52959k4490J56466o2077M870
$$ -59945 -152732 48383 136875 -75809 4263 204173 51214 26724 183190 121113 125983
209A25983R7423q9607k4405J09041o9246j47079Q0454O7258j72876j4996J27360
$$ 125983 223406 133799 109394 218435 149189 2110 82564 149822 -23054 -38050 89310
220H9310j09311n3570P6032r7855k3377P8799r2744l3807J17743l209q1908N9964
$$ 89310 -20001 -73571 2461 -95394 -118771 -39972 -132716 -166523 -48780 -51989 -133897 -73933
232g3933Q5382p8378k1754R7398m5178j5010R2606n1943k676J01432o0864n1276
$$ -73933 11449 -66929 -88683 8715 -36463 -51473 41133 -10810 -13486 87946 27082 -24194
244b4194P2905r097o9121J2017M9131l3791k3137N7662l0393k9270O0469n2912
$$ -24194 48711 39614 -29507 -17490 31641 -2150 -25287 32375 1982 -27288 33181 -19731
256a9731l3435Q2534k9400l4675O8015J1691k3499J0174K0337j1869k2099K8269
$$ -19731 -53166 29368 -32 -34707 33308 44999 21500 31674 52011 40142 18043 46312
268D6312j0569k4377N2819j9513l9585N2058k5795m9208K3619j7210k2717L831
$$ 46312 35743 11366 64185 44672 5087 57145 31350 -17858 5761 -11449 -34166 -30335
280c0335j681L686j1755R330N77l1377K3274j203l3847M1139O635j5280L8216
$$ -30335 -32016 -28330 -40085 -30755 -30178 -61555 -38281 -39484 -73331 -32192 -25557 -40837 -2621
293b621N81k724J6167j0218P390p47j97K0903j1332J4530J7596k6680J4340j493
$$ -2621 -2040 -4764 11403 1185 8575 7828 7631 28534 17202 31732 49328 22648 36988 35495
307C5495k8020J4490r845r748J7205j2489N145L605j9947R766j6708j3574J4982
$$ 35495 7475 21965 12120 2372 19577 7088 12233 15838 -4109 5657 -11051 -24625 -9643
320i643j9064O962J4531j6505J7116j606j5173J5469j5235p66J5846j2608J8846
$$ -9643 -28707 -21745 -7214 -23719 -6603 -8209 -23382 -7913 -23148 -23914 -8068 -20676 -1830
333a830R346q456K1667r061m708J4893j8566J0482R105j2567K1685l157r032J4725
$$ -1830 7516 -940 20727 11666 6958 21851 3285 13767 22872 10305 31990 28833 19801 34526
347C4526j9469m093K811k0387J1077o088q376J7942j8340p04R377k7126Q297J952
$$ 34526 15057 10964 13775 -6612 4465 -1623 -9999 7943 -10397 -11101 -1724 -28850 -20553 -18601
361a8601j7228J9139N57k630J4001n451Q442m572q535J9372j6409N82K5695k1154
$$ -18601 -35829 -16690 -16133 -18763 -4762 -10213 -1771 -6343 -14878 4494 -11915 -11333 14362 -6792
375f792P804J7746k8431O244O169k0985P46K397L990n521l688K3931j5737p002
$$ -6792 1012 18758 -9673 -3429 2740 -18245 -17499 -15102 -11112 -16633 -20321 3610 -12127 -19129
389a9129K9604k5113J976L8691k6160Q425M1408j5140m284K0963N166j3274m678
$$ -19129 10475 -14638 -12662 26029 -131 8294 49702 34562 30278 51241 56407 43133 38455
402C8455K1344j6258j0969L0606l4563j6052L9601m9173l2863L9667k7906l8599
$$ 38455 59799 43541 32572 63178 28615 12563 52164 2991 -29872 9795 -18111 -56710
414e6710J8643K946k3784m176J6292k1809o975L9395l4598j3208P7140k4100l7251
$$ -56710 -38067 -35121 -58905 -63081 -46789 -68598 -75573 -36178 -70776 -83984 -6844 -30944 -68195
427f8195P7078P156m0056L5941J9440k0601J3910K2273k6953M396N4043m8695
$$ -68195 8883 16039 -24017 11924 31364 10763 24673 46946 19993 24389 78432 29737
439B9737m0569Q2784k6521q1578O2260J2983o2713K8106J3649l7599K5173K1269
$$ 29737 -10832 71952 45431 -36147 26113 39096 -23617 4489 18138 -19461 5712 26981
451B6981n4695M671P8370m7578n9452J03832J0509r0263N9312L1271o2748L3318
$$ 26981 -27714 -23043 55327 7749 -51703 52129 62638 -27625 31687 62958 210 33528
463C3528Q295o1869L9696L5683q7087j7002R2485m8417j00189P8455K1464r9891
$$ 33528 41823 -20046 19650 55333 -31754 -48756 43729 -4688 -104877 -26422 -4958 -104849
475a04849L6913K6726o1875N2216K0588q6305N6247Q4521q7474k7547J27063J271
$$ -104849 -67936 -41210 -103085 -50869 -30281 -116586 -60339 24182 -63292 -90839 36224 37495
487C7495r0135P8714N9203o9785M3806K8595p3795P5123M1816j29450L1895J18719
$$ 37495 -52640 26074 85277 15492 59298 87893 14098 89221 131037 1587 33482 152201
499A52201r8397q4350J07030P049j13161L1673L2251p4914M4413J3267j14401
$$ 152201 53804 -30546 76484 83533 -29628 2045 34296 -40618 3795 17062 -97339
510i7339P7682Q6031j55363q301J58145o2487r9621R7619L8752p4054L7191K1736
$$ -97339 -19657 66374 -88989 -97290 60855 -1632 -101253 -3634 35118 -38936 -1745 19991
522A9991o7210P6584L1367j51454O0497J36976j50394o4148J53548k9674j07244
$$ 19991 -47219 29365 60732 -90722 -30225 106751 -43643 -107791 45757 16083 -91161
533i1161N8452K0051n5098M7406k043q9375R7711P8314j64990K3384J86643r9728
$$ -91161 -32709 -12658 -67756 -20350 -22393 -111768 -14057 64257 -100733 -77349 109294 9566
545I566r0259J43038J3017o9854N9138N52l9290Q7823l310j32433Q3743J17111
$$ 9566 -80693 62345 75362 5508 64646 65198 25908 113731 110421 -22012 61731 178842
557A78842j73821n0540J74632o6365j22940Q7610p890o4452N4322m5208p7535
$$ 178842 5021 -45519 129113 62748 -60192 27418 19528 -44924 9398 -35810 -113345
568a13345J11677J9302j67703N2892J62791j29316q5415J61939q874q8345Q0970
$$ -113345 -1668 17634 -150069 -97177 65614 -63702 -149117 12822 3948 -84397 -3427
579c427j0629l5725J06660l5948j09977J28343P4314j70663j425J67451p6106
$$ -3427 -14056 -49781 56879 20931 -89046 39297 113611 -57052 -58477 108974 32868
590C2868j06833J07608r06o6649O9021m4227o3350J31123j5140j52755R9597J18009
$$ 32868 -73965 33643 32737 -33912 35109 -9118 -72468 58655 43515 -109240 -9643 108366
602A08366j37705m2395J46955k2188q2148P5071n589m0155R4950m7506r7774J40541
$$ 108366 -29339 -71734 75221 53033 -29115 45956 40367 212 95162 47656 -50118 90423
614I0423K8047j73668M5106J25794j05700p2391R0220j6390n9930M8777m2076
$$ 90423 118470 -55198 -10092 115702 10002 -62389 27831 11441 -48489 288 -41788
625d1788n1160J10094l6678j38201J20659P8649j54271Q896J28444n1213m6529
$$ -41788 -92948 17146 -19532 -157733 -37074 41575 -112696 -103800 24644 -26569 -73098
636g3098O8013q150j6990P4382m1664o1294J32473J1863j49382Q0452J08120j20463
$$ -73098 -5085 -13235 -30225 44157 2493 -58801 73672 85535 -63847 16605 124725 4262
648D262k4916R1644l7183l1744M1462m0478k0160Q0669m4970r6470J05682M5822
$$ 4262 -20654 70990 33807 2063 43525 3047 -17113 63556 18586 -77884 27798 73620
660G3620j41966K8878J05145p5401k6239O4807l1836l916N0444n1729k6583R3468
$$ 73620 -68346 -39468 65677 -9724 -35963 28844 -2992 -6908 43536 -8193 -34776 58692
672E8692j6065j05230P1033P0394j10192o812Q1384n4285k0454M2299m9702j569
$$ 58692 42627 -62603 8430 78824 -31368 -38180 43204 -11081 -31535 10764 -38938 -40507
684d0507O1145n6056m6694Q6055J0772r7550L7536P6203o6196j2079O6576l3642
$$ -40507 20638 -35418 -82112 3943 14715 -82835 -45299 30904 -35292 -47371 19205 -14437
696a4437J087N2059m9140l438P9446l5439n7313P0416K9656p4881R137N8446m4434
$$ -14437 -13350 38709 -10431 -13869 65577 30138 -27175 43241 72897 -1984 7153 65599 21165
709B1165j7128L8760m0264n608M8565n5448k6159O8797k1091o2307M0083L1433
$$ 21165 4037 42797 2533 -3075 45490 -9958 -36117 32680 11589 -50718 -10635 20798
721B0798n0442l238L8456k4028n917L6063l4486n000N7655l5883l3951O0238j188
$$ 20798 -29644 -32882 5574 -18454 -24371 11692 -22794 -27794 29861 -6022 -39973 20265 19077
734A9077m7288K5425K3672k7603l360K2175k0228l860K9741l1017j6651N0790
$$ 19077 -28211 -2786 20886 -6717 -10077 12098 -8130 -11990 17751 -13266 -29917 20873
746B0873j9833l9108M2967Q507l4678J5463J6199j7102M822J5371j4259j513L0248
$$ 20873 1040 -38068 4899 13406 -21272 -5809 10390 -6712 -1890 13481 -778 -2291 27957
759B7957j7787k1805M1124m247l5684K9332O714k6047J1880N485j5821L811O810
$$ 27957 10170 -11635 29489 25242 -10442 18890 25604 -443 11437 16922 1101 4912 11722
772A1722j4919o698J9319r751k3485K4163L296k8341J6547P781j8995J1622M448
$$ 11722 -3197 -9895 9424 -327 -23812 351 3647 -24694 -8147 -366 -19361 -7739 -3291
785c291j2443Q103P475m901n157J4427J449j6260J3643Q605j7891J0242P972j5445
$$ -3291 -15734 -7631 -156 -5057 -10214 4213 5662 -10598 3045 11650 -6241 4001 11973 -3472
799c472R294M897j2303O278K482m665l753L013N462j0758J714Q471j2403K727
$$ -3472 5822 10719 -1584 4694 7176 2511 -1242 1771 7233 -3525 -1811 6660 -5743 -3016
813c016Q264j3107N403M019r253M262K475l431K764k174K819j947l309Q501o010
$$ -3016 5248 -7859 -2456 1563 -7690 -3428 -953 -4384 -1620 -3794 -975 -2922 -6231 2270 -3740
828c740k4Q464o251J717N168o420N610J618l638K740k156P74J733m887M856k422
$$ -3740 -3764 4700 -1551 166 5334 -1086 4524 6142 2504 5244 3088 3862 5595 708 5564 3142
844C142l405P668o288j678M626o265K523L57l929N523l774j397L619m174K942
$$ 3142 -263 7405 1117 -561 4065 -2200 323 680 -3249 2274 -1500 -2897 722 -3452 -510
859e10J878m688N988o94m644P034n975J447L180o122M510j153l644L992n309m74
$$ -510 1368 -3320 2668 1974 -2670 4364 -1611 -164 3016 -3106 1404 251 -3393 599 -4710 -5184
875e184L221p263N119j221m880P359m453j003P055m956K007M917l068M594K314
$$ -5184 -1963 -9226 -4107 -5328 -10208 -2849 -7302 -8305 -1250 -6206 -4199 718 -2350 2244 4558
890D558p23N733k780M954O94l415Q301l439n800R474o550l507O280q472k575O78
$$ 4558 3835 9568 6788 11742 12436 9021 17322 13883 8083 17557 11007 7500 13780 5308 2733 3411
906C411l698k250l600O32l164q053J0021m317r800J2796k910q477J1978j402l336
$$ 3411 -287 -2537 -6137 -5505 -8669 -16722 -6701 -11018 -20818 -8022 -10932 -19409 -7431 -8833 -12169
921a2169P763O90j415K621P094k060n976J3067j227j2825J3776Q05j3429J1397
$$ -12169 -4406 -3716 -5131 -2510 4584 2524 -3452 9615 8388 -4437 9339 10144 -3285 8112
935H112p91j2101R508M84j0429K612Q716o959r041J5916J625j7018J5165O007
$$ 8112 7321 -4780 4728 5212 -5217 -2605 6111 -848 -9889 6027 7652 -9366 5799 11806
949A1806j5982J5623M227j6995J5908P592j8001L055J5883j0837j4728J6006J670
$$ 11806 -4176 11447 15674 -1321 14587 22179 4178 7233 23116 12279 -2449 13557 15227
962A5227k3262R755M527k3993J3598L744k8978J3481J4779k7830k016K4242q386
$$ 15227 -8035 1720 6247 -17746 -4148 -404 -29382 -15901 -1122 -28952 -30968 -6726 -15112
975a5112j7182J7719Q303j6717J4186J0905k1515K2407J6667l2549J4631L1643
$$ -15112 -32294 -14575 -6272 -22989 -8803 2102 -19413 2994 19661 -12888 1743 33386
987C3386k7322q896L0563n864j8875J4468M127j9965J4080N463l4420J8737K3028
$$ 33386 6064 -2832 27731 21867 2992 17460 21587 1622 15702 21165 -13255 5482 28510
1000B8510m5511J138M0350k8365j9457L0208l580j7622J6853J084j9555K4036
$$ 28510 -17001 -15863 24487 -3878 -23335 6873 3293 -14329 2524 3608 -15947 8089
1012H089J1235m1373J8614L9988m5879j1181M8457k0580k5580K7513o780j8242
$$ 8089 19324 -22049 -3435 36553 -9326 -20507 27950 7370 -18210 9303 2523 -15719
1024a5719K1563p886l0168K8573J6983n2214P504N1198l8927k3711M8494j0636
$$ -15719 5844 -2042 -32210 -3637 13346 -38868 -31364 19834 -19093 -42804 5690 -4946
1036d946k1448L0653q162j4641L7417k687l7816L4416L4901n0685m609N7664k5570
$$ -4946 -26394 4259 -3903 -18544 18873 16186 -21630 12786 47687 -2998 -7607 50057 24487
1049B4487l1041L9890j0117k2017L1093j9313k9662M2583q02n7068K2452M2481
$$ 24487 -6554 33336 23219 1202 32295 12982 -16680 25903 25101 -31967 -9515 32966
1061C2966m9197k1762N0586j5404k9698L3674j2615j9223M4530j7310m1004N3165
$$ 32966 -16231 -37993 12593 -2811 -32509 1165 -11450 -30673 13857 -3453 -44457 8708
1073H708J8549o1172J4188N3141l3930k5773M2382r235k2148L3346k0145k7034
$$ 8708 27257 -33915 -19727 33414 -516 -26289 16093 6858 -15290 18056 -2089 -29123
1085b9123N4942j1595o0555M7007L3218o0611j903M9749k2221k1830L2075j1050
$$ -29123 25819 14224 -46331 676 33894 -26717 -28620 21129 -1092 -22922 9153 -1897
1097a897j3941M1922k0601l7312O2471Q161o7978L3445M6678m8642j0419L9096
$$ -1897 -15838 26084 5483 -31829 30642 38803 -29175 4270 50948 2306 -8113 30983
1109C0983j6464j4476K5392k2490j7486M7152j9637n6223N2524K3458p0770J2617
$$ 30983 14519 43 25435 2945 -14541 32611 12974 -43249 9275 32733 -38037 -25420
1121b5420M6241l7159j1685K8829j8787l764L2311k6837k2941N7496k292o1967
$$ -25420 20821 -16338 -28023 806 -17981 -21745 10566 -16271 -39212 18284 15992 -45975
1133d5975M2433M1804n7435K993M3159k7039l550K5816k7604j748M1463k8454
$$ -45975 -3542 38262 -19173 -16180 26979 -60 -3610 22206 -5398 -7146 34317 5863
1145E863l6797N3215J1232o4371K2053M3261m4935m425L2065k6737K528K8726
$$ 5863 -30934 22281 33513 -30858 -8805 34456 -10479 -14904 17161 -9576 -7048 21678
1157B1678l5286p197N0387j9338m4935M3434K5222n2621O822L9110l0930k767
$$ 21678 -13608 -20805 29582 10244 -34691 8743 33965 -18656 -11834 27276 -3654 -6421
1169f421K5770l0389L441L6314l7173k0467N0384p068m8224K6706K8751l8485
$$ -6421 19349 -11040 -7599 28715 -8458 -28925 21459 14391 -33833 -7127 21624 -16861
1181a6861j419K8438k4028J435K6507l3532r69M5785k8533k8882M5922O372m0413
$$ -16861 -18280 10158 -13870 -12435 14072 -19460 -20429 25356 -3177 -32059 13863 20235 -20178
1194b0178J6073K5737k4558J44K0747k2621L062L0541l3733j2276M7219j8267
$$ -20178 -4105 21632 -2926 -2782 17965 -4656 -1594 28947 -4786 -17062 30157 11890
1206A1890l5850L4045J0420l2561P772J6557j9092K411J6815k5181K18L3789k7333
$$ 11890 -23960 10085 20505 -12056 -4284 12273 -6819 -4408 12407 -12774 -12556 21233 -6100
1219f100k0720M1872n595l3122K3485J1843k2855P765J0631j6092O355J7330k2849
$$ -6100 -26820 15052 9457 -23665 -180 11663 -11192 -3427 7204 -8888 -2533 14797 -8052
1232h052n058L3795j5811k5759L2347L242k7867J5570Q740j7546R021O839j7330
$$ -8052 -13110 20685 4874 -20885 11462 14704 -13163 2407 11147 -6399 2622 9461 -7869
1245g869N404J7651j9180j0896K8170o365k5049K1266N665k1485J1975N241j5562
$$ -7869 -2465 15186 -3994 -14890 13280 6915 -18134 3132 8797 -12688 -713 4528 -11034
1258a1034J0370P331j7127L234J7517j2414j2305K1016J003j9987J3805O962j6376
$$ -11034 -664 6667 -10460 -7226 10291 -2123 -14428 6588 7591 -12396 1409 8371 -8005
1271h005J0239N328j5925R950Q206j5590M05J4127o510j1963J2226L498j4026
$$ -8005 2234 7562 -8363 1587 9793 -5797 -5392 8735 2225 -9738 2488 5986 -8040
1284h040P659O381j3476Q364O296j4012O934R795j1407j042J1339k436p375O447
$$ -8040 -381 6000 -7476 888 7184 -6828 106 9901 -1506 -2548 8791 6355 -1020 5427
1298E427L923q885M112N077j1005M388O440j3227K267P670r913k450N472l060
$$ 5427 9350 465 4577 9654 -1351 3037 9477 -3750 -1483 6187 -3726 -6176 -704 -3764
1312c764m986K197K045n723J139N072p568K324Q217p967J734Q467m257K63O009
$$ -3764 -8750 -6553 -4508 -10231 -9092 -4020 -11588 -9264 -1047 -9014 -7280 1187 -3070 -2807 3202
1327C202o02j19K232K767j539p28N462m704o06N580o082j682M953n185j237J879
$$ 3202 2600 2481 4713 7480 5941 5213 10675 5971 5365 10945 4863 3181 8134 2949 1712 3591
1343C591l136j203j80n24m63k140K951j250k233M540j552j866N627l122K51L002
$$ 3591 455 -748 -928 -1452 -1915 -4055 -1104 -2354 -4587 -47 -1599 -3465 2162 -960 -709 2293
1359B293j738J142r14k86J050j964L2J72m010J956j505l380K752k570j538K282
$$ 2293 555 1697 783 497 1547 -417 -385 -213 -4223 -2267 -3772 -7152 -4400 -6970 -8508 -6226
1375f226k541J045J406j013K684N8J309L725j253L403K963r05M001R56m94L752
$$ -6226 -8767 -7722 -6316 -7329 -4645 -4587 -3278 447 -806 2597 5560 4655 8656 9612 9118 12870
1391A2870j202j29J821k216K80j217k172L62l997j370k10m757j89r07m430J917
$$ 12870 11668 11539 13360 11144 11424 10207 8035 8397 4400 3030 2820 -1937 -2126 -3033 -7463 -5546
1407e546k247k181K541j734j8J899j150K351R6J470K184j429K822K379l428L660
$$ -5546 -7793 -9974 -7433 -9167 -9185 -7286 -8436 -6085 -5989 -4519 -2335 -3764 -942 1437 -1991 1669
1423A669N47k997L816q95k403J428q21j605j228N17P31l239K131J748m498L581
$$ 1669 2216 -781 3035 2140 -263 1165 344 -1261 -2489 -1972 -1241 -4480 -2349 -601 -5099 -1518
1439a518K298m006M554K420l182M048K884j834J266L274N04k985K343J829o073
$$ -1518 780 -3226 1328 3748 566 4614 7498 5664 6930 10204 10708 7723 10066 11895 5822
1454E822K923J032q400K237K065r223M89K986o316l172K440j232m802K683J567
$$ 5822 8745 9777 1377 3614 5679 -3544 -3055 -69 -6385 -9557 -7117 -8349 -13151 -10468 -8901
1469h901o163M825M930q301M649Q395p608K435R072l358r60O430K93l403N738
$$ -8901 -15064 -10239 -5309 -13610 -8961 -566 -8174 -5739 3333 -25 -985 5445 5738 2335 8073
1484H073J718p777M915O157j1900J093R450j0462l411R560o594l903P090l353
$$ 8073 9791 2014 6929 13086 1186 2279 11729 1267 -2144 7416 822 -3081 4009 656
1498F56n376O181K291j0388O312R358j2828Q6J4401q806m620J2085o176m629J0245
$$ 656 -4720 1461 3752 -6636 -324 9034 -3794 -3708 10693 1887 -2733 9352 3176 -1453 8792
1513H792n068q957R739J543j4593L858J1457j4901m659J4149q731o926J2144o740
$$ 8792 3724 -5233 4506 6049 -8544 -4686 6771 -8130 -12789 1360 -7371 -14297 -2153 -8893
1527h893o991J4889l559j2295J4038P285j5082M081J6210j0345m408J6633o724
$$ -8893 -15884 -995 -4554 -16849 -2811 4474 -10608 -6527 9683 -662 -5070 11563 4839
1540D839n335J5762p401r777J8649l475j8018J3236R560j9300p50J3992j0245
$$ 4839 -496 15266 7865 -1912 16737 13262 -4756 8480 18040 -1260 -2010 11982 1737
1553A737p504J3512r027q536J7451q946j5300K1031J209k2209J1470J4504j6364
$$ 1737 -5767 7745 -1282 -9818 7633 -1313 -16613 4418 5627 -16582 -5112 9392 -6972
1566f972j996J5234q113m901J4689q787r536K1717n709k1696K0952P736k4344
$$ -6972 -8968 6266 -1847 -6748 7941 -846 -10382 11335 5626 -16070 4882 12618 -11726
1579a1726O151J5419j5527j793J2899j0676l632J6390j0385j3533K4612n42k5384
$$ -11726 -5575 9844 -5683 -7476 5423 -5253 -8885 7505 -2880 -16413 8199 7657 -17727
1592a7727J8138J4378k2821M418J5971j3704P16J3845j3231l968K1188j0164j9253
$$ -17727 411 14789 -8032 -3614 12357 -1347 -631 13214 -17 -3985 17203 7039 -12214
1605a2214K3247N542k8153J1052J5951k1362R76J3952j5600L97J5204j6255q283
$$ -12214 11033 16575 -11578 -526 15425 -5937 -4961 8991 -6609 -6212 8992 -7263 -15546
1618a5546K4140o276k3596K0371J1382k5058O380J7663j7792K493J4844j6668
$$ -15546 8594 2318 -21278 -907 10475 -14583 -8203 9460 -8332 -5839 9005 -7663
1630g663J002K0859j5759j2241K5398m02k5271J4793J4721k2005L360J4859j7270
$$ -7663 -6661 14198 -1561 -13802 11596 11194 -14077 716 15437 -6568 -3208 11651 -5619
1643e619L082J5831j9983k493K5033j4102j7936K3342M317k3717R680J4112j7966
$$ -5619 -2537 13294 -6689 -9182 15851 1749 -16187 7155 11472 -12245 -2565 11547 -6419
1656f419L141J3681j7885L052J9912k0535p485K6647q223k1199J9422P206j9923
$$ -6419 -3278 10403 -7482 -4430 15482 -5053 -12538 14109 5886 -15313 4109 11315 -8608
1669h608O566J1081j5202L504J3346j9053L45K2773j7274j3073K5379l017k0015
$$ -8608 -2042 9039 -6163 -2659 10687 -8366 -8021 14752 -2522 -15595 9784 6767 -13248
1682a3248J3521Q412j5899N478R161j4643M442J4848j8272l855K4152j1683j6550
$$ -13248 273 8685 -7214 -1736 7425 -7218 -2776 12072 -6200 -10055 14097 2414 -14136
1695a4136K1555J276j8105J0829O186j3602O980P465j5931L622J6816j6442q445
$$ -14136 7419 8695 -9410 1419 7605 -5997 983 8448 -7483 -3861 12955 -3487 -11932
1708a1932K2768o618j7737J6578L094j5782R835M354j3897Q291Q140j6113J654
$$ -11932 10836 4218 -13519 3059 6153 -9629 206 4560 -9337 -1046 7094 -9019 -7365
1721g365J8048j2492j1067J9923j611j5607J3122L743j2713R339M255j3515P733
$$ -7365 10683 -1809 -12876 7047 5436 -10171 2951 6694 -6019 3320 7575 -5940 1793
1734A793J0427j5063j481J6527p773j2151J4142Q66j3654R443K621j2606Q256
$$ 1793 12220 -2843 -4324 12203 4430 -7721 6421 7287 -6367 3076 5697 -6909 1347
1747A347M661j4603N319J0393j1819m421J3566l809j0414J0391J813j0195Q267
$$ 1347 6008 -8595 -3276 7117 -4702 -9123 4443 634 -9780 611 2424 -7771 496
1760D96L452j1645Q196O789j3277L091J1206q944m941J0792j936q338P388J022
$$ 496 3948 -7697 499 7288 -5989 -2898 8308 -636 -5577 5215 3279 -5059 2329 3351
1774C351q793O915L195j1628N581P761j1534M58R949o142m006Q067p17n558O084
$$ 3351 -5442 1473 4668 -6960 -1379 6382 -5152 -4694 5255 -887 -4893 3174 2457 -3101 2983
1789B983J782p236N629M737r669K933Q096q966j509P866m603m346N688j775n159
$$ 2983 4765 -2471 3158 7895 -1774 1159 9255 289 -1220 6646 2043 -2303 3385 1610 -3549
1804c549L502R61o712K194M518p833O1O789n536k345P068l194k003M966l60k383
$$ -3549 -47 914 -5798 -3604 914 -6919 -6858 -69 -5605 -7950 -882 -4076 -6079 -1113 -1473 -3856
1820c856L742K098l840K079M935m285o83O582m178k061N295k665k093L370j146
$$ -3856 -114 1984 -1856 223 5158 873 190 6772 2594 533 5828 3163 1070 4440 3294
1835C294l379K483o41k675J58L207k971k295M077j308k133L522r86j973L320n60
$$ 3294 -85 2398 1757 -918 -760 2447 -524 -2819 1258 -50 -2183 1339 353 -1620 1700 1140
1851A140j531J749R19j413l68K382j919j627K103q46k272K287j245k284J267j147
$$ 1140 -391 1358 2277 864 496 2878 959 -668 1435 589 -1683 604 -641 -2925 -1658 -2805
1867b805j424Q57j98j060l73J547M61j320J578O70p06K740O58r07K344N49q09
$$ -2805 -4229 -3372 -3570 -4630 -5003 -3456 -2995 -4315 -2737 -2067 -2773 -33 625 -282 2062 2611 1802
1884A802J239R13L40m94N46Q45j733K42J034k216K00k08k516Q16n55j511j0o31
$$ 1802 3041 3954 4294 3800 4346 5191 3458 3700 4734 2518 2718 2510 -6 810 255 -1256 -1266 -1897
1902a897o01O40j405J105j086P05J039j228J310J113j136R92J760j627M96N1m16
$$ -1897 -2498 -1858 -3263 -2158 -3244 -2539 -1500 -2728 -1418 -305 -1441 -449 1311 -316 180 231 -185
1919a85P23L54q4l56m80k33m20r35M50r24J39Q85j569O75J501j354R30J144p13
$$ -185 538 892 808 452 -28 -261 -681 -1616 -1166 -2090 -1951 -1066 -2635 -1960 -459 -1813 -883 261 -452
1938d52Q79P91J192l86q3K049q75K98J574j645J97K41j162N6j3j004j157J58o70
$$ -452 427 1218 2410 2024 1941 3990 3115 3413 4987 3342 3539 3780 2618 2674 2661 1657 500 658 -12
1957a2j210q41N86k397o00J638k151J85K817k264P92J276j04q06J607O53L61L48
$$ -12 -1222 -2063 -1477 -3874 -4474 -2836 -4987 -4802 -1985 -4249 -3457 -2181 -2285 -3091 -1484 -831 -470 -122
1975a22J734j739j76L786k540K05K123j775j008J649q10j608J421L13l278K435
$$ -122 1612 -127 -303 3483 943 1148 3271 1496 488 2137 1327 -281 1140 1453 -1825 610
1991F10Q56l019P41J790k148o8K949j667j529M251q21k303L322l4k395J879J179
$$ 610 1466 -1553 -812 978 -1170 -1238 1711 44 -1485 2766 1945 -358 2964 2930 535 2414 3593
2008C593k535m92L485k982k676M475k556l369K730m34m906N012l96l260J48M179
$$ 3593 1058 566 4051 1069 -1607 2868 312 -3057 -327 -761 -5667 -655 -1051 -4311 -4163 16
2024A6l094j285M293k814j739N742j063l798O644o55n496N706J756m601J391M045
$$ 16 -3078 -4363 -70 -2884 -4623 1119 56 -3742 2902 2247 -3249 2457 4213 -388 1003 5048
2040E048l937j012M821l448j974M849j482o816N630J170p108N940M97o705K639
$$ 5048 1111 99 4920 1472 -502 4347 2865 -3951 1679 2849 -4259 1681 2178 -4527 -1888
2055a888L908m779n35M918j733m321P001q27o346P487N14p794M554M392o416M74
$$ -1888 2020 -2759 -3294 1624 -109 -4430 2571 1744 -4602 2885 3399 -4395 159 4551 -1865 -1391
2071a391M467n298j050O157m116l591O344q41p191N768L493p380L311M842p391
$$ -1391 3076 -2222 -3272 2885 -1231 -4822 1522 681 -6510 -742 2751 -4629 -1318 3524 -3867
2086c867J623N558o009N15O351l575n655Q924J170q984M684O201q041J297O201
$$ -3867 -2244 3314 -2695 -2180 4171 596 -5059 3865 5035 -3949 735 6936 -1105 192 6393
2101F393p956L06Q252p558k536P908l091o059N859K012q735M445M283q919K745
$$ 6393 -1563 -1257 6995 -563 -3099 4809 1718 -4341 1518 3530 -5205 -760 3523 -5396 -2651
2116b651O310p165k91P931n964l040Q171j164p070O110K584p679L234N905q383
$$ -2651 3659 -3506 -3797 4134 -1830 -4870 3301 2137 -4933 1177 3761 -3918 -684 5221 -3162
2131c162K030P099q469r75R280o261n369R841j836q666O974L564q121K345O525
$$ -3162 -1132 5967 -2502 -3477 5803 -458 -5827 4014 2178 -6488 486 4050 -4071 -1726 4799
2146D799q587J555P555p673j591J0510n520q355J0662p4q934P722L110p879K851
$$ 4799 -3788 -2233 5322 -2351 -3942 6568 1048 -7307 3355 3281 -5653 2069 5179 -2700 151
2161A51N773q521k19Q460p053n135J1439k316q901P607J536p841M785L473p544
$$ 151 5924 -2597 -2816 5644 -1409 -6544 4895 2579 -6322 1285 2821 -5020 -235 3238 -4306
2176d306J833O336p180r85R462n329n826J0311j212q661P487K569q595M677M213
$$ -4306 -2473 3863 -3317 -4302 5160 -169 -5995 4316 3104 -5557 1930 4499 -4096 581 4794
2191D794q407K165P217o940l516J0741m396p332Q444O83q443N864K388p696M353
$$ 4794 -3613 -1448 5769 -1171 -4687 6054 1658 -5674 2770 3453 -4990 874 3262 -4434 -81
2206h1M336p937J023P986o478l973R207j672p299O673J245p914N842L544q952
$$ -81 4255 -3682 -2659 5327 -1151 -5124 4083 2411 -4888 1785 3030 -4884 958 4502 -4450
2221d450L996N322o889o68P550m896m472P605j077o034M995J965p674N220L495
$$ -4450 -454 4868 -2021 -2689 4861 -35 -4507 3098 2021 -4013 982 2947 -4727 493 3988
2236C988p930K749O512o605j897O974l971m279O462o76m896M621K054o733L616
$$ 3988 -3942 -1193 5319 -1286 -3183 3791 -180 -4459 2003 1327 -3569 1052 3106 -3627 -11
2251a1M474q431K101P023o172k216O676k967l506M944P7n181M618K130o445K093
$$ -11 4463 -3968 -1867 5156 -1016 -3232 3444 477 -3029 1915 1992 -3189 1429 3559 -2886 -793
2267g93N431o701r79O656m115k648N990k474m028M941L72m342K974K275m893J198
$$ -793 4638 -2063 -3042 3614 -501 -3149 2841 367 -3661 1280 1652 -2690 284 2559 -2334 -1136
2283a136M809n548l91N950l224l040N491j146l108L676Lm479K820K493m158r00
$$ -1136 3673 -1875 -2266 3684 460 -2580 2911 1765 -1343 2333 2336 -2143 677 3170 -988 -1888
2299a888N098l074l009N239k621k509M402j752k833L640j78l845K911K099l831
$$ -1888 3210 136 -2873 2366 -255 -2764 1638 -114 -2947 693 515 -3330 -419 1680 -2151
2314b151P12L573j838k228L736n67l216M138q36k622L111L90l844K012J580k053
$$ -2151 -1439 2134 296 -1932 1804 1237 -1979 2159 1323 -1299 1812 2202 -1642 370 1950 -103
2330a03q10K099q92j849L735j605l854L726L98l527K704J767l636J131K085j604
$$ -103 -913 1186 294 -1555 2180 575 -3279 447 845 -2682 22 1789 -1847 -716 1369 -235
2346b35k37K620j242k161K801O67j983J020J125l785K081K38k414P38J017j164
$$ -235 -472 2148 906 -1255 1546 2213 230 1250 2375 -1410 671 909 -1505 -767 250 -914
2362i14p0O84L78k024J474m9k213J955R98j430l34J444j163P42N44l9n28J112
$$ -914 -984 -300 78 -1946 -472 -521 -2734 -779 219 -1211 -1545 -101 -1264 -522 22 -17 -545 567
2380E67R16j409J381O20j030l58J214k116J387O19j102J62J68j788p64J763l00
$$ 567 1483 74 1455 2075 1045 687 1901 -215 1172 1791 689 851 1019 -769 -1533 230 -70
2397g0j514L07J86q33N78J676j533R75L83j239J168J24m56L56l92L58K55p0R4
$$ -70 -1584 -1277 -1091 -1924 -1346 330 -1203 -228 155 -1084 84 208 -248 108 -284 74 329 259 353
2416C53o38p1J205q6j396N25J68p29N76o12k57J78P4j23J009o61J177j549J055
$$ 353 -285 -356 849 763 -633 -108 60 -669 -93 -705 -962 -784 -710 -833 176 -485 692 -857 198
2435A98j37k33Q53n92J48J363%q12N73lk17k27M71L8q00R61j428n39J241q69q68
$$ 198 61 -172 681 89 237 1600 1600 788 1361 1358 1141 914 1385 1423 623 1584 156 -383 858 -11 -879
2456h79R7M12j631J526j267O06L11J230j765r9J25J783r28P32M59o11L49K07o41
$$ -879 -782 -370 -2001 -475 -1742 -1136 -825 405 -1360 -1459 -1334 449 -479 253 712 101 450 657 16
2475A6J918q06j320O64Q10j509q2J445j476L38n40O35j406K107j040m09J54mj41
$$ 16 1934 1128 -192 472 1282 -227 -309 1136 -340 -2 -542 93 -1313 794 -246 -655 -501 -505 -646
2494f46Q05J276j486L74j27k24Q81L02q09n72J557J21j262R90k39j017o89J294
$$ -646 159 1435 -51 323 196 -28 853 1155 346 -226 1331 1452 190 1180 941 -76 -765 529
2512E29j261l50O73J70n13Q94o58j626J605J24j366J248Q14j137J0J334j001k33
$$ 529 -732 -1082 -409 -239 -752 142 -516 -2142 -537 -413 -1779 -531 283 -854 -844 490 -511 -744
2530g44J634l13q15J666k44j854J050J640k533J119P03k122M87J216j829O03J147
$$ -744 890 577 -238 1428 1184 -670 380 2020 -513 606 1309 -813 -326 890 -939 -336 811
2547H11j159l13J350o29k069J816J281k738J532J420j993j89K338k230K86K199
$$ 811 -348 -661 689 60 -2009 -193 1088 -1650 -118 1302 -691 -880 1458 -772 -486 1713
2563A713j652j094K583J67l075J832J503l183J169J995l363L90K653j756j605
$$ 1713 61 -1033 1550 1717 -1358 474 1977 -1206 -37 1958 -1405 -1015 1638 -118 -1723
2578a723K617o74k818L744o22l135K395J491k699N43L244k417o91L211k372j109
$$ -1723 894 220 -2598 1146 524 -2611 -216 1275 -1424 -881 2363 -54 -745 2466 94 -1015
2594a015K827r81k884L408O50l348K020J827l587K30L514l607j224M117k160k504
$$ -1015 1812 831 -2053 1355 2005 -1343 677 2504 -1083 -853 2661 -946 -2170 1947 -213 -2717
2610b717M594j036l644L212O32l261J430K721l142j69L635k864j203M098j321
$$ -2717 1877 841 -2803 409 1041 -2220 -790 1931 -1211 -1380 2255 -609 -1812 2286 965
2625I65l550M599j65m425L528J483m070J212K438k812m09L639k877k101M518j528
$$ 965 -2585 2014 1849 -2576 952 2435 -1635 -423 2015 -797 -1206 2433 -444 -2545 1973 445
2641D45l404M097L37m507L957J449m205J671K723l500o38M201k270k569M555p33
$$ 445 -2959 1138 1475 -3032 925 2374 -1831 -160 2563 -937 -1575 2626 356 -2213 2342 1609
2657A609m699M508J107n068L019K211m968J664L289l640r50M361k070l263M568
$$ 1609 -3090 1418 2525 -2543 476 2687 -2281 -617 2672 -968 -1918 2443 373 -2890 1678
2672A678n23m346L842J516n013K870K309m510J101L628l438j385M615j809l235
$$ 1678 1155 -3191 651 2167 -2846 24 2333 -2177 -1076 2552 -886 -2271 2344 535 -2700
2687b700M358o4m389L590J504m762K407K887m462K70M575l616j454M209j653l509
$$ -2700 1658 1594 -2795 795 2299 -2463 -56 2831 -1631 -1361 3214 -402 -1856 2353 700 -2809
2703b809L753J066m875K754K547m722J165L623m033m83M562k684k428M069m10
$$ -2809 944 2010 -2865 -111 2436 -2286 -1121 2502 -1531 -2014 2548 -136 -2564 1505 1095
2718A095l614L221J387m396K040L035m685J034M191l988j067M787k761k477M044
$$ 1095 -2519 702 2089 -2307 -267 2768 -1917 -883 3308 -680 -1747 3040 279 -2198 1846
2733A846p12l279K646J495m168J899K609m025L22L933l609j375M772k374k533
$$ 1846 1134 -2145 501 1996 -2172 -273 2336 -1689 -1367 2566 -1043 -2418 2354 -20 -2553
2748b553L897n21k955K524J456l630J201L175l706l57M265l076k001M468j737
$$ -2553 1344 823 -2132 392 1848 -1782 -581 2594 -1112 -1469 2796 -280 -2281 2187 450
2763D50k625L209K48l194K183J608l640N40L208l052j266M308k241k204L845r87
$$ 450 -2175 1034 1282 -1912 271 1879 -1761 -1221 1987 -1065 -2331 1977 -264 -2468 1377 390
2779C90k740L181M82l472K391J791l143N68K847k475r76L272j412k165L257n78
$$ 390 -2350 831 1313 -2159 232 2023 -1120 -552 2295 -180 -1156 2116 704 -1461 1796 1218
2795A218l082K888M08l372J539J858k603j12K289j460j487K873q15k198K919J99
$$ 1218 -1864 1024 1432 -1940 -401 1457 -1146 -1258 1031 -429 -1916 957 142 -2056 863 1062
2811A062k913K298R60k893J435J780k058r2K206j365j380K136o9k461K226O59
$$ 1062 -1851 447 1407 -1486 -51 1729 -329 -421 1785 420 -960 1176 1107 -1354 872 1531
2827A531l057J833J174k850P47J881k137k73J886r53j054J510N52k390J858J105
$$ 1531 -1526 307 1481 -1369 -622 1259 -878 -1151 735 -218 -1272 238 790 -1600 258 1363
2843A363k480J009J577k176M37J824j465k12J245q15o70R75K55j798R26R53k199
$$ 1363 -1117 -108 1469 -707 -270 1554 89 -123 1122 307 -363 612 867 -931 -5 948 -1251
2860a251N60J612k027j05J685j540J09J252n11j220J423L82j140O09J263j600
$$ -1251 -691 921 -1106 -1211 474 -1066 -957 295 -216 -1436 -13 369 -771 -162 1101 -499
2876d99K55J434j241m36J446q69k93J166m25o37N95M6o82m7P70q38m25J081q86
$$ -499 -244 1190 -51 -487 959 90 -203 963 538 -99 496 542 -140 -187 583 -255 -680 401 -485
2895d85l85J201p96o69J028Q7l58J86K74l38L92M22k6p47J063k97p88J089o41
$$ -485 -870 331 -465 -1134 -106 -19 -377 -191 83 -255 137 559 533 -214 849 552 -236 853 212
2914B12l28P08n78k24K92J76m25n83O88o1l11K88j54m57Q91K59r31J066n84l30
$$ 212 -116 592 14 -210 82 258 -167 -750 -62 -123 -434 -146 -300 -757 134 393 -538 528 -56 -386
2934c86M73l3j25l02O21q3m03Q16K44l60k59K42k99M62n37q19J193l76n48J52
$$ -386 87 54 -71 -373 248 165 -238 578 822 462 203 445 146 608 71 -748 445 69 -479 -327
2954c27J75K03j360J401j73l38J27O50j053O73L67l33p4K35k71L67m09K75j11
$$ -327 -152 51 -1309 92 -81 -419 -292 358 -695 -22 345 12 -62 173 -98 269 -140 135 24
2973B4l9Q61p45R2j30l32J50P63j069Q02m77j81m8L83l37k26j51R73k38n41O53
$$ 24 -15 846 101 193 63 -269 -119 644 -425 377 -100 -281 -329 54 -283 -509 -660 313 75 -466 187
2994A87p90L74P19q45M15J69r6M08m35J57J01k78J4M52o80M29l44j04O78j523
$$ 187 -603 -229 490 -355 60 229 133 541 106 263 364 86 100 552 -128 301 -43 -147 531 -992
3014i92N38M35m66L7J42K22n27N91J01n02l48J137n22j82J042l69n79J89r1k38
$$ -992 -454 -19 -485 -448 -306 -84 -611 -20 81 -421 -769 368 -154 -336 706 337 -242 -53 -144 -382
3034c82Q91p70o3L75J78n26M36J24n89n0R11p16q47J782q11k31N54l24l44P77
$$ -382 509 -261 -324 51 229 -297 139 263 -326 -376 535 -181 -1028 754 -57 -288 266 -58 -402 375
3054C75n58m12M60O24o69l37J035o69l14J141j001m18J481l41q88J145j16r13
$$ 375 -183 -595 -135 489 -180 -517 518 -151 -465 676 -325 -743 738 397 -491 654 538 -375
3072c75O86M73q23K8J092r75m97J152n44j190J590k38j348J150J57j242O59P48
$$ -375 311 784 -39 -11 1081 106 -391 761 217 -973 617 379 -969 181 338 -904 -245 503
3090E03q67l18J490q67q89J708o51j208K284l63j841J487L20j499R51P68j474
$$ 503 -364 -682 808 -59 -948 760 109 -1099 1185 822 -1019 468 788 -711 240 1008 -466
3107d66K05J201j102n77J591n87j607J883m0k148J403P56j843R25J055j578J3
$$ -466 -261 940 -162 -739 852 265 -1342 541 501 -1647 -244 512 -1331 -406 649 -929 -916
3124i16J582o37j121J934j03j854J826N26k498J963N66k100O29J577j699m62K106
$$ -916 666 29 -1092 842 739 -1115 711 1237 -1261 702 1268 -832 -203 1374 -325 -787 1319
3141A319j540r54J819K24k523J536Q42k381J191J267k308P82J728j771m07K343
$$ 1319 -221 -1175 644 868 -1655 -119 723 -1658 -467 800 -1508 -726 1002 -769 -1176 1167
3157A167j070j173K087q4j938J411J339k614R88J817k730N11K099k130p71K583
$$ 1167 97 -1076 1011 927 -1011 400 1739 -875 113 1930 -800 -289 1810 -320 -1091 1492
3173A492j169j864K015J68k242J283J295k690J030K350k992K26K617j958n84K362
$$ 1492 323 -1541 474 642 -1600 -317 978 -1712 -682 1668 -1324 -1098 1519 -439 -1023 1339
3189A339r54j591J810O85k344J513J396k805O22K407k656p55L128j907j703K625
$$ 1339 385 -1206 604 1289 -1055 458 1854 -951 -329 2078 -578 -1333 1795 -112 -1815 810
3205H10o94j908J999M11k488R99K196k591J04K533j953r63L392j714j622K850
$$ 810 116 -1792 207 618 -1870 -871 1325 -1266 -1162 1371 -582 -1545 1847 133 -1489 1361
3221A361l07k034J730R13k546Q99K151k556k99K667j679j932L149j568j899K787
$$ 1361 1054 -980 750 1663 -883 16 2167 -389 -688 1979 300 -1632 1517 -51 -1950 837
3237H37k35k666K076M61j758L22K290k220m89K772j193k039L575j260j955K523
$$ 837 602 -2064 12 473 -1285 -963 1327 -893 -1382 1390 197 -1842 1733 473 -1482 1041
3253A041k12j484J213J280k536P74J593k128p65K379j638j090K445o90k249K719
$$ 1041 829 -655 558 1838 -698 76 1669 -459 -1224 1155 -483 -1573 872 182 -2067 652
3269F52Pj963Q62J968l057Q44K006k035m11K273l8k488K621J82k727K052J353
$$ 652 659 -1304 -442 1526 -1531 -687 1319 -716 -1127 1146 1108 -1380 1241 1423 -1304 748 2101
3286B101l079R99J725k436J83K028j813q62J946m67k001K411l36k568K011P09
$$ 2101 -978 21 1746 -690 -507 1521 -292 -1154 792 325 -1676 735 399 -2169 -158 551
3302E51k357Q59J758j031m54J615j637k47J623r9j246J194Q55k230J045J642k502
$$ 551 -1806 -947 811 -220 -674 941 -696 -943 680 581 -665 529 1384 -846 199 1841 -661
3319f61L46J935j965n83J738j079q89J401j05j367R67R33j808O17J717k125QK193
$$ -661 -315 1620 -345 -928 810 -269 -1158 243 138 -1229 -262 671 -1137 -520 1197 -928 -920 1273
3337A273j837j20J649q68o65J249Q0j029M13J280j855N96J463k026l89J712q49
$$ 1273 -564 -684 965 97 -568 681 761 -268 145 1425 -430 166 1629 -397 -786 926 77
3354G7r57J659r65r24J311o3j199O77R88j130nJ877j675o46J982q64r82J880n96
$$ 77 -880 779 -186 -1110 201 138 -1061 -384 604 -526 -531 1346 -329 -975 1007 143 -839 1041 445
3373D45j178J379n3p02K72Q44j158j25J478j165p22J557q59r64J652n37j125J132
$$ 445 -733 646 593 -109 163 1007 -151 -276 1202 37 -685 872 13 -951 701 164 -961 171
3391A71k86o55N8R86p12j21J051n37m49J025k12o09Q53k47o91O12N51j035M71
$$ 171 -115 -770 -712 274 -438 -559 492 -45 -494 531 319 -290 563 316 -375 237 788 -247 224
3410B24L04m82l89O01k95o03J054k38p30N35L36o71J69K29p00O53L80m07l77M69
$$ 224 528 46 -343 258 -37 -640 414 176 -554 -19 317 -354 -185 44 -656 -3 377 -30 -407 62
3430F2j32m00O53M06p11N35R2p67K97N61m18o0M10p90Q7K76j16m78M22M78p26
$$ 62 -70 -470 183 589 -122 413 505 -262 35 596 178 118 528 -262 -175 101 -15 -493 -71 407 -319
3451c19K32K53o26M29L03n00j4K17l48M42j15M40j15j21J42k77j95N91n49L23
$$ -319 -87 166 -460 -31 272 -228 -242 -25 -373 69 -46 394 279 158 300 23 -172 419 -130 193
3471A93K45n77K35N6m02J34lJ88k11l52Q10m45o8K27O6n12Q61n69j09M52n12r9
$$ 193 438 -139 96 152 -250 -116 -119 69 -142 -494 316 -129 -197 30 96 -416 445 -124 -233 219 -293 -392
3493c92L01J01j25J56K48k53j08L97n46k11R14r23K62L51l05J5K38l84M49n19
$$ -392 -91 10 -115 41 289 36 -72 325 -221 -432 482 -441 -179 172 -133 -118 120 -264 185 -334
3513c34K16M06q23N79k7m76P66n77R2N08n98k17O91k92N0K17Rpk70L50K02o33
$$ -334 -118 288 -535 44 17 -459 307 -270 -178 330 -268 -485 206 -86 -36 181 190 183 -87 263 465 -168
3535a68N41j38l96N00k88L3Lj20O9j1k4j27j19L72M5m80N02pp48Q09kr19J048
$$ -168 373 235 -161 339 51 84 87 -33 36 25 1 -126 -245 127 172 -308 194 187 -561 248 246 -673 375
3558C75j94m34J6M64m19LL64J39m75L15K58o86P30Q2q12N47k30k78L01j38j00
$$ 375 181 -253 -237 227 -192 -189 175 314 -161 154 412 -274 456 538 -274 273 43 -235 66 -72 -172
3579a72q4L84j80m22M21J68q25Q48P4j030Q13M64n07j47R37j133L90L83k10l74
$$ -172 -256 128 -52 -474 -53 115 -710 138 212 -818 -5 459 -48 -195 742 -391 -1 382 172 -202
3599b02N95R4r05N39Q57j594N46M66r26J30P45p68L00N92q21k82N55J00m95L15
$$ -202 393 487 -418 121 978 -616 -70 396 -530 -400 345 -423 -123 469 -352 -634 -79 21 -474 -159
3619a59P38j413Q14O48r66m0J235j140J17J239o28l48L55n0j119R83M55j403L55
$$ -159 579 -834 -20 628 -338 -378 857 -283 -166 1073 445 97 452 402 -717 266 721 -682 -327
3638c27J528j455m59J565j019q50J451q22n49J210j07j218J033O88j411O57J308
$$ -327 1201 -254 -713 852 -167 -1017 434 -388 -937 273 166 -1052 -19 669 -742 -85 1223
3655A223j784J61J346r48o91J834r84o09Q14K10j048R45M48j491L72J149j437
$$ 1223 -561 -400 946 -2 -693 1141 157 -452 362 572 -476 469 917 -574 -202 947 -490
3672d90o36J937j190p41J955p50j441J717j08j164O37J254j462J62J537j128m05
$$ -490 -1126 811 -379 -1120 835 85 -1356 361 253 -911 -274 980 -482 -320 1217 89 -316
3689c16J748r92j628K122r5j414J253l77j333J31J618j699K45J759j460m39J436
$$ -316 1432 440 -1188 934 839 -575 678 301 -1032 -901 717 -982 -737 1022 -438 -877 559
3706E59m31j603J872k42j404J411O72j828Q87J504j531l42J827r41j444J978l8
$$ 559 128 -1475 397 155 -1249 162 834 -994 -107 1397 -134 -476 1351 410 -1034 944 906
3723I06k083K195l06j866J462K18j511J108P87j304l25J580o69j823K534m19j612
$$ 906 -1177 1018 712 -1154 308 526 -985 123 910 -394 -719 861 192 -1631 903 484 -1128
3740a128J313O70j845J009P75j417P54M35o64m90J770j064j117K082k25j919J325
$$ -1128 185 855 -990 19 794 -623 131 566 -98 -588 1182 118 -999 1083 858 -1061 264
3757B64R30j795N62J021j963R19J076j562n39J723q81j072J398N26j810J125J282
$$ 264 1194 -601 -39 982 -981 -62 1014 -548 -1087 636 -245 -1317 81 607 -1203 -78 1204
3774A204k216J308Q08j626O08J702j752n25J454n67j127J218L04j789Q27J545
$$ 1204 -1012 296 1104 -522 86 1788 36 -489 965 398 -729 489 793 -996 -169 1376
3790A376k290Q50J040j779M73J103j180l46J279m79r33R73M85j583Q22J190j978
$$ 1376 -914 -64 976 -803 -330 773 -407 -753 526 47 -886 87 572 -1011 -189 1001 -977
3807i77Q18J303j483R1J557j180p82J218M8j472J146K35j642R60R50j967L45J453
$$ -977 -159 1144 -339 -248 1309 129 -653 565 613 -859 287 522 -1120 -160 790 -1177 -832 621
3825F21j155k38J536j042p79J495j18r60J067M00j195J45J164j356K8J300o72
$$ 621 -534 -772 764 -278 -1057 438 320 -640 427 827 -368 -223 941 -415 -387 913 241
3842B41r01J695r05j050J858q45n20M88N84j336K33J182r52j54P46k91j076J473
$$ 241 -660 1035 130 -920 938 93 -427 61 645 -691 -458 724 -228 -382 364 73 -1003 470
3860D70l04q51Q64K81q00O09l6o22L02P59n09p00J162k45j226J508n26r71J000
$$ 470 166 -685 179 460 -340 269 233 -389 -87 672 163 -537 625 380 -846 662 136 -835 165
3879A65ro31K79P36r18p1R19p29l51J160m56j118J426M47j634P10N43j088P56
$$ 165 156 -475 -196 540 -378 -449 470 -259 -610 550 94 -1024 402 849 -785 -75 468 -620 136
3898A36O40j080O31j1l65m4L47L2n99N18k9j052Q25L45r15O44J2m47j21O82k43
$$ 136 776 -304 327 316 -49 -93 254 286 -313 205 176 -876 -51 294 -621 23 35 -412 -533 149 -94
3919i4p9n59R39r38M07R48j238N64O08o50J30L14k73R1M3j43p12R04n0q21M30
$$ -94 -173 -732 207 -731 -324 624 -614 -50 558 -92 38 352 79 170 213 70 -642 262 212 -609 -179
3940a79M08r18K99Q28o59q4O14l99k43K08P3J56O2L35m62l89M52k96K50J30k15
$$ -179 229 -689 -390 438 -221 -305 309 -90 -333 -125 -52 104 166 501 39 -350 102 -194 56 186 -29
3961b9r9O32r92M80L83m89Q1M7J81l78N54o7m92r9J78k90j86P46j08k27N08k97
$$ -29 -128 504 -488 -8 375 -114 -33 14 195 -183 371 304 -188 -287 -109 -399 -585 161 53 -174 334 37
3983C7J47L79l11j38o7K39n18L57M18n86p1Q53j012J61N73o63R6k7j31M10r70
$$ 37 184 563 252 114 47 286 -232 125 543 -43 -114 739 -273 -112 461 -202 -106 -133 -264 146 -824
4004h24J311p4o99J53M23n18n23Q66q04Q39o60j92O83K17K21j051J014o16J41
$$ -824 487 413 -286 -133 290 -228 -751 115 -689 150 -510 -702 -19 198 419 -632 382 -234 -93
4023i3O27k11l98K58m05P9N20k73k1k48K81m10M0L95L93n66k19J63k70J127m59
$$ -93 534 323 -75 183 -222 -143 377 104 83 -165 116 -294 -254 141 534 -32 -251 -88 -358 769 310
4044C10j018J417j019P20k06J99l10l73K75k04K74L11m76K3J12l3m80K38P50j039
$$ 310 -708 709 -310 410 204 403 93 -280 -5 -209 65 376 -100 -77 35 2 -478 -240 510 -529
4064e29R04n08j71L88j57r38J158P6j20l69J07L1J19P7N07r52M72M50q41P55n48
$$ -529 375 -133 -304 84 -73 -1011 147 223 103 -266 -159 -128 -9 68 575 -377 95 545 -296 459 -89
4085h9j80K87K77l30Q1Q4o5%J7J097j058j43N83j149O42J9l46J91J51Q2K0k03
$$ -89 -269 18 295 -35 46 130 65 65 82 1179 121 -22 561 -588 54 73 -273 -82 69 151 171 -32
4107c2K01k61J61O98j227J20Q87o60j42L79j15r2L90l10l40M17N28n47j28L53
$$ -32 169 -92 69 767 -460 -340 547 -113 -255 124 9 -83 307 -3 -343 74 602 55 -73 280
4127B80n95J07P37n68j59J14J87l64O82n97p3J43N57o73k80R48n25l83J014p44
$$ 280 -315 -208 529 -39 -198 -84 103 -261 421 -176 -249 -106 451 -222 -502 446 -79 -462 552 -192
4147a92l86J523j366J02l0L75o2l76L90J57m06N02k10j26R63j183P07m85L06j16
$$ -192 -578 945 -421 -319 -349 26 -36 -412 -22 135 -271 231 21 -105 858 -325 382 -103 203 87
4167H7M0k89l27P75k06r21M19R13p58o5P92J13j400J794o82j225J529J99q34J33
$$ 87 127 -162 -489 286 80 -841 -422 491 -267 -332 460 573 -827 967 285 -940 589 788 -46 87
4187H7J87j82m61N29k72N97O4m89r64P47J58r39J114J16j146P78M87p56J88Q40
$$ 87 274 92 -369 160 -112 485 549 60 -904 -157 1 -938 176 292 -854 -76 411 -345 -157 683
4207F83p95N43l86j8r89J409R48k019Q52l66p1L16r6l58M85L41r50N93Q65j616
$$ 683 -112 431 45 27 -962 447 1395 -624 228 -138 -209 107 11 -347 138 479 -471 122 987 -629
4227f29M14K08k87J85L87j85j130Q17P61q91L34J92J00j064K39N79o38J227o14
$$ -629 -215 -7 -294 -109 278 93 -1037 -220 541 -350 -16 176 276 -788 -549 30 -608 619 5
4246Ep68N25M65q42N75O13j342l32K051j754L78O35n33k54Q57P4n79K74J93k80
$$ 5 -763 -238 227 -615 -40 573 -769 -1101 950 -804 -426 209 -324 -578 279 353 -226 48 241 -39
4266c9l42J148j488K52J165o81j158J343J36q6J73M64j344K31J05k83k31J667
$$ -39 -381 767 -721 -469 696 15 -1143 200 336 250 423 887 -457 -226 -121 -404 -635 1032
4284A032j165r4R95j145m69R09k4p44N16O60j158n5J242n73q67J973j455J37Q52
$$ 1032 -133 -227 768 -377 -846 63 39 -705 -189 471 -687 -742 500 -73 -940 1033 -422 -285 567
4303E67m73j92Q03l46j103O39N53q52J85J358j955N75O70k23q05J200q37r24J433
$$ 567 94 -98 705 359 -744 -105 448 -404 -219 1139 -816 -241 429 206 -599 601 -236 -1160 273
4322B73J77q56L50K04m08pN18k53j014J544o45n75O36J046j733P39%j93k05L27
$$ 273 450 -406 -56 148 -260 -267 251 -2 -1016 528 -117 -692 -56 990 -743 -4 -4 -197 -402 -75
4342g5K29m99J228j000j44R30r70k69P57l0p93Q78l73k81J20R47o77r52J806q01
$$ -75 154 -345 883 -117 -261 669 -301 -570 187 157 -636 242 -131 -412 -292 655 -22 -974 832 31
4362C1k77N74Jj037Q49L92o07k12J07O5L44M57j180J013l14l03k52R89k94n37
$$ 31 -246 328 329 -708 141 533 -74 -286 -179 -114 230 687 -493 520 206 -97 -349 640 346 -191
4382a91O8J50k47M96J2p65N34P32n85o34P72r6m66K99O2j059Q15M82l41o20J306
$$ -191 -123 27 -220 276 288 -477 57 789 204 -430 342 246 -220 79 141 -918 -103 379 38 -582 724
4403G24j109L03J25J20K55o10J63j116J175l71N53R5j94l8K0N23r73r7N9N43j61
$$ 724 -385 -82 43 163 418 -192 -29 -1145 30 -341 212 307 113 75 95 618 -355 -452 -393 150 -11
4424a1q8m1n57P98J40n74J170L30n85m57N17q38Q53L28n55j273J072k24m89N68
$$ -11 -99 -140 -697 101 241 -333 837 1167 582 125 642 -196 657 985 430 -843 229 5 -484 84
4444H4J14p55R47m70j85J203r98L71q15L00m28P91O38m55p03K02M06o05r76M30
$$ 84 198 -557 390 -80 -265 938 -60 311 -504 -204 -632 159 797 342 -361 -159 247 -358 -1334 -904
4464i04O11M39j13J93j72P10J50j399Q75n36L1O50o07M79M0P54j924P41m31R13
$$ -904 -293 146 33 226 54 764 914 -485 390 -146 -115 535 -72 407 447 1201 -723 18 -413 500
4484E00l87o4j7n97n96J073N4m62L75p9K42j19M76j170R08P9j54o09P29K85q67
$$ 500 113 49 32 -565 -1161 -88 -34 -496 -121 -200 42 -77 399 -771 137 216 62 -547 182 467 -400
4505d00q5O19m64J256r93L44n4k02o44L68K35l45O90o58k9ML43m31M58K62j62
$$ -400 -485 134 -330 926 -67 277 223 21 -623 -255 -20 -365 325 -333 -362 -358 -15 -446 12 274 112
4526A12QK2L0J88l96M11m58M89j29n8j22k24O5n2j26k24O85k10j81k19J47K22
$$ 112 120 142 172 360 -36 375 -83 406 277 219 97 -127 -62 -114 -240 -464 221 11 -170 -389 -242 -20
4548b0K19k24j13N02m97J23J0J48J8J7r4q3j26O6L18L8l62O0L87j36j77J78k35
$$ -20 199 -25 -138 364 -133 -10 0 148 166 183 89 6 -120 -54 264 302 -60 0 387 251 74 252 17
4571A7pK77l64J12R6j95N0k17K48N3k15K03M8o5j6RN7J15j85j76K59k53k5M92
$$ 17 10 287 -77 35 131 -64 -14 -231 17 70 -145 58 106 41 25 34 91 206 21 -155 104 -149 -174 318
4595C18k70L19q27J58j49O81L53o64L54k60J00l45j47J66K61M29l2m50m18P20
$$ 318 48 367 -460 -302 -451 230 583 -81 273 13 113 -232 -379 -213 48 477 445 -5 -423 297
4615B97p68kN95k2n80P13l4j15K19K4k42kk7j77j10K57K47k44K14j48l60K79J99
$$ 297 -471 -473 122 100 -480 233 199 84 303 327 85 83 56 -121 -231 26 273 29 243 95 -265 14 213
$$ [...]
8191b22
##END NTUPLES=NMR FID
##END=
