##TITLE=1H_80-2021
 CDCl3, 8 sc, 
 23.08.2021
##JCAMPDX= 6.0         $$ Bruker NMR JCAMP-DX V2.0
##DATA TYPE= NMR FID
##DATA CLASS= NTUPLES
##ORIGIN= UXNMR, Bruker Analytische Messtechnik GmbH
##OWNER= root
$$ XWIN-NMR		Version 3.5
$$ Mon Aug 23 10:15:46 2021 Russian Standard Time (UT+4h)  she@DPX200
##.OBSERVE FREQUENCY= 200.131506
##.OBSERVE NUCLEUS= ^1H
##.DELAY= (6, 6)
##.ACQUISITION MODE= SIMULTANEOUS
##.ACQUISITION SCHEME= undefined
##.AVERAGES= 8
##.DIGITISER RES= 18
##SPECTROMETER/DATA SYSTEM= spect
##.PULSE SEQUENCE= zg30
##.SOLVENT NAME= CDCl3
##.SHIFT REFERENCE= (INTERNAL, CDCl3, 0, 15.7039)
##AUDIT TRAIL= $$ (NUMBER, WHEN, WHO, WHERE, WHAT)
$$ ##TITLE= Audit trail, XWIN-NMR		Version 3.5
$$ ##JCAMPDX= 5.01
$$ ##ORIGIN= Bruker BioSpin GmbH
$$ ##OWNER= she
$$ F:/spectra/data/she/nmr/H-F/1/audita.txt
$$ ##AUDIT TRAIL=  $$ (NUMBER, WHEN, WHO, WHERE, WHAT)
(   1,<2021-08-23 10:14:28.87 +0400>,<she>,<DPX200>,
      <created by zg, POWCHK disabled, PULCHK disabled
       configuration hash MD5:
       00 E9 B6 7A A2 85 ED C7 34 08 36 98 17 FE 4E 26
       data hash MD5: 16K
       55 1A 75 00 F4 3C 7D D1 E0 16 45 69 2D A4 CD 64>)
$$ ##END=
$$ 
$$ hash MD5
$$ 26 AB CB CA A0 57 AE 2E 5A D7 1E D5 F7 E0 E0 BB
##$RELAX= 
##$RELAX= 
##$RELAX= 
##$RELAX= 
##$RELAX= 
##$RELAX= 
$$ Bruker specific parameters
$$ --------------------------
##$DU= <F:/spectra>
##$EXPNO= 1
##$NAME= <H-F>
##$PROCNO= 1
##$TYPE= <nmr>
##$USER= <she>
##$AMP= (0..31)
100 100 100 100 100 100 100 100 100 100 100 100 100 100 100 100 100 100 
100 100 100 100 100 100 100 100 100 100 100 100 100 100 
##$AQSEQ= 0
##$AQ_mod= 1
##$AUNM= <au_zg>
##$AUTOPOS= <>
##$BF1= 200.13
##$BF2= 200.13
##$BF3= 200.13
##$BF4= 200.13
##$BF5= 200.13
##$BF6= 200.13
##$BF7= 200.13
##$BF8= 200.13
##$BYTORDA= 1
##$CFDGTYP= 0
##$CFRGTYP= 5
##$CHEMSTR= <none>
##$CNST= (0..31)
1 1 145 1 1 1 1 1 1 1 1 1 1 1 1 1 1 1 1 1 1 1 1 1 1 1 1 1 1 1 1 1 
##$CPDPRG= <>
##$CPDPRG1= <>
##$CPDPRG2= <>
##$CPDPRG3= <>
##$CPDPRG4= <mlev>
##$CPDPRG5= <mlev>
##$CPDPRG6= <mlev>
##$CPDPRG7= <mlev>
##$CPDPRG8= <mlev>
##$CPDPRGB= <>
##$CPDPRGT= <>
##$D= (0..31)
0 1.2 0 0 0 0 0 0 0 0.06 0 0.03 0 0 0 0 0.0002 0 0 0 0 0 0 0 0 0 0 0 0 
0 0 0 
##$DATE= 1629699268
##$DBL= (0..7)
120 120 120 120 120 120 120 120 
##$DBP= (0..7)
150 150 150 150 150 150 150 150 
##$DBP07= 0
##$DBPNAM0= <>
##$DBPNAM1= <>
##$DBPNAM2= <>
##$DBPNAM3= <>
##$DBPNAM4= <>
##$DBPNAM5= <>
##$DBPNAM6= <>
##$DBPNAM7= <>
##$DBPOAL= (0..7)
0.5 0.5 0.5 0.5 0.5 0.5 0.5 0.5 
##$DBPOFFS= (0..7)
0 0 0 0 0 0 0 0 
##$DE= 6
##$DECBNUC= <off>
##$DECIM= 32
##$DECNUC= <off>
##$DECSTAT= 4
##$DIGMOD= 1
##$DIGTYP= 9
##$DL= (0..7)
0 120 120 120 120 120 120 120 
##$DP= (0..7)
150 150 150 150 150 150 150 150 
##$DP07= 0
##$DPNAME0= <>
##$DPNAME1= <>
##$DPNAME2= <>
##$DPNAME3= <>
##$DPNAME4= <>
##$DPNAME5= <>
##$DPNAME6= <>
##$DPNAME7= <>
##$DPOAL= (0..7)
0.5 0.5 0.5 0.5 0.5 0.5 0.5 0.5 
##$DPOFFS= (0..7)
0 0 0 0 0 0 0 0 
##$DQDMODE= 0
##$DR= 18
##$DS= 0
##$DSLIST= <SSSSSSSSSSSSSSS>
$$ [...]
##$SUBNAM2= <"">
##$SUBNAM3= <"">
##$SUBNAM4= <"">
##$SUBNAM5= <"">
##$SUBNAM6= <"">
##$SUBNAM7= <"">
##$SUBNAM8= <"">
##$SUBNAM9= <"">
##$SW= 20.0188882624521
##$SWIBOX= (0..15)
0 0 2 0 0 0 0 0 0 0 0 0 0 0 0 0 
##$SW_h= 4006.41025641026
##$TD= 16384
##$TD0= 1
##$TE= 0
##$TE2= 300
##$TE3= 300
##$TEG= 300
##$TL= (0..7)
0 120 120 120 120 120 120 120 
##$TP= (0..7)
150 150 150 150 150 150 150 150 
##$TP07= 0
##$TPNAME0= <>
##$TPNAME1= <>
##$TPNAME2= <>
##$TPNAME3= <>
##$TPNAME4= <>
##$TPNAME5= <>
##$TPNAME6= <>
##$TPNAME7= <>
##$TPOAL= (0..7)
0.5 0.5 0.5 0.5 0.5 0.5 0.5 0.5 
##$TPOFFS= (0..7)
0 0 0 0 0 0 0 0 
##$TUNHIN= 0
##$TUNHOUT= 0
##$TUNXOUT= 0
##$USERA1= <user>
##$USERA2= <user>
##$USERA3= <user>
##$USERA4= <user>
##$USERA5= <user>
##$V9= 5
##$VALIST= <valist>
##$VCLIST= <CCCCCCCCCCCCCCC>
##$VD= 0
##$VDLIST= <DDDDDDDDDDDDDDD>
##$VPLIST= <PPPPPPPPPPPPPPP>
##$VTLIST= <TTTTTTTTTTTTTTT>
##$WBST= 1024
##$WBSW= 4
##$XGAIN= (0..3)
0 0 0 0 
##$XL= 0
##$YL= 0
##$YMAX_a= 423485
##$YMIN_a= -529713
##$ZGOPTNS= <>
##$ZL1= 120
##$ZL2= 120
##$ZL3= 120
##$ZL4= 120
##$ABSF1= 10
##$ABSF2= 0
##$ABSG= 5
##$ABSL= 3
##$ALPHA= 0
##$AQORDER= 0
##$ASSFAC= 0
##$ASSFACI= 0
##$ASSFACX= 0
##$ASSWID= 0
##$AUNMP= <proc_1d>
##$AZFE= 0.1
##$AZFW= 0.1
##$BCFW= 1
##$BC_mod= 2
##$BYTORDP= 1
##$COROFFS= 0
##$CY= 11.3945322036743
##$DATMOD= 1
##$DC= 2
##$DFILT= <>
##$DTYPP= 0
##$F1P= 2.36226072786647
##$F2P= -0.459571619588291
##$FCOR= 0.5
##$FTSIZE= 0
##$FT_mod= 4
##$GAMMA= 1
##$GB= 0.15
##$INTBC= 1
##$INTSCL= 1
##$ISEN= 128
##$LB= 0.24
##$LEV0= 0
##$LPBIN= 0
##$MAXI= 10000
##$MC2= 0
##$MEAN= 0
##$ME_mod= 0
##$MI= 1.114404
##$NCOEF= 0
##$NC_proc= 0
##$NLEV= 6
##$NOISF1= 3.799351
##$NOISF2= 2.8
##$NSP= 1
##$NTH_PI= 0
##$NZP= 0
##$OFFSET= 15.70392
##$PC= 1
##$PHC0= -13357.04
##$PHC1= 12.60099
##$PH_mod= 1
##$PKNL= yes
##$PPARMOD= 0
##$PSCAL= 0
##$PSIGN= 0
##$REVERSE= no
##$SF= 200.130013532006
##$SI= 16384
##$SIGF1= 3
##$SIGF2= 2
##$SINO= 400
##$SIOLD= 16384
##$SREGLST= <1H.CDCl3>
##$SSB= 0
##$STSI= 0
##$STSR= 0
##$SW_p= 3612.71676300578
##$SYMM= 0
##$S_DEV= 0
##$TDeff= 0
##$TDoff= 0
##$TI= <>
##$TILT= no
##$TM1= 0
##$TM2= 0
##$TOPLEV= 0
##$USERP1= <user>
##$USERP2= <user>
##$USERP3= <user>
##$USERP4= <user>
##$USERP5= <user>
##$WDW= 1
##$XDIM= 8192
##$YMAX_p= 0
##$YMIN_p= 0
$$ End of Bruker specific parameters
$$ ---------------------------------
##NTUPLES= NMR FID
##VAR_NAME=  TIME,          FID/REAL,        FID/IMAG
##SYMBOL=    X,             R,               I
##VAR_TYPE=  INDEPENDENT,   DEPENDENT,       DEPENDENT
##VAR_FORM=  AFFN,          ASDF,            ASDF
##VAR_DIM=   8192,          8192,            8192
##UNITS=     SECONDS,       ARBITRARY UNITS, ARBITRARY UNITS
##FACTOR=    0.0002496,     1,               1
##FIRST=     0,             0,               0
##LAST=      2.0444736,     0,               0
##MIN=       0,             -529713,         0
##MAX=       2.0444736,     423485,          0
$$ Real data points
##PAGE= N=1
##DATA TABLE= (X++(R..R)), XYDATA
$$ [...]
$$ plain form
2459 -471 -1466 2353 1420 -749 -44 -225 -6 791 1774 626 -2183 756 1420 -788 1664 501 -2049
2476 -2049 489 983 348 838 235 -238 -729 1087 1678 -930 415 781 -1275 1534 1378 -788 476
2493 476 305 -367 777 458 875 -1095 -221 1265 -784 350 1175 -1516 354 777 -574 539 -68
2510 -68 -23 -110 -173 1088 -458 -641 1335 -835 439 1591 -1051 243 561 -456 353 33 126 233 -267
2529 -267 1013 -186 -459 1098 -793 -167 865 -731 -20 210 -658 562 -512 40 61 -1202 571
2546 571 -297 -507 787 -838 -455 439 -681 211 233 -482 475 -497 279 544 -1096 559 -273 -887 739
2565 739 -640 -160 287 -814 141 -123 -746 244 -844 -263 255 -1045 338 -135 -877 577 -960 -487
2583 -487 328 -588 139 -194 -809 462 -693 55 490 -959 210 347 -602 474 -528 -283 261 -1029
$$ packed form
2459d71r95L819r33k169P05j81K19P97R83j148k809K939O64k208K452j163k550
2476b049K538M94o35M90o03m73m91J816N91k608J345L66k056K809j56k166J264
2493D76j71o72J144l19M17j970Q74J486k049J134Q25k691J870M23j351J113o07
2510f8M5q7o3J261j546j83J976k170J274J152k642J294L18j017Q09l20R3J07n00
2529b67J280j199k73J557j891O26J032j596P11K30q68J220j074N52K1j263J773
2546E71q68k10J294j625L83Q94j120Q92K2p15R57r72P76K65j640J655q32o14J626
2565G39j379M80M47j101R55k64o23R90j088N81N18j300J383m73p42J454j537M73
2583d87Q15r16P27l33o15J271j155P48M35j449J169J37r49J076j002K45N44j290
$$ plain form
2601 -1029 158 -91 -665 857 -939 236 -813 -1766 191 -418 -622 68 -818 -724 232 -862 43 -158
2619 -158 -615 496 -672 -204 532 -1013 348 -67 -301 472 -12 -57 748 -688 479 208 -472 818
2637 818 -374 18 475 -808 559 518 -303 1714 -293 -750 267 -287 662 274 -542 927 -12 -56
2655 -56 870 -281 735 703 -321 925 112 223 786 -390 822 564 269 1045 221 17 870 -30 529
2674 529 560 -205 748 -191 -236 432 -558 653 -174 -549 1032 -797 -286 853 -971 523 420 -310 469
2693 469 -163 332 309 -613 680 538 -626 805 -209 -225 494 -534 -386 -98 -420 488 -340 -160 -213
2712 -213 -1327 355 102 -1099 376 -1028 -1031 281 -429 -272 -457 -421 -50 -629 147 583 -1068 2
2730 2 509 -615 950 395 -493 391 170 711 564 101 609 -805 151 1236 -346 478 387 -1094 471
$$ packed form
2601a029J187k49n74J522j796J175j049r53J957o09k04O90q86R4R56j094R05k01
2619a58m57J111j168M68P36j545J361m15k34P73m84m5Q05j436J167k71o80J290
2637H18j192L92M57j283J367m1q21K017k007m57J017n54R49l88q16J469r39m4
2655e6R26j151J016l2j024J246q13J11N63j176J212k58k95P76q24k04Q53r00N59
2674E29L1p65R53r39m5O68r90J211q27l75J581j829N11J139j824J494j03p30P79
2693D69o32M95k3r22J293j42j164J431j014j6P19j028J48K88l22R08q28J80n3
2712b13j114J682k53j201J475j404lJ312p10J57j85L6L71n79P76M36j651J070
2730BN07j124J565n55q88Q84k21N41j47m63N08j414R56J085j582Q24r1j481J565
$$ plain form
2749 471 245 -16 -19 -678 -215 -315 140 1234 -615 -425 638 -1041 917 1293 -133 468 101 -158 769
2768 769 924 999 -176 -427 1048 69 520 1550 -402 63 985 -94 608 398 -565 -245 -582 1092
2786 1092 74 -519 626 -1009 -738 1449 114 -108 491 -996 81 811 1045 540 -749 175 -72
2803 -72 233 2145 247 -924 653 -377 373 1595 404 -446 -535 385 870 345 1143 -646 -1341 994
2821 994 898 -190 739 -882 -1019 653 929 941 -471 -296 -380 -242 1755 1302 -896 422 -386 -162 1754
2840 1754 837 -336 -290 -90 1040 733 1110 170 -1760 511 1110 8 1179 -116 -1554 636 650
2857 650 623 35 -310 -543 -648 1069 1413 -664 -288 1242 -193 1167 1154 -782 -303 29 632 999 497
2876 497 -2 -1315 -9 1500 -37 420 199 -1834 393 930 11 -195 -799 -586 28 637 1224 -933
$$ packed form
2749D71k26k61lo59M63j00M55J094j849J90J063j679J958L76j426O01l67k59R27
2768G69J55P5j175k51J475r79M51J030j952M65R22j079P02k10r63L20l37J674
2786A092j018n93J145j635K71K187j335k22N99j487J077P30K34n05j289R24k47
2803g2L05J912j898j171J577j030P50J222j191q50q9R20M85n25P98j789o95K335
2821I94r6j088R29j621j37J672K76J2j412J75q4J38J997m53k198J318q08K24J916
2840A754r17j173M6K00J130l07L77r40j930K271N99j102J171j295j438K190J4
2857F50k7n88l45k33j05J717L44k077L76J530j435J360j3j936M79L32O03L67n02
2876D97m99j313J306J509j537M57k21k033K227N37r19k06o04K13O14O09N87k157
$$ plain form
2894 -933 -1309 660 -362 884 729 -1245 -850 29 350 924 -117 -372 -835 -314 1709 285 -577 -103
2912 -103 -1511 -156 1367 -43 -477 -1016 -746 150 764 678 -559 -1728 364 -66 132 1003 -1241 -1484
2930 -1484 48 -30 665 -35 -785 -1141 -780 985 794 -728 -92 -1462 -806 1569 433 -544 -629 -992
2948 -992 -40 479 449 -159 -1420 -198 25 -294 815 -783 -1805 -105 421 196 352 -520 -1015 -575
2966 -575 -55 669 -214 -455 -501 -991 617 154 -633 -390 -874 -472 97 272 -163 -994 -364 281 -312 94
2986 94 -5 -946 -182 -101 -500 503 -489 -493 -144 -454 470 -286 -245 6 -664 188 851 -351 4 -265 -518
3007 -518 243 -122 -33 78 -593 612 -20 80 756 -492 -260 522 -316 192 183 -354 228 -292 242 153 -551
3028 -551 489 99 -124 751 -656 11 216 -675 435 58 261 313 -437 51 261 -239 634 -202 -621
$$ packed form
2894i33l76J969j022J246j55j974L95Q79L21N74j041k55m63N21K023j424q62M74
2912a03j408J355J523j410m34n39K70Q96O14q6j237j169K092m30J98Q71k244k43
2930a484J532p8O95p00p50l56L61J765j91j522O36j370O56K375j136r77q5l63
2948i92R52N19l0o08j261J222K23l19J109j598j022J700N26k25J56q72m95M40
2966e75N20P24q83k41m6m90J608m63p87K43m84M02N69J75m35q31O30O45n93M06
2986I4r9r41P64Q1l99J003r92mL49l10R24p56M1K51o70Q52O63j202L55k69k53
3007e18P61l65Q9J11o71J205o32J00O76j248K32P82q38N08rn37N82n20N34q9p04
3028e51J040l90k23Q75j407O67K05q91J110l77K03N2p50M88K10n00Q73q36m19
$$ plain form
3047 -621 629 -410 269 946 -259 86 61 50 337 -329 -83 95 -749 563 134 -296 679 -314 -94
3066 -94 329 -396 348 -25 -77 620 -366 125 319 -604 211 149 -348 824 -173 8 292 -301 192 135 -123
3087 -123 507 -1 100 625 -455 240 -94 -549 354 298 -89 465 -204 718 179 -339 1021 -389 -45
3106 -45 212 -692 50 772 116 754 -184 62 206 -710 335 351 -29 982 -1 109 106 -482 306 -379 -666
3127 -666 456 -91 -797 543 -349 430 1198 -728 -534 -398 463 353 300 -358 210 -426 261 338 -1228
3146 -1228 653 -341 584 1027 -662 -20 -68 -273 333 183 -431 -743 -721 58 -125 -954 809 -315 518
3165 518 -355 -615 58 -797 474 813 -319 122 -204 -493 774 -85 102 428 -750 -209 653 -227 711
3184 711 -264 27 565 -542 77 -14 -95 293 -247 424 176 -164 351 -153 432 745 -416 -167 973 -29
$$ packed form
3047f21J250j039O79O77j205L45k5j1K87o66K46J78q44J312m29m30R75r93K20
3066i4M23p25P44l73n2O97r86M91J94r23Q15o2m97J172r97J81K84n93M93n7k58
3087a23O30n08J01N25j080O95l34m55R03n6l87N54o69R22n39n18J360j410L44
3106d5K57r04P42P22o56O38r38K46J44r16J045J6l80J011r83J10ln88P88o85k87
3127f66J122n47p06J340q92P79P68j926J94J36Q61j10n3o58N68o36O87P7j566
3146a228J881r94R25M43j689O42m8k05O06j50o14l12K2P79j83q29J763j124Q33
3165E18q73k60O73q55J271L39j132M41l26k89J267q59J87L26j178N41Q62q80R38
3184G11r75K91N38j107O19r1q1L88n40O71k48l40N15n04N85L13j161K49J140j002
$$ plain form
3204 -29 1044 -372 -441 415 -148 236 343 -490 416 8 -233 679 25 -119 460 -387 204 15 -420 418
3224 418 -149 -103 476 -385 -28 -72 -376 524 -53 -89 405 -374 324 -2 184 542 -143 59 104 -43 413
3245 413 311 -79 136 -403 -188 378 -344 93 128 -432 185 -376 -29 301 -543 -66 22 -341 344 -93 -183
3266 -183 378 -447 11 425 -430 283 -111 123 263 -251 402 0 -518 348 -291 -54 210 -471 -105 107
3286 107 -243 512 -228 -206 -151 -434 225 413 -516 -70 -315 -118 614 -84 132 215 -353 98 132 165 307 -683
3308 -683 307 43 -59 529 -213 -312 102 -199 332 236 -628 -22 -574 -233 879 -457 -58 -144 -1507 -100
3328 -100 -319 -166 79 -1192 -40 -449 -84 -47 -14 -433 -398 -248 414 3 -688 264 -446 420 876 -312
3348 -312 202 -98 -453 497 45 244 6 -697 82 324 -574 187 -187 -615 228 -141 -39 -326 -578 207
$$ packed form
3204b9J073j416o9Q56n63L84J07q33R06m08k41R12o54j44N79q47N91j89m35Q38
3224D18n67M6N79q61L57m4l04R00n77l6M94p79O98l26J86L58o85K02M5j47M56
3245D13j02l90K15n39K15N66p22M37L5n60O17n61L47L30q44M77Q8l63O85m37r0
3266a83N61q25M58M14q55P13l94K34J40n14O53m02n18Q66o39K37K64o81L66K12
3286A07l50P55p40K2N5k83O59J88r29M46k45J97P32o98K16Q3n68M51L4L3J42r90
3308f83R90k64j02N88p42r9M14l01N31r6q64O06n52L41J112j336L99q6j363J407
3328a00k19J53K45j271J152m09L65L7L3m19L5J50O62m11o91R52p10Q66M56j188
3348c12N14l00l55R50m52J99k38p03P79K42q98P61l74m28Q43l69J02k87k52P85
$$ plain form
3368 207 -428 135 718 -605 -142 394 -556 711 26 -112 116 -19 507 81 43 362 -201 -76 1089
3387 1089 -251 184 464 -679 253 473 106 -341 -521 81 -64 -105 795 -402 -501 815 -134 78 484
3406 484 -475 20 243 -29 458 85 387 -188 -148 1003 38 -341 463 -455 175 649 134 -146 -200 -23
3426 -23 63 -127 512 -13 -898 401 -126 -189 1014 -558 -515 239 98 4 91 -149 -265 -397 728 335 -472
3447 -472 578 -232 -398 1042 377 26 387 -167 618 287 677 461 -1203 625 102 -15 925 262 -1001
3466 -1001 520 -460 432 178 -1248 -493 -769 1250 495 -279 182 -18 -74 1021 803 -452 -399 263 -179
3485 -179 445 580 816 -651 -717 693 -133 1449 1031 -1516 303 524 753 586 20 -1171 -505 63
3503 63 613 -66 186 -1 -1403 128 1219 -385 -343 -375 -1000 12 747 503 -711 -1131 128 -217 535
$$ packed form
3368B07o35N63N83j323M63N36r50J267o85j38K28j35N26m26l8L19n63J25J165
3387A089j340M35K80j143R32K20l67m47j80O02j45m1R00j197r9J316r49K12M06
3406D84r59M95K23k72M87l73L02n75M0J151r65l79Q04r18O30M74n15k80n4J77
3426b3Q6j90O39n25q85J299n27o3J203j572M3P54j41r4Q7k40j16j32J125l93q07
3447d72J050q10j66J440o65l51L61n54P85l31L90k16j664J828n23j17R40o63j263
3466a001J521r80Q92k54j426P55k76K019p55p74M61k00n6J095k18j255N3O62m42
3485a79O24J35K36j467o6J410q26J582m18k547J819K21K29j67n66j191O66N68
3503F3N50o79K52j87j402J531J091j604M2l2o25J012P35k44j214m20J259l45P52
$$ plain form
3522 535 1102 -1039 -921 608 12 742 739 -362 -612 -63 782 177 -91 -362 -633 -136 1226 359 -699
3541 -699 177 -1310 78 502 -21 -904 -1250 -978 406 470 926 -398 -1414 316 14 26 483 -306 -473
3560 -473 -16 217 804 65 441 -400 -582 946 854 -554 -517 -427 -881 993 240 -167 -330 -49 -275 -319
3580 -319 504 142 -1145 3 -96 -255 729 -63 -569 -185 46 243 -126 83 385 -474 524 605 -415 318
3600 318 124 -768 653 26 -90 -140 -89 93 -534 -61 309 -947 151 229 -872 141 421 -657 -205
3619 -205 -288 -366 -64 -221 20 -377 212 478 -614 -127 705 -283 344 371 -53 124 138 238 -112 -184 598
3640 598 -83 -152 290 -522 -157 518 -534 158 152 -344 86 -132 112 32 -405 485 18 -428 157 154 -243 236
3662 236 -579 424 321 -647 745 -526 393 647 -488 142 -129 -474 232 -555 224 712 -91 738 203
$$ packed form
3522E35N67k141J18J529n96P30lj101k50N49Q45o05k68k71k71M97J362q67j058
3541f99Q76j487J388M24n23q83l46K72J384O4M56j324j016J730l02J2M57p89j67
3560d73M57K33N87p39L76q41j82J528r2j408L7R0m54J874p53m07j63K81k26m4
3580c19Q23l62j287J148r9j59R84p92n06L84K31J97l69K09L02q59R98Q1j020P33
3600C18j94q92J421o27j16n0N1J82o27M73L70j256J098P8j101J013K80j078M52
3619b05q3p8L02j57K41l97N89K66j092M87Q32r88O27K7m24J77J4J00l50p2P82
3640E98o81o9M42q12L65O75j052O92om96M30k18K44q0m37Q90m67m46N85ll97M79
3662B36q15J003j03r68J392j271R19K54j135O30k71l45P06p87P79M88q03Q29n35
$$ plain form
3681 203 -659 220 -337 156 -199 -718 261 -41 -532 364 -196 -161 182 -447 24 -89 -380 180 -440 -96
3701 -96 289 -425 237 -190 -396 504 71 -120 116 -133 258 -8 -147 320 -259 359 593 -47 415 395 -284
3722 -284 522 -294 -49 113 -243 529 -133 99 390 -401 -28 274 -275 247 304 -373 422 53 170 185 -249
3743 -249 -1 -148 -226 672 64 60 430 -156 449 434 167 663 226 121 394 -223 397 293 -50 741 -40
3764 -40 -225 800 -201 268 -68 -372 250 -572 130 -51 -158 544 174 -224 89 -183 13 395 -113 278
3784 278 124 -317 565 81 290 741 -332 466 165 -126 740 -108 -202 166 -284 41 -71 -322 231 -219
3804 -219 -72 462 -578 -89 -7 -716 438 -277 22 563 -500 252 -1 333 612 177 -131 27 -179
3823 -179 459 97 57 822 -83 -147 669 -15 -115 -101 26 124 -699 24 183 -540 70 109 -932 380 -340
$$ packed form
3681B03q62Q79n57M93l55n19R79l02m91Q96n60L5L43o29M71j13k91N60o20L44
3701i6L85p14O62m27k06R00m33j91K36k49L91k66j39M67n79O18K34o40M62k0o79
3722b84Q06q16K45J62l56P72o62K32K91p91L73L02n49N22N7o77P95l69J17J5m34
3743b49K48j47p8Q98o08mL70n86O05j5k67M96m37j05K73o17O20j04l43P91p81
3764d0j85J025j001M69l36l04O22q22P02j81j07P02l70l98L13k72J96L82n08L91
3784B78j54m41Q82m84K09M51j073P98l01k91Q66q48r4L68m50L25j12k51N53m50
3804b19J47N34j040M89Q2p09J154p15K99N41j063P52k53L34K79m35l08J58k06
3823a79O38l62m0P65r05o4Q16o84j00J4J27R8q23P23J59p23O10L9j041J312p20
$$ plain form
3844 -340 -194 129 -87 -173 123 160 553 -363 -86 445 -860 211 304 -547 469 194 -814 570 -186
3863 -186 -354 -16 63 565 -752 181 428 -226 -443 -10 -533 -155 -162 -230 310 -200 -110 -528 503 165 -838
3884 -838 -567 236 -1039 234 649 -732 28 61 -471 -415 145 49 -528 -443 599 -520 -346 370 -488 -162
3904 -162 132 -520 166 35 -348 -344 82 -21 -320 -615 739 -1111 -226 314 -681 -535 56 -420 -704 690
3924 690 263 -177 -647 708 -697 -581 781 -472 -803 748 -351 -299 124 244 11 376 440 -285 -633
3943 -633 218 -1034 -476 814 1028 -880 502 -534 -803 589 622 -78 -203 299 7 -373 126 -366
3961 -366 -815 995 507 -823 53 -3 -1788 -100 862 -456 -754 824 920 -663 1225 323 -1806 633
3979 633 398 -591 584 389 -791 -1514 998 602 -220 800 -303 -1580 215 1387 -485 587 -495
$$ packed form
3844c40J46L23k16q6K96L7L93r16K77N31j305J071R3q51J016k75j008J384p56
3863a86j68L38P9N02j317R33K47o54k17M33n23L78po8N40n10R0m18J031l38j003
3884h38K71Q03j275J273M15j381P60L3n32N6N60r6n77Q5J042j119J74P16q58L26
3904a62K94o52O86j31l83MM26j03k99k95J354j850Q85N40r95J46N91m76k84J394
3924F90m27m40m70J355j405J16J362j253l31J551j099N2M23J20k33L65O4p25l48
3943f33Q51j252N58J290K14j908J382j036k69J392L3p00j25N02k92l80M99m92
3961c66m49J810m88j330Q76n6j785J688R62j318k98J578R6j583J888r02k129K439
3979F33k35r89J175j95j180p23K512l96q22J020j103j277J795J172j872J072j082
$$ plain form
3996 -495 -994 652 893 -145 -1449 -1375 -65 -437 148 814 -1367 -484 887 388 2229 1321 -876 -1707
4014 -1707 817 969 -324 343 -253 -922 -223 1670 402 -15 -347 -1570 -509 1611 1768 -986 -363
4031 -363 216 -421 760 1371 -513 -1135 482 -395 3 1283 -276 -1221 56 543 62 358 441 -1062
4049 -1062 -441 1259 -41 -518 1041 -505 -700 1120 400 -455 -243 218 -357 -180 1187 -228 -1014
4066 -1014 689 -231 -665 1130 269 -1054 322 251 -372 47 795 -68 -689 944 405 -714 849 702
4084 702 -738 928 689 -593 348 381 -249 -449 802 229 -818 760 328 -832 385 605 -707
4101 -707 389 442 -492 -77 369 70 -525 747 418 -1008 178 955 -825 226 599 -785 328 941
4119 941 249 -240 186 77 -585 629 827 -913 125 693 -628 148 748 -735 -459 359 -76 -294
$$ packed form
3996d95m99J646K41j038j304P4J310l72N85O66k181Q83J371m99J841r08k197q31
4014a707K524J52j293O67n96o69O99J893j268m17l32j223J061K120J57k754O23
4031c63N79o37J181O11j884o22J617q77L98J280j559r45J277M87m81K96Q3j503
4049a062O21J700j300m77J559j546j95J820p20q55K12M61n75J77J367j415p86
4066a014J703r20m34J795q61j323J376p1o23M19P48q63o21J633n39j119J563j47
4084G02j440J666k39j282R41L3o30k00J251n73j047J578m32j160J217K20j312
4101g07J096N3r34M15M46k99n95J272l29j426J186P77j780J051L73j384J113O13
4119I41o92m89M26j09o62J214J98j740J038N68j321P76O00j483K76Q18m35k18
$$ plain form
4137 -294 355 509 -921 -434 786 -404 -26 773 -761 -214 567 39 179 198 229 -203 -92 1019 -226
4156 -226 -354 985 -678 -322 682 -231 -246 85 -70 -347 -121 246 -465 -641 694 -173 -391 560 -154
4175 -154 -543 747 -24 -531 446 369 -710 -445 342 -73 13 1010 -75 -486 673 490 191 427 2
4194 2 -400 -6 195 -164 -227 334 225 -571 742 57 -727 276 62 -688 -25 -77 -249 -236 148 40 -484
4215 -484 247 193 -615 291 180 -689 16 153 -253 -33 135 235 -259 30 246 -671 81 263 -816 156
4235 156 191 -180 217 -92 -270 192 -179 154 -195 -163 449 -550 31 226 -307 192 197 -321 4 200 -156
4256 -156 64 -101 322 -216 -341 387 -194 2 273 -513 122 292 -14 326 31 174 36 -160 139 -14
4276 -14 -349 165 -15 -43 276 -389 217 174 -379 332 -24 -110 343 -196 98 80 -211 265 -175 -240 253 -18
$$ packed form
4137b94O49J54j430M87J220j190L78P99j534N47P81n28J40J9L1m32J11J111j245
4156b26j28J339j663L56J004r13j5L31j55k77K26L67p11j76J335q67k18R51p14
4175a54l89J290p71n07R77p7j079K65P87m15Q6R97j085m11J159j83k99K36m25
4194Bm02L94K01l59o3N61j09p96J313o85p84J003k14p50O63n2j72J3L84j08n24
4215d84P31n4q08R06j11q69P05J37m06K20J68J00m94K89K16r17P52J82j079R72
4235A56L5l71L97l09j78M62l71L33l49L2O12r99N81J95n33M99Nn18L25J96l56
4256a56K20j65M23n38j25P28n81J96K71p86O35J70l06L40k95J43j38j96K99j53
4276a4l35N14j80k8L19o65O06m3n53P11l56q6M53n39K94j8k91M76m40o5M93k71
$$ plain form
4298 -18 26 226 577 -172 914 -484 -758 33 203 471 -274 499 -46 151 343 -11 342 281 -141 136
4318 136 -95 53 196 -242 280 -195 -233 -40 -102 -135 277 -71 2 97 -509 257 -279 272 -342 -404 -34 -48
4340 -48 -357 -165 171 -639 877 195 -293 246 -424 -539 19 607 251 -93 269 572 -421 353 112 -63
4360 -63 -53 -198 -9 -208 -110 426 -93 -41 382 -393 278 173 -430 -121 -162 -162 205 38 173 -255 12 624
4382 624 -167 -267 624 -278 69 547 -85 408 214 16 -186 -141 604 23 -36 593 -340 -108 739 -204 -110
4403 -110 114 -319 18 -1 -37 19 -466 492 115 -95 522 -162 -134 483 -143 -225 224 -172 -164 110 343 219
4425 219 -334 529 256 -58 666 -39 -690 439 96 -352 457 89 137 -173 130 -165 -372 558 -235 -654
4445 -654 670 298 -469 294 139 -432 224 413 -78 -230 351 107 -247 657 296 -584 484 480 -278 617
$$ packed form
4298a8M4K00L51p49J086j398k74P91J70K68p45P73n45J97J92l54L53o1m22K77
4318A36k31J48J43m38N22m75l8J93o2l3M12l48P3R5o06P66n36N51o14o2L70j4
4340d8l09J92L36q10J516o82m88N39o70j15N58N88l56l44L62L03r93P74k41j75
4360f3J0j45J89j99R8N36n19N2M23p75O71j05o03L09m1%L67j67J35m28K67O12
4382F24p91j00Q91r02L47M78o32M93j94j98k02M5P45n81n9O29r33K32Q47r43R4
4403a10K24m33L37j9l6N6m85R58l77k10O17o84K8O17o26q2M49l96QK74K33j24
4425B19n53Q63k73l14P24p05o51J129l43m48Q09l68M8l10L03k95k07R30p93m19
4445f54J324l72p67P63j55n71O56J89m91j52N81k44l54R04l61q80J068mp58Q95
$$ plain form
4465 617 769 -177 8 397 605 -38 380 567 -599 543 861 -578 363 502 -700 -9 836 -110 -369
4484 -369 209 65 -331 423 846 -948 -91 912 -552 441 1269 -622 -486 385 99 -399 446 571 -845
4503 -845 -201 1632 -418 -40 898 -359 -367 718 190 -549 206 342 -518 228 1232 -864 -833 634 -515
4522 -515 -488 902 -286 -985 441 72 -425 694 685 -852 -567 1247 -341 -360 1095 -111 -751 1191
4540 1191 562 -856 317 349 -481 -22 1114 -135 -470 883 -148 -981 997 29 -1158 348 209
4557 209 -912 39 649 -681 -986 1110 5 -831 1229 268 -1367 411 381 -938 114 374 -565
4574 -565 -345 1044 53 -912 930 320 -1153 812 715 -1130 232 877 -859 -155 870 -266 -794
4591 -794 595 403 -1125 580 628 -1100 267 718 -1246 -335 528 -813 -545 521 34 -792 412
$$ packed form
4465F17J52r46J85L89K08o43M18J87j166J142L18j439R41J39j202O91Q45r46k59
4484c69N78j44l96P54M23j794Q57J003j464R93Q28j891J36Q71k86m98Q45J25j416
4503h45O44J833k050L78R38j257qJ085n28p39P55J36q60P46J004k096L1J467j149
4522e15K7J390j188o99J426l69m97J119rj537K85J814j588j9J455j206o40J942
4540A191o29j418J173L2q30M59J136j249l35J353j031q33J978r68j187J506j39
4557B09j121R51O10j330l05K096j105q36K060r61j635J778l0j319J052K60r39
4574e65K20J389r91r65J842o10j473J965r7j845J362O45j736P04J025j136n28
4591g94J389j92j528J705M8j728J367M51j964R11Q63j341K68J066m87q26J204
$$ plain form
4608 412 560 -1037 539 913 -878 -11 1237 -648 -331 1053 -211 -535 725 432 -847 257 1203
4625 1203 -993 -239 1137 -836 -464 896 -287 -800 153 239 -549 49 936 -752 -364 1158 -594
4642 -594 -364 1128 -253 -687 967 433 -582 510 933 -314 -24 1341 -392 -837 1258 -52 -597
4659 -597 1199 58 -748 579 513 -680 -68 828 -644 -756 1003 -137 -629 782 -21 -776 296
4676 296 465 -333 380 692 -372 -58 444 206 -676 1217 57 -973 789 554 -574 330 332 -716
4694 -716 -141 633 -212 -643 729 -288 -1080 611 438 -970 394 180 -879 58 498 -128 -508 480
4712 480 314 -748 636 503 -894 201 891 -569 328 863 -301 -47 678 433 -410 231 138 -555
4730 -555 355 759 -478 -230 362 -607 -112 668 -109 -346 62 57 -459 121 494 -551 -213 571 -328 -289
$$ packed form
4608D12J48j597J576L74j791Q67J248j885L17J384j264l24J260k93j279J104R46
4625A203k196P54J376j973L72J360j183n13R53Q6p88N98Q87j688L88J522j752
4642e94K30J492j381m34J654n34j015J092M23j247K90J365j733m45K095j310n45
4659e97J796j141q06J327o6j193O12Q96j472j12J759j140m92J411q03p55J072
4676B96J69p98P13L12j064L14N02k38q82J893j160j030J762k35j128R04Kj048
4694g16N75P74q45m31J372j017p92J691j73j408J364k14j059R37M40o26l80R88
4712D80j66j062J384j33j397J095O90j460Q97N35j164K54P25k45q43O41r3o93
4730e55R10M04j237K48N92r69M95P80p77k37M08nn16N80L73j045L38P84q99L9
$$ plain form
4750 -289 560 -226 -397 191 188 -189 -89 552 -242 -377 688 -266 -401 575 -77 -72 652 142 -319 35 -65
4771 -65 -258 -170 556 -310 -526 442 -238 -568 619 -321 -402 532 -71 -203 -439 290 -8 -281 368 157 -531
4792 -531 418 319 -533 540 235 -376 153 86 -75 -255 -112 -52 -616 191 14 -631 165 -302 -345 231 -227
4813 -227 -419 -198 -71 7 -527 -56 136 -460 233 229 -394 109 21 -297 244 34 -241 -137 224 101 -255
4834 -255 -5 351 -365 -198 452 -176 119 407 -236 187 -107 246 228 -75 157 -108 259 339 -248 -147 289
4855 289 -376 106 295 -303 274 -260 -220 349 -83 361 -182 -85 550 48 262 368 -198 167 35 32 215
4876 215 3 234 51 -178 130 295 30 292 225 -90 55 -291 -20 129 -402 98 -113 -189 -22 -107 138
4897 138 97 -310 219 -105 126 258 -267 267 188 96 258 43 53 119 -92 403 186 -160 423 25 79 126
$$ packed form
4750b89Q49p86j71N88ll77J00O41p94j35J065r54j35R76o52NP24n10m61L54j00
4771f5j93Q8P26q66k16R68o80l30J187r40q1R34o03j32k36P29k98k73O49k11o88
4792e31R49r9q52J073l05o11N29o7j61j80J43O0n64Q07j77o45P96m67m3N76m58
4813b27j92K21J27P8n34M71J92n96O93mo23N03q8l18N41k10k75J04L61j23l56
4834b55K50L56p16J67O50o28K95K88o43M23k94L53j8l03K32k65L67Q0n87J01M36
4855B89o65M82J89n98N77n34M0N69m32M44n43R7O35n02K14J06n66L65j32lJ83
4876B15k12K31j83k29L08J65k65K62o7l15J45l46K71J49n31N00k11p6J67q5K45
4897A38m1m07N29l24K31J32n25N34p9r2J62k15J0O6k11M95k17l46N83l98N4M7
$$ plain form
4919 126 -297 106 -82 -426 273 -418 85 -10 -85 -59 135 -419 202 -330 -129 170 -192 -82 -2 11 251 -342
4941 -342 146 337 -442 443 -54 -300 157 39 -9 46 -261 145 -88 -174 335 -37 160 318 -621 69 -14
4962 -14 -250 391 93 -16 28 25 1 -217 -122 210 -430 160 399 -514 -63 453 -82 -143 138 -21 -28 -45 208
4985 208 -30 146 660 -243 76 480 -393 -53 250 -250 -109 248 360 -81 99 153 -294 -109 744 -581
5005 -581 -353 720 2 -346 226 -197 -534 206 343 -80 -279 660 -202 -402 494 -302 -459 690 428
5024 428 -289 352 238 -417 -55 752 -115 -489 789 -177 -500 808 -78 -533 364 186 -653 74 198
5043 198 -393 -487 -30 9 -617 574 -1 -870 367 291 -420 488 269 -659 -254 587 -115 -437 505 312
5063 312 -725 711 844 -889 117 511 -688 202 402 -137 -435 242 162 -989 330 626 -1006 17
$$ packed form
4919A26m23M03j88l44O99o91N03r5p5K6J94n54O21n32K01K99l62J10Q0J3K40n93
4941c42M88J91p79Q85m97k46M57j18m8N5l07M06k33q6N09l72J97J58r39O90q3
4962a4k36O41k98j09M4lk4k18R5L32o40N90K39r13M51N16n35o1K81j59pj7K53
4985B08k38J76N14r03L19M04q73L40L03n00J41L57J12m41J80N4m47J85Q53j325
5005e81K28J073p18l48N72m23l37P40J37m23j99R39q62k00Q96p96j57J149k62
5024D28p17O41j14o55L62Q07q67l74J278r66l23J308q86m55Q97j78q39P27J24
5043A98n91r4M57L9o26J191n75q69J237p6p11R08k19r28M05Q41p02l22R42j93
5063C12j037J436J33j733J006L94j199Q90K00n39k98O77q0j151J319K96j632J023
$$ plain form
5081 17 537 -939 -298 239 -604 -423 389 63 -688 339 189 -898 -82 1014 -534 -56 535 -585
5099 -585 -459 894 104 -601 265 121 -364 226 951 -885 -364 907 -516 -42 969 -778 -865 442
5117 442 268 -467 121 376 -977 -556 954 -488 -753 871 -561 -899 767 -7 -870 232 217 -848
5135 -848 -211 946 -511 -675 959 -468 -946 1265 42 -965 448 21 -650 44 861 -611 -673
5152 -673 529 -253 -553 586 172 -1069 277 381 -732 76 437 -494 -520 856 40 -523 785 -76
5170 -76 -1215 731 642 -629 90 204 -824 -122 905 5 -884 413 -223 -1103 930 703 -818 313
5188 313 221 -1589 -437 293 -695 -109 458 264 -421 932 465 -1002 248 988 -619 231 830 -677
5206 -677 -358 759 433 -452 174 438 -1197 302 1091 -782 -127 716 -697 -341 607 -381 -706 215
$$ packed form
5081A7N20j476O41N37q43J81Q12l26p51J027j50j087Q16J096j548M78N91j120
5099e85J26J353p90p05Q66j44m85N90P25j836N21J271j423M74J011j747q7J307
5117D42j74p35N88K55j353M21J510j442k65J624j432l38J666p74q63J102j5j065
5135h48O37J157j457j64J634j427m78K211j223j007J413m27o71O94Q17j472o2
5152f73J202p82l00J139m14j241J346J04j113Q08L61r31k6J376q16n63J308q61
5170g6j139J946q9j271P19J14j028P02J027r00q89J297o36q80K033k27j521J131
5188C13r2j810J152P30r88N86N67j94o85J353m67j467J250P40j607Q50N99j507
5206f77L19J117l26q85O26K64j635J499P89j873O55Q43j413L56R48r88l25R21
$$ plain form
5224 215 58 -611 347 734 -876 -514 638 -585 18 845 -435 -638 586 220 -311 284 544 -647
5242 -647 -1 946 -248 -565 802 -224 -431 667 147 -467 347 170 -487 65 808 -374 -612 977
5260 977 -132 -343 627 -266 -813 551 167 -317 592 408 -571 -255 640 -83 -263 614 -144 -205 853
5279 853 640 -1676 686 1163 -201 -679 574 -884 -941 453 -115 -530 615 71 -727 965 -225
5296 -225 -221 -32 108 -138 45 82 -161 -248 735 669 -442 163 494 -663 173 452 -179 20 135 -90 -425
5317 -425 134 91 -211 136 501 -619 75 307 -629 90 196 85 -393 196 135 -413 110 365 -288 -71
5337 -71 421 -439 -195 292 -294 -186 151 152 -5 3 291 -175 -149 243 -180 -83 337 -134 -64 180 -29 -67 179
5360 179 92 -254 -235 398 -64 -199 419 -279 -262 174 -187 -86 129 -166 -101 -109 194 5 -279 55 311 -148
$$ packed form
5224B15j57o69R58L87j610L62J152j223O03Q27j280k03J224l66n31N95K60j191
5242f47O46R47j194l17J367j026k07J098n20o14Q14j77o57N52P43j182k38J589
5260I77j109k11R70q93n47J364l84m84R09j84r79L16Q95p23j80Q77p58o1J058
5279H53k13k316K362M77j364m78J253j458n7J394n68m15J145n44p98J692j190
5296b25MJ89J40k46J83L7k43q7R83o6j111O05L31j157Q36K79o31J99J15k25l35
5317d25N59m3l02L47L65j120O94K32r36P19J06j11m78N89o1n48N23K55o53K17
5337g1M92q60K44M87n86J08L37Jj57QK88m66K6L92m23R7M20m71P0K44k09l8K46
5360A79q7l46J9O33m62j35O18o98J7M36l61J01K15k95O5qL03j89k84L34K56m59
$$ plain form
5382 -148 296 9 -106 412 -131 22 -22 94 125 -108 -10 -207 -162 175 64 -438 92 115 -31 -45 37 -113
5404 -113 11 219 38 -104 -81 388 -205 100 -121 -63 -37 187 -112 124 18 35 178 245 241 -151 40 378
5426 378 94 -68 30 -189 242 83 -4 490 -80 -167 41 -50 203 -181 -5 211 -202 125 172 -27 94 -48
5448 -48 -11 -174 5 -93 -98 -213 139 -224 -173 165 9 143 51 -183 288 13 -212 -55 -176 49 -136 88
5470 88 229 252 81 383 -124 -59 287 51 130 431 109 -89 -205 -21 10 -1 243 -86 -123 141 -457 -97
5492 -97 253 -212 -86 1 102 9 -278 295 -25 -310 429 -103 -219 152 287 68 68 -182 -6 -88 148 -64
5514 -64 -256 -280 -144 -465 189 -198 -178 259 -197 -410 119 34 -27 -83 24 331 -258 123 84 -333 43 189
5536 189 7 42 92 -134 -86 209 -209 -68 -30 178 -213 204 70 -457 32 55 -147 280 137 -91 -202 336
$$ packed form
5382a48M44k87j15N18n43J53m4J16L1k33R8j97M5L37j11n02N30K3j46j4Q2j50
5404a13J24K08j81j42K3M69n93L05k21N8K6K24k99K36j06J7J43O7ml92J91L38
5426C78k84j62R8k19M31j59q7M94n70q7K08r1K53l84J76K16m13L27M7j99J21j42
5448d8L7j63J79r8nj15L52l63N1L38j56J34r2k34M71k75k25J57j21K25j85K24
5470H8J41K3j71L02n07O5L46k36P9L01l22j98j16J84L1j1K44l29l7K64n98L60
5492i7L50m65J26Q7J01r3k87N73l20k85P39n32j16L71J35k19%k50J76q2K36k12
5514f4j92k4J36l21O54l87K0M37m56k13N29q5o1n6J07L07n89L81l9m17L76J46
5536A89j82L5N0k26M8K95m18J41L8K08l91M17j34n27M89K3k02M27j43k28j11N38
$$ plain form
5558 336 82 -92 338 320 -309 -150 435 -377 215 227 -243 -68 211 297 -141 11 277 -110 321 660 -278
5579 -278 163 423 -545 -139 510 -129 40 -61 -86 -275 156 482 -332 -324 431 -521 -150 447 -355 -423 82
5600 82 161 -269 92 97 -255 -222 409 -79 -401 767 -149 -628 604 345 -251 138 76 -142 -250 651 18
5621 18 -282 424 -36 -127 692 23 -515 174 166 -154 214 463 -54 -172 227 -71 -563 818 230 -481 288
5642 288 294 -412 210 429 -277 -294 556 -45 -426 393 -43 -617 359 619 -657 226 201 -609 -204 749 -32
5663 -32 -667 164 51 -569 142 682 -849 24 581 -524 -69 858 -353 -599 246 140 -491 287 449
5682 449 -826 -77 468 -564 46 735 -443 -337 710 -96 -250 461 213 -707 206 762 -430 -282
5700 -282 838 -297 -529 921 20 -496 293 69 -599 252 720 -674 -443 492 -309 -17 781 -242
$$ packed form
5558C36k54j74M30j8o29J59N85q12N92J2m70J75K79Q6m38J52K66l87M31L39r38
5579b78M41K60r68M06O49o39J69j01k5j89M31L26q14QP55r52L71N97q02o8N05
5600H2P9m30L61Nl52L3O31m88l22J168r16m79J232k59n96L89o2k18j08R01o33
5621A8l00P06m60r1Q19o69n38O89ql20L68K49n17j18L99k98m92J381n88p11P69
5642B88Op06O22K19p06j7Q50o01l81Q19m36n74R76K60j276Q83k5q10M05R53p81
5663c2o35Q31j13o20P11N40j531Q73N57j105M55R27j211k46Q45j06o31P78J62
5682D49j275P49N45j032O10O89j178J06J047q06j54P11k48r20R13N56j192J48
5700b82J120j135k32J450r01n16P89k24o68Q51M68j394K31R35q01K92P98j023
$$ plain form
5718 -242 -603 145 227 -303 256 722 -706 -16 869 -470 -460 495 -279 -943 490 249 -382 344 271 -659
5738 -659 -266 460 -139 -539 528 -285 -643 816 7 -752 297 481 -769 64 219 -552 -283 483 95
5757 95 -771 682 321 -791 693 606 -769 158 435 -582 -158 753 -214 -348 539 157 -493 432 399
5776 399 -780 126 549 -444 24 580 -278 -352 512 50 -509 415 225 -945 324 504 -561 182 668
5795 668 -260 -237 343 -25 -417 328 339 -696 225 559 -543 -16 594 -566 -169 545 -22 -40 297 189
5815 189 -393 347 542 -346 -195 761 -277 -484 1104 -13 -562 533 302 -263 197 551 -399 -160 621
5834 621 -344 -211 538 -271 -402 403 -192 -368 129 490 -596 -100 328 -12 -267 708 -240 -617 712
5853 712 360 -408 457 268 -225 82 308 5 -233 383 -131 -404 692 -130 -266 369 102 -470 40 401
$$ packed form
5718b42l61P48Q2n30N59M66j428O90Q85j339J0R55p74o64J433k41o31P26p3r30
5738f59L93P26n99m00J067q13l58J459q09p59J049J84j250Q33J55p71K69P66l88
5757I5q66J453l61j112J484q7j375R27K77j017M24R11r67j34Q87l82o50R25l3
5776C99j179R06M23r93M68N56q58p4Q64m62n59R24j90j170J269J80j065P43M86
5795F68r28K3N80l68l92P45J1j035R21L34j102N27O10j160L97P14n67j8L37j08
5815A89n82P40J95q88J51R56j038k07J588j117n49J095k31n65M60L54r50K39P81
5834F21r65J33P49q09j31Q05n95j76M97L61j086M96M28l40k55R75r48l77J329
5853G12l52p68Q65j89m93L07K26l03k38O16n14k73J096q22j36O35k67n72N10L61
$$ plain form
5873 401 -201 -64 413 -36 -672 503 310 -557 305 214 -292 110 187 -516 -76 99 113 -71 92 23 -155
5894 -155 499 138 -538 116 506 -53 19 93 -281 -27 101 184 -303 295 300 -159 63 363 -270 -128 612 -285
5916 -285 -116 20 -91 125 -68 298 -263 53 364 -226 39 434 -135 108 156 -123 33 15 17 -38 69 -8
5938 -8 -81 -295 56 69 -175 214 65 -225 -5 -404 2 -139 38 -215 -272 315 -214 176 184 -176 -146 57 -47
5961 -47 -43 45 -296 60 172 147 -255 -156 128 -162 -409 275 124 -160 7 71 -33 -151 -142 222 -117 119 304
5984 304 34 351 253 -229 325 -260 -164 104 -41 109 -251 46 -150 -97 253 214 -266 -157 -228 -121 -8 -113
6006 -113 -104 145 -279 -18 243 172 357 21 125 78 132 139 253 -159 12 67 139 -19 20 -157 -210 86 -20 -65
6030 -65 -243 383 175 123 378 98 -41 323 138 219 328 14 315 -132 53 -201 137 175 -131 35 154
$$ packed form
5873D01o02J37M77m49o36J175j93q67Q62r1n06M02P7p03M40J75J4j84J63o9j78
5894a55O54l61o76O54L90n59P2P4l74K54J28Q3m87N98Nm59K22L00o33J42P40q97
5916b85J69J36j11K16j93L66n61L16L11n90K65L95n69K43M8k79J56j8Kn5J07p7
5938hp3k14L51J3k44L89j49k90K20l99M06j41J77k53n7N87n29L90Ql60L0K03j04
5961d7MQ8l41L56J12k5m02R9K84k90k47O84j51k84J67O4j04j18RL64l39K36J85
5984C04k70L17r8m82N54n85R6K68j45J50l60K97j96N3L50l9m80J09p1J07J13j05
6006a13RK49m24K61K61p1J85l36J04m7N4PJ14m12J71N5P2j58L9j77n3K96j06m5
6030f5j78O26k08n2K55k80j39L64j85Q1J09l14L01m47J85k54L38L8l06J66J19
$$ plain form
6051 154 -11 -181 147 38 -97 -198 199 -493 96 438 -398 20 415 -80 -52 285 -407 -12 324 146
6071 146 -28 -407 420 193 -441 207 57 46 846 144 190 15 581 167 -122 216 1 -213 475 218 114
6092 114 -88 -601 -359 -302 -354 387 -19 -8 27 66 9 -509 291 -193 -400 9 468 -225 75 19 -566 -680
6114 -680 -64 142 136 138 160 -142 -1008 963 18 -485 -486 46 -87 671 361 147 -341 268 757 -391 238 534
6136 534 -49 587 -1082 -487 739 755 -48 336 854 -168 -53 -713 -84 -554 -411 145 -808 634 1156
6155 1156 -424 290 170 80 -864 198 1014 -56 548 489 147 -406 356 49 -118 773 -177 -1005 675
6174 675 -199 -525 447 354 -252 -448 674 -225 -40 333 -120 -315 328 -87 -479 100 244 -216 318 247
6194 247 -374 37 430 -280 57 542 43 -148 613 83 -448 342 339 -224 -210 339 -155 -275 427 -50 -569
$$ packed form
6051A54j65j70L28j09j35j01L97o92N89L42q36M18L95m95K8L37o92L95L36j78
6071A46j74l79Q27k27o34O48j50j1Q00p02M6j75N66m14k89L38k15k14O88k57j04
6092A14k02n13K42N7n2P41m06J1L5L9n7n18Q00m84k07M09M59o93L00n6n85j14
6114f80O16K06oKK2l02q66J971r45n03jN32j33P58l10k14m88O09M89j148O29K96
6136E34n83O36j669N95J226J6q03L84N18j022J15o60O29m70J43N56r53J442N22
6155A156j580P14j20r0r44J062Q16j070O04n9l42n53P62l07j67Q91r50q28J680
6174F75q74l26R72r3o06j96J122q99J85L73m53j95O43m15l92N79J44m60N34p1
6194B47o21M11L93p10L37M85m99j91P61n30n31P90ln63J4N49m94j20P02m77n19
$$ plain form
6215 -569 464 353 -492 313 289 -188 62 481 90 -569 541 -105 -527 717 175 -615 -13 154 -273
6234 -273 203 659 -52 -160 483 239 -390 648 303 -560 413 67 -302 290 432 -235 59 595 -245 -205
6254 -205 463 164 -753 587 547 -701 2 794 -231 48 629 -344 -520 321 315 -486 289 655 -600 159
6274 159 812 -414 -44 361 -235 -349 616 -19 -329 34 73 -377 -220 637 -344 -151 748 -718 -329 608
6294 608 -225 -643 0 352 -526 45 605 -593 -324 980 -201 -362 695 -208 -649 244 296 -399 52
6313 52 261 -467 -182 639 -419 -711 176 -294 -655 449 333 -780 114 125 -394 -135 376 -590 -475 584
6333 584 -46 -401 485 -57 -531 314 327 -227 -388 342 -500 -213 466 357 -777 311 274 -652 149 312
6353 312 -660 49 425 -122 -101 313 -71 -617 382 409 -671 56 204 -538 -227 197 -360 -470 385 -168
$$ packed form
6215e69J033j11q45Q05k4m77K50M19l91o59J110o46m22J244n42p90O02J67m27
6234b73M76M56p11j08O43k44o29J038l45q63R73l46l69N92J42o67K94N36q40M0
6254b05O68k99r17J340m0j248P03P92j025K79N81r73j76Q41oq01P75L66j255P59
6274A59O53j226L70M05n96j14R65o35l10L63L9m50J57Q57r81J93Q99j466L89R37
6294F08q33m18O43L52q78N71N60j198K69J304j181j61J057r03m41Q93N2o95M51
6313E2K09p28K85Q21j058k92Q87m70l61J104j16j113Q94J1n19K59N11r66J15J059
6333E84o30l55Q86n42m74Q45J3n54j61P30q42K87O79j09j134J088l7r26Q01J63
6353C12r72P09L76n47K1M14l84n46R99K7j080P27J48p42L11M24n57j10Q55n53
$$ plain form
6373 -168 -258 599 58 -761 144 374 -292 138 276 -460 342 362 -230 -428 98 71 -287 405 241 -708 -170
6394 -170 250 -326 -30 528 -56 -413 460 89 -392 337 79 -364 3 404 -335 -157 233 -280 -258 361
6414 361 -13 -240 250 -47 -95 -130 408 -424 -328 312 -195 -324 622 -112 -283 146 162 -108 177 -16 -131
6435 -131 -153 419 19 -447 148 -147 -255 389 265 -221 29 -186 76 19 378 -170 -145 -49 -380 -87 456
6456 456 49 -227 161 208 -360 127 314 -238 31 311 -196 -300 320 296 -448 442 -159 -119 334 261 -172
6477 -172 -249 135 81 -45 237 233 -236 227 410 -175 -142 346 -126 -238 40 -27 14 -252 573 -360 141 234 -287
6500 -287 -218 514 -223 -156 266 -313 -33 243 61 67 -50 247 435 119 662 -455 -117 -6 308 257 255 -353
6522 -353 -143 -229 249 -20 -447 268 -383 301 313 380 232 3 -630 -138 -21 20 -239 95 115 24 -124 446
$$ packed form
6373a68r0Q57n41q19R05K30o66M30J38p36Q02K0n92j98N26k7l58O92j64r49N38
6394a70M20n76K96N58n84l57Q73l71m81P29k58m43L67M01p39J78L90n13K2O19
6414C61l74k27M90k97m8l5N38q32R6O40n07j29R46p34j71M29J6k70K85j93j15
6435a31k2N72m00m66N95k95j08O44j24m86K50k15K62n7L59n48K5R6l31K93N43
6456D56m07k76L88M7n68M87J87n52K69K80n07j04O20k4p44Q90o01M0M53p3m33
6477a72p7L84n4j26K82mm69M63J83n85L3M88m72j12K78o7M1k66Q25r33N01R3n21
6500b87O9P32p37O7M22n79K80K76j82Oj17K97J88l16N43j117L38J11L14n1ko08
6522c53K10q6M78k69m27P15o51O84J2O7j48k29o33M92J17M1k59L34K0r1j48N70
$$ plain form
6544 446 -258 -126 -79 2 193 691 483 -353 -273 347 641 -60 -395 226 -333 1082 186 96 80 272 111
6565 111 441 -186 -30 -245 -11 220 199 -477 248 -335 267 -37 -295 -108 163 -67 459 -187 193 -184
6585 -184 -77 -88 -326 516 -451 311 236 -73 -32 -504 -964 -41 105 50 -143 248 -292 594 91 -511 -353
6606 -353 -506 41 135 161 4 305 52 24 6 251 -157 25 540 221 370 -1013 44 -132 492 269 708
6627 708 87 -445 188 363 505 -1041 1117 -120 -48 766 257 -204 -101 835 -284 58 277 -595 -193
6646 -193 348 -308 -271 -32 922 73 -170 -590 206 -20 -169 88 801 -115 102 360 -627 -206 -10 30 1308
6667 1308 4 -993 132 -349 -481 463 13 421 -63 -120 541 -245 642 -339 27 232 644 -464 116
6686 116 -186 -571 16 1172 -39 98 675 788 58 -210 -60 53 269 541 -510 1169 -199 26
$$ packed form
6544D46p04J32M7Q1J91M98k08q36Q0O20K94p01l35O21n59J415q96r0j6J92j61
6565A11L30o27J56k15K34K31k1o76P25n83O02l04k58J87K71k30N26o46L80l77
6585a84J07j1k38Q42r67P62p5l09M1m72m60R23J46n5j93L91n40Q86n03o02J58
6606c53j53N47R4K6j57L01k53k8j8K45m08J82N15l19J49j383J057j76O24k23M39
6627G08o21n32O33J75J42j546K158j237P2Q14n09m61J03R36j119L42K19q72M02
6646a93N41o56L7K39R54q49k43m20P96k26j49K57P13r16K17K58r87M21J96M0J278
6667A308j304r97J125m81j32R44m50M08m84n7O61p86Q87r81L66K05M12j108N80
6686A16l02l85N87J156j211J37N77J13p30k68J50J13K16K72j051J679j368K25
$$ plain form
6704 26 -127 688 108 13 744 749 -424 461 -48 -823 93 396 -1102 163 171 341 -481 -296 51 -186 -66
6725 -66 -79 -120 94 -168 -753 298 160 -604 -58 201 27 -162 -271 458 -520 -216 252 -219 -33 -278 -409
6746 -409 78 344 -348 -608 -150 -272 -505 390 -226 -561 -697 598 -365 -376 201 -658 -63 166 -161 -210
6766 -210 -79 221 -303 -177 73 -197 147 11 -208 -114 442 -24 -529 131 81 -280 305 332 -42 -338 447
6787 447 -209 -316 420 -17 -809 85 99 -59 -208 256 -207 -206 330 40 -402 387 -115 -672 537 179 -494
6808 -494 146 363 -444 -188 354 -130 -178 362 52 12 497 492 -497 354 319 -268 377 211 -281 -281 296 191
6830 191 -374 342 166 -468 141 286 -450 398 660 -263 -27 337 -348 -240 79 28 -613 191 242 -537 159
6851 159 388 -360 -215 448 25 11 206 110 -372 513 431 -270 -3 595 -519 -344 375 -179 -190 142 -115
$$ packed form
6704B6j53Q15n80r5P31Nj173Q85n09p75R16L03j498J265QJ70q22J85L47k37J20
6725f6j3m1K14k62n85J051j38p64N46K59j74j89j09P29r78L04M68m71J86k45j31
6746d09M87K66o92k60M58j22k33Q95o16l35j36J295r63j1N77q59N95K29l27m9
6766b10J31L00n24J26K50k70L44j36k19R4N56m66n05O60n0l61N85K7l74k96P85
6787D47o56j07P36m37p92Q94J4j58j49M64m63JN36k90m42P89n02n57J209l58o73
6808d94O40K17q07K56N42m84m8N40l10m0M85nr89Q51l5n87O45j66m92%N77j05
6830A91n65P16j76o34O09J45p36Q48K62r23K36L64o85J08L19n1o41Q04N1p79O96
6851A59K29p48J45O63m23j4J95r6m82Q85q2p01K67N98j114J75P19n54j1L32k57
$$ plain form
6872 -115 -280 337 173 -391 -175 511 -727 -69 443 -441 -353 341 -98 -173 287 119 -416 7 632 50
6892 50 87 349 -68 -294 321 221 -245 473 70 -411 114 514 162 -199 437 -369 100 618 16 -426 124
6913 124 154 -254 197 247 -370 -189 420 -13 -206 617 -3 -45 312 142 -412 195 245 -416 -74 249 110
6934 110 16 192 10 -397 382 254 -399 33 59 -205 373 252 -158 -41 220 10 -114 170 23 -277 214
6955 214 236 -157 139 273 -432 -155 126 -31 -345 94 24 -465 162 262 -410 132 161 -193 1 148 24
6976 24 -140 182 275 -214 66 306 -707 53 340 -239 -313 255 14 -178 205 -31 -277 148 71 -138 -77
6997 -77 259 -110 -127 284 -327 -154 46 -188 -392 255 58 -24 -79 251 -551 -40 234 -286 -151 276 -5
7018 -5 -170 50 -160 -154 65 234 -78 -474 265 -112 -357 153 -292 -230 458 -92 6 372 -343 35 -160 10
$$ packed form
6872a15j65O17j64n64K16O86j238O58N12q84Q8O94m39p5M60j68n35M23O25n82
6892E0L7K62m17k26O15j00m66P18m03m81N25M00l52l61O36q06M69N18o02m42N50
6913A24L0m08M51N0o17J81O09m33j93Q23o20m2L57j70n54O07N0o61L42L23j39
6934A10r4J76j82m07P79j28o53M32K6k64N78j21m10J17K61k10j24K84j47l00M91
6955B14K2l93K96J34p05K77K81j57l14M39p0m89O27J00o72N42K9l54J94J47j24
6976B4j64L22R3m89K80K40j013P60K87n79p4N68k41j92L83k36k46M25p7k09O1
6997g7L36l69j7M11o11J73K00k34k04O47j97q2n5L30q02N11K74n20J35M27k81
7018ej65K20k10OK19J69l12l96P39l77k45N10m45O2O88n50R8L66p15L78j95J70
$$ plain form
7040 10 -37 -102 343 41 -129 153 -141 -46 -55 -116 248 -273 30 343 -157 215 -15 -71 6 186 -218 198 -263
7063 -263 -278 216 -136 -88 14 1 -49 -160 -95 68 -149 223 -30 -260 115 -168 64 9 -16 -28 40 96 183 110
7087 110 130 266 -166 61 68 46 46 117 -204 201 114 103 131 27 58 -56 71 146 45 109 44 -143 50 10 -222
7112 -222 95 -29 -126 -107 -68 50 -268 -213 219 -121 -6 -17 332 107 -330 177 10 85 -7 -27 -321 255 -77
7135 -77 -165 -30 -117 39 -35 -104 -21 8 213 -70 -15 18 52 -385 185 85 -37 -32 -22 4 173 -35 218 -182 -136
7160 -136 315 60 322 149 -155 -72 -81 30 32 -155 33 -9 -105 61 -61 44 134 -158 -329 -134 -126 65 -139
7183 -139 14 99 43 -264 18 38 121 -27 -123 275 -95 -60 -175 -153 75 164 -31 165 -74 -171 -208 -145 -137 6
7207 6 -277 -181 -244 -142 -29 -291 -128 182 -262 178 121 -91 -112 81 177 -46 6 244 -30 311 151 147 63 34
$$ packed form
7040A0m7o5M45l02j70K82k94R5ro1L64n21L03L13n00L72k30n6P7J80m04M16m61
7063b63j5M94l52M8J02j3n0j11O5J63k17L72k53k30L75k83K32n5k5j2O8N6Q7p3
7087A10K0J36m32K27Pk2%P1l21M05q7j1K8j04L1j14J27P5j01O4o5j87J93m0k32
7112b22L17j24r7J9L9J18l18N5M32l40J15j1L49k25m37N07j67P5r2k0k94N76l32
7135g7q8J35q7J56p4o9Q3K9K05k83N5L3L4m37N70j00j22NJ0K6J69k08K53m00M6
7160a36M51k55K62j73l04Q3rJ11Kj87J88m2r6J66j22J05R0k92j71J95QJ91k04
7183a39J53Q5n6l07K82K0Q3j48r6L98l70L5j15K2K28Q9j95J96k39r7l7O3QJ43
7207Fk83R6o3J02J13k62J63L10m44M40n7k12k1J93R6k23N2K38k74L41j60mq4k9
$$ plain form
7231 34 145 340 328 -115 305 -232 213 -67 -265 41 -87 163 303 -311 -25 -196 -4 -66 -65 -38 -24 -242
7253 -242 76 -517 17 339 -286 -263 216 62 -94 235 325 -18 81 249 81 -120 295 436 169 464 -216
7274 -216 -152 351 104 -80 219 48 -79 -277 141 -103 -482 377 -109 -373 59 35 44 141 -144 62 307 97
7296 97 176 -362 31 133 -474 198 672 -647 374 -168 -161 5 -564 378 -440 -442 47 -952 250 -33 -408
7317 -408 288 80 -643 -262 9 27 445 39 663 38 177 -115 -344 -30 287 -414 282 201 -120 -53 503
7338 503 7 -106 48 -177 -340 244 255 -179 3 399 -537 -110 344 -409 -371 216 49 19 343 225 -395
7359 -395 -5 103 -356 22 443 -294 237 512 142 -110 300 174 -208 374 711 -69 -53 370 -73 -162 623
7380 623 47 46 72 -108 -277 -246 185 -315 13 188 -120 -641 596 147 -274 572 -65 -123 167 301 -351
$$ packed form
7231C4J11J95j2m43M20n37M45k80j98L06j28K50J40o14K86j71J92o2JK7J4k18
7253b42L18n93N34L22o25K3M79j54j56L29R0l43R9J68j68k01M15J41k67K95o80
7274b16O4N03k47j84K99j71j27j98M18k44l79Q59m86k64M32k4RR7k85K06K45k10
7296I7P9n38L93J02o07O72M74j319J021n42PJ66n69R42q18kM89r99J202k83l75
7317d08O96k08p23L81K71J8M18m06O24o25J39k92k29L14L17p01O96q1l21O7N56
7338E03m96j13J54k25j63N84J1m34J82L96r36M27M54p53L8N87j67l0L24j18o20
7359c95L90J08m59L78M21p37N31K75l70k52M10j26l82N82L37p80J6M23m43q9P85
7380F23n76jK6j80j69L1M31n00L28J75l08n21J237m49m21Q46o37n8K90J34o52
$$ plain form
7401 -351 41 405 49 -195 339 -76 -310 323 -170 -370 139 184 -158 175 -85 11 15 444 -409 -700 469
7422 469 -86 -307 226 241 -333 -46 397 -18 -106 44 180 -580 83 215 -419 112 388 -464 247 198 -215
7443 -215 -124 60 -107 -478 -10 -12 -497 119 179 -509 -114 45 -462 33 365 -17 -153 40 36 -460 370 393
7465 393 11 -14 358 -474 64 430 -323 48 248 315 49 252 259 -71 -287 472 -176 -255 606 -1015 -267
7486 -267 325 118 -185 129 523 -354 -395 450 341 -535 486 -336 -487 177 -347 -199 -420 409 109 416
7506 416 -140 -317 -204 574 309 -35 293 -51 -263 503 89 31 75 -272 48 -49 292 -327 -570 317 -404
7527 -404 197 9 -7 -447 408 102 115 -240 -405 407 -532 626 -34 -224 178 56 -189 534 116 -309
7547 -309 286 66 48 -59 206 252 -102 -12 166 -185 -10 420 -415 251 9 -147 227 -108 -194 207 -33
$$ packed form
7401c51L92L64l56k44N34m15k34O33m93k00N09M5l42L33k60R6MM29q53k91J169
7422D69n55k21N33J5n74K87M43m15q8J50J36p60O63J32o34N31K76q52P11m9m13
7443b15R1J84j67l71M68km85O16O0o88L95J59n07M95L32l82j36J93mm96Q30K3
7465C93l82k5L72q32N38L66p53L71K00O7k66K03Pl30k16P59o48p9Q61j621P48
7486b67N92k07l03L14L94q77m1Q45j09q76J021q22j51O64n24J48k21Q29l00L07
7506D16n56j77J13P78k65l44L28l44k12P66m14n8M4l47L20r7L41o19k43Q87p21
7527d04O01j88j6m40Q55l06J3l55j65Q12r39J158o60j90M02j22k45P23m18m25
7547c09N95k20j8j07K65M6l54R0J78l51J75M30q35O66k42j56L74l35q6M01k40
$$ plain form
7568 -33 135 40 -136 -106 -109 330 261 -304 -269 333 -342 -69 325 236 -225 -62 -165 89 342 -13 -391 -464 112
7591 112 123 -254 -143 157 271 213 237 -7 70 463 -49 289 24 -107 42 215 -285 303 220 -223 -382 143
7613 143 355 -156 166 191 -406 165 637 171 -13 -106 -272 -141 343 -343 -23 -125 73 -26 -232 292 45
7634 45 103 9 258 219 -47 -156 -299 31 545 -24 145 -386 -535 31 90 184 67 -33 -107 383 347 726 -8
7657 -8 -229 -213 -274 213 -497 -772 -761 85 -199 -694 410 -231 39 500 -41 294 356 -258 85 -118 626 82
7679 82 165 19 189 218 495 -430 -3 285 114 -77 -134 128 29 -50 141 229 142 104 123 -334 228 -86 133
7702 133 -205 -40 215 -33 -186 -21 172 141 157 -97 -9 -55 -140 -447 41 163 285 -170 337 622 -222 -187
7724 -187 -87 86 -297 -31 15 292 274 -241 216 -300 -16 129 146 -73 -234 534 285 194 -140 -457 304
$$ packed form
7568c3J68r5j76L0lM39o9n65L5O02o75K73L94q9m61J63j03K54K53l55l78p3N76
7591A12J1l77J11L00J14n8K4k44P7L93n12L38k65j31J49J73n00N88q3m43j59N25
7613A43K12n11L22K5n97N71M72m66j84r3j66J31M84o86L20j02J98r9k06N24k47
7634D5N8r4K49l9k66j09j43L30N14n69J69n31j49N66N9R4j17j00p4M90l6L79p34
7657hk21J6o1M87p10k75J1Q46k84m95J104o41K70M61n41L35O2o14L43k03P44n44
7679H2Q3j46J70K9K77r25M27K88j71j91n7K62r9p9J91Q8q7l8J9m57N62l14K19
7702A33l38J65K55k48j53J65J93l1J6k54Q8m6q5l07M88J22J22m55N07K85q44L5
7724a87J00J73l83K66M6K77j8n15M57n16K84J45J7k19j61P68k49r1l34l17P61
$$ plain form
7745 304 423 -622 296 -390 456 972 262 -288 -134 589 -754 44 -452 -245 86 -54 102 -603 418
7764 418 -173 61 -356 305 490 282 136 -426 -92 -369 487 -797 -176 -31 22 -297 -85 60 3 -97
7784 -97 -39 163 391 164 268 189 -5 301 -115 -18 -153 27 -130 -469 353 -171 39 39 -412 952 -23 -228
7806 -228 285 110 -334 -37 -299 144 -237 24 76 -104 4 278 39 178 54 85 153 -369 -69 90 -442
7827 -442 158 -162 -331 110 -240 68 162 -80 -157 -86 -23 -325 -23 126 -41 -69 -39 -108 -172 434 248 -20 280
7850 280 32 63 -96 -357 -95 116 396 -77 -87 213 -135 -208 386 -1 -236 76 -36 -213 6 62 108 -7
7872 -7 74 124 80 276 311 49 63 127 -74 286 150 -71 -126 -179 -341 -338 20 359 -357 -225 93 -455 164 -216
7896 -216 -143 -35 297 -161 -210 -137 473 263 122 96 -169 230 -9 -485 -10 249 -421 -47 -93 -361 115 -164
$$ packed form
7745C04J19j045R18o86Q46N16p10n50J54P23j343P98m96K07L31j40J56p05J021
7764D18n91K34m17O61J85k08j46n62L34k77Q56j284O21J45N3l19K12J45n7j00
7784i7N8K02K28k27J04p9j94L06m16R7j35J80j57l39Q22n24K10%m51J364r75k05
7806b28N13j75m44K97k62M43l81K61N2j80J08K74k39J39j24L1O8n22L00J59n32
7827d42O00l20j69M41l50L08R4k42p7P1O3l02L02J49j67k8L0o9o4O06j86k68L00
7850B80k48L1j59k61K62K11K80m73j0L00l48p3N94l87k35L12j12j77K19N6M6j15
7872gQ1N0m4J96L5k62J4O4k01L60j36k21n5n3j62LL58L39p16J32L18n48O19l80
7896b16P3J08L32m58m9P3O10k10j41k6k65L99k39m76M75K59o70L74m6k68M76k79
$$ plain form
7918 -164 95 -143 217 193 -439 68 339 -340 -141 18 -358 -304 98 7 -361 -20 86 -26 -91 304 -328
7939 -328 103 323 -22 -263 262 71 -123 -193 185 -163 6 175 -24 208 -7 -106 -167 -20 -18 -161 -30 58
7961 58 -224 -18 459 -13 -27 453 -314 -280 180 113 2 -182 -8 110 432 476 -255 -209 16 -32 -210 482
7983 482 -144 -441 -42 110 163 243 76 -409 -81 345 143 -159 156 -288 -346 502 18 -150 254 -2 -132
8004 -132 17 391 -123 -308 -4 -444 -208 270 -119 19 305 -80 -190 -82 11 -447 -17 348 206 -484
8024 -484 105 140 -301 -11 -103 -298 270 -178 -52 103 175 -65 24 -62 41 -77 78 361 -425 -22 481 41
8046 41 369 177 76 170 222 131 -86 234 135 -487 36 207 -92 78 243 60 -136 -12 30 34 12 -43 77
8069 77 26 277 -194 -20 209 130 153 -19 102 -136 8 144 -236 -120 141 -105 -21 214 -88 -315 195 -128
$$ packed form
7918a64K59k38L60k4o32N07K71o79J99J59l76N4M02r1l68L41J06j12o5L95o32
7939c28M31K20l45k41N25j91j94p0L78l48J69J69j99K32k15r9o1J47Kj43J31Q8
7961E8k82K06M77m72j4M80p67L4M60o7j11j84J74J18L22M4p31M6K25m8j78O92
7983D82o26k97L99J52N3Q0j67m85L28M26k02l02L15m44n8Q48m84j68M04k56j30
8004a32J49L74n14j85L04m40K36M78l89J38K86l85j10J08R3m58M30L65j42o90
8024d84N89L5m41K90r2j95N68m48J26J55P2k40Q9q6J03j18J55K83p86M03N03m40
8046D1L28j92j01R4N2r1k17L20r9o22N23J71k99J70J65j83j96J24M2Mk2n5J20
8069G7n1K51m71J74K29p9K3j72J21k38J44J36l80J16K61k46Q4K35l02k27N10l23
$$ plain form
8091 -128 -117 205 -172 -34 -166 115 -115 -120 100 -301 -151 101 -261 73 321 -103 -335 34 -47 -126 86 140
8113 140 62 -308 231 -6 -337 -33 255 -44 -92 60 -100 339 -192 -38 -62 -3 -285 5 521 346 -8
8134 -8 130 240 -378 38 176 69 216 232 52 -94 218 320 -216 216 335 -72 666 -26 -257 -109 382
8155 382 -284 -577 73 -121 57 178 13 -437 177 -70 35 64 -83 -183 182 -32 101 81 203 19 -148
8176 -148 245 294 -122 -133 219 -183 -204 239 -158 136 96 -207 113 283 -229
$$ packed form
8091a28J1L22l77J38j32K81k30nK20m01J50K52l62L34K48m24k32L69q1p9K12N4
8113A40p8l70N39k37l31L04K88k99m8J52j60M39n31J54k4N9k82K90N16j75l54
8134hJ38J10o18M16J38j07J47J6j80j46L12J02n36M32J19m07P38o92k31J48M91
8155C82o66k93O50j94J78J21j65m50O14k47J05K9j47j00L65k14J33k0J22j84j67
8176a48L93M9m16j1L52m02k1M43l97K94m0l03L20J70n12
8191b29
$$ Imaginary data points
##PAGE= N=2
##DATA TABLE= (X++(I..I)), XYDATA
$$ plain form
0 0 0 0 0 0 0 0 0 0 0 0 0 -8 8 -8 8 -16 16 -20 24 -28 32 -40 48 -56 66 -79 90 -106 121 -138 156 -178 201
33 201 -230 257 -287 325 -362 405 -449 500 -555 616 -680 752 -831 918 -1009 1113 -1226 1350
51 1350 -1488 1642 -1813 2008 -2225 2475 -2764 3105 -3511 4002 -4614 5400 -6450 7922 -10130
66 -10130 13806 -20989 40041 -191177 -446315 90059 -20838 -174891 74069 -145495 -529713
77 -529713 -166900 159567 -105206 -129566 35540 -348128 -324539 242252 92337 -195676
87 -195676 66045 -66157 -266086 138212 271266 -125573 -120872 113172 -86354 -67585 288554
98 288554 -24760 -334626 42415 43288 -173150 101616 35677 -369166 -207616 81628 -102905
109 -102905 -151786 49221 -212319 -381368 54295 53381 -239037 -4229 -10976 -294754 -30576
$$ packed form
0@%%%%%%%%%%%qJ6j6J6k4L2l6M4n2O0p2Q8j04J22j45J69j96K27k59K94l34L79
33B01m31M87n44O12o87P67q54R49j055J171j296J432j583J749j927K122k339K576
51A350k838L130l455L821m233M700n239N869o616P513q616J0014j1850J4372j8052
66a0130K3936l4795O1030k31218k55138N36374j10897j54053K48960k19564l84218
77e29713L62813L26467k64773k4360J65106l83668K3589N66791j49915k88013
87a95676K61721j32202j99929M04298J33054l96839M701K34044j99526J8769L56139
98B88554l13314l09866L77041Q73k16438K74766o5939m04843J61550K89244j84533
109a02905m8881K01007k61540j69049M35663r14k92418K34808o747k83778K64178
$$ plain form
120 -30576 180326 -94457 -120187 100404 -41790 -122991 198500 109121 -200287 57646 135237
131 135237 -129975 77695 179669 -148039 -103324 123556 -27508 -109386 98240 -9907
141 -9907 -240569 6293 79076 -196340 -35904 78340 -202920 -107225 98979 -94216 -134165
152 -134165 65286 -12791 -151376 48307 88196 -143534 2945 141892 -100168 -19205
162 -19205 161878 -47911 -59145 131588 21836 -79727 80263 81607 -97563 11566 112969
173 112969 -103097 -47189 125303 -73007 -87213 89274 -46529 -114438 50322 22944 -108124
184 -108124 -12333 56301 -99758 -46335 106192 -59537 -80255 96848 -24610 -76497 87085
195 87085 26569 -74086 30891 67504 -42383 -5539 96803 -32540 -56804 102058 2605
$$ packed form
120c0576K10902k74783k5730K20591j42194q1201L21491q9379l09408K57933P7591
131A35237k65212K07670J01974l27708M4715K26880j51064q1878K07626j08147
141i907k30662K46862P2783k75416J60436J14244k81260R5695K06204j93195l9949
152a34165J99451p8077j38585J99683L9889k31730J46479J38947k42060Q0963
162a9205J81083k09789j1234J90733j09752j01563J59990J344j79170J09129J01403
173A12969k16066N5908J72492j98310j4206J76487j35803o7909J64760k7378j31068
184a08124R5791O8634j56059N3423J52527j65729k0718J77103j21458n1887J63582
195H7085o0516j00655J04977L6613j09887L6844J02342j29343k4264J58862r9453
$$ plain form
206 2605 -65278 80657 8766 -77041 39906 43049 -49366 -10275 46472 -37949 -51632 67285
218 67285 -4076 -75493 51954 6389 -73039 43189 29820 -55815 5556 37732 -21565 -18249
230 -18249 50844 5560 -49389 50599 30857 -51854 45379 36236 -47252 26050 42704 -18180
242 -18180 1900 37071 3329 -25349 35466 29701 -40864 27492 36780 -44033 19854 39177
254 39177 -30049 5057 28532 -7584 -8959 20196 16848 -26251 11755 33786 -31758 9292
266 9292 37268 -30871 5303 29886 -15080 1223 16416 3911 -7853 4281 23062 -15813
278 -15813 -1258 32020 -21469 -1918 29520 -18290 -243 17670 -7744 362 3247 6544 -3429
291 -3429 -8299 18752 -9150 -11156 24030 -14072 -7969 18934 -13081 -979 7049 -6159 2369
$$ packed form
206B605o7883J45935p1891q5807J16947L143r2415L9091N6747q4421j3683J18917
218F7285p1361p1417J27447m5565p9428J16228j3369q5635O1371L2176n9297L316
230a8249O9093m5284n4949R9988j9742q2711R7233r143q3488P3302J6654o0884
242a8180K0080L5171l3742k8678O0815n765p0565O8356R288q0813O3887J9323
254C9177o9226L5106K3475l6116j375K9155l348m3099L8006K2031o5544M1050
266I292K7976o8139L6174K4583m4966J6303J5193j2505j1764J2134J8781l8875
278a5813J4555L3278n3489J9551L1438m7810J8047J7913k5414Q106K885L297r973
291c429m870K7051k7902k006L5186l8102O103K6903l2015J2102Q028j3208Q528
$$ plain form
304 2369 -6432 4018 1585 -14157 13201 -3998 -14076 16202 -9365 -7600 11463 -11441 1086
317 1086 1584 -7314 6398 -9104 1189 6364 -14318 9147 155 -11881 12621 -6819 -3467
330 -3467 9742 -10417 5733 1304 -7912 11009 -7542 -1004 9236 -12000 6876 1858 -9821
343 -9821 11221 -6474 -2082 9093 -10944 6470 2127 -8749 11624 -5737 -1140 10195 -9391
356 -9391 7788 4031 -7009 13362 -3066 240 12029 -7123 8717 5041 -5021 13128 -3445
369 -3445 1321 11488 -8837 8401 5125 -8456 11445 -2707 -2500 8682 -7345 5586 907
382 907 -5983 11467 -7924 -160 11907 -12167 6831 8067 -9918 9626 1325 -1500 7354 -2819
396 -2819 8238 -1063 -4147 15541 -9409 -1239 15546 -15356 427 9419 -12748 592 -1219
$$ packed form
304B369q801J0450k433j5742K7358j7199j0078L0278k5567J765J9063k2904J2527
317A086M98q898J3712j5502J0293N175k0682K3465q992j2036K4502j9440L352
330c467J3209k0159J6150m429r216J8921j8551O538J0240k1236J8876n018j1679
343i821K1042j7695M392J1175k0037J7414m343j0876K0373j7361M597J1335j9586
356i391J7179l757j1040K0371j6428L306J1789j9152J5840l676j0062J8149j6573
369c445M766J0167k0325J7238l276j3581J9901j4152K07J1182j6027J2931m679
382I07o890J7450j9391P764J2067k4074J8998J236j7985J9544q301k825Q854j0173
396b819J1057r301l084J9688k4950Q170J6785l0902J5783Q992k2167J3340j811
$$ plain form
409 -1219 -6263 -5277 -9298 5258 -12763 -14640 10959 -19310 -13302 14860 -18922 -11288 7784 -12132
423 -12132 -7149 1244 1743 -8724 -10048 15216 -8660 -12818 24150 -12047 -17475 22930 -7524
436 -7524 -13855 12126 -3398 -15457 -4586 8795 -13163 -21733 14275 -16451 -32884 19424 -13506
449 -13506 -36816 10699 -9458 -31652 -454 2012 -22767 -18220 14328 -10549 -29924 24523
461 24523 -87 -34912 27207 10120 -30766 18551 18573 -17586 3053 24733 -6670 -19745 29275
474 29275 8475 -35868 23463 10330 -47031 15723 18964 -42161 -8815 11240 -31386 -24856
486 -24856 19206 -11643 -54243 5910 5320 -52826 12948 20208 -61997 -10519 29281 -27660 -8818
499 -8818 29668 -19407 -41031 29557 28737 -35981 14753 24277 -58710 7021 58019 -33474 -23028
$$ packed form
409a219n044R86m021J4556j8021j877K5599l0269O008K8162l3782P634J9072j9916
423a2132M983Q393M99j0467j324K5264k3876m158L6968l6197n428M0405l0454
436g524o331K5981j5524j2059J0871J3381k1958q570L6008l0726j6433N2308l2930
449a3506k3310M7515k0157k2194L1198K466k4779M547L2548k4877j9375N4447
461B4523k4610l4825O2119j7087m0886M9317K2l6159K0639K1680l1403j3075M9020
474B9275k0800m4343N9331j3133n7361O2754L241o1125L3346K0055m2626O530
486b4856M4062l0849m2600O0153n90n8146O5774P260q2205N1478L9800n6941J8842
499h818L8486m9075k1624P0588q20o4718N0734R524q2987O5731N0998r1493J0446
$$ plain form
512 -23028 22414 -35306 -33428 38268 5535 -67644 -17571 7701 -60221 -1782 38324 -77225
524 -77225 -59364 24202 -33979 -31007 31890 -30277 -79826 3479 34811 -33363 -1107 30166
536 30166 -67935 -25367 81750 -2203 -29906 37962 -22646 -41373 61786 52045 -42734 -14124
548 -14124 27977 -38748 3247 83507 -34543 -73202 33367 -9718 -34990 54716 1442 -88446
560 -88446 -14613 39522 -25542 -6879 43346 -59878 -64477 72717 22238 -40726 44796 -2390
572 -2390 -65475 49900 79412 -21795 -6823 46288 -22975 -7980 104285 21714 -61796 43952
584 43952 24629 -39005 65721 53969 -67080 -17252 50389 -15523 -10958 59401 -26476 -81893
596 -81893 44808 33601 -54568 30662 20296 -83189 6006 70171 -23730 -22024 42613 -20684
$$ packed form
512b3028M5442n7720J878P1696l2733p3179N0073K5272o7922N8439M0106j15549
524g7225J7861Q3566n8181K972O2897o2167m9549Q3305L1332o8174L2256L1273
536C0166r8101M2568J07117q3953k7703O7868o0608j8727J03159r741r4779K8610
548a4124M2101o6725M1995Q0260j18050l8659J06569m3085k5272Q9706n3274q9888
560h8446P3833N4135o5064J8663N0225j03224m599J37194n0479o2964Q5522m7186
572b390o3085J15375K9512j01207J4972N3111o9263J4995J12265q2571q3510J05748
584D3952j9323o3634J04726j1752j21049M9828O7641o5912M565P0359q5877n5417
596h1893J26701j1207q8169Q5230j0366j03485Q9195O4165r3901J706O4637o3297
$$ plain form
608 -20684 -41108 73859 43251 -58721 28404 43739 -49853 38019 81094 -41698 -21060
619 -21060 58745 -6252 -20875 64210 12638 -71601 24748 47671 -54362 12043 49130 -72203
631 -72203 -29105 60870 -25552 -41952 36965 -15192 -67105 30334 39542 -62631 -4358 44364
643 44364 -58972 -11836 73377 -29566 -41827 49155 -2873 -38695 47746 32477 -56307 5327
655 5327 54797 -36737 -5585 65750 -37401 -41783 58611 -2575 -41567 36799 7401 -58491
667 -58491 9343 43480 -42261 -21026 44320 -40045 -38475 59391 -9767 -53179 33215 4642
679 4642 -46777 27187 37186 -42165 -12110 47033 -19706 -20078 59730 -6544 -46314 48143 19275
692 19275 -36545 34735 29634 -41685 3564 48966 -16022 -20597 45785 -10736 -43192 46519
$$ packed form
608b0684k0424J14967l0608j01972Q7125J5335r3592Q7872M3075j22792K0638
619b1060P9805o4997j4623Q5085n1572q4239R6349K2923j02033O6405L7087j21333
631g2203M3098Q9975q6422j6400P8917n2157n1913R7439R208j02173N8273M8722
643D4364j03336M7136Q5213j02943j2261R0982n2028l5822Q6441j5269q8784O1634
655E327M9470r1534L1152P1335j03151m382J00394o1186l8992P8366k9398o5892
667e8491O7834L4137q5741K1235O5346q4365J570R7866o9158m3412Q6394k8573
679D642n1419P3964R999p9351L0055N9143o6739l72P9808o6274l9770R4457k8868
692A9275n5820P1280n101p1319M5249M5402o4988m575O6382n6521l2456Q9711
$$ plain form
704 46519 16808 -48379 24213 18298 -45812 9092 37199 -28424 -21144 31917 -9872 -32892
716 -32892 38049 10285 -49268 24165 24854 -38739 15569 34502 -30831 -8117 36653 -5186
728 -5186 -20317 34365 9423 -37081 26062 29593 -36258 13189 32289 -32623 -2437 35266
740 35266 -14483 -18392 25490 1183 -30928 18233 20231 -37040 5300 28286 -34363 -4067
752 -4067 31889 -21179 -15016 24915 -4112 -21649 17561 15093 -27742 5175 26883 -25585 -1725
765 -1725 33088 -18830 -11284 27660 -6426 -14648 19402 7829 -20408 4806 20458 -19024 -4788
778 -4788 26815 -18031 -14180 26069 -8747 -15721 17627 -542 -17515 6025 12180 -14585 -6128
791 -6128 18544 -12960 -13516 23094 -6940 -16977 17551 -2153 -14621 10384 5785 -11715 -2458
$$ packed form
704D6519k9711o5187P2592n915o4110N4904K8107o5623P280N3061m1789k3020
716c2892P0941k7764n9553P3433O89o3593N4308J8933o5333K2714M4770m1839
728e186j5131N4682k4942m6504O3143L531o5851M9447J9100o4912L0186L7703
740C5266m9749l909M3882k4307l2111M9161J998n7271M2340K2986o2649L0296
752d067L5956n3068O163L9931k9027j7537L9210k468m2835L2917K1708n2468K3860
765a725L4813n1918P546L8944l4086q222L4050j1573k8237K5214J5652l9482J4236
778d788L1603m4846L851M0249l4816o974L3348j8169j6973K3540O155k6765Q457
791f128K4672l1504n56L6610l0034j0037L4528j9704j2468K5005m599j7500R257
$$ plain form
804 -2458 12376 -6617 -10077 17842 -3581 -15554 17391 686 -13777 12863 3580 -10115 4530
817 4530 8396 -3575 -5071 11173 1199 -11553 13697 3406 -13854 11505 4207 -10896 6832
830 6832 3998 -5952 -765 4829 543 -7955 5286 3797 -12164 6905 5094 -12190 5678 3643
844 3643 -7394 3466 2591 -795 -1372 2547 6034 -4660 3716 8414 -7287 5499 8550 -5466
858 -5466 5919 4077 -2395 3889 1013 2848 -350 -1225 5570 -4466 -628 6359 -7209 -71 3416
873 3416 -7234 1654 -679 -4446 1108 -3695 1153 -344 -3822 4364 -3914 -2088 6379 -4418 1132
888 1132 4563 -3228 4407 779 13 4811 -2121 3459 2586 -3114 6026 -232 -1582 5685 -3396 954
904 954 2808 -4095 3458 -1297 -2491 3374 -4531 286 1628 -4632 3445 -1379 -2353 4254 -3351 1419
$$ packed form
804b458J4834j8993l460K7919k1423j1973L2945j6705j4463K6640r283j3695J4645
817D530L866j1971j496J6244r974j2752K5250j0291j7260K5359p298j5103J7728
830F832k834r950N187N594m286q498J3241j489j5961J9069j811j7284J7868k035
844C643j1037J0860q75l386n77L919L487j0694Q376M698j5701J2786L051j4016
858e466J1385j842o472O284k876J835l198q75O795j0036L838O987j3568P138L487
873C416j0650Q888k333l767N554m803M848j497l478Q186q278J826Q467j0797N550
888A132L431p791P635l628p66M798o932N580q73n700R140o258j350P267r081M350
904I54J854o903P553m755j194N865p905M817J342o260Q077m824r74O607p605M770
$$ plain form
920 1419 2831 -3184 4488 356 -696 5608 -1670 2927 3860 -2456 5606 1269 -558 6214 -1628
935 -1628 1612 3652 -2422 4299 135 -636 4591 -2927 1910 2109 -4672 4070 -710 -3163 4060 -2733
951 -2733 -845 1916 -3002 1794 -2216 -1715 2438 -5103 1091 1778 -6053 3815 545 -3969 2863 -2502
967 -2502 -1627 1032 -1807 1166 -2461 27 3872 -6672 1591 3365 -7450 2211 1296 -5359 1822
982 1822 -399 -2039 -2021 -985 2126 -5756 -605 4932 -8783 78 5493 -7631 -137 4132 -5878
997 -5878 -47 1684 860 -3155 -717 4845 -5199 1040 9748 -7546 -2359 9563 -4853 -519
1011 -519 7656 -2296 -3309 3135 5045 -3474 -319 9054 -9160 -4115 13868 -6943 -4625 9392
1025 9392 -5084 -5716 7889 2340 -5356 -125 7166 -5432 -2251 15508 -4137 -7906 13743 -2192
$$ packed form
920A419J412o015P672m132j052O304p278M597R33o316Q062m337j827O772p842
935a628L240K040o074O721m164p71N227p518M837J99o781Q742m780k453P223o793
951b733J888K761m918M796m010N01M153p541O194O87p831R868l270m514O832n365
967b502Q75K659k839K973l627K488L845j0544Q263J774j0815R661r15o655P181
982A822k221j640J8J036L111p882N151N537j3715Q861N415j3124P494M269j0010
997e878N831J731q24m015K438N562j0044O239Q708j7294N187J1922j4416M334
1011e19Q175r952j013O444J910q519L155R373j8214N045J7983k0811K318J4017
1025I392j4476o32J3605n549p696N231P291j2598L181J7759j9645l769K1649j5935
$$ plain form
1039 -2192 -6295 15043 1423 -7374 5093 7151 -4368 -322 11547 -5343 -10764 15101 -132
1052 -132 -11584 13833 -2040 -14427 8575 6263 -8893 -331 6836 -8008 -8047 15900 -100
1065 -100 -15972 12669 2131 -15202 14449 9500 -14227 2911 11691 -6569 -1586 15377 -2379
1078 -2379 -15513 14604 6420 -16682 13359 6998 -22555 4533 13695 -11723 -3854 8257 -11148
1091 -11148 -14583 13376 4704 -21393 4942 6109 -22257 8835 19703 -17575 -4603 14579
1103 14579 -6258 -4296 21322 4369 -19652 10049 16193 -12632 11757 19545 -21579 -3711
1115 -3711 24946 -4198 -3970 13910 -8367 -19246 14469 15577 -17205 -1267 8331 -26069 -2109
1128 -2109 28009 -14580 -15877 12258 -9889 -10003 23266 8836 -23684 -1026 17044 -9178 8172
$$ packed form
1039b192m103K1338j3620q797J2467K058j1519M046J1869j6890n421K5865j5233
1052a32j1452K5417j5873j2387K3002k312j5156Q562P167j4844l9K3947j6000
1065a00j5872K8641j0538j7333K9651m949k3727J7138Q780j8260M983J6963j7756
1078b379j3134L0117q184k3102L0041o361k9553K7088R162k5418P869J2111j9405
1091a1148l435K7959q672k6097K6335J167k8366L1092J0868l7278J2972J9182
1103A4579k0837J962K5618j6953k4021K9701O144k8825K4389P788m1124J7868
1115c711K8657k9144K28J7880k2277j0879L3715J108l2782J5938R598l4400K3960
1128b109L0118m2589j297K8135k2147j14L3269j4430l2520K2658J8070k6222J7350
$$ plain form
1141 8172 30160 -18599 -15806 27163 3016 -3454 22734 -1961 -24951 10428 23820 -9142
1153 -9142 -2795 12813 -23924 -12963 32743 -2822 -23192 8652 -11197 -22273 17770 14091
1165 14091 -22917 -13202 9486 -12585 -2936 29469 -10645 -30286 16589 6160 -10472 24701
1177 24701 7778 -27662 2131 24294 -1299 -448 18986 -13743 -21560 27942 12176 -19519
1189 -19519 12045 80 -28239 11311 20885 -16994 -11940 8785 -13430 -13455 24125 1514 -30190
1202 -30190 7929 7481 -20557 15880 16693 -23919 -5948 18247 -4430 -4321 21462 -824 -23632
1215 -23632 17403 16856 -16792 11741 15289 -24380 1312 23463 -8985 -6537 13550 -6420 -18399
1228 -18399 13185 9435 -23154 3198 11116 -24691 -87 20546 -16852 -10277 13313 -8768
$$ packed form
1141H172K1988m8759K793M2969k4147o470K6188k4695k2990L5379J3392l2962
1153i142O347J5608l6737J0961M5706l5565k0370L1844j9849j1076M0043l679
1165A4091l7008R715K2688k2071R649L2405m0114j9641M6875j0429j6632L5173
1177B4701j6923l5440K9793K2163k5593Q51J9434l2729p817M9502j5766l1695
1189a9519L1564j1965k8319L9550R574l7879N054K0725k2215k5L7580k2611l1704
1202c0190L8119m48k8038L6437Q13m0612J7971K4195k2677J09K5783k2286k2808
1215b3632M1035n47l3648K8533L548l9669K5692K2151l2448K448K0087j9970j1979
1228a8399L1584l750l2589K6352P918l5807K4604K0633l7398O575K3590k2081
$$ plain form
1240 -8768 -14403 14148 7158 -20425 4651 14747 -18535 2757 23243 -15512 -8268 19348 -7026
1253 -7026 -9502 17481 1869 -16893 5120 12217 -14632 1239 18324 -17855 -9914 20124 -7331
1266 -7331 -10841 15284 -4761 -16361 7623 9839 -13570 -1778 11908 -14084 -6512 20693 -5684
1279 -5684 -13270 15694 -2738 -13226 13649 7241 -12347 1972 11379 -8392 -3263 18056 -5921
1292 -5921 -13316 15268 -475 -12042 14301 2794 -14438 6577 9848 -8891 -1443 12380 -5821
1305 -5821 -10090 14268 909 -13388 11977 3462 -13866 9446 7532 -9635 -141 9711 -4631
1318 -4631 -6489 11370 205 -11990 10095 4630 -13756 7335 6333 -11674 2158 7938 -6129
1331 -6129 -3040 6746 -678 -8367 7679 5109 -12561 5944 7060 -10442 2904 7378 -8183
$$ packed form
1240h768n635K8551o990k7583K5076J0096l3282K1292K0486l8755P244K7616k6374
1253g026k476K6983j5612j8762K2013P097k6849J5871J7085l6179P941L0038k7455
1266g331l510K6125k0045j1600K3984K216k3409J1792J3686k5992P572K7205k6377
1279e684p586K8964j8432j0488K6875o408j9588J4319R407j9771N129K1319k3977
1292e921p395K8584j5743j1567K6343j1507j7232K1015L271j8739P448J3823j8201
1305e821m269K4358j3359j4297K5365q515j7328K3312j914j7167R494R852j4342
1318d631j858J7859j1165j2195K2085n465j8386K1091j002j8007J3832N780j4067
1331f129L089R786p424p689J6046k570j7670J8505J116j7502J3346M474j5561
$$ plain form
1344 -8183 -1303 8143 -725 -5180 4875 3287 -8850 3748 7065 -10430 140 7660 -8349
1357 -8349 -313 6125 -4855 -4390 3517 89 -5495 1137 4575 -6730 -392 7942 -6458 -1342
1371 -1342 7650 -4541 -1855 6241 646 -1127 2479 2960 -3627 686 6435 -3537 -2121 7619 -3546
1386 -3546 -2367 6671 -2227 -2062 2568 -10 -1616 -463 3378 -3026 -4345 5205 -3228 -4089 5768
1401 5768 -2918 -2796 3715 -1386 -507 914 1281 -420 -1839 3459 1795 -2467 4962 106 -2476 4535
1417 4535 -904 -1149 2467 -916 236 -263 -63 690 -3133 1419 459 -4079 1855 -1153 -3939 1738
1433 1738 -2420 -1710 -81 -2719 -316 -1541 -720 1356 -3892 38 704 -3467 2360 -94 -2572 2793
1449 2793 -548 -5 877 -1444 1337 -678 -1092 2678 -2336 46 1728 -2863 1294 -413 -2146 1207
$$ packed form
1344h183O880R446q868m455J0055j588j2137J2598L317j7495J0570P520j6009
1357h349Q036O438j0980M65P907l428n584O632L438j1305O338Q334j4400N116
1371a342Q992j2191K686Q096n595j773L606M81o587M313N749r972J416R740j1165
1386c546J179R038q898J65M630k578j606J153L841o404j319R550q433q61R857
1401E768q686J22O511n101Q79J421L67j701j419N298j664m262P429m856k582P011
1417D535n439k45L616l383J152m99K00P53l823M552r60m538N934l008k786N677
1433A738m158P10J629k638K403j225Q21K076n248L930O66m171N827k454k478N365
1449B793l341N43Q82k321K781k015m14L770n014K382J682m591M157j707j733L353
$$ plain form
1465 1207 -2205 -1203 737 -2716 1419 -861 -2250 1887 -1597 -612 923 -2238 1431 208 -1239
1480 -1239 2109 -1314 478 2590 -1365 1727 717 -477 3494 -454 1125 2613 -1288 2482 837
1495 837 -916 3317 -662 468 1668 -1456 2255 60 -1256 3240 -2072 119 2426 -2298 1353
1510 1353 1049 -1496 1879 -692 351 981 -2068 2105 148 -1438 3437 -1510 1042 3993 -1083
1525 -1083 1208 1302 -602 1425 -203 1065 -146 -1350 2923 154 -1808 2887 -1475 -867 2504 -1452
1541 -1452 -113 673 -615 922 -1576 1159 1011 -3006 3326 377 -2755 3683 170 -1470 2382
1556 2382 362 375 787 1417 1273 -2443 2662 1697 -3038 3732 842 -4277 3087 721 -2419 1409
1572 1409 150 -1653 -1646 1210 827 -4604 1118 1178 -5932 2655 2122 -5662 785 866 -3125 521 2056
$$ packed form
1465A207l412J002J940l453M135k280j389M137l484R85J535l161L669j223j447
1480a239L348l423J792K112l955L092j010j194L971l948J579J488l901L770j645
1495H37j753M233l979J130J200l124L711k195j316M496n312K191K307m724L651
1510A353l04k545L375k571J043O30l049M173j957j586M875m947K552K951n076
1525a083K291R4j904K027j628J268j211j204M273k769j962M695m362O08L371l956
1541a452J339P86j288J537k498K735j48m017O332k949l132O438l513j640L852
1556B382k020J3M12O30j44l716N105r65m735O770k890n119P364k366l140L828
1572A409j259j803PK856l83n431N722O0p110Q587n33p784O447Q1l991L646J535
$$ plain form
1589 2056 -550 -4089 653 2683 -3998 2611 3239 -7213 202 4251 -3529 979 2379 -4233 -3626
1604 -3626 2033 2734 -3877 -967 1355 -7920 304 6929 -5601 -2637 2068 -5678 -1201 5511 480
1619 480 -5565 -1459 2329 -3211 2918 7306 -7494 -4624 7178 -1684 693 7793 -4072 -6044
1633 -6044 3278 5554 -1009 743 3605 -7888 -2139 11199 -1363 -4350 4277 -6167 -4948 9183
1647 9183 3906 -5992 -2370 1235 -4341 1651 11228 -4431 -9140 6166 -772 -2269 10935 -146
1661 -146 -10153 1459 5731 -526 2216 5793 -7608 -7756 10643 2957 -5586 5817 -3249 -10713
1675 -10713 7021 6704 -5541 -1789 1127 -7557 -3026 11005 -271 -10511 4042 -715 -8481
1688 -8481 8647 4386 -10727 -1336 3501 -3929 578 7559 -4247 -10136 6333 3373 -7669 7368
$$ packed form
1589B056k606l539M742K030o681O609O28j0452P415M049p780M508J400o612O07
1604c626N659P01o611K910K322r275Q224O625j2530K964M705p746M477O712n031
1619D80o045M106L788n540O129M388j4800K870J1802q862K377P100j1865j972
1633f044R322K276o563J752K862j1493N749J3338j2562k987Q627j0444J219J4131
1647I183n277r898L622L605n576N992R577j5659m709J5306o938j497J3204j1081
1661a46j0007J1612M272o257K742L577j3401j48J8399p686q543J1403r066p464
1675a0713J7734l17j2245L752K916q684M531J4031j1276j0240J4553m757p766
1688h481J7128m261j5113R391M837p430M507O981j1806n889J6469k960j1042J5037
$$ plain form
1702 7368 3181 -13215 2341 7953 -5671 -907 4492 -6908 -7074 7919 2532 -8735 3922
1715 3922 2919 -11781 4319 9667 -8409 -1431 6169 -6294 -3038 9116 1038 -7769 4303
1728 4303 4410 -8596 4890 10262 -9128 -1057 9725 -5224 -1117 10699 -1426 -7018 5475
1741 5475 4799 -6222 4858 8841 -9596 -1113 11915 -4893 -1750 10267 -4029 -6594 7910
1754 7910 4692 -5476 3351 5808 -8353 -82 12882 -5151 -3853 9768 -4196 -5075 11744
1767 11744 1976 -7287 3332 3936 -5447 1765 9963 -5845 -5045 9913 -2744 -4409 10737 -585
1781 -585 -9399 5128 4595 -5494 1004 6399 -6365 -4230 9369 -2008 -7382 8167 -1263 -9305
1795 -9305 7683 3383 -8182 1799 4056 -6132 -1184 7163 -3598 -7494 6927 -619 -8035 6190
$$ packed form
1702G368m187j6396J5556N612j3624M764N399j1400j66J4993n387j1267J2657
1715C922j003j4700J6100N348j8076O978P600j2463L256J2154q078q807J2072
1728D303J07j3006J3486N372j9390Q071J0782j4949M107J1816j2125n592J2493
1741E475o76j1021J1080L983j8437Q483J3028j6808L143J2017j4296k565J4504
1754G910l218j0168Q827K457j4161Q271J2964j8033J298J3621j3964q79J6819
1767A1744r768r263J0619O04r383P212Q198j5808Q00J4958j2657j665J5146j1322
1781e85q814J4527n33j0089O498N395j2764K135J3599j1377n374J5549r430q042
1795i305J6988m300j1565R981K257j0188M948Q347j0761l896J4421p546p416J4225
$$ plain form
1809 6190 1893 -9426 2551 4653 -6225 -463 5584 -3741 -5349 6829 853 -8207 5732 2667
1823 2667 -9193 4233 5414 -7771 102 5398 -3931 -2742 6103 -614 -7126 4417 3235 -8025
1837 -8025 3343 4875 -8655 600 6027 -4661 -1832 4813 -1751 -4838 4127 2759 -6872 1748
1851 1748 4726 -7259 931 6491 -6043 -1867 5485 -2497 -3164 4259 965 -5410 1496 4774 -5249
1866 -5249 86 5867 -6164 -2182 6529 -3006 -2947 3857 -753 -4181 2514 3097 -4663 -1343 4426
1881 4426 -4500 -1732 6233 -3325 -3883 4324 -1303 -2631 2977 581 -3912 -600 4002 -2627 -1833
1896 -1833 4708 -3167 -3605 5481 -626 -3223 3069 -133 -3231 1433 2786 -1979 -1597 2934 -1458
1911 -1458 -3216 5339 -596 -4224 3538 -769 -2133 2756 1495 -1787 -981 1986 86 -847 2535
$$ packed form
1809F190m297j1319J1977K102j0878N762O047r325j608J2178n976r060J3939l065
1823B667j1860J3426J181j3185P873N296r329J189Q845o717o512J1543j182j1260
1837h025J1368J532j3530R255N427j0688K829O645o564l087Q965j368r631Q620
1851A748K978j1985Q190N560j2534M176P352p982o67P423l294o375O906L278j0023
1866e249N335N781j2031L982Q711r535N9O804m610l428O695N83p760L320N769
1881D426q926K768P965r558n58Q207n627j328N608k396m493L312M602o629P94
1896a833O541p875m38R086o107k597O292l202l098M664J353m765L82M531m392
1911a458j758Q555n935l628P762m307j364M889j261l282Q06K967j900r33L382
$$ plain form
1926 2535 -888 -3768 3991 1491 -2805 2291 507 -2131 1521 2341 74 -1227 1219 735 -2178
1941 -2178 3664 2012 -3336 1489 1136 -1613 2827 986 -1509 -27 924 1094 -1087 637 986 -3006
1957 -3006 1009 1703 -2995 791 542 -2383 -15 374 -1118 318 -115 797 -1175 31 1831 -2513
1973 -2513 -1381 1520 -1990 427 1017 -1923 209 -669 415 539 -1803 609 -1347 -989 1605 -1358
1989 -1358 -991 610 -1918 195 732 -730 -148 -1403 -531 425 -1277 235 -882 -1442 1620 -1503
2005 -1503 -928 863 -1408 -76 188 -695 791 -981 -231 -68 -1716 1104 -613 -1486 920 -1340
2021 -1340 -492 777 -1436 290 47 -1150 530 -1399 -504 573 -1874 838 -303 -1231 1117 -774
2037 -774 -44 598 -937 498 -53 -1015 1298 -825 191 1317 -1191 874 258 -941 1310 -540
$$ packed form
1926B535l423k880P759k500m296N096j784k638L652Q20k267j301K446m84k913
1941b178N842j652n348M825l53k749M440j841k495J482R51J70k181J724L49l992
1957c006M015O94m698L786k49k925K368L89j492J436m33R12j972J206J800m344
1973b513J132K901l510K417N90k940K132q78J084J24k342K412j956L58K594k963
1989a358L67J601k528K113N37j462N82j255Q72R56j702J512j117n60L062l123
2005a503N75J791k271J332K64q83J486j772P50J63j648K820j717q73K406k260
2021a340Q48J269k213J726k43j197J680j929Q95J077k447K712j141r28K348j891
2037g74P30O42j535J435n51r62K313k123J016J126k508K065o16j199K251j850
$$ plain form
2053 -540 -276 948 -692 998 410 -364 1381 -233 193 1323 -840 1224 576 -453 1570 -510
2069 -510 669 1312 938 1427 479 -1066 1644 -47 887 1565 -868 1034 1218 -19 1819 21 470
2086 470 1180 171 1356 395 143 1732 -853 581 2270 -387 842 1083 -637 1450 261 119
2102 119 768 -305 1105 161 -13 2112 -884 8 1577 -1083 948 994 -1006 688 32 -17 584 -599
2120 -599 984 -491 -753 2005 -778 -652 1238 -1850 -205 1117 -1111 -38 -354 -84 -178 -906 1538
2137 1538 -841 -2007 1537 -1339 -696 2366 -1382 -1590 123 -616 189 5 105 -901 -2431 2054
2153 2054 -331 -1285 1691 -2028 -2200 2218 468 -480 721 -1172 -1529 -391 799 -16 -1579 1560
2169 1560 617 -2044 3084 -15 -1562 1814 -480 -509 1313 884 -318 -1890 1545 684 -1590 2339
$$ packed form
2053e40K64J224j640J690n88p74J745j614M26J130k163K064o48j029K023k080
2069e10J179O43l74M89r48j545K710j691R34O78k433J902J84j237J838j798M49
2086D70P10j009J185r61k52J589k585J434J689k657J229K41j720K087j189j42
2102A19O49j073J410r44j74K125k996Q92J569k660K031M6k000J694o56m9O01j183
2120e99J583j475k62K758k783J26J890l088J645J322k228J073l16K70r4p28K444
2137A538k379j166L544k876O43L062l748k08J713p39Q05j84J00j006j530M485
2153B054k385r54K976l719j72M418j750r48J201j893l57J138J190q15j563L139
2169A560r43k661N128l099j547L376k294k9J822m29j202j572L435q61k274L929
$$ plain form
2185 2339 466 -2878 2215 1449 -1332 1441 582 -1057 -1024 1327 526 -1706 1448 650 -3029 2004
2201 2004 1938 -2837 1908 1113 -2347 868 2139 -292 -1976 925 1394 -2121 832 2309 -3973 449
2217 449 2024 -2805 317 1686 -2458 -1507 1062 156 -2275 422 1184 -3706 -744 2780 -3090 -1083
2233 -1083 2149 -3399 -1341 2149 -652 -2277 -44 137 -2379 -49 2564 -3701 -1907 2926 -2767
2248 -2767 -1059 2891 -2066 -2784 996 -13 -2088 98 1563 -3157 -1766 2972 -2543 -2128 2901
2263 2901 -2635 -3352 2339 -280 -2464 404 798 -2474 -637 3566 -1613 -2758 3289 -924 -2252
2278 -2252 4392 137 -2737 2032 1088 -1311 914 3039 -1316 -2338 3534 57 -2184 4146 -65
2293 -65 -3900 2597 1780 -1729 1034 1599 -2148 -1119 3315 773 -2488 2586 383 -3556 3789 2324
$$ packed form
2185B339j873l344N093p66k781K773q59j639L3K351q01k232L154p98l679N033
2201B004o6m775M745p95l460L215J271k431j684K901M69l515K953J477o282M422
2217D49J575m829L122J369m144R51K569r06k431K697P62m890K962L524n870K007
2233a083L232n548K058L490k801j625K233J81k516K330K613o265J794M833n693
2248b767J708L950m957p18L780j009k075K186J465m720J391M738n515M15N029
2263B901n536p17N691k619k184K868L94l272J837M203n179j145O047m213j328
2278b252O644m255k874M769r44k399K225K125m355j022N872l477k241O330m211
2293f5l835O497q17l509K763N65l747J029M434k542l261N074k203l939P345j465
$$ plain form
2309 2324 -2864 1508 1277 -1751 823 3316 -108 -2293 2185 1556 -2978 3911 2672 -4430 1618
2324 1618 2173 -2061 2060 3131 -1168 -2291 2877 1734 -1943 1226 686 -4703 1575 3512 -2555
2339 -2555 153 1204 -2383 406 3269 523 -2158 1058 1711 -1547 2468 3803 -4022 68 3334
2354 3334 -1225 871 2818 -1680 -1890 2139 1717 -953 464 1866 -3185 37 4740 -1609 -1110 2299
2370 2299 -1620 -105 3714 722 -1820 137 1529 -686 1224 3533 -2537 -1898 3699 -141 -117 3913
2386 3913 -898 -2624 2577 2504 65 -696 1298 -2301 -224 4315 -529 -2652 1832 -1593 -527 3319
2402 3319 107 -2462 -201 1287 81 314 1978 -1626 -3266 2790 1254 -812 2126 -1075 -2562
2417 -2562 1683 2289 93 -696 -24 -978 -749 3453 1062 -3089 883 187 -1155 2811 1350 -2288
$$ packed form
2309B324n188M372k31l028K574K493l424k185M478o29m534O889j239p102O048
2324A618N55m234M121J071m299j123N168j143l677L169n40n389O278J937o067
2339b555K708J051l587K789K863k746k681L216O53l258M015J335p825M090L266
2354C334m559K096J947m498k10M029m22k670J417J402n051L222M703o349M99L409
2370B299l919J515L819k992k542J957J392k215J910K309o070O39N597l840K4M030
2386C913m811j726N201p3k439p61J994l599K077M539m844k123M484l425J066L846
2402C319l212k569K261J488j206K33J664l604j640O056j536k066K938l201j487
2417b562M245O06k196p89O72r54K29M202k391m151L972o96j342L966j461l638
$$ plain form
2433 -2288 -1253 490 845 450 1635 -1059 -2895 1288 2342 -1562 1228 -527 -2225 705 1996
2448 1996 23 -508 -368 -586 -891 1866 1899 -2378 -385 693 -1459 1850 1319 -2349 -793 25 99
2465 99 608 526 -72 -2431 -161 1934 -1306 105 760 -2608 7 1613 -336 -132 -483 -574 -601 409
2483 409 1516 -1111 -1176 1118 -1403 335 1647 -1479 -931 233 -700 -309 -128 -185 -948 -741 1226 -572
2501 -572 -723 956 -1159 -706 1161 -1053 -259 -351 -884 262 -141 463 -298 -997 711 -337 -921 1152
2519 1152 -1035 -662 602 -937 -208 189 -833 -95 -1082 246 -241 -1375 420 -712 -766 638 -794
2536 -794 -652 210 -1110 187 -125 -229 123 -718 68 154 -1113 721 -266 -1123 733 -166 -291 534 -604
2555 -604 103 -194 -451 763 -720 -214 489 -1107 601 196 -1041 414 -574 -97 314 -1102 123
$$ packed form
2433b288J035J743L55l95J185k694j836M183J054l904K790j755j698K930J291
2448A996j973n31J40k18l05K757L3m277J993J078k152L309n31l668J556Q18P4
2465I9N09q2n98k359K270K095l240J411O55l368K615J606j949K04l51r1k7J010
2483D09J107k627o5K294k521J738J312l126N48J164r33L91J81n7p63K07J967j798
2501e72j51J679k115M53J867k214P94r2n33J146m03O04p61o99J708j048n84K073
2519A152k187L73J264j539P29L97j022P38r87J328m87j134J795j132n4J404j432
2536g94J42Q62j320J297l12j04L52q41P86Q6j267J834r87q57J856q99j25Q25j138
2555f04P07k97k57J214j483N06P03j596J708m05j237J455r88M77M11j416J225
$$ plain form
2572 123 -248 -710 561 -447 -130 518 -968 457 -129 -962 604 -174 -103 407 -585 216 -165 -602 590
2591 590 -467 -92 708 -544 488 188 -378 492 -508 104 612 -826 -144 -142 -102 789 -567 -19 1137
2610 1137 -1279 267 454 -418 829 -87 348 1019 -547 563 336 -360 1316 -143 130 1112 -219
2627 -219 739 310 143 866 -64 136 744 -549 725 678 -313 1140 -37 483 868 -473 664 926
2645 926 -672 817 23 119 769 -179 667 462 -266 1034 9 -57 451 -435 599 319 -264 549 -276
2664 -276 -122 615 -626 304 39 -786 499 -417 -620 -11 -1025 -155 -65 -762 47 -890 -432 463 -1259
2683 -1259 179 -379 -933 442 -306 -841 527 -525 -22 -238 -990 459 -376 442 305 -1032 187
2700 187 292 -952 654 -108 -889 413 -514 166 -175 -915 116 -881 -347 689 -1063 300 159 -568
$$ packed form
2572A23l71m62J271j008L17O48j486J425n86q33J566p78P1N10r92Q01l81m37J192
2591E90j057L75Q00j252J032l00n66Q70j000O12N08j438O82KM0Q91j356N48J156
2610A137k416J546J87q72J247r16M35O71j566J110k27o96J676j459K73R82j331
2627b19R58m29j67P23r30K00O08j293J274m7r91J453j177N20L85j341J137K62
2645I26j598J489p94R6O50r48Q46k05p28J300j025o6N08q86J034k80n83Q13q25
2664b76J54P37j241R30k65q25J285r16k03O09j014Q70R0o97Q09r37M58Q95j722
2683a259J438n58n54J375p48n35J368j052N03k16p52J449q35Q18j37j337J219
2700A87J05j244J606p62p81J302r27O80l41p40J031r97N34J036j752J363j41p27
$$ plain form
2718 -568 1019 188 -42 68 -292 586 354 263 1017 -47 283 1303 -96 839 796 -503 521 335 232
2737 232 449 -126 437 -272 -304 1133 -463 -60 419 -903 25 778 -318 151 -290 56 611 60 1147
2756 1147 -92 -466 1074 -80 313 1537 -476 -263 564 -50 748 229 516 -150 -956 734 167 -507
2774 -507 707 -1032 -982 651 -215 -276 96 -1054 -987 23 229 433 -767 194 -575 -1026 1692 273
2792 273 -963 276 -512 -194 1299 590 -76 -742 163 787 -71 1235 58 -1710 435 159 -268 1163
2810 1163 -286 -1327 -576 245 885 -355 -215 -454 -1652 647 936 -655 224 -900 -1261 965 819
2827 819 106 -326 -436 185 -226 1241 826 -1619 -304 195 -262 1273 324 -1519 -744 -410 380 148
2845 148 -364 -536 -2170 -316 1207 -894 -365 -187 -1794 170 1027 -40 -603 -1354 -741 -76 739 824
$$ packed form
2718e68J587q31k30J10l60Q78k32r1P54j064L30J020j399R35m3j299J024j86j03
2737B32K17n75N63p09l2J437j596M03M79j322R28P53j096M69m41L46N55n51J087
2756A147j239l74J540j154L93J224k013K13Q27o14P98n19K87o66q06J690n67o74
2774e07J214j739N0J633q66o1L72j150O7J010K06K04j200R61p69m51K718j419
2792B73j236J239p88L18J493p09o66o66R05O24q58J306j177j768K145k76m27J431
2810A163j449j041P51Q21O40j240J40k39j198K299K89j591Q79j124l61K226j46
2827H19p13m32j10O21m11J467m15k445J315M99m57J535r49j843P75L34P90k32
2845A48n12j72j634J854J523k101N29J78j607J964Q57j067n63p51O13O65Q15Q5
$$ plain form
2863 824 -1343 -1093 1090 -680 687 1170 -1594 -900 355 340 388 -581 -348 -1509 -981 1228 -637 -970
2881 -970 -349 -1434 -340 1179 -754 -1087 -710 -631 142 173 300 -1110 -1409 906 -3 -127 795 -1639
2899 -1639 -1127 638 77 495 -527 -1075 -612 -467 1149 233 -1412 -249 -1006 -489 1506 -489 -1274
2916 -1274 -547 -767 459 380 0 -758 -1827 267 1121 -13 603 -1218 -1554 742 599 418 -39 -1042
2934 -1042 -754 -186 1031 1030 -1266 -452 -403 -796 1123 495 -1129 -819 -478 56 874 -87 -655 -1231 53
2953 53 1185 59 283 -258 -1564 452 823 393 720 -842 -1021 104 368 634 -594 -786 -7 -791
2971 -791 722 398 -435 9 -235 -204 618 229 23 -647 -351 740 128 210 400 -1086 -116 955 -163
2990 -163 217 -149 -385 412 612 789 379 -319 422 37 454 1004 -133 63 429 -352 579 719 -154 348
$$ packed form
2863H24k167K50K183j770J367M83k764O94J255j5M8r69K33j161N28K209j865l33
2881i70O21j085J094J519j933l33L77P9P73L1J27j410k99K315r09j24R22k434
2899a639N12J765n61M18j022n48M63J45J616r16j645J163p57N17J995j995p85
2916a274P27k20J226p9l80p58j069K094Q54j134O16j821l36K296j43j81m57j003
2934a042K88N68J217jk296Q14M9l93J919o28j624L10L41N34Q18r61n68n76J284
2953E3J132j126K24n41j306K016L71m30L27j562j79J125K64K66j228j92P79p84
2971g91J513l24q33M44k44L1Q22l89k06o70K96J091o12Q2J90j486R70J071j118
2990a63L80l66k36P97K00J77m10o98P41l85M17N50j137J96L66p81R31J40q73N02
$$ plain form
3010 348 -344 342 472 -175 413 -317 -252 809 -66 285 470 -418 321 248 -46 512 -346 142 103 -704 678
3031 678 81 -218 638 -521 219 551 -125 288 -256 -199 536 -186 423 246 -659 564 118 -20 437 -530
3051 -530 -227 520 -324 109 102 -98 59 -560 153 535 -289 35 50 -328 607 18 -24 412 -324 248 88
3072 88 -231 457 -156 -112 371 -479 645 137 -483 507 -363 12 256 -230 429 -171 -102 286 -193 -105 206
3093 206 -476 313 -19 -401 758 -166 402 90 -52 345 -452 -279 54 -193 39 423 -275 782 -340
3112 -340 -377 -21 -704 -22 75 -952 155 51 -871 236 -607 280 -579 -800 251 -385 -453 361 -561 -521
3132 -521 -1312 -234 88 777 497 -261 -462 -172 943 -965 274 -60 -573 -609 352 243 872 -766 149
3151 149 274 -533 169 -535 -915 672 -680 -52 390 214 629 -285 -158 455 -1139 -330 633 -1274 53
$$ packed form
3010C48o92O86J30o47N88p30O5J061q75L51J85q88P39p3k94N58q58M88l9q07J382
3031F78n97k99Q56j159P40L32o76M13n44N7P35p22O09j77r05J223m46j38M57r67
3051e30L03P47q44M33pk00J57o19P13L82q24L24J5l78R35n89m2M36p36N72j60
3072H8l19O88o13M4M83q50J124n08o20R90q70L75K44m86O59o00O9L88m79Q8L11
3093B06o82P89l32l82J159r24N68l12j42L97p97J73L33k47K32L84o98J057j122
3112c40l7L56o83O82R7j027J107j04r22J107q43Q87q59k21J051o36o8Q14r22M0
3132e21p91J078L22O89k80p58k01K90J115j908J239l34n13l6R61j09O29j638R15
3151A49J25q07P02p04l80J587j352O28M42j76M15r14J27O13j594Q09R63j907J327
$$ plain form
3170 53 -103 373 462 -1004 284 73 -440 338 -104 176 349 -258 89 394 -568 648 -19 535 764 -110
3190 -110 806 174 -8 539 -276 -819 307 -899 -337 -58 -91 890 -922 558 1003 -899 -181 -365 -148
3209 -148 527 -33 -267 366 -400 -119 2 -491 258 -194 -79 102 -638 167 -201 -448 366 -374 71 407
3229 407 -293 150 280 -361 286 -536 -218 261 -253 337 22 -534 392 -192 -24 334 -529 246 -203 -551
3249 -551 157 -333 -354 17 -370 -25 109 -274 439 -231 -60 368 -517 475 153 -420 436 35 -16 427 -472
3270 -472 -261 -41 -279 183 -180 -120 129 -582 11 294 -558 234 -352 -239 596 -377 165 79 -538 51 -301
3291 -301 144 275 -527 -203 29 -279 621 409 -342 213 -240 -37 354 -48 64 -298 -274 374 -307 183
3311 183 -111 -737 262 -208 -86 -117 -562 -154 -114 -743 -29 -75 -185 -152 -452 388 404 -1064 317 142 -39
$$ packed form
3170E3j56M76Q9j466J288k11n13P78m42K80J73o07L47L05r62J216o67N54K29q74
3190a10R16o32j82N47q15n43J126j206N62K79l3R81j812J480M45j902P18j84K17
3209a48O75n60k34O33p66K81J21m93P49m52J15J81p40Q05l68k47Q14p40M45L36
3229D07p00M43J30o41O47q22L18M79n14N90l15n56R26n84J68L58q63P75m49l48
3249e51P08m90k1L71l87L45J34l83P13o70J71M28q85R92l22n73Q56m01n1M43q99
3270d72K11K20k38M62l63O0K49p11N93K83q52P92n86J13Q35r73N42q6o17N89l52
3291c01M45J31q02L24K32l08R00k12p51N55m53K03L91m02J12l62K4O48o81M90
3311A83k94o26R99m70J22l1m45M08M0o29P14m6j10L3l00Q40J6j468J381j75j81
$$ plain form
3332 -39 123 246 -4 -457 -653 928 258 419 856 -446 396 118 90 400 60 -673 -176 65 333 206
3352 206 -149 449 -428 -184 719 -552 3 273 -380 282 146 127 211 -109 429 249 202 894 -81 -172 876
3373 876 -173 70 531 -407 159 154 63 309 -71 335 -85 -139 1041 -143 -435 463 -355 163 567 -223
3393 -223 -120 -139 60 308 61 371 -334 -506 848 -56 3 945 -345 -191 656 125 219 -260 182 -109
3413 -109 -230 670 -55 -836 552 -162 -343 794 -48 -443 -145 -10 293 -140 102 71 -896 384 413 -720
3433 -720 388 -276 -616 696 258 135 102 -174 -148 -93 518 470 -699 222 212 -653 799 314 -678 -241
3453 -241 -80 272 253 41 -39 -905 -316 490 -758 271 161 -1406 -179 340 -353 55 -902 -1684 -558
3472 -558 186 1216 -155 -412 234 -819 696 516 -561 -1116 -298 -108 279 223 -158 -582 -1014 893
$$ packed form
3332c9J62J23k50m53j96J581o70J61M37j302Q42k78k8L10l40p33M97K41K68j27
3352B06l55N98q77K44R03j271N55K70o53O62j36j9Q4l20N38j80m7O92r75r1J048
3373H76j049K43M61r38N66nr1K46l80M06m20n4J180j184k92Q98q18N18M04p90
3393b23J03j9J99K48k47L10p05j72J354r04N9R42j290J54Q47n31R4m79M42k91
3413a09j21R00p25p81J388p14j81J137q42l95K98J35L03m33K42l1r67J280K9j133
3433g20J108o64l40J312m38j23l3k76K6N5O11m8j169R21j0q65J452m85r92M37
3453b41J61L52j9k12q0q66N89Q06j248J029j10j567J227N19o93M08r57p82J126
3472e58P44J030j371k57O46j053J515j80j077n55Q18J90L87n6l81m24m32J907
$$ plain form
3490 893 121 203 -54 -1224 -508 666 36 -306 -19 -1225 -903 229 849 430 -1077 239 -436 59
3508 59 1273 -513 -711 -108 -399 255 874 -200 -777 -834 557 424 422 589 -755 -882 946 401 18
3527 18 338 -894 -699 441 872 54 -529 -342 -233 -837 1426 26 -762 178 -1158 3 1039 186
3545 186 -903 -465 115 635 186 618 -581 -919 663 597 -113 506 -179 -496 237 522 321 4 -414
3564 -414 -207 -815 744 536 -98 650 -232 -397 303 19 -579 -237 -197 186 -121 -91 131 -937 141 416
3584 416 -493 626 437 -520 374 320 431 309 -204 524 -345 61 799 -711 333 482 -707 97 181
3603 181 -637 117 -206 16 -115 -227 126 -226 -330 331 -557 -348 336 -450 150 199 -541 -97 57 341
3623 341 371 91 585 -118 -193 847 -309 -99 261 -271 -357 326 -158 22 -455 -86 -189 -424 618 -275
$$ packed form
3490H93p72Q2k57j170P16J174o30l42K87j206L22J132O20m19j507J316o75M95
3508E9J214j786j98O03k91O54O19j074n77n7J391j33kJ67j344j27J828n45l83
3527A8L20j232J95J140M31q18n83J87J09o04K263j400p88R40j336J161J036q53
3545A86j089M38N80N20m49M32j199l38J582o6p10O19o85l17P33K85k01l17m18
3564d14K07o08J559k08o34P48q82j65P00k84n98L42M0L83l07L0K22j068J078K75
3584D16r09J119j89r57Q94n4J11j22n13P28q69M06P38j510J044J49j189Q04Q4
3603A81q18P54l23K22j31j12L53l52j04O61q88K09O84p86O00M9p40M44J54K84
3623C41L0k80M94p03p5J040j156K10L60n32q6O83m84J80m77L69j03k35J042q93
$$ plain form
3643 -275 -974 435 -259 -90 397 -278 -240 152 138 271 -79 332 103 -401 644 -21 -621 351 -419 534
3663 534 720 -288 -8 -661 -164 454 -183 -450 157 -126 299 -59 -428 426 -543 229 295 -413 547 42
3683 42 -177 432 -170 345 392 -302 157 -18 -255 588 172 -152 129 -296 114 177 -166 520 -318 -93 399
3704 399 -263 337 201 -152 308 -37 181 296 -51 387 85 -291 527 -205 40 -97 -494 160 -32 -275
3724 -275 400 -118 67 141 -202 288 -186 -190 258 -118 -92 367 -478 506 225 -228 559 18 66 241 76 214
3746 214 -350 113 202 -179 5 293 -275 190 3 -297 299 24 -152 181 -317 116 -141 -285 320 -392
3766 -392 -502 318 -387 15 -607 369 -259 -776 336 40 -95 113 381 -62 454 -162 -51 447 -220 -154
3786 -154 1 -293 233 -458 -256 -14 -332 -272 -307 -490 -24 -291 -310 -37 -600 -284 407 -213 -179 -328 -99
$$ packed form
3643b75o99J409o94J69M87o75L8L92j4J33l50M11k29n04J045o65o00R72p70R53
3663E34J86j008K80o53M97O18o37k67O07k83M25l58l69Q54r69P72O6p08R60n05
3683D2k19O09o02N15M7o94M59j75k37Q43m16l24K81m25M10O3l43O86q38K25M92
3704C99o62O00j36l53M60l45K18J15l47M38l02l76Q18p32K45j37l97O54j92k43
3724b75O75n18J85P4l43M90m74mM48l76K6M59q45R84k81m53P87n41M8J75j65J38
3746B14n64M63Q9l81J84K88n68M65j87l00N96k75j76L33m98M33k57j44O05p12
3766c92j10Q20p05M02o22R76o28n17J112k96j35K08K68m43N16o16J11M98o67O6
3786a54J55k94N26o91K02K42l18O0l5j83M66k67j9K73n63L16O91o20L4j49K29
$$ plain form
3807 -99 -37 -282 502 39 -272 325 86 -49 457 -207 239 4 120 328 -352 131 116 -772 110 -133 -528
3828 -528 -103 -229 -414 -113 -319 -203 -307 -231 0 -606 -32 304 -700 231 151 -591 2 229 -408 37
3848 37 -87 345 270 117 496 25 253 556 -691 177 365 -656 -498 -290 -426 -84 -55 -40 -22 -691 631
3869 631 -552 -216 1034 -680 456 267 187 144 -3 -809 49 -195 940 -164 -117 486 -458 -137 436
3888 436 -314 -606 647 71 -356 -186 266 -705 -784 850 -281 -452 439 -133 -600 1039 -828 -67 -97
3907 -97 -318 -320 210 281 32 8 251 260 -532 1062 108 77 478 307 -139 173 -56 -194 -383 544 -335 -1180
3929 -1180 486 4 -325 947 347 -282 543 -182 -182 340 428 -238 -487 -263 474 -196 632 391 -1060 592
3949 592 -102 -81 456 -96 -483 -175 896 224 -951 -144 432 -980 828 655 -532 -478 210 -830 372
$$ packed form
3807i9O2k45P84m63l11N97k39j35N06o64M46k35J16K08o80M83j5q88Q82k43l95
3828e28M25j26j85L01k06J16j04P6K31o06N74L36j004R31q0p42N93K27o37M45
3848C7j24M32p5j53L79m71K28L03j247Q68J88j021J58K08j36L42K9J5J8o69J322
3869F31j183L36J250j714J136j89q0m3j47q06Q58k44J135j104M7O03r44L21N73
3888D36p50k92J253n76m27J70M52r71p9J634j131j71Q91n72m67J639j867P61l0
3907i7k21kN30P1k49k4K43Rp92J594r54l1M01j71m46L12k29j38j89R27q79q45
3929a180J666m82l29J272o00o29Q25p25%N22Q8o66k49K24P37o70Q28k41j451J652
3949E92o94K1N37n52l87L08J071o72j175Q07N76j412J808j73j187N4O88j040J202
$$ plain form
3968 372 1050 169 -306 90 1016 -17 199 873 -908 -389 1247 102 -168 617 -813 -899 1326 904
3986 904 -599 -326 175 -1106 490 2071 -643 -739 535 -864 1 1542 -244 -897 743 592 -320
4003 -320 569 728 -843 -1045 1203 761 51 1023 -1477 -976 678 890 -326 -674 217 -1010 105 2172
4021 2172 -478 -1478 477 -93 221 1807 471 -1013 -161 661 108 400 1321 -490 -620 1049 424
4038 424 -2 1095 -85 -1360 146 937 209 72 684 -380 -768 1384 696 -930 508 -123 -830
4055 -830 948 667 -707 -159 268 -340 -295 1037 78 -1229 551 665 -667 632 567 -1302 232 1045
4073 1045 188 323 633 -176 -762 814 760 -757 562 748 -1225 278 1040 -922 -128 617 -222 -356
4091 -356 266 297 -801 260 351 -1221 148 1081 -587 327 995 -515 -292 459 345 -193 169 840 -774
$$ packed form
3968C72O78q81m75L96R26j033K16O74j781N19J636j145k70P85j430q6K225m22
3986I04j503K73N01j281J596J581k714r6J274j399Q65J541j786o53J640j51r12
4003c20Q89J59j571k02K248m42p10R72k500N01J654K12j216l48Q91j227J115K067
4021B172k650j000J955n70L14J586j336j484Q52Q22n53K92R21j811j30J669o25
4038D24m26J097j180j275J506P91p28j37O12j064l88K152o88j626J438o31p07
4055h30J778k81j374N48M27o08M5J332r59j307J780J14j332J299o5j869J534Q13
4073A045q57J35L10q09n86J576n4j517J319J86j973J503P62j962P94P45q39j34
4091c56O22L1j098J061R1j572J369R33j668R14O68j510K23P51j14n38L62O71j614
$$ plain form
4110 -774 -9 1183 -508 -187 693 -717 -282 732 47 -298 -192 70 -459 -104 659 -804 -757 675
4128 675 -448 -197 806 -800 -367 113 110 -391 -6 458 -370 -256 935 -372 -596 893 -205 -471
4146 -471 792 65 -386 6 363 -161 -262 508 -66 -612 617 -385 -760 521 -48 -932 421 112
4164 112 -550 19 169 -105 -458 690 -49 -163 359 219 -810 94 403 -567 37 362 78 -996 201
4183 201 59 -723 -33 197 -292 519 529 -641 210 994 -328 215 -129 -429 -438 -255 261 -544 250 658
4203 658 -795 253 392 -594 46 148 -258 -133 213 129 -120 -165 436 -380 317 504 -490 172 215 -181
4223 -181 -104 154 -195 -30 36 152 -190 -122 725 -305 169 506 -381 -4 254 -123 13 -83 -22 -123 -152 266
4245 266 -216 -312 478 -188 -250 429 -87 -24 237 -105 -155 81 326 20 -352 541 -5 -102 486 -114 69 213
$$ packed form
4110g74P65J192j691L21Q80j410M35J014o85l45J06K62n29L55P63j463M7J432
4128F75j123K51J003j606M33M80ln01L85M64q28J14J191j307k24J489j098k66
4146d71J263p27m51L92L57n24j01P70n74n46J229j002l75J281n69q84J353l09
4164A12o62N69J50k74l53J148p39j14N22j40j029R04L09r70O04L25k84j074J197
4183B01j42p82O90K30m89Q11J0j170Q51P84j322N43l44l00rJ83N16q05P94M08
4203F58j453J048J39r86O40J02m06J25L46q4k49m5O01q16O97J87r94O62M3l96
4223a81P7K58l49J65O6J16l42O8Q47j030M74L37q87L77K58l77J36r6O1j01k9M18
4245B66m82r6P90o66o2O79n16O3K61l42n0K36K45l06l72Q93n46r7N88o00J83J44
$$ plain form
4267 213 -111 74 273 -121 112 64 66 154 -143 462 76 -339 112 -187 -221 266 -320 -151 114 -63 99 -86
4289 -86 130 174 -508 43 62 -82 203 -108 8 109 -196 10 -592 -257 276 -391 94 475 -345 62 484
4310 484 -177 144 1 -240 362 -250 80 -84 -157 153 -336 91 44 -210 -116 -151 -225 165 -159 -37 396 252
4332 252 180 253 -49 -77 -184 -132 748 -405 1125 240 -340 -313 294 390 -107 -57 -2 -330 89 122 -129 0
4354 0 476 -437 105 126 -352 -76 163 -189 189 -100 167 -215 -245 303 -315 -40 448 -52 78 238 85
4375 85 55 259 59 128 41 155 129 -94 650 33 206 515 -169 122 413 -165 -69 52 209 184 -298 112
4397 112 -72 -368 262 -181 -392 433 -14 32 243 -85 -60 19 373 363 -33 538 283 -172 596 71 -92
4418 -92 221 138 -107 561 122 -31 -85 190 236 -449 635 105 -680 150 291 -314 348 333 -187 -275 237 131
$$ packed form
4267B13l24J85J99l94K33m8KQ8k97O05l86m15M51k99l4M87n86J69K65j77J62j85
4289h6K16M4o82N51J9j44K85l11J16J01l05K06o02L35N33o67M85L81q20M07M22
4310D84o61L21j43k41O02o12L30j64p3L10m89M27m7k54R4l5p4L90l24J22M33j44
4332B52p2P3l02k8j07N2Q80j153J530q85n80K7O07R6m97N0N5l28M19L3k51J29
4354@M76r13N42K1m78K76K39l52L78k89K67l82l0N48o18K75M88n00J30J60j53
4375H5l0K04k00O9q7J14k6k23P44o17J73L09o84K91K91n78R6J21J57k5m82M10
4397A12j84k96O30m43k11Q25m47M6K11l28K5P9L54j0l96N71k55m55P68n25j63
4418i2L13q3k45O68m39j53n4K75M6o85J084n30p85Q30J41o05O62j5n20q8N12j06
$$ plain form
4440 131 -578 63 546 -779 592 437 -542 442 553 -462 202 767 112 -382 90 348 -293 733 744
4459 744 -713 -5 461 -390 19 612 -736 -304 251 254 -165 29 170 -898 -117 861 -755 -271 477
4478 477 -850 -133 646 -291 -562 -127 85 -345 7 854 -743 -622 699 -401 -268 605 -445 -784
4496 -784 531 389 -171 81 117 -758 -249 1249 -396 -1015 499 -522 -693 850 429 -768 -226 186
4514 186 -290 -100 856 -484 -1060 892 37 -830 861 -48 -1100 274 403 -555 82 457 -640 -523
4532 -523 1243 342 -899 552 -178 -993 744 998 -669 13 184 -549 -403 793 -10 -1043 553
4549 553 192 -1390 622 534 -1413 -182 543 -637 85 548 -249 -938 772 520 -1155 527 575 -1294
4567 -1294 282 935 -688 41 1029 -309 -347 785 248 -1081 469 576 -851 260 829 -1153 -478
$$ packed form
4440A31p09O41M83j325J371j55r79R84J11j015O64N65o55m94M72K58o41J026J1
4459G44j457P08M66q51M09N93j348M32N55Lm19J94J41j068P81R78j616M84P48
4478D77j327P17P79r37k71M35K12m30L52Q47j597J21J321j100J33Q73j050l39
4496g84J315j42n60K52L6q75N09J498j645o19J514j021j71J543m21j197N42M12
4514A86m76J90R56j340n76J952q55q67J691r09j052J374J29r58O37L75j097J17
4532e23J766r01j241J451p30q15J737K54j667O82J71p33J46J196q03j033J596
4549E53l61j582K012q8j947J231P25j180P22M63p97o89J710k52j675J682M8j869
4567a294J576O53j623P29R88j338l8J132n37j329J550J07j427J111N69j982O75
$$ plain form
4584 -478 856 -454 -365 602 -222 -922 412 569 -1049 -17 1254 -1226 -286 999 -593 -401 1001
4601 1001 -370 -550 768 222 -458 79 1000 -757 -46 1355 -580 -543 1166 -247 -662 928 43
4618 43 -917 412 598 -758 -74 1003 -429 -840 1339 -589 -842 971 227 -976 412 597 -302
4635 -302 -116 741 -583 -721 1192 226 -649 1158 267 -926 912 577 -237 -24 938 -473 -374 1023
4653 1023 -238 -756 966 125 -1159 823 415 -1315 350 411 -439 32 439 -190 -914 660 239 -1098
4671 -1098 699 331 -1007 301 762 -688 -171 365 -272 -516 482 480 -879 39 556 -1251 347 1051
4689 1051 -857 -317 127 -776 -277 764 42 -886 -42 199 -969 311 737 -1086 -179 689 -386 -50
4707 -50 734 -212 -574 457 345 -576 21 600 -808 -144 994 -491 -309 480 -192 -581 382 154 -489
$$ packed form
4584d78J334j310Q9R67q24p00J334J57j618J032J271k480R40J285j592J92J402
4601A001j371j80J318n46o80N37R21j757P11J401j935L7J709j413m15J590q85
4618D3r60J329J86j356O84J077j432m11K179j928k53J813p44j203J388J85q99
4635c02J86Q57j324j38J913r66q75J807q91j193J838l35q14K13R62j411R9J397
4653A023j261n18J722q41j284J982m08j730J665O1q50M71M07o29p24J574m21j337
4671a098J797l68j338J308M61j450N17N36o37k44R98kj359R18N17j807J598P04
4689A051j908N40M44r03M99J041p22r28Q44K41j168J280M26j823R07Q68j075L36
4707e0P84r46l62J031j12r21N97N79j408O64J138j485J82P89o72l89R63k28o43
$$ plain form
4726 -489 -103 274 -867 -384 828 -775 -582 451 -665 -448 412 -218 -208 251 181 -55 -195 387 -488
4745 -488 -354 748 -355 -523 534 -154 -702 458 262 -267 -239 31 -364 -377 696 -380 -709 484
$$ packed form
4726d89L86L77j141M83J212j603J93J033j116K17Q60o30J0M59p0k36j40N82q75
4745d88J34J102j103j68J057o88n48J160j96n29K8K70l95j3J073j076l29J193
$$ [...]
8191A37
##END NTUPLES=NMR FID
##END=
