##TITLE=1H_8-2022
 CDCl3
 8 sc, 
 9.02.2022
##JCAMPDX= 6.0         $$ Bruker NMR JCAMP-DX V2.0
##DATA TYPE= NMR FID
##DATA CLASS= NTUPLES
##ORIGIN= UXNMR, Bruker Analytische Messtechnik GmbH
##OWNER= root
$$ XWIN-NMR		Version 3.5
$$ Wed Feb  9 11:05:23 2022 Russian Standard Time (UT+4h)  she@DPX200
##.OBSERVE FREQUENCY= 200.131346
##.OBSERVE NUCLEUS= ^1H
##.DELAY= (6, 6)
##.ACQUISITION MODE= SIMULTANEOUS
##.ACQUISITION SCHEME= undefined
##.AVERAGES= 8
##.DIGITISER RES= 18
##SPECTROMETER/DATA SYSTEM= spect
##.PULSE SEQUENCE= zg30
##.SOLVENT NAME= CDCl3
##.SHIFT REFERENCE= (INTERNAL, CDCl3, 0, 15.7039)
##AUDIT TRAIL= $$ (NUMBER, WHEN, WHO, WHERE, WHAT)
$$ ##TITLE= Audit trail, XWIN-NMR		Version 3.5
$$ ##JCAMPDX= 5.01
$$ ##ORIGIN= Bruker BioSpin GmbH
$$ ##OWNER= she
$$ F:/spectra/data/she/nmr/H-F/1/audita.txt
$$ ##AUDIT TRAIL=  $$ (NUMBER, WHEN, WHO, WHERE, WHAT)
(   1,<2022-02-09 11:03:30.43 +0400>,<she>,<DPX200>,
      <created by zg, POWCHK disabled, PULCHK disabled
       configuration hash MD5:
       00 E9 B6 7A A2 85 ED C7 34 08 36 98 17 FE 4E 26
       data hash MD5: 16K
       2E 2A D8 9E BB D8 EB FF 10 63 B1 33 D0 B8 95 9F>)
$$ ##END=
$$ 
$$ hash MD5
$$ AB B1 5E 7E CC AA 8A 02 E5 49 9D 46 5E DF 32 A8
##$RELAX= 
##$RELAX= 
##$RELAX= 
##$RELAX= 
##$RELAX= 
##$RELAX= 
$$ Bruker specific parameters
$$ --------------------------
##$DU= <F:/spectra>
##$EXPNO= 1
##$NAME= <H-F>
##$PROCNO= 1
##$TYPE= <nmr>
##$USER= <she>
##$AMP= (0..31)
100 100 100 100 100 100 100 100 100 100 100 100 100 100 100 100 100 100 
100 100 100 100 100 100 100 100 100 100 100 100 100 100 
##$AQSEQ= 0
##$AQ_mod= 1
##$AUNM= <au_zg>
##$AUTOPOS= <>
##$BF1= 200.13
##$BF2= 200.13
##$BF3= 200.13
##$BF4= 200.13
##$BF5= 200.13
##$BF6= 200.13
##$BF7= 200.13
##$BF8= 200.13
##$BYTORDA= 1
##$CFDGTYP= 0
##$CFRGTYP= 5
##$CHEMSTR= <none>
##$CNST= (0..31)
1 1 145 1 1 1 1 1 1 1 1 1 1 1 1 1 1 1 1 1 1 1 1 1 1 1 1 1 1 1 1 1 
##$CPDPRG= <>
##$CPDPRG1= <>
##$CPDPRG2= <>
##$CPDPRG3= <>
##$CPDPRG4= <mlev>
##$CPDPRG5= <mlev>
##$CPDPRG6= <mlev>
##$CPDPRG7= <mlev>
##$CPDPRG8= <mlev>
##$CPDPRGB= <>
##$CPDPRGT= <>
##$D= (0..31)
0 1.2 0 0 0 0 0 0 0 0.06 0 0.03 0 0 0 0 0.0002 0 0 0 0 0 0 0 0 0 0 0 0 
0 0 0 
##$DATE= 1644390209
##$DBL= (0..7)
120 120 120 120 120 120 120 120 
##$DBP= (0..7)
150 150 150 150 150 150 150 150 
##$DBP07= 0
##$DBPNAM0= <>
##$DBPNAM1= <>
##$DBPNAM2= <>
##$DBPNAM3= <>
##$DBPNAM4= <>
##$DBPNAM5= <>
##$DBPNAM6= <>
##$DBPNAM7= <>
##$DBPOAL= (0..7)
0.5 0.5 0.5 0.5 0.5 0.5 0.5 0.5 
##$DBPOFFS= (0..7)
0 0 0 0 0 0 0 0 
##$DE= 6
##$DECBNUC= <off>
##$DECIM= 32
##$DECNUC= <off>
##$DECSTAT= 4
##$DIGMOD= 1
##$DIGTYP= 9
##$DL= (0..7)
0 120 120 120 120 120 120 120 
##$DP= (0..7)
150 150 150 150 150 150 150 150 
##$DP07= 0
##$DPNAME0= <>
##$DPNAME1= <>
##$DPNAME2= <>
##$DPNAME3= <>
##$DPNAME4= <>
##$DPNAME5= <>
##$DPNAME6= <>
##$DPNAME7= <>
##$DPOAL= (0..7)
0.5 0.5 0.5 0.5 0.5 0.5 0.5 0.5 
##$DPOFFS= (0..7)
0 0 0 0 0 0 0 0 
##$DQDMODE= 0
##$DR= 18
##$DS= 0
##$DSLIST= <SSSSSSSSSSSSSSS>
$$ [...]
##$SUBNAM2= <"">
##$SUBNAM3= <"">
##$SUBNAM4= <"">
##$SUBNAM5= <"">
##$SUBNAM6= <"">
##$SUBNAM7= <"">
##$SUBNAM8= <"">
##$SUBNAM9= <"">
##$SW= 18.0517287032376
##$SWIBOX= (0..15)
0 0 2 0 0 0 0 0 0 0 0 0 0 0 0 0 
##$SW_h= 3612.71676300578
##$TD= 16384
##$TD0= 1
##$TE= 0
##$TE2= 300
##$TE3= 300
##$TEG= 300
##$TL= (0..7)
0 120 120 120 120 120 120 120 
##$TP= (0..7)
150 150 150 150 150 150 150 150 
##$TP07= 0
##$TPNAME0= <>
##$TPNAME1= <>
##$TPNAME2= <>
##$TPNAME3= <>
##$TPNAME4= <>
##$TPNAME5= <>
##$TPNAME6= <>
##$TPNAME7= <>
##$TPOAL= (0..7)
0.5 0.5 0.5 0.5 0.5 0.5 0.5 0.5 
##$TPOFFS= (0..7)
0 0 0 0 0 0 0 0 
##$TUNHIN= 0
##$TUNHOUT= 0
##$TUNXOUT= 0
##$USERA1= <user>
##$USERA2= <user>
##$USERA3= <user>
##$USERA4= <user>
##$USERA5= <user>
##$V9= 5
##$VALIST= <valist>
##$VCLIST= <CCCCCCCCCCCCCCC>
##$VD= 0
##$VDLIST= <DDDDDDDDDDDDDDD>
##$VPLIST= <PPPPPPPPPPPPPPP>
##$VTLIST= <TTTTTTTTTTTTTTT>
##$WBST= 1024
##$WBSW= 4
##$XGAIN= (0..3)
0 0 0 0 
##$XL= 0
##$YL= 0
##$YMAX_a= 810536
##$YMIN_a= -935813
##$ZGOPTNS= <>
##$ZL1= 120
##$ZL2= 120
##$ZL3= 120
##$ZL4= 120
##$ABSF1= 10
##$ABSF2= 0
##$ABSG= 5
##$ABSL= 3
##$ALPHA= 0
##$AQORDER= 0
##$ASSFAC= 0
##$ASSFACI= 0
##$ASSFACX= 0
##$ASSWID= 0
##$AUNMP= <proc_1d>
##$AZFE= 0.1
##$AZFW= 0.1
##$BCFW= 1
##$BC_mod= 2
##$BYTORDP= 1
##$COROFFS= 0
##$CY= 11.3945322036743
##$DATMOD= 1
##$DC= 2
##$DFILT= <>
##$DTYPP= 0
##$F1P= 2.36226072786647
##$F2P= -0.459571619588291
##$FCOR= 0.5
##$FTSIZE= 0
##$FT_mod= 4
##$GAMMA= 1
##$GB= 0.15
##$INTBC= 1
##$INTSCL= 1
##$ISEN= 128
##$LB= 0.24
##$LEV0= 0
##$LPBIN= 0
##$MAXI= 10000
##$MC2= 0
##$MEAN= 0
##$ME_mod= 0
##$MI= 1.114404
##$NCOEF= 0
##$NC_proc= 0
##$NLEV= 6
##$NOISF1= 3.799351
##$NOISF2= 2.8
##$NSP= 1
##$NTH_PI= 0
##$NZP= 0
##$OFFSET= 15.70392
##$PC= 1
##$PHC0= -15864.76
##$PHC1= 5.20078
##$PH_mod= 1
##$PKNL= yes
##$PPARMOD= 0
##$PSCAL= 0
##$PSIGN= 0
##$REVERSE= no
##$SF= 200.130013532006
##$SI= 16384
##$SIGF1= 3
##$SIGF2= 2
##$SINO= 400
##$SIOLD= 16384
##$SREGLST= <1H.CDCl3>
##$SSB= 0
##$STSI= 0
##$STSR= 0
##$SW_p= 3612.71676300578
##$SYMM= 0
##$S_DEV= 0
##$TDeff= 0
##$TDoff= 0
##$TI= <>
##$TILT= no
##$TM1= 0
##$TM2= 0
##$TOPLEV= 0
##$USERP1= <user>
##$USERP2= <user>
##$USERP3= <user>
##$USERP4= <user>
##$USERP5= <user>
##$WDW= 1
##$XDIM= 8192
##$YMAX_p= 0
##$YMIN_p= 0
$$ End of Bruker specific parameters
$$ ---------------------------------
##NTUPLES= NMR FID
##VAR_NAME=  TIME,          FID/REAL,        FID/IMAG
##SYMBOL=    X,             R,               I
##VAR_TYPE=  INDEPENDENT,   DEPENDENT,       DEPENDENT
##VAR_FORM=  AFFN,          ASDF,            ASDF
##VAR_DIM=   8192,          8192,            8192
##UNITS=     SECONDS,       ARBITRARY UNITS, ARBITRARY UNITS
##FACTOR=    0.0002768,     1,               1
##FIRST=     0,             0,               0
##LAST=      2.2672688,     0,               0
##MIN=       0,             -935813,         0
##MAX=       2.2672688,     810536,          0
$$ Real data points
##PAGE= N=1
##DATA TABLE= (X++(R..R)), XYDATA
$$ plain form
0 0 0 0 0 0 0 0 0 8 -8 8 -11 16 -24 32 -40 48 -64 80 -96 116 -136 168 -200 235 -275 320 -374 433 -500 574
30 574 -655 748 -852 966 -1089 1225 -1378 1546 -1729 1928 -2146 2387 -2650 2935 -3247 3585
46 3585 -3957 4365 -4813 5300 -5835 6430 -7086 7819 -8634 9553 -10597 11793 -13180
59 -13180 14808 -16752 19118 -22083 25910 -31061 38394 -49726 69665 -114800 424384 -383762
71 -383762 -746111 810536 -109817 -630737 614994 329863 -821331 209605 629996
80 629996 -544646 -325778 597213 -99807 -324707 400065 42212 -522693 121353 371574
90 371574 -193934 -159955 282479 -64363 -318653 234559 210801 -377241 28968 381904
100 381904 -247039 -191463 380700 -139617 -365341 449351 186676 -552644 166269 381261
$$ packed form
0@%%%%%%%Qj6J6j9K7m0N6p2Q8j12J44j76K12k52L04l68M35n10N95o94Q07r33J074
30E74j229J403j600J818k055K314k603K924l275L657m074M533n037N585o182O832
46C585p542Q322r178J0113j1135J2265j3516J4905j6453J8187k0150K2390k4973
59a3180K7988l1560L5870m1201M7993n6971O9455q8120J19391j84465N39184q08146
71c83762l62349J556647r20353n20920J245731k85131j151194J030936M20391
80F29996j174642K18868R22991o97020k24900P24772l57853n64905O44046K50221
90C71574n65508L3979M42434l46842k54290N53212k3758n88042M06209L52936
100C81904o28943N5576N72163n20317k25724Q14692k62675p39320P18913K14992
$$ plain form
110 381261 -478060 14959 525807 -432918 -253525 640734 -139563 -520557 425470 137758
120 137758 -506592 276637 355270 -519232 -32607 487658 -307364 -256891 451093 -31114
130 -31114 -346424 248818 133730 -338021 42894 302696 -168336 -171876 282025 13239
140 13239 -328790 126401 244678 -228340 -52728 289510 -156456 -265106 316051 96069
150 96069 -387754 164707 300525 -366710 -45073 373993 -260030 -197800 424126 -53954
160 -53954 -356080 274437 128577 -364696 133269 274367 -306278 -35826 324546 -187676
170 -187676 -171904 267413 -53994 -207315 207670 94731 -220893 16533 133185 -127897
180 -127897 -37306 182900 -47679 -148124 118412 52511 -170769 15143 160058 -58723
$$ packed form
110C81261q59321M93019N10848r58725J79393Q94259p80297l80994R46027k87712
120A37758o44350P83229P8633q74502M86625N20265p95022N0473P07984m82207
130c1114l15310N95242j15088m71751L80915K59802m71032l540M53901k68786
140A3239l42029M55191J18277m73018J75612L42238m45966j08650N81157k19982
150I6069m83823N52461J35818o67235L21637M19066o34023O2230O21926m78080
160e3954l02126O30517j45860m93273M97965J41098n80645K70452L60372n12222
170a87676J5772M39317l21407j53321M14985j12939l15624K37426J16652k61082
180a27897R0591K20206k30579j00445K66536o5901k23280J85912J44915k18781
$$ plain form
190 -58723 -75259 133726 -42960 -201682 147392 159075 -191909 24917 180446 -198669
200 -198669 -92150 241770 -57256 -160900 214292 42391 -267373 81844 156620 -201731
210 -201731 33588 236158 -171727 -134621 184181 -53894 -131270 178386 55498 -180983
220 -180983 35640 108340 -127939 -28164 156892 -39235 -87590 100924 -5037 -123701
230 -123701 55140 100316 -63789 -36035 87135 -32730 -101441 90663 54051 -122365 39665
241 39665 105019 -111578 -40773 117153 -53603 -87407 123158 25904 -138412 63249 83821
252 83821 -141578 11271 138172 -96517 -46067 134792 -50146 -105608 96851 32165 -96987
263 -96987 56842 79325 -107529 -25832 98286 -54677 -48363 103944 -3942 -86082 36344
$$ packed form
190e8723j6536K08985j76686j58722L49074J1683l50984K16826J55529l79115
200a98669J06519L33920k99026j03644L75192j71901l09764L49217P4776l58351
210b01731K35319K02570m07885L7106L18802k38075p7376L09656j22888k36481
220a80983K16623P2700k36279R9775J85056j96127m8355J88514j05961j18664
230a23701J78841M5176j64105K7754J23170j19865o8711J92104l6612j76416J62030
241C9665O5354k16597P0805J57926j70756l3804K10565r7254j64316K01661K0572
252H3821k25399J52849J26901k34689N0450J80859j84938n5462K02459o4686j29152
263i6987J53829K2483j86854Q1697J24118j52963O314J52307j07886q2140J22426
$$ plain form
274 36344 28812 -65709 6801 77206 -29591 -54204 57106 -3270 -78102 49880 56449 -61883
286 -61883 1188 58881 -47905 -46632 70473 13839 -67594 49488 46448 -89351 6163 72490
298 72490 -64502 -18520 86092 -28080 -59893 55369 8127 -76957 31718 63227 -59751
309 -59751 -6903 64740 -57873 -43930 69229 -3943 -38564 50619 17586 -62825 -6961 43582
321 43582 -21179 -8761 64430 -10442 -59899 22852 8818 -36449 32353 47698 -28753 -33551
333 -33551 17795 -12966 -36080 49135 39689 -50330 -137 22426 -55835 -8321 61778 281
345 281 -24471 25892 -8571 -58214 21299 52276 -29804 4587 45152 -47839 -34410 44944
357 44944 -1668 -16640 39196 8561 -45425 -5159 26058 -20904 -4227 44936 -13943 -34833
$$ packed form
274C6344p532r4521P2510P0405j06797k4613J11310o0376p4832J27982O569j18332
286f1883O3071N7693j06786J273J17105n6634q1433J17082l040j35799R5514O6327
298G2490j36992M5982J04612j14172l1813J15262m7242q5084J08675L1509j22978
309e9751N2848P1643j22613J3943J13159p3172l4621Q9183l3033q0411N5864N0543
321D3582o4761J2418P3191p4872m9457Q2751j4034m5267O8802J5345p6451m798
333c3551N1346l0761k3114Q5215r446r0019N0193K2563p8261M7514P0099o1497
345B81k4752N0363l4463m9643P9513L0977q2080L4391M0565r2991J3429P9354
357D4944m6612j4972N5836l0635n3986M0266L1217m6962J6677M9163n8879k0890
$$ plain form
369 -34833 21888 -3676 -28384 19248 22952 -14591 -10846 15796 -8131 -26305 24970 17846 -29210
382 -29210 14858 24278 -30712 -7509 24229 -10220 -11786 31279 10145 -36729 4948 21584
394 21584 -31935 4824 37127 -24777 -10531 27282 -22025 -26706 23413 15016 -14334 6563
406 6563 11057 -30408 -9642 30204 -5664 -7586 23788 -6921 -19715 6752 6003 -5300 2915
419 2915 19707 -890 -22868 7885 4518 -19379 17163 19434 -20422 -7117 12751 -9292 -13775
432 -13775 16198 6080 -21551 16540 17507 -36585 -2794 24659 -17317 3702 26687 -14881
444 -14881 -15040 13964 -1824 -16263 15028 21557 -13678 -2401 9490 -23617 -5980 23565 2523
457 2523 36 4744 -11116 -16686 -7034 15557 13189 -4750 5269 -7411 -24809 4251 13231
$$ packed form
369c4833N6721k5564k4708M7632L704l7543L745K6642k3927j8174N1275p124m7056
382b9210M4068R420n4990K3203L1738l4449j566M3065k1134m6874M1677J6636
394B1584n3519L6759L2303o1904J4246L7813m9307m681N0119q397k9350K0897
406F563M494m1465K0766L9846l5868j922L1374l0709j2794K6467p49j1303Q215
419B915J6792k0597k1978L0753l367k3897L6542K271l9856J3305J9868k2043m483
432a3775K9973j0118k7631L8091R67n4092L3791K7453m1976K1019K2985m1568
444a4881j59K9004j5788j4439L1291O529l5235J1277J1891l3107J7637K9545k1042
457B523k487M708j5860n570R652K2591k368j7939J0019j2680j7398K9060Q980
$$ plain form
470 13231 -3346 8162 17245 -9915 -27122 2831 10869 -4700 26126 15836 -35608 -4849
482 -4849 14445 -17787 9860 28183 -10562 -12644 6737 -10042 -16376 16640 16018 -13474 4176
495 4176 4689 -27790 -2563 17274 -1920 5961 4611 -12435 -8013 1538 9587 1499 -6901 9564
509 9564 6009 -8348 -865 -1038 -4860 7334 16548 -1724 -18861 6074 7609 -16983 10139 12074
523 12074 -20799 8673 16243 -23289 -8246 12415 -5655 1403 18196 -5997 -23328 5616
535 5616 8954 -10068 13207 9790 -19435 4864 9997 -14381 -715 8107 3259 7831 -152 -10978
549 -10978 -11173 2409 16551 3789 -7877 -4140 -1710 549 -1169 644 -664 -4675 13631 4958
563 4958 -23211 1275 9716 -9235 12941 11138 -19300 -2383 14438 -6093 -8342 11542 2605
$$ packed form
470A3231j6577J1508R083k7160j7207K9953Q038j5569L0826j0290n1444L0759
482d849J9294l2232K7647J8323l8745k082J9381j6779o334L3016o22k9492J7650
495D176N13l2479K5227J9837j9194P881j350j7046M422R551Q049q088q400J6465
509I564l555j4357P483j73l822J2194R214j8272j7137K4935J535k4592K7122J935
523A2074l2873K9472P570l9532J5043K0661j8070P058J6793k4193j7331K8944
535E616L338j9022K3275l417k9225K4299N133k4378J3666Q822m848M572p983j0826
549a0978j95J3582J4142j2762j1666L737K430K259j718J813j308m011J8306q673
563D958k8169K4486Q441j8951K2176j803l0438J6917J6821k0531k249J9884q937
$$ plain form
576 2605 -8343 13928 1959 -25618 4124 12684 -8051 10840 6405 -19426 -4432 5584 -2337
589 -2337 206 5532 4235 -3529 -4229 -4530 -8126 6246 14606 4930 -2381 -10965 -5596 3323 791
604 791 13371 8421 -11945 1278 -999 -15501 7279 14268 -1895 1257 799 -14625 -11181 11379
618 11379 7239 -5965 10325 -1047 -23060 3308 7869 -8043 11420 9050 -12212 -3539 2387
631 2387 -3600 1008 10483 5434 -6354 187 1048 -8004 3976 7807 -345 2354 -2786 -3773 -555
646 -555 -4026 4853 2396 -6160 5560 -29 -10947 1593 1925 -4541 3529 6789 -3654 -7840 4258
661 4258 -47 -8074 11503 6590 -10125 6841 2064 -13699 5167 9132 -3111 2383 4673 -4958
675 -4958 -8349 3058 3973 -3669 6547 3535 -11815 -1448 2047 -4271 3582 3685 216 -2233 -4678
$$ packed form
576B605j0948K2271j1969k7577K9742Q560k0735J8891m435k5831J4994J0016p921
589b337K543N326j297p764p00l01l596J4372Q360r676p311q584N369Q919k532
604G91J2580m950k0366J3223k277j4502K2780O989j6163L152m58j5424L444K2560
618A1379m140j3204J6290j1372k2013K6368M561j5912J9463k370k1262Q673N926
631B387n987M608R475n049j1788O541Q61r052J1980L831q152K699n140r87L218
646e55l471Q879k457q556J1720n589j0918J2540L32o466Q070L260j0443m186J2098
661D258m305q027J9577m913j6715J6966m777j5763J8866L965j2243N494K290r631
675d958l391J1407R15p642J0216l012j5350J0367L495o318P853J03l469k449k445
$$ plain form
690 -4678 1359 -1787 -1616 8716 596 -4066 3297 -1912 -4287 2531 5333 967 -2095 4974 -2028
705 -2028 -9164 6779 2176 -8238 8198 4108 -8606 348 -829 -6525 1838 8620 608 -7066
719 -7066 1360 -292 -8868 5510 7011 -3714 5325 1920 -9285 -2928 2778 4978 4316 2753 1098
734 1098 -9427 -5160 5876 -138 3238 7565 -4310 -7391 -3183 -457 849 2408 7638 -1643
748 -1643 -9268 909 -4161 -4516 12815 5713 -5906 -1076 -2227 -4191 1603 7755 2882 -3392 4095
763 4095 -950 -10160 4411 5931 -2775 5339 1459 -8010 -3099 1758 1604 -1072 2133 2817 -7038
778 -7038 -1970 3281 -5510 983 6023 -2101 -762 1292 -1566 -3078 61 7113 632 -2189 5115
793 5115 -3610 -4592 5953 -366 -1687 5160 1441 -3661 -3526 838 -660 -2032 6976 996 -8071
$$ packed form
690d678O037l146J71J0332q120m662P363n209k375O818K802m366l062P069p002
705b028p136J5943m603j0414J6436m090j2714Q954j177n696Q363O782q012p674
719g066Q426j652q576J4378J501j0725R039l405j1205O357N706K200o62j563j655
734A098j0525M267J1036o014L376M327j1875l081M208K726J306J559N230r281
748a643p625J0177n070l55J7331p102j1619M830j151j964N794O152m873o274P487
763D095n045r210J4571J520q706Q114l880r469M911M857j54k676L205O84r855
778g038N068N251q791O493N040q124J339K054k858j512L139P052o481k821P304
793E115q725r82J0545o319j321O847l719n102J35M364j498j372R008n980r067
$$ plain form
808 -8071 1505 -980 -5841 4742 3627 -2155 -684 -48 -2111 -3743 3284 5076 -2890 2955 3325
823 3325 -7460 -577 4372 -364 2406 2520 -1440 -3498 -580 3331 -3217 -922 5927 -3034 -2678
838 -2678 2701 -4792 -3010 3902 1761 -626 -1204 772 -2459 -3547 4685 704 -2391 6525 327
853 327 -5471 725 3 125 3624 4217 182 -5619 -743 1028 -3323 5184 4305 -4615 -23 -1081
869 -1081 -5971 -455 3889 3475 -812 -2033 -1427 -6433 260 7124 -616 1504 2932 -5569 -2989 2111
885 2111 1943 2686 2588 2240 -3719 -4885 2947 80 378 6035 -1350 -4399 -300 -2199 -909 1592 2661
902 2661 422 -4066 96 -947 -4431 3790 2977 -2639 1791 -157 -3126 106 1696 1926 -178 2175
918 2175 2497 -4736 -21 3354 -2954 2161 3840 -2500 -523 61 -2118 -1035 655 2930 -1191 -1851
$$ packed form
808h071R576k485m861J0583j115n782J471O36k063j632P027J792p966N845L70
823C325j0785O883M949m736K770J14l960k058K918L911o548K295O849q961L56
838b678N379p493J782O912k141k387n78J976l231j088Q232l981l095Q916o198
853C27n798O196p22J22L499N93m035n801M876J771m351Q507q79q920M592j058
869a081m890N516M344m14m287j221O06n006O693O864p740K120J428q501K580N100
885B111j68P43r8l48n959j166P832k867K98N657p385l049M099j899J290K501J069
902B661k239m488M162j043l484Q221q13n616M430j948k969L232J590K30k104K353
918B175L22p233M715L375o308N115J679o340J977N84k179J083J690K275m121o60
$$ plain form
934 -1851 1316 -4261 -2052 3858 -954 396 2113 -1846 -1695 -1497 1289 2491 82 2902 -262 -3967
950 -3967 2225 583 -1212 3281 1406 -1119 -1058 -1115 -118 -1476 2082 2591 -3780 -68 628 -4553 1096
967 1096 2118 -1912 1070 898 -980 -1639 -578 1590 -569 1552 3561 -2641 -683 1489 -2173 1541
983 1541 2608 -334 893 -549 -620 -1461 -2165 2810 1855 -578 667 -3381 -3215 948 800 1360 337
1000 337 -221 -380 -3865 1 2117 -871 4032 2303 -4391 -906 -176 -367 3471 2953 500 -1971
1016 -1971 -1313 79 -1717 2229 3464 -1964 227 -771 -4446 213 1096 612 2048 -1214 -2147 -1954
1032 -1954 -1484 2396 1031 84 1272 -1370 -766 73 -167 2050 883 1408 1382 -3120 90 1347 -1348
1049 -1348 2983 1308 -2440 595 -348 -1810 -394 278 749 -742 257 -31 -3819 313 1184 -1597
$$ packed form
934a851L167n577K209N910m812J350J717l959J51J98K786J202k409K820l164l705
950c967O192j642j795M493j875k525O1n7R97j358L558N09o371L712O96n181N649
967A096J022m030K982j72j878o59J061K168k159K121K009o202J958K172l662L714
983A541J067k942J227j442p1q41p04M975r55k433J245m048J66M163j48N60j023
1000C37n58j59l485L866K116k988M903j729o694L485P30j91L838n18k453k471
1016a971O58J392j796L946J235n428K191r98l675M659Q83m84J436l262r33J93
1032a954M70L880j365r47J188k642O04Q39k40K217j167N25k6m502L210J257k695
1049a348M331j675l748L035r43j462J416O72M71j491R99k88l788M132Q71k781
$$ plain form
1065 -1597 2549 821 -2737 622 -480 -610 1914 874 1438 246 -1049 -71 -881 1053 2029 262
1081 262 774 -1456 -1776 817 -1299 908 1882 -2204 156 -207 -3222 690 936 -723 1105 -221
1097 -221 -971 -1087 242 939 -690 1960 1483 -2238 1320 579 -2144 2257 956 -666 1671 -623
1113 -623 -1455 -42 -566 438 258 513 186 -1965 -664 -799 -705 1911 109 -371 741 -2832 -571
1130 -571 1465 -636 2580 1506 -1740 -216 -535 -253 1573 2090 1424 -1041 -543 -396 -2264 2003 2248
1147 2248 -1211 1352 -1173 -3679 893 101 -436 1865 -98 -1353 -1354 -1084 117 502 2038 870 -1580
1164 -1580 374 -1100 -544 2894 105 479 1567 -1847 89 692 -1232 1491 1012 -627 -72 -1070
1180 -1070 -943 -339 439 673 -1380 324 -150 -2613 895 215 -1727 2247 516 -1574 683 -845
$$ packed form
1065a597M146j728l558L359j102j30K524j040N64j192j295R78q10J934R76j767
1081B62N12k230l20K593k116K207R74m086K360l63l015L912K46j659J828j326
1097b21p50j16J329O97j629K650m77l721L558p41k723M401j301j622K337k294
1113f23q32J413n24J004j80K55l27k151J301j35R4K616j802m80J112l573K261
1130e71K036k101L216j074l246J524l19K82J826N17o66k465M98J47j868M267K45
1147B248l459K563k525k506M572p92n37K301j963j255jK70J201L85J536j168k450
1164a580J954j474N56L438k789L74J088l414J936O03j924K723m79j639N55r98
1180a070J27O04P78K34k053J704m74k463L508o80j942L974j731k090K257j528
$$ plain form
1196 -845 -562 1612 1262 727 -137 143 -128 -746 1327 407 -307 2035 -933 -1683 441 -1484 404 1654
1214 1654 -1212 -246 -662 -1781 369 145 206 569 -82 27 -1251 -44 1022 -504 1886 1245 -1527
1231 -1527 1108 114 -1141 2290 415 -673 1154 -517 -919 -56 99 37 -299 761 -523 -1774 447
1248 447 -954 -1139 1696 -530 -514 1026 -1474 -464 629 -259 1340 766 -40 139 -867 186 371
1265 371 871 1752 -572 -219 -30 -1999 1129 1139 -726 1090 -817 -2204 313 -535 -45 1528 125
1282 125 -637 -1263 -726 -381 76 2030 508 -969 763 -1057 -695 2082 286 565 1248 -1080 -464
1299 -464 74 -137 852 468 465 -259 -1351 -221 -756 42 1119 -1079 -50 -12 -1814 290 38 -469 1302
1318 1302 17 -662 408 -525 127 769 688 697 -292 332 81 -881 1243 -7 -381 1543 -958 -1190 540
$$ packed form
1196h45K83K174l50n35q64K80k71o18K073r20p14K342k968p50K124j925J888J250
1214A654k866R66m16j119K150k24O1L63o51J09j278J207J066j526K390o41k772
1231a527K635r94j255L431j875j088J827j671m02Q63J55o2l36J060j284j251K221
1248D47j401j85K835k226J6J540k500J010J093q88J599n74q06J79j006J053J85
1265C71N00Q81k324L53J89j969L128J0j865J816j907j387K517q48M90J573j403
1282A25p62o26N37L45M57J954j522j477J732j820L62K777j796K79O83k328O16
1299d64N38k11R89l84lp24j092J130n35P98J077k198J029L8j802K104k52n07J771
1318A302j285o79J070r33O52O42q1Rr89O24k51r62K124j250l74J924k501k32J730
$$ plain form
1337 540 -997 -136 777 -322 -363 -820 -700 -461 -198 725 80 -335 652 -1255 -352 1110 -59 1242
1355 1242 945 -752 678 -215 -441 1031 183 262 457 -604 -125 -489 197 211 -571 315 -629 -1385 487
1374 487 -712 -637 1093 -535 -403 598 -907 -70 439 279 734 353 658 -107 -590 801 -65 282
1392 282 1451 -468 9 340 -1299 240 465 -357 691 -575 -1077 -483 -879 461 192 194 112 -1082
1410 -1082 -329 -108 -505 1504 606 -259 674 -958 -442 1176 246 866 1047 -301 -427 -448 173 519 104
1429 104 647 -824 -921 225 -1287 -111 1130 -786 30 -112 -1407 30 118 58 725 -115 26 -141
1447 -141 -262 566 6 644 960 -262 411 20 -724 922 242 -78 755 -802 -624 -22 -782 31 219
1466 219 -210 -78 -550 -185 -525 -562 830 -88 74 497 -1046 240 884 -237 828 651 -372 420
$$ packed form
1337E40j537Q61R13j099m1m57J20K39K63R23o45m15R87j907R03J462j169J301
1355A242k97j697J430q93k26J472q48P9J95j061M79l64O86J4p82Q86r44p56J872
1374D87j199P5J730j628J32J001j505Q37N09j60M55l81L05p65m83J391q66L47
1392B82J169j919M77L31j639J539K25q22J048j266n02N94l96J340k69Kq2j194
1410a082P53K21l97K009q98q65R33j632N16J618r30O20J81j348j26k1O21L46m15
1429A04N43j471r7J146j512J176J241j916Q16j42j295J437Q8o0O67q40J41j67
1447a41j21Q28n60O38L16j222O73l91p44J646o80l20Q33j557J78O02p60Q13J88
1466B19m29J32m72L65l40l7J392r18J62M23j543J286O44j121J065j77j023P92
$$ plain form
1484 420 -247 -214 382 309 745 -144 -296 61 -875 253 509 -733 392 -321 -1103 258 -601 -366 622
1503 622 -467 173 -8 -557 -14 156 485 383 96 583 -239 -247 842 -392 361 989 -572 265 134
1522 134 -1079 34 239 -280 375 -358 -397 -455 -476 214 -274 198 542 -1001 8 -154 -487 1203 472
1541 472 2 784 -639 -99 539 174 900 391 -97 14 -598 62 46 -7 696 -450 -671 1 -1267 -10
1561 -10 754 -466 314 -167 -1092 -46 36 107 552 228 254 -293 1 446 -200 857 646 -603 502 55
1581 55 -503 811 114 22 502 -423 -389 -350 -510 138 -261 -131 -262 -675 -28 -428 -262 570 -287 217 593
1602 593 -628 111 469 -356 785 651 -49 306 -19 -102 48 320 643 -274 12 72 -965 245 178 -685
1622 -685 384 -375 -762 65 -545 -191 423 -103 42 -89 -255 180 -149 536 416 -10 709 -113 -109 723
$$ packed form
1484D20o67L3N96p3M36q89j52L57r36J128K56j242J125p13p82J361q59K35R88
1503F22j089O40j81n49N43J70L29j02k87M87q22qJ089j234P53O28j561Q37j31
1522A34j213J113K05n19O55p33l9n8k1O90m88M72L44j543J009j62l33J690p31
1541D72m70P82j423N40O38l65P26n09m88J11o12O60j6n3P03j146k21O72j268J257
1561a0P64j220P80m81r25J046Q2P1M45l24K6n47K94M45o46J057k11j249J105m47
1581E5n58J314o97r2M80r25L4L9j60O48l99J30j31m13O47m00J66Q32q57N04L76
1602E93j221P39L58q25J141j34p00L55l25q3J50K72L23r17K86O0j037J210o7q63
1622f85J069p59l87Q27o10L54O14n26J45j31j66M35l29O85j20m26P19q22MQ32
$$ plain form
1642 723 -214 428 704 -566 169 -233 -571 155 -176 -113 69 -227 -42 -653 -190 249 -387 346 160 -668
1662 -668 334 -56 -411 977 247 137 636 -346 -72 294 341 595 175 129 36 -639 131 -67 -106 475 -393
1683 -393 -419 -42 -679 149 342 -363 442 -282 -488 -65 -161 324 314 104 385 -431 93 353 -164 754 595
1704 595 -278 509 -262 -491 629 34 100 225 -365 -316 -428 -295 -25 -392 298 -96 -617 122 -474 -176
1724 -176 623 -462 167 339 -404 190 249 -39 508 279 235 252 -129 119 180 207 626 -304 175 -86 -635
1745 -635 328 -96 -437 105 -365 -510 -41 -432 -202 121 9 85 -248 6 102 -246 617 117 108 690 -267
1766 -267 -19 465 -127 325 334 -187 -11 -90 -280 15 -151 160 58 -297 -33 -493 -140 229 -358 74 171
1787 171 -622 259 -131 -215 601 164 104 416 -142 86 49 250 454 173 397 -73 -429 198 -332 -159 452
$$ packed form
1642G23r37O42K76j270P35m02l38P26l31O3J82k96J85o11M63M39o36P33j86q28
1662f68J002l90l55J388p30j10M99r82K74L66M7K54m20m6r3o75P70j98l9N81q68
1683c93k6L77o37Q28J93p05Q05p24k06M23r6M85j0k10K81q16N24K60n17R18j59
1704E95q73P87p71k29J120n95O6J25n90M9j12J33K70l67O90l94n21P39n96K98
1724a76P99j085O29J72p43N94N9k88N47k29m4J7l81K48O1K7M19r30M79k61n49
1745f35R63m24l41N42m70j45M69l91K30L23j12P6l33K54R6l48Q63n00rN82r57
1766b67K48M84n92M52Rn21J76p9j90K95j66L11j02l55K64m60L53L69n87M32R7
1787A71p93Q81l90q4Q16m37o0L12n58K28l7K01K04k81K24m70l56O27n30J73O11
$$ plain form
1808 452 -569 -169 -25 -701 -114 96 -104 213 -324 -214 -58 -335 168 120 247 237 -191 251 339 -99 575
1829 575 422 -11 314 -143 -191 226 -9 75 47 -288 -170 -440 -151 -42 -310 187 -149 -612 22 -399 -189
1850 -189 284 -61 363 145 -200 112 151 47 368 213 364 70 17 180 -67 167 445 -152 -50 -30 -572
1871 -572 121 -251 -312 123 -297 -388 28 -277 -40 15 157 199 -207 1 63 -69 404 121 57 398 -163 115
1893 115 432 -177 295 89 -210 62 -259 -35 109 -256 105 -62 -212 -96 -513 -143 13 -283 96 296
1913 296 -99 131 -72 105 194 113 260 143 48 241 78 211 171 -142 220 81 -325 71 -303 -200 218
1934 218 -55 -151 -29 -494 -86 -165 -30 43 -230 3 -181 -327 196 127 58 391 -260 124 267 -53 392 349
1956 349 139 204 -242 159 -56 -119 176 -266 -43 -19 -344 -71 -89 -242 39 -204 -459 -1 -321 24 232
$$ packed form
1808D52j021M00J44o76N87K10k00L17n37J10J56k77N03m8J27j0m28M42Q8m38O74
1829E75j53m33L25m57m8M17k35Q4k8l35J18k70K89J09k68M97l36m63O34m21K10
1850a89M73l45M24k18l45L12L9j04L21j55J51k94n3J63k47K34K78n97J02K0n42
1871e72O93l72o1M35m20r1M16l05K37N5J42M2m06K08O2j32M73k83o4L41n61K78
1893A15L17o09M72k06k99K72l21K24J44l65L61j67j50J16m17L70J56k96L79K00
1913B96l95K30k03J77Q9q1J47j17r5J93j63J33m0l13L62j39m06L96l74J03M18
1934B18k73r6J22m65M08p9J35P3k73K33j84j46N23o9o9L33o51L84J43l20M45m3
1956C49k10O5m46M01k15o3K95m42K23K4l25K73j8j53K81k43k55M58l20L45K08
$$ plain form
1977 232 37 205 96 -22 331 -32 279 294 157 332 49 -164 196 -185 -13 221 -43 -99 -77 -300 -118
1998 -118 -300 -69 -95 -287 -5 -354 -301 -33 -29 130 16 -170 -26 111 62 450 149 165 377 78 104 52 37
2021 37 193 27 -92 -10 -255 -10 -181 -33 74 -268 -157 48 -179 -101 -74 -167 100 -237 -11 128 -46 161
2043 161 88 61 203 169 312 344 -33 213 246 171 207 105 25 173 -158 192 -168 -194 -19 -210 -163 -253 -72 -60
2067 -60 -45 -349 54 -125 -125 168 -35 315 316 170 191 233 46 171 203 115 -35 -164 -15 -5 61 49 -79 -143 6
2092 6 -400 -117 -137 -103 -44 -323 -81 -70 -140 133 253 69 157 -141 126 133 170 186 -90 -44 118 44 170 111 -138
2117 -138 110 -181 -182 -159 -254 -181 -182 -189 -64 -126 -141 -190 -191 5 -176 -81 43 -22 -59 174 86 163 298 198 143 280 115
2144 115 199 36 65 139 134 90 -254 -69 -109 -51 -30 44 -254 -124 -57 -178 113 -42 -48 57 48 -8 -33 -18 180 165
$$ packed form
1977B32j95J68j09j18L53l63L11J5j37J75k83k13L60l81J72K34k64n6K2k23J82
1998a18j82K31k6j92K82l49N3K68MJ59j14j86J44J37m9L88l01J6K12k99K6n2j5
2021C7J56j66j19Q2k45K45j71J48J07l42J11K05k27P8K7r3K67l37K26J39j74K07
2043A61p3k7J42l4J43L2l77K46L3p5L6j02q0J48l31L50l60k6J75j91M7r0J81J2
2067f0J5l04M03j79%K93k03L50Jj46K1M2j87J25L2q8j50j29J49J0O6j2j28o4J49
2092Fm06K83k0L4N9k79K42J1p0K73J20j84Q8k98K67PL7J6k76M6J62p4J26n9k49
2117a38K48k91jK3r5P3jpJ25o2j5m9jJ96j81R5J24o5l7K33q8P7J35j00n5J37j65
2144A15Q4j63K9P4nm4l44J85m0N8K1P4k98J30O7j21K91j55oJ05rn6k5J5J98j5
$$ plain form
2170 165 182 300 -119 413 79 -82 55 15 5 93 8 99 150 -13 -1 -186 -80 -356 -165 -86 -65 -217 -118 -143
2194 -143 -111 255 -219 240 -41 93 212 236 129 166 79 250 -87 100 381 16 197 283 -81 68 24 -9
2216 -9 116 -300 -206 -170 -336 -5 -59 -151 -45 -58 181 40 42 214 -26 4 214 26 100 412 71 96 159 -75
2240 -75 160 99 25 145 -41 -127 -93 -89 -37 -209 -119 -100 -373 -15 -80 -284 175 -205 -92 222 -208 153 175 -25
2264 -25 156 37 225 223 -15 37 152 -46 161 127 -48 166 -186 -124 -69 -150 103 -69 -193 -74 -367 -99 86
2287 86 -60 43 -145 38 198 0 41 33 95 231 80 -75 315 -17 221 283 -160 129 -94 -219 -95 -271
2309 -271 126 81 -201 -54 -80 -182 151 -263 -148 158 -360 105 -35 -139 121 1 165 80 14 194 129 144
2331 144 196 -72 210 315 -181 256 -136 -198 170 -36 -62 -152 -265 -176 -188 -107 -36 -253 -106 -252 -296 142 88
$$ packed form
2170A65J7J18m19N32l34j61J37m0j0Q8q5R1N1j63J2j85J06k76J91P9K1j52R9k5
2194a43L2L66m74M59k81J34J19K4j07L7q7J71l37J87K81l65J81Q6l64J49m4l3
2216iJ25m16R4L6j66L31n4r2J06j3K39j41KJ72k40L0K10j88P4L12l41K5O3k34
2240g5K35o1p4J20j86q6L4MN2j72R0J9k73L58o5k04M59l80J13L14m30L61K2k00
2264b5J81j19J88kk38N2J15j98K07l4j75K14l52O2N5q1K53j72j24J19k93K68J85
2287H6j46J03j88J83J60j98M1qO2J36j51j55L90l32K38O2m43K89k23j25J24j76
2309b71L97m5k82J47k6j02L33m14J15L06n18M65j40j04K60j20J64q5o6J80o5J5
2331A44N2k68K82J05m96M37l92o2L68k06k6r0j13Q9j2Q1P1k17J47j46m4M38n4
$$ plain form
2354 88 -57 438 -69 -43 156 -85 219 284 104 341 -3 -45 96 -138 240 78 -109 66 -429 -41 -6 -320
2376 -320 202 -110 -321 2 -157 -257 3 -149 84 19 -221 125 35 151 266 -51 413 140 -157 281 -96
2397 -96 -46 403 -220 106 100 -297 107 -226 -241 38 -219 11 -40 -142 48 -66 -11 116 -166 16 183 -364
2419 -364 338 139 100 517 -61 18 428 154 67 138 188 95 -131 -48 -116 -250 179 51 -223 100 -237 -121 192
2442 192 -196 138 8 -220 66 -258 53 149 -76 210 53 -79 123 -162 157 427 -168 338 47 -253
2462 -253 162 -54 -160 207 -222 -14 -36 -83 150 -242 79 261 -198 43 -125 -445 303 -103 -171 293 -88
2483 -88 138 179 -128 404 144 98 84 -283 -2 -143 -127 314 -39 -134 339 -250 -51 94 -259 155 -133 -378
2505 -378 111 -290 131 103 -119 130 -3 0 263 35 249 296 -104 391 54 -296 372 157 7 433 -286
$$ packed form
2354H8j45M95n07K6J99k41L04O5j80K37l44m2J41k34L78j62j87J75m95L88L5l14
2376c20N22l12k11L23j59j00K60j52K33o5k40L46r0J16J15l17M64k73k97M38l77
2397i6N0M49o23L26ol97M04l33j5K79k57K30n1j02J90j14N5J27k82J82J67n47
2419c64P02j99l9M17n78P9M10k74q7P1N0r3k26Q3o8j34M29j28k74L23l37J16L13
2442A92l88L34j30k28K86l24L11R6k25K86j57j32K02k85L19K70n95N06k91l00
2462b53M15k16j06L67m29K08k2m7K33l92L21J82m59K41j68l20P48m06o8M64l81
2483h8K26M1l07N32k60m6j4l67K81j41J6M41l53r5M73n89J99J45l53M14k88k45
2505c78M89m01M21k8k22K49j33LK63k28K14M7m00M95l37l50O68k15j50M26p19
$$ plain form
2526 -286 -45 5 -313 39 -134 21 79 -269 -41 -235 -387 320 -332 -21 231 -260 263 259 -192 267 186 9
2548 9 285 -22 202 -4 -74 171 109 130 155 -374 73 74 -167 289 -66 -260 159 -336 -175 176 -323 145 67
2571 67 -103 -6 -166 158 -42 -125 554 -96 -100 225 -215 262 475 -265 360 11 -325 138 -100 -79 275 49
2593 49 187 -346 -138 212 -373 121 5 -453 198 -56 -438 270 12 -76 300 -150 68 120 -120 147 -47
2614 -47 200 113 -111 308 35 -171 335 -210 -77 271 -414 -52 63 -379 168 -351 -232 15 -184 -60 -35
2635 -35 -176 105 -134 124 124 -254 363 69 -155 505 32 -294 449 -57 70 266 -180 19 -5 -230 -8
2656 -8 -140 14 107 -202 178 -178 -545 391 -255 19 403 -470 224 240 -65 283 212 71 240 -22 129 -146
2678 -146 -85 302 -234 -12 170 -340 153 -128 -308 269 -168 -151 381 -227 -108 92 -141 50 -171 73 69
$$ packed form
2526b86K41N0l18L52j73J55N8l48K28j94j52P07o52L11K52m91N23mm51M59q1j77
2548IK76l07K24k06p0K45o2K1K5n29M47Jk41M56l55j94M19m95J61L51m99M68p8
2571F7j70R7j60L24k00q3O79o50mL25m40M77K13p40O25l49l36M63k38K1L54k26
2593D9J38n33K08L50n85M94j16m58O51k54l82P08k58q8L76m50K18N2k40K67j94
2614d7K47q7k24M19k73k06N06n45J33L48o85L62J15m42N47n19J19K47j99J24K5
2635c5j41K81k39K58%l78O17k94k24O60m73l26P43n06J27J96m46J99k4k25K22
2656hj32J54R3l09L80l56l67R36o46K74L84q73O94J6l05L48p1j41J69k62J51k75
2678a46O1L87n36K22J82n10M93k81j80N77m37J7N32o08J19K00k33J91k21K44m
$$ plain form
2699 69 -194 244 10 -93 470 -60 -9 501 -341 171 268 -289 339 149 -92 67 -25 212 -88 -146 175 -355
2721 -355 -56 199 -466 104 41 -319 389 80 -359 221 -30 -75 305 -65 190 24 30 293 -108 370 179
2742 179 -318 286 -64 -74 278 -273 -12 288 -388 104 -4 -167 142 -47 -58 -195 -148 120 -198 -151 269
2763 269 -352 72 197 -489 287 133 -225 526 6 -88 373 -279 74 20 -53 349 -206 47 17 -429 125
2784 125 -32 -285 376 -231 -175 264 -452 70 221 -98 191 182 -144 202 -43 188 -35 -157 441 -93 56
2805 56 333 -196 206 409 -307 115 -21 -397 159 -144 -186 43 -272 -61 -189 -80 110 -147 45 107 -512
2826 -512 344 -36 -152 602 29 -29 358 -121 176 306 -144 294 -102 -49 135 -175 166 -11 -151 303 -426
2847 -426 40 82 -404 284 145 -263 157 -27 -296 221 -5 224 125 92 324 -342 84 237 -287 435 227
$$ packed form
2699F9k63M38k34j03N63n30N1N10q42N12R7n57O28j90k41J59r2K37l00n8L21n30
2721c55K99K55o65N70o3l60P08l09m39N80k51m5L80l70K55j66OK63m01M78j91
2742A79m97O04l50j0L52n51K61L00o76M92j08j63L09j89j1j37M7K68l18M7M20
2763B69o21M24J25o86P76j54l58P51n20r4M61o52L53n4p3M02n55K53l0m46N54
2784A25j57k53O61o07N6M39p16N22J51l19K89rl26L46k45K31k23j22N98n34J49
2805E6K77n29M02K03p16M22j36l76N56l03m2K29l15K11j28J09J90k57J92O2o19
2826e12Q56l80j16P54n73n8L87m79K97J30m50M38l96N3J84l10L41j77j40M54p29
2847d26M66M2m86O88j39m08M20j84k69N17k26K29r9l3K32o66M26J53n24P22k08
$$ plain form
2868 227 -436 302 -144 -238 354 -261 173 102 -350 42 -110 -7 77 -244 87 46 -472 316 -320 -21 561
2889 561 -430 302 283 -304 323 120 -232 446 -35 34 106 -243 217 -116 177 365 -411 -24 -28 -455 109 -63
2911 -63 -376 371 -349 -235 407 -176 27 334 -38 295 -96 -21 180 -236 474 158 89 560 -200 -144 499
2932 499 -366 97 100 -451 152 -86 -238 -14 -212 -36 -46 -252 132 -270 -105 426 -445 192 124 -340 260
2953 260 -48 -172 457 -115 41 214 -271 192 -69 90 180 -155 115 -82 -224 324 -289 -270 445 -457 -219
2974 -219 97 -492 109 133 -181 300 2 -127 190 -48 266 -45 -32 490 -207 152 323 -308 443 300 -290
2995 -290 433 -213 -263 135 -319 -9 132 -159 45 -163 -28 -27 -269 273 25 -268 244 -293 -143 450 -254
3016 -254 186 131 -432 272 43 -148 107 -104 71 23 -52 159 -191 41 373 -263 -20 70 -438 301 -158
$$ packed form
2868B27o63P38m46r4N92o15M34p1m52L92j52J03Q4l21L31m1n18P88o36K99N82
2889E61r91P32j9n87O27k03l52O78m81O9P2l49M60l33K93J88p76L87mm27N64j72
2911f3l13P47p20J14O42n83K03L07l72L33l91P5K01m16P10l16o9M71p60N6O43
2932D99q65M63Ln51O03k38j52K24j98J76j0k06L84m02J65N31q71O37o8m64O00
2953B60l08j24O29n72J56J73m85M63k61J59R0l35K70j97j42N48o13J9P15r02K38
2974b19L16n89O01K4l14M81k98j29L17k38L14l11J3N22o97L59J71o31P51j43n90
2995b90P23o46n0L98m54L10J41k91K04k08J35Jk42N42k48k93N12n37J50N93p04
3016b54M40n5n63P04k29j91K55k11J75m8p5K11l50K32L32o36K43R0n08P39m59
$$ plain form
3037 -158 -388 339 -175 -199 211 -288 201 5 -123 195 -152 228 75 -135 582 -15 -103 253 -280 -78 451
3058 451 -201 201 231 -484 86 -88 -92 6 -171 126 -314 -76 337 -387 -153 165 -382 456 150 -218 404
3079 404 -199 -298 347 -102 208 97 -226 271 -57 128 147 -316 274 -186 -297 301 -468 -372 373 -467 2
3100 2 50 -415 23 92 -42 143 -48 99 -75 -150 507 -10 -145 387 -281 173 474 -392 428 0 -314 300
3122 300 -298 -252 151 -97 83 -16 -91 30 -314 24 23 -266 245 -204 -331 419 -190 125 264 8 238 244
3144 244 -207 213 -155 106 101 -157 412 54 -207 344 -241 46 134 -379 -31 167 -320 170 -107 -223 236
3165 236 -382 114 117 -445 131 -134 -34 402 -389 102 129 -381 323 82 -111 326 -248 -131 273 -326 139
3186 139 177 -115 170 -358 -63 -49 -336 309 -368 -261 285 -408 -88 27 -237 278 -26 -176 305 -188 -31
$$ packed form
3037a58k30P27n14k4M10m99M89j96j28L18l47L80j53k10P17n97q8L56n33K02N29
3058D51o52M02L0p15N70j74mR8j77K97m40K38M13p24K34L18n47Q38l06l68O22
3079D04o03r9O45m49L10j11l23M97l28J85J9m63N90m60j11N98p69R6P45q40M69
3100BM8m65M38O9j34J85j91J47j74p5O57n17j35N32o68M54L01q66Q20m28l14O14
3122C00n98M6M03k48J80r9p5J21l44L38jk89N11m49j27P50o09L15J39k56K30O
3144B44m51M20l68K61nk58N69l58k61N51n85K87Q8n13L48J98m87M90k77j16M59
3165B36o18M96Ln62N76k65J00M36p91M91K7n10P04k41j93M37n74J17M04n99M65
3186A39L8k92K85n28K95J4k87O45o77J07N46o93L20J15k64N15l04j50M81m93J57
$$ plain form
3207 -31 369 -114 368 1 -104 375 -192 206 56 -398 319 50 -319 350 -160 -77 225 -215 22 0 -303
3228 -303 186 -156 22 195 -249 131 26 -213 444 -153 208 317 -239 129 58 -319 223 211 -148 191 -363
3249 -363 33 174 -236 150 -227 -86 210 -345 56 35 -366 153 -25 -322 498 -120 -33 318 -193 152 -1
3270 -1 -17 258 -180 87 207 -158 281 -194 -164 235 -327 117 196 -344 80 16 -53 153 -341 -54 284 -269
3292 -269 234 19 -337 175 -329 49 238 -285 286 30 -158 415 14 -7 345 -200 164 -21 -233 324
3312 324 -264 162 162 -314 117 89 -214 324 -171 -117 280 -395 39 205 -339 288 -52 -115 159 -188 410 309
3334 309 -167 399 -111 -212 328 -227 58 97 -236 353 -172 -245 231 -323 -87 131 -352 134 -43 -209 253
3355 253 -319 28 225 -249 337 80 -85 338 -129 133 186 -192 163 -102 6 243 -148 -74 264 -380 129
$$ packed form
3207c1M00m83M82l67j05M79n67L98j50m54P17k69l69O69n10Q3L02m40K37k2l03
3228c03M89l42J78J73m44L80j05k39O57n97L61J09n56L68p1l77N42j2l59L39n54
3249c63L96J41m10L86l77J41K96n55M01k1m01N19j78k97Q20o18Q7L51n11L45j53
3270aj6K75m38K67J20l65M39m75L0L99n62M44P9n40M24o4o9K06m94K87L38n53
3292b69N03k15l56N12n04L78J89n23N71k56j88N73m01k1L52n45L64j85k12N57
3312C24n88M26%m76M31k8l03N38m95N4L97o75M34J66n44O27l40o3K74l47N98j01
3334C09m76N66n10j01N40n55K85L9l33N89n25p3M76n54K36K18m83M86j77j66M62
3355B53n72L47J97m74N86k57j65M23m67K62N3l78L55k65J08K37l91P4L38o44N09
$$ plain form
3376 129 -149 -108 385 -226 -63 47 -342 5 -104 -316 290 -96 -36 193 -489 103 41 -164 330 17 -96
3397 -96 213 -121 249 117 -152 449 -154 -76 223 -290 172 184 -225 245 -300 -180 242 -372 70 67 -323 179
3419 179 65 -163 267 -372 92 85 -245 306 -6 21 180 -77 213 238 -169 256 -103 -90 242 -369 23 78
3441 78 -215 69 51 -231 99 -319 11 66 -180 118 55 -145 254 -53 96 215 -357 180 97 -135 455 -18
3463 -18 -85 256 -77 17 196 -141 151 -186 48 63 -286 -32 135 -335 157 -249 -123 307 -277 31 108 -115
3485 -115 268 -98 -248 291 -258 239 171 -243 318 -91 -95 206 -132 178 252 -297 -33 -211 -205 154 -140 21
3507 21 -44 -260 181 -141 -245 409 -84 -78 81 -375 177 -80 -191 373 -26 105 292 -199 154 178 -127 171
3529 171 -40 -83 149 -125 103 18 -222 223 -142 -89 175 -404 164 57 -241 33 -229 -44 197 -213 272
$$ packed form
3376A29k78M1M93o11J63J10l89L47j09k12O06l86O0K29o82N92o2k05M94l13j13
3397i6L09l34L70j32k69O01o03P8K99n13M62J2m09M70n45J20M22o14M42ll90N02
3419A79j14k28M30o39M64pl30N51l12K7J59k57K90K5m07M25l59J3L32o11L92N5
3441G8k93K84j8k82L30m18L30N5k46K98o3k00L99l07J49J19n72N37q3k32N90m73
3463a8o7L41l33R4J79l37K92l37K34J5l49K54J67m70M92m06J26M30n84L08P7k23
3485a15L83l66j50N39n49M97o8m14N61m09mL01l38L10P4n49K64j78OL59k94J61
3507B1o5k16M41l22j04O54m93OJ59m56N52k57j11N64l99J31J87m91L53K4l05K98
3529A71k11m3K32k74K28q5k40M45l65N3K64n79N68j07k98K74k62J85K41m10M85
$$ plain form
3550 272 40 -50 180 -318 3 324 -228 326 117 -188 259 -78 45 272 -175 6 119 -310 15 -146
3570 -146 8 71 -330 193 7 -267 347 -217 -116 348 -286 100 248 -130 179 8 -163 289 5 108
3590 108 150 -76 305 -104 -100 139 -333 -136 102 -366 124 -19 -249 178 -149 27 165 -265 126 -93 -1
3611 -1 167 27 146 202 -209 292 181 -165 385 -209 -64 371 -244 129 160 -223 134 -164 -87 1 -172 28
3633 28 -128 -30 168 -359 -95 234 -209 213 129 -287 408 -218 -209 292 -141 260 35 -239 208 -116 32 259
3655 259 -191 175 -83 -315 140 74 -156 173 -352 -121 1 -117 7 -10 -183 66 -79 98 -62 -196 239
3676 239 -7 12 289 -131 -41 56 -133 303 -44 -147 254 27 -16 215 -173 43 -177 -183 -27 -203 -15 92
3698 92 -266 244 -209 -33 214 -199 -133 233 -199 250 32 -55 170 -89 57 180 -119 221 -93 -255 301
$$ packed form
3550B72k32r0K30m98L21L21n52N54k09l05M47l37J23K27m47J81J13m29L25j61
3570a46J54O3m01N23j86k74O14n64J01M64o34L86J48l78L09j71j71M52k84J03
3590A08M2k26L81m09MK39m72J97K38m68M90j43k30M27l27J76J38m30L91k19R2
3611aJ68j40J19N6m11N01j11l46N50n94J45M35o15L73L1l83L57k98P7Q8j73K00
3633B8j56R8J98n27K64L29m43M22q4m16O95o26RN01m33M01k25k74M47l24J48K27
3655B59m50L66k58k32M55o6k30L29n25K31J22j18J24j7j73K49j45J77j60j34M35
3676B39k46J9K77m20R0R7j89M36l47j03M01k27m3K31l88K16k20oJ56j76J88J07
3698I2l58N10m53J76K47m13O6L66m32M49k18q7K25k59J46J23k99L40l14j62N56
$$ plain form
3719 301 -140 -79 244 -285 -59 -33 -226 -10 -106 -67 128 -191 77 -36 -286 217 -120 15 234 -198 139
3740 139 108 -306 330 -122 -115 298 -57 35 264 -204 -16 84 -100 14 -261 133 -107 -193 111 24 -64 197
3762 197 -245 -293 127 -388 19 -54 -221 300 72 35 227 56 172 22 8 205 -176 70 203 -215 221
3783 221 -61 -261 61 -21 -82 -111 -278 -131 80 -201 -1 -232 -89 15 -101 -13 -102 -134 385 -57 9 303
3805 303 -303 202 205 -209 284 -109 -141 -139 -127 48 -113 -78 48 -129 13 151 -363 76 55 -335 133 -121 -151
3828 -151 89 13 138 135 -5 59 -7 -37 180 13 150 137 -107 269 -119 -89 84 -369 12 245 -233 126 -70
3851 -70 -291 136 -27 -67 4 -225 89 -185 -56 119 -78 161 76 -307 278 -14 -271 400 -72 12 260 -29
3873 -29 96 182 -192 -67 -176 13 252 -156 104 82 62 105 -435 -99 194 -65 -51 87 -228 282 122 -162
$$ packed form
3719C01m41O1L23n29K26K6j93K16r6L9J95l19K68j13k50N03l37J35K19m32L37
3740A39l1m14O36m52PM13l55R2K29m68J88J00j84J14k75L94k40q6L04q7q8K61
3762A97m42m8M20n15M07p3j67N21k28l7J92j71J16j50j4J97l81K46J33m18M36
3783B21k82k00L22q2o1k9j67J47K11k81K00k31J43J04j16Q8q9l2N19m42O6K94
3805C03o06N05Lm14M93l93l2KJ2J75j61L5J26j77J42J38n14M39k1l90M68k54l0
3828a51K40p6J25lj40O4o6l0K17j67J37j3k44L76l88L0J73m53L81K33m78L59j96
3851g0k21M27j63m0P1k29L14k74J29J75j97K39q5l83N85k92k57O71m72Q4K48k89
3873b9J25Q6l74J25j09J89K39m08K60k2k0M3n40L36K93k59J4J38l15N10j60k84
$$ plain form
3895 -162 7 -32 202 2 -17 304 -49 -49 205 -313 234 191 -278 251 -9 -108 281 -174 -189 -120 -302 45 -237
3918 -237 119 -32 -196 80 113 -273 177 -153 -34 197 -316 -210 150 -116 185 159 -146 258 -65 4 113
3939 113 -279 39 -20 -50 148 -341 -105 79 -424 334 -64 -160 143 -212 -66 88 -188 36 39 8 -69 -66 -57 340
3963 340 -250 189 -42 -28 379 -195 30 147 -302 -61 16 -205 79 -76 -152 66 -142 21 137 -103 143
3984 143 -263 16 208 -222 63 41 -62 348 48 -252 193 -3 -45 57 -139 171 -35 -67 78 -386 188
4005 188 -31 -207 236 -250 -257 302 -101 -134 120 -439 -57 -8 -103 227 -27 94 83 -84 179 8 58 225
4027 225 -285 54 243 -334 137 154 -336 187 -77 -158 111 -57 -64 17 23 62 -205 -96 178 -116 221 -88 -169
4050 -169 176 -74 -178 239 -71 65 21 -93 231 -32 92 72 -85 143 91 82 248 -84 -62 44 -383 -158
$$ packed form
3895a62J69l9K34k00j9L21l53%K54n18N47m3m69N29k60r9L89m55j5O9j82L47k82
3918b37L56j51j64K76L3l86M50l30J19K31n13J06L60k66L01k6l05M04l23O9J09
3939A13l92L18n9l0J98m89K36J84n03P58l98r6L03l55J46J54k76K24Ll1p7LRL97
3963C40n90M39k31J4M07n74K25J17m49K41P7k21K84j55p6K18k08J63J16k40K46
3984A43m06K79J92m30K85k2j03M10l00l00M45j96m2J02j96L10k06l2J45m64N74
4005A88k19j76M43m86pN59m03l3K54n59L82M9r5L30k54J21j1j67K63j71N0J67
4027B25n10L39J89n77M71J7m90N23k64q1K69j68pQ1OL9k67J09K74k94L37l09q1
4050a69L45k50j04M17l10J36m4j14L24k63J24k0j57K28n2rJ66l32K2J06m27K25
$$ plain form
4072 -158 79 -503 141 48 -11 199 -77 -110 60 20 111 -109 62 62 -330 375 181 -211 161 -4 -136 222
4094 222 -289 57 96 -170 -157 174 -114 234 -334 130 4 -289 128 -114 -76 182 -260 -12 169 -33 198
4115 198 -17 -7 357 89 -97 230 -132 123 25 -24 35 -38 110 110 -177 213 -138 -357 176 -25 -65 119 -177
4138 -177 87 -25 -196 85 -211 -53 18 -301 140 91 -75 130 -60 32 291 -110 -79 90 -107 146 -14
4159 -14 -100 3 -32 142 -1 -121 101 -137 -85 105 -385 -31 174 -411 200 -155 -103 232 47 7 292 49
4181 49 133 120 -88 187 -103 62 28 -141 185 -61 15 329 -178 5 156 -247 68 0 -150 267 -88 -97 252
4204 252 -226 84 94 -130 71 -15 64 220 -220 191 32 -149 285 -237 145 131 15 45 -37 -126 113 -139
4226 -139 -7 139 -211 108 -64 -329 170 10 -263 200 -102 50 93 -110 174 57 -173 186 -55 -51 148
$$ packed form
4072a58K37n82O44r3n9K10k76l3J70m0R1k20J71%l92P05j94l92L72j65j32L58
4094B22n11L46L9k66J3L31k88L48n68M64j26k93M17k42L8K58m42K48J81k02K31
4115A98k15J0L64k68j86L27l62K55r8m9N9p3J48%k87L90l51k19N33k01m0J84k96
4138a77K64j12j71K81k96J58P1l19M41m9j66K05j90R2K59m01L1J69j97K53j60
4159a4q6J03l5J74j43j20K22k38N2J90m90L54K05n85O11l55N2L35j85m0K85k43
4181D9Q4j3k08K75k90J65l4j69L26k46P6L14n07J83J51m03L15o8j50M17l55rL49
4204B52m78L10J0k24K01q6P9J56m40M11j59j81M34n22L82j4j16L0q2q9K39k52
4226a39J32J46l50L19j72k65M99j60k73M63l02J52M3k03K84j17k30L59k41MJ99
$$ plain form
4247 148 15 260 21 10 161 -254 69 96 -179 193 -159 -151 147 -151 97 47 -108 98 85 -208 134 -109
4269 -109 102 253 -38 210 -149 -143 401 -159 64 278 -223 154 60 -77 175 -79 34 165 -148 -95 -31 -140
4291 -140 9 -333 -47 53 -423 201 91 -320 3 -91 -132 172 -85 97 266 -75 204 0 -44 233 -86
4312 -86 160 22 -190 403 -169 -110 112 -250 37 81 -136 116 -4 -166 -1 -71 19 70 -36 159 -14 -46
4334 -46 103 -200 -10 158 -234 10 -21 -103 108 -129 -15 218 13 43 32 -104 162 -224 82 76 -229 87
4356 87 -162 -266 286 -200 -125 217 -65 118 100 -232 103 86 -10 33 35 152 -22 -35 257 -107 47 249 -338
4379 -338 222 -65 -98 179 -81 -45 91 -193 40 147 -39 67 134 -127 89 -70 129 149 -198 287 77
4400 77 -181 169 -241 144 60 -191 125 -53 -108 197 -136 -79 5 8 111 -120 66 192 -207 72 141 -163 10
$$ packed form
4247A48j33K45k39j1J51m15L23K7k75L72l52QK98k98K48n0j55K06j3k93L42k43
4269a09K11J51k91K48l59ON44n60K23K14n01L77r4j37K52k54J13J31l13N3O4j09
4291a40J49l42K86J00m76O24j10m11L23r4m1L04k57J82J69l41K79k04m4K77l19
4312h6K46j38k12N93n72N9K22l62K87M4k17K52j20j62J65p0R0N1j06J95j73l2
4334d6J49l03J90J68l92K44l1q2K11k37J14K33k05L0j1j36K66l86L06ol05L16
4356H7k49j04N52m86P5L42k82J83j8l32L35j7r6M3KJ17j74j3K92l64J54K02n87
4379c38N60k87l3K77k60L6J36k84K33J07j86J06O7k61K16j59J99K0l47M85k10
4400G7k58L50m10L85q4k51L16j78n5L05l33N7Q4LJ03k31J86J26l99K79O9l04J73
$$ plain form
4423 10 32 -108 194 -44 -176 -64 -223 27 54 -151 152 -92 109 106 -211 138 99 -50 113 -151 -76 79
4445 79 -190 55 -21 -230 140 -92 14 53 -189 -86 21 -271 212 -175 -24 166 -213 16 49 -121 83
4466 83 -27 -131 202 -22 144 237 -174 1 -108 -146 136 -124 46 -22 -368 0 -208 -256 304 -95 18 -37
4488 -37 -269 49 -14 -8 412 -226 54 139 -312 234 25 8 225 -55 -5 33 -259 238 -40 -81 160 -163 -50
4511 -50 128 -125 -109 35 -32 144 -267 15 28 -295 126 33 -263 276 -178 -76 357 -147 72 84 61 148 -140
4534 -140 0 94 -104 119 2 -269 151 -67 -73 117 -171 62 4 -254 -101 -1 -212 149 -2 116 125 -108
4556 -108 -6 -9 -77 120 -85 150 140 -209 167 22 -43 107 -162 -135 -28 -249 119 7 -53 -46 -271 -51 78
4579 78 -102 19 79 -236 175 -133 136 120 -168 179 -57 -47 167 -151 -37 139 -158 179 136 -171 274 -156
$$ packed form
4423A0K2j40L02k38j32J12j59K50K7k05L03k44K01ll17L49l9j49J63k64P5J55
4445G9k69K45p6k09L70k32J06L9k42J03J07k92M83l87J51J90l79K29L3j70K04
4466H3j10j04L33k24J66R3m11J75j09l8K82k60J70o8l46L68k08m8N60l99J13n5
4488c7k32L18o3OM20o38K80Q5m51N46k09j7K17k80N0L8k92M97k78m1K41l23J13
4511e0J78k53J6J44o7J76m11K82J3l23M21r3k96N39m54J02M33n04K19J2k3Q7k88
4534a40J40R4j98K23j17k71M20k18oJ90k88K33n8k58J53J00k11L61j51J18Rk33
4556a08J02lo8J97k05K35j0l49L76j45o5J50k69K7J07k21L68j12o0Pk25K20J29
4579G8j80J21O0l15M11l08K69j6k88L47k36J0K14l18J14J76k97L37m3l07M45m30
$$ plain form
4601 -156 73 216 -373 101 63 -180 89 -115 -67 364 -147 9 103 11 142 -224 -47 105 -33 208 148 -73
4623 -73 271 -5 -46 91 -12 125 242 -106 86 -140 -174 199 -318 0 112 -144 2 -152 -88 32 -222
4644 -222 173 39 -42 164 -53 -88 327 -135 -137 15 -83 47 19 -63 241 -29 -2 169 -218 252 -4 -160 175
4667 175 -244 -79 43 -6 141 123 -79 95 -144 -102 245 -123 63 28 -32 48 16 -107 305 -349 -59 144
4689 144 -186 182 -151 103 44 -230 86 -75 -213 -4 -73 -29 -20 -145 88 6 -223 89 -74 81 327 -169
4711 -169 220 15 -164 124 7 -105 104 -123 69 207 -45 66 -15 -163 263 -261 61 20 -216 87 -50
4732 -50 -129 193 -218 -102 124 -237 -34 138 -32 222 93 141 97 -102 -8 169 -123 290 -40 10 138 -86
4754 -86 89 27 -156 139 89 -22 86 -213 -2 57 -123 141 -21 -222 -43 -57 -92 67 -241 -82 -17 -104 268
$$ packed form
4601a56K29J43n89M74l8k43K69k04M8M31n11J56R4r2J31l66J77J52j38K41o0k21
4623g3L44k76m1J37j03J37J17l48J92k26l4L73n17L18J12k56J46j54O4J20k54
4644b22L95j34q1K06k17l5M15m62kJ52r8J30k8q2L04k70K7J71l87M70k56j56L35
4667A75m19J65J22m9J47j8k02J74k39M2L47l68J86l5o0Q0l2j23M12o54K90K03
4689A44l30L68l33K54n9k74L16j61j38K09o9M4Rj25K33q2k29L12j63J55K46m96
4711a69L89k05j79K88j17j12K09k27J92J38k52J11q1j48M26n24L22m1k36L03j37
4732e0p9L22m11J16K26l61K03J72j70K54j29M8m4j99R4J77k92M13l30N0J28k24
4754h6J75o2j83K95n0j11J08k99K11N9j80K64j62k01J79j4l5J59l08J59O5q7L72
$$ plain form
4777 268 -169 78 167 -141 42 -52 -48 127 -151 125 48 -181 204 -212 -137 43 -59 56 176 -48 150 6
4799 6 -47 158 -138 -49 -33 -131 86 -44 127 207 -120 15 263 -160 87 51 -97 152 -149 102 204 -94 -59
4822 -59 -6 -96 123 3 -32 76 -39 23 -43 -167 5 -173 94 82 -238 44 5 -135 243 -27 163 180 -136
4845 -136 -81 104 -126 76 -25 -46 -34 -295 14 5 -253 37 -120 -48 92 -299 -76 53 8 176 -49 11 138
4868 138 -147 1 87 -149 348 -73 -140 262 -88 61 109 38 175 -47 -88 254 -103 38 52 -150 228 -71
4890 -71 41 120 59 -85 -133 -210 119 -123 -171 87 -131 37 68 -115 278 163 -52 82 -33 -23 159 -187 -75
4913 -75 33 -143 147 -158 -45 124 -99 105 80 -159 88 -133 -110 303 -213 -27 26 -63 118 -104 -51 89
4935 89 -45 22 32 -149 255 40 -158 113 -94 270 217 -122 188 -23 -150 166 -74 20 -52 -266 111 -22
$$ packed form
4777B68m37K47Q9l08J83r4MJ75k78K76p7k29L85m16P5J80j02J15J20k24J98j44
4799Fn3K05k96Q9J6r8K17j30J71Q0l27J35K48m23K47l6j48K49l01K51J02k98L5
4822e9N3r0K19j20l5J08j15O2o6j24J72j78K67j2l20K82l9j40L78k70J90J7l16
4845a36N5J85k30K02j01k1J2k61L09rk58K90j57P2J40l91K23J29m5J68k25O0J27
4868A38k85J48Q6k36M97m21o7M02l50J49M8p1J37k22m1L42l57J41J4k02L78k99
4890g1J12P9o1j44m8p7L29k42m8K58k18J68L1j83L93j15k15J34j15J0J82l46J12
4913g5J08j76K90l05J13J69k23K04k5k39K47k21K3M13n16J86N3q9J81k22N3J40
4935H9j34O7J0j81M04k15j98K71k07L64n3l39L10k11j27L16k40R4p2k14L77j33
$$ plain form
4957 -22 -205 164 95 79 13 -84 141 184 9 184 36 21 13 -131 -92 54 85 -36 -136 -140 194 -129 37 -4 86
4982 86 257 -84 4 183 -136 51 -10 -201 45 -71 -46 82 -82 121 47 -55 127 57 97 147 94 38 -89
5005 -89 -161 134 47 -109 -6 -133 -81 31 -251 94 89 -102 -74 -121 212 -9 -266 -3 54 -217 211 -157 127
5028 127 43 -82 -53 133 -137 27 65 41 89 -194 163 83 -11 34 -183 97 125 -88 -7 -24 73 159 -54 49
5052 49 -22 7 184 23 134 32 -21 -9 8 -35 86 69 -53 87 -1 -70 121 -131 -124 -58 -282 163 -49 -74 -31
5077 -31 -130 -69 -10 -187 332 -32 -124 94 -111 167 163 -115 91 -116 46 253 -218 181 138 -173 8 -73 -23
5100 -23 183 -16 -217 36 93 189 -13 -10 13 -204 36 -13 -159 130 98 -164 105 -145 -70 215 -87 244 80
5123 80 -19 53 -146 -5 149 62 -28 -26 71 36 -40 12 -49 -69 107 31 -171 104 -88 -45 -1 -46 -19 174 -211 273
$$ packed form
4957b2j83L69o9j6o6r7K25M3j75J75j48j5qj44L9J46L1j21j00mL34l23J66m1R0
4982H6J71l41Q8J79l19J87o1j91K46j16K5J28j64K03p4j02J82p0M0N0n3n6j27
5005h9p2K95q7j56J03j27N2J12k82L45nj91K8m7L33k21k57K63N7k71M28l68K84
5028A27q4j25K9J86k70J64L8k4M8k83L57q0r4M5k17K80K8k13Q1j7R7Q6k13J03
5052D9p1K9J77j61J11j02n3J2J7m3J21j7j22J40q8o9J91k52PO6k24M45k12k5M3
5077c1r9O1N9j77N19l64r2K18k05K78mk78K06k07J62K07m71L99m3l11J81q1N0
5100b3K06j99k01K53N7R6k02LK3k17K40m9j46K89l2k62K69k50P5K85l02L31j64
5123H0r9P2j99J41J54q7r0KR7l5p6N2o1k0J76p6k02K75j92M3M4m5K7J93l85M84
$$ plain form
5149 273 -37 -218 110 -49 -2 -168 8 42 -60 -61 -89 -144 41 24 -80 40 -93 28 -82 -118 -28 42 -105
5172 -105 85 58 -111 171 -68 67 5 -156 -31 -173 155 227 -199 135 103 -173 243 115 -99 44 29 25
5194 25 131 0 167 -7 -171 39 -56 58 71 18 10 129 118 8 -115 94 41 -36 237 -191 -274 111 -97
5217 -97 103 45 -113 61 192 -113 133 -7 93 108 -157 73 125 -31 143 16 -119 31 -77 217 -68
5238 -68 -88 33 -127 -83 69 -230 121 43 -104 97 -45 -121 132 -31 36 37 -77 122 -127 -27 121 86 -28
5261 -28 134 -261 173 -82 -6 181 -63 65 -58 -85 99 -111 -16 123 -127 107 126 -54 -62 20 -47 118 19
5284 19 -22 132 9 -215 47 -132 11 -273 23 -89 -100 10 68 -222 61 -35 49 96 -255 77 91 85 -10 47
5308 47 76 34 -165 34 -16 -44 -10 -26 40 -6 -32 25 60 -206 135 -13 160 111 -33 215 10 -88 -18 -148 -49
$$ packed form
5149B73l10j81L28j59M7j66J76L4j02jk8n5J85j7j04J20j33J21j10l6R0P0j47
5172a05J90k7j69K82k39J35o2j61J25j42L28P2m26L34l2k76M16j28k14J43j5m
5194B5J06j31J67j74j64K10r5J14J3n3qJ19j1j10j23K09n3p7K73m28q3L85k08
5217i7K00n8j58J74J31l05K46j40J00J5k65K30N2j56J74j27j35J50j08K94k85
5238f8k0J21j60M4J52k99L51p8j47K01j42p6K53j63O7Jj14J99k49J00J48l5j14
5261b8J62l95M34k55P6J87k44J28j23k7J84k10R5J39k50K34J9j80qQ2o7J65r9
5284A9m1J54j23k24K62j79J43k84K96j12j1J10N8k90K83r6Q4M7l51L32J4or5N7
5308D7K9m2j99J99n0k8L4j6O6m6k6N7L5k66L41j48J73m9j44K48k05r8P0j30R9
$$ plain form
5333 -49 104 9 60 213 -282 217 113 -171 236 -168 -77 15 -82 21 -47 -119 96 37 127 -130 -32 69 -35 -192
5357 -192 86 -46 17 -35 -76 0 -86 -142 157 -53 53 -24 -84 82 -103 89 118 13 35 -52 -66 112 128 64 124
5382 124 -102 1 127 -63 69 112 -124 124 -197 -67 -2 -113 50 12 -152 158 33 2 171 -109 38
5403 38 -23 127 120 71 29 84 -141 49 67 60 -40 -87 -87 63 -86 103 124 -2 152 135 -180 47 -32 -76 -145 -52
5429 -52 89 195 -178 146 -76 6 189 -131 46 -91 45 16 -89 85 160 -124 174 -69 -27 41 31 -66 -56
5452 -56 -151 144 -25 -60 110 -96 10 185 -4 -144 31 -5 49 -92 -78 76 -63 104 -54 58 44 -140
5474 -140 60 203 -83 180 -80 -265 -59 -43 -163 -85 -110 49 -113 40 8 -85 172 111 -94 30 -35 -27 -13
5497 -13 -70 36 -109 -49 134 -27 -108 46 -50 -55 -48 -58 -35 45 7 -144 15 -35 148 107 141 -20 -242 199 211 -166
$$ packed form
5333d9J53r5N1J53m95M99j04k84M07m04R1R2r7J03o8p2K15n9R0k57R8J01j04j57
5357a92K78j32O3n2m1P6q6n6K99k10J06p7o0J66j85J92K9j05K2q7j4J78J6o4O0
5382A24k26J03J26j90J32M3k36K48l21J30O5j11J63l8j64L10j25l1J69k80J47
5403C8o1J50pm9m2N5k25J90J8pj00m7%J50j49J89K1j26J54j7l15K27p9m4o9R3
5429e2J41J06l73L24k22Q2J83l20J77j37J36k9j05J74P5k84K98k43M2O8j0r7J0
5452e6r5K95j69l5J70k06J06J75j89j40J75l6N4j41J4J54j39J67j58J12j4j84
5474a40K00J43k86K63k60j85K06J6j20P8k5J59j62J53l2r3K57o1k05J24o5QJ4
5497a3n7J06j45O0J83j61q1J54r6nPj0K3Q0l8j51J59n0J83m1L4j61k22M41J2l77
$$ plain form
5523 -166 -86 -95 -48 135 53 2 -70 134 116 106 61 119 17 113 122 -73 147 78 100 3 46 -22 17 -54 -13 -136 10
5550 10 118 -30 -156 -216 -148 94 -61 -10 59 -16 30 -99 -117 48 -78 111 204 -86 65 134 -24 -62 -131 -82
5574 -82 -55 -235 -97 5 -7 169 62 32 86 -99 22 17 -11 95 -134 -23 117 47 128 -98 -135 93 90 -1 194
5599 194 -220 -140 52 0 238 18 126 206 23 50 -3 -145 -83 0 46 124 -91 -76 66 -38 108 -110 -33 106
5623 106 149 -68 -18 9 18 32 -75 7 43 -165 -36 -200 32 83 -59 -66 5 1 145 16 62 -15 -100 -137 -28 79
5649 79 27 -57 224 196 121 41 -8 -34 -23 67 104 47 50 -7 94 -90 52 -96 69 21 -126 74 44 -50 102 -56
5675 -56 -106 -37 -187 -20 -21 -191 -200 -92 -27 63 -122 98 -51 -50 -7 18 -11 167 -257 67 41 11 150 -100 -60 44
5701 44 -94 129 -41 -3 -49 -218 19 140 -142 56 -88 -51 15 1 60 177 -92 193 248 21 151 -106 -176
$$ packed form
5523a66Q0rM7J83q2n1p2K04j8j0m5N8j02R6Rj95K20o9K2r7M3o8L9p1M1j23J46
5550A0J08j48j26o0O8K42j55N1O9p5M6j29j8J65j26J89R3k90J51O9j58l8o9M9
5574h2K7j80J38J02j2J76j07l0N4j85J21nk8J06k29J11J40p0Q1k26l7K28lr1J95
5599A94m14Q0J92n2K38k20J08Q0j83K7n3j42O2Q3M6P8k15J5J42j04J46k18P7J39
5623A06M3k17N0K7RJ4j07Q2L6k08J29j64K32N1j42pP1mJ44j29M6p7q5l7J09J07
5649G9n2q4K81k8p5q0m9k6J1R0L7n7Ln7J01j84J42j48J65m8j47K00l0r4J52j58
5675e6n0O9j50J67jj70rJ08O5R0j85K20j49JM3K5k9J78m24L24k6l0J39k50M0J04
5701D4j38K23j70L8m6j69K37J21k82J98j44L7O6j4N9J17k69K85N5k27J30k57p0
$$ plain form
5724 -176 64 -240 87 -56 -11 27 -42 -27 161 -57 207 119 -89 43 51 49 177 -144 38 31 -95 23 -1 -58
5748 -58 100 -34 109 -53 16 -43 14 -105 -99 103 98 106 -69 37 37 41 -12 3 -113 -25 -28 105 83 141 18 -56 -1 38
5776 38 37 36 -121 -3 63 56 196 35 -76 70 -160 -68 165 44 -23 -129 45 102 -53 26 162 24 -62 -153 -64
5801 -64 -60 -16 -34 160 -104 -60 -4 -5 -23 81 100 -67 -63 -47 84 -40 71 144 -75 -50 37 14 -37 -40 93 12 -1 120
5829 120 -77 -168 87 7 13 12 -77 -68 -113 -17 -134 -58 -59 103 72 120 -241 -5 38 58 -69 -21 -148 86 105 37 120
5856 120 -138 -55 -97 118 -3 73 -10 136 -186 -96 -60 -23 21 33 -63 15 -64 46 81 52 92 156 29 77 -93 -18
5882 -18 43 -127 33 -43 -96 -197 80 149 29 0 93 248 -210 78 -89 115 -37 -135 150 -19 -114 -52 97
5905 97 -114 -55 -146 182 200 -75 171 -190 42 246 11 11 85 -26 249 -152 -135 45 -55 42 -59 -52 3 -129
$$ packed form
5724a76K40l04L27j43M5L8o9J5J88k18K64q8k08J32QkJ28l21J82pj26J18k4n7
5748e8J58j34J43j62O9n9N7j19OK02nQj75J06%Mn3J5j16Q8lJ33k2N8j23p4N5L9
5776C8jjj57J18O6pJ40j61j11J46k30R2K33j21o7j06J74N7j55P9J36j38q6r1Q9
5801f4MM4j8J94k64M4N6jj8J04J9j67MJ6J31j24J11P3k19K5Q7k3n1lJ33q1j3J21
5829A20j97r1K55q0Ojq9Rm5R6j17P6jJ62l1M8l61K36M3K0j27M8j27K34J9o8Q3
5856A20k58Q3m2K15j21P6q3J46l22R0L6L7M4J2r6P8p9J10L5k9M0O4j27M8j70P5
5882a8O1j70J60p6n3j01K77O9j20k9R3J55m58K88j67K04j52r8K85j69r5O2J49
5905I7k11N9r1L28J8k75K46l61K32K04k35%P4j11K75m01J7J80j00R7j01PN5j32
$$ plain form
5929 -129 53 141 -254 -23 55 76 6 -111 -118 109 6 89 10 25 25 -87 84 104 -164 27 54 100 69 13 -54 73
5955 73 -44 -54 130 -130 152 38 -105 12 -17 -144 94 42 -62 76 151 42 -31 -137 60 -59 124 29
5977 29 68 152 11 -45 -26 -90 -42 181 -18 187 -33 -104 -114 8 46 -106 -156 75 62 -21 126 -43 21 75 34
6002 34 120 26 8 24 43 107 -92 -17 160 -96 -43 43 -6 -41 -108 -62 79 -20 -80 -29 4 -84 168 -31 160 -41
6028 -41 -12 16 80 8 100 -2 -63 -95 -63 7 -17 -74 -18 -152 -46 -163 -2 14 43 -21 89 -15 55 153 40 148
6054 148 -44 -82 -34 -32 -5 42 -53 43 87 -177 171 -72 117 131 -75 58 80 -44 43 39 205 -31 -157 94 -167
6079 -167 -69 97 -154 47 159 -68 36 46 90 10 163 -212 -171 -122 -81 -198 82 -55 -185 113 79 -105 86
6102 86 8 -5 16 -89 -46 -104 -111 64 59 -259 -34 -44 30 -72 -55 1 57 -1 -36 -144 -14 96 -136 125 48 -104
$$ packed form
5929a29J82Q8l95K31P8K1p0j17pK27j03Q3p9J5%j12J71K0k68J91K7M6l1n6o7J27
5955G3j17j0J84k60K82j14j43J17k9j27K38n2j04J38P5j09p3j06J97j19J83r5
5977B9L9Q4j41n6J9o4M8K23j99K05k20p1j0J22L8j52n0K31j3q3J47j69O4N4m1
6002C4Q6r4j8J6J9O4j99P5J77k56N3Q6m9l5o7M6J41r9o0N1L3q8K52j99J91k01
6028d1K9K8O4p2R2j02o1l2L2P0k4n7N6j34J06j17J61J6K9o4J10j04P0R8j13J08
6054A48j92l8M8KK7M7r5R6M4k64L48k43J89J4k06J33K2j24Q7mJ66k36j26K51k61
6079a67R8J66k51K01J12k27J04J0M4q0J53l75M1M9M1j17K80j37j30K98l4j84J91
6102H6p8j3K1j05M3n8pJ75nl18K25j0P4j02J7N6N6n8l5j08J30J10k32K61p7j52
$$ plain form
6128 -104 251 81 18 118 -41 -41 23 9 183 -74 8 -17 50 66 -69 -25 -111 -53 35 14 -61 -37 -86 99 149 13
6154 13 -108 52 17 8 18 110 8 -4 -128 109 19 96 -92 -83 -97 -76 -39 -31 -85 83 74 -114 -74 26 -39 188 63
6181 63 40 -15 -83 232 61 136 74 -52 4 99 -122 -14 -251 -107 20 35 18 37 -75 -89 136 26 118 110 -121
6206 -121 19 -148 -80 20 -92 118 -97 91 42 -151 -16 -111 18 48 -113 67 -14 -60 67 164 90 -20 -41
6229 -41 -123 108 29 -21 -143 -92 72 -18 -32 83 -71 -41 -111 -128 -23 0 -97 -8 35 -52 -46 -22 12 105 33 246 27
6256 27 -114 45 -69 73 8 -48 -25 1 -63 -14 -1 185 110 -126 -7 -34 -137 30 132 49 -18 -183 16 -26
6280 -26 -18 14 -27 180 26 -178 -23 160 127 205 99 -93 -6 122 85 -116 25 -27 -35 80 126 -108 85 -6 -36
6305 -36 42 -74 -4 79 -26 176 -103 112 119 -42 -11 26 0 230 -84 -23 45 -29 35 59 -140 -140 -176 -130 38 -44
$$ packed form
6128a04L55j70o3J00j59%O4j4J74k57Q2k5O7J6j35M4q6N8Q8k1p5K4m9J85N0j36
6154A3j21J60l5rJ0R2j02j2j24K37r0P7j88Rj4K1L7Qn4J68rj88M0J00o5K27j25
6181F3k3n5o8L15j71P5o2j26N6R5k21J08k37J44J27J5j7J9j12j4K25j10R2qk31
6206a21J40j67O8J00j12K10k15J88m9j93J35r5J29L0j61J80q1m6J27R7p4j10k1
6229d1q2K31p9n0j22N1J64r0j4J15j54L0p0j7J05K3r7Q9M3q7OK4L4R3p2K13k19
6256B7j41J59j14J42o5n6K3K6o4M9J3J86p5k36J19k7j03J67J02q3o7j65J99m2
6280b6QL2m1K07j54k04J55J83l3P8j06j92Q7J28l7k01J41n2qJ15M6k34J93r1l0
6305c6P8j16P0Q3j05K02k79K15Pj61L1L7k6K30l14O1O8p4O4K4j99%l6M6J68q2
$$ plain form
6331 -44 -76 113 -39 -102 -84 -25 -55 93 100 115 -66 196 -43 -19 61 -38 -35 -136 -107 -111 17 26 51 -23 33 59 -25 101
6359 101 123 -42 39 -7 -123 -45 126 72 -8 -83 -22 -25 62 123 61 5 136 22 111 28 -114 28 95 -42 70 -109
6385 -109 43 24 -105 -191 6 28 -26 -123 59 -90 -9 -110 -118 21 -90 125 -44 58 88 -5 -25 14 -33 131
6409 131 -34 -7 2 -38 -8 -114 -2 -33 41 -94 -146 139 -80 -12 -85 -117 -61 89 15 17 -86 -96 -161 -15 -44 -73
6435 -73 108 106 -67 -40 -59 73 -71 94 -188 142 74 -27 -55 -54 108 -68 -10 63 -37 -110 29 1 41 -1 -91
6460 -91 -88 -4 -124 -68 116 47 33 51 27 146 -42 143 6 238 -19 -17 124 23 -82 101 50 6 89 38 56
6485 56 -85 -7 174 6 -39 108 -51 -56 -31 25 3 -89 -74 86 -205 -192 13 -49 -65 -104 172 -9 62 31 171
6510 171 74 129 137 -81 -69 48 91 -36 120 -106 67 -47 -51 -30 19 -47 182 -120 -27 8 51 76 -15 14 -11 0
$$ packed form
6331d4l2J89j52o3J8N9l0J48PJ5j81K62k39K4Q0r9Lj01K9mJ28RK5p4N6K6q4J26
6359A01K2j65Q1m6j16P8J71n4q0p5O1lQ7O1o2n6J31j14Q9q3j42J42O7j37J12j79
6385a09J52j9j29q6J97K2n4r7J82j49Q1j01qJ39j11K15j69J02L0r3k0L9m7J64
6409A31j65K7Rm0L0j06J12l1P4j35n2K85k19O8p3l2N6J50p4Kj03j0o5J46k9k9
6435g3J81kj73K7j9J32j44J65k82L30o8j01k8JJ62j76N8P3j00p3J39k8M0m2r0
6460i1LQ4j20N6J84o9j4J8k4J19j88J85j37K32k57KJ41j01j05J83n1m4Q3n1J8
6485E6j41P8J81j68m5J47j59nK5N6k2r2J5J60k91J3K05o2j6l9K76j81P1l1J40
6510A71r7N5Qk18J2J17M3j27J56k26J73j14mK1M9o6K29l02R3L5M3K5r1K9k5J1
$$ plain form
6536 0 -56 51 67 120 -155 -59 128 96 -14 105 -100 137 -69 -1 -7 -56 25 112 160 -36 -17 7 -23 -60 121 58
6562 58 27 155 -85 126 97 -39 -45 -46 73 76 26 8 -105 38 9 -80 -84 6 -40 -273 -84 36 -85 0 19 -169
6588 -169 280 -73 -35 159 159 -9 -17 38 -142 132 104 17 -67 -66 87 -55 -33 16 -106 13 82 3 -82 -22 63 -79
6614 -79 -22 -12 -181 -42 93 -7 -21 10 -123 -75 -83 -32 97 14 21 -13 -29 -63 -199 190 -27 46 116 105 -60 -82
6640 -82 20 -263 -16 -88 1 -63 24 -138 -7 18 -56 42 131 -82 -37 68 5 29 118 9 -11 83 -87 -143 -50 121
6666 121 -3 100 82 92 -36 -182 -6 -181 -24 -53 -16 -93 -16 -31 18 127 64 -17 26 77 100 107 22 18 -31 10 -47
6693 -47 -147 -95 29 -12 119 174 -68 59 -56 54 143 57 60 78 -55 -21 -133 63 -89 -196 68 34 -69 208
6717 208 4 -113 28 -185 -127 156 16 -48 -197 -17 32 15 -114 119 17 -82 -28 13 223 170 43 77 -9
$$ packed form
6536@n6J07J6N3k75R6J87l2j10J19k05K37k06O8om9Q1Q7M8j96J9K4l0l7J81o3
6562E8l1J28k40K11k9j36ojJ19Ln0j8j13J43k9q9mR0m6k33J89J20j21Q5J9j88
6588a69M49l53L8J94%j68qN5j80K74k8q7q4JJ53j42K2M9j22J19O9p9q5O0Q5j42
6614g9N7J0j69J39J35j00j4L1j33M8qN1J29q3Pl4j6l4j36L89k17P3P0j1j65k2
6640h2J02k83K47p2Q9o4Q7j62J31K5p4R8Q9k13M5J05o3K4Q9j09k0R4j70n6R3J71
6666A21j24J03j8J0j28j46J76j75J57k9L7p7P7j5M9J09o3q1M3N1K3Pq5mm9M1n7
6693d7j00N2J24m1J31N5k42J27j15J10Q9q6LJ8j33L4j12J96j52j07K64l4j03K77
6717B08k04j17J41k13N8K83j40o4j49J80M9j7j29K33j02r9N4M1K10n3j27L4q6
$$ plain form
6740 -9 -63 71 6 83 119 51 -45 77 -20 -143 28 201 151 -113 1 -11 67 105 -22 -60 -18 -19 115 23 -64 96
6766 96 119 -144 55 117 26 18 -10 31 -45 73 40 -40 115 -85 -63 179 -197 156 28 42 99 -145 27 108 -369
6791 -369 -83 -21 99 142 29 -18 50 -22 129 64 -115 80 -23 5 -117 -7 -183 -90 -36 -25 -1 -106 22 8
6815 8 -76 91 -41 48 27 -50 30 66 3 152 -59 58 -36 42 68 8 177 51 -76 28 82 -32 98 -95 44
6840 44 -138 -48 29 47 -117 47 19 153 1 -124 -107 35 -51 30 111 -128 274 125 -61 98 4 27 -126 -21
6864 -21 -98 93 162 15 -3 -68 3 -189 -147 -11 -162 125 69 166 119 25 88 -127 -29 41 -256 35 11 91 116 37
6890 37 141 44 26 115 1 -37 66 -48 297 35 -207 77 22 14 134 -9 8 -46 -65 120 96 49 115 139 -174
6915 -174 -49 130 47 30 108 -75 -57 49 44 61 60 -106 50 -36 34 37 152 -171 -83 -64 -14 -73 88 -49 -140 106
$$ packed form
6740in4J34o5P7L6o8r6J22r7j23J71J73n0k64J14j2P8L8j27l8M2jJ34r2q7J60
6766I6K3k63J99O2r1qk8M1p6J18l3q0J55k00K2K42l76L53j28J4N7k44J72Q1m77
6791c69K86O2J20M3j13m7O8p2J51o5j79J95j03K8j22J10j76R3N4J1K4j05J28j4
6815Hq4J67j32Q9k1p7Q0L6o3J49k11J17r4P8K6o0J69j26j27J04N4j14J30j93J39
6840D4j82R0P7J8j64J64k8J34j52j25J7J42q6Q1Q1k39M02j49j86J59r4K3j53J05
6864b1p7J91O9j47j8o5P1j92M2J36j51K87n6R7m7r4O3k15R8P0k97K91k4Q0K5p9
6890C7J04r7j8Q9j14l8J03j14L45k62k42K84n5qJ20j43J7n4j9J85k4m7O6K4l13
6915a74J25J79q3j7P8j83J8J06nJ7jj66J56q6P0LJ15l23Q8J9N0n9J61j37r1K46
$$ plain form
6941 106 -5 -42 44 -44 -1 -106 80 -41 94 61 39 5 -226 26 131 -104 -56 49 -62 -72 -49 -40 -44 -92 14
6966 14 118 -40 89 63 48 -14 23 91 5 84 147 9 -32 28 -165 -80 -91 5 65 -18 2 32 -48 73 -36 93
6992 93 45 54 75 -11 38 -2 -12 18 231 38 -145 -27 -159 -71 -5 134 125 -79 35 51 15 95 -72 -85 90 28
7018 28 23 210 -63 134 -90 -18 73 8 109 9 84 -89 175 -64 -25 50 -37 122 29 -29 7 -47 221 151 -56
7043 -56 -87 83 61 137 -55 -30 52 -94 22 29 -253 40 -85 -20 96 -90 152 5 23 76 33 -108 0 10
7067 10 118 33 -58 0 -8 6 -2 -100 -26 10 127 98 74 -3 63 67 2 -17 -69 119 4 -27 103 -46 43 -12 45 214
7095 214 -104 -58 -54 32 60 36 -23 216 -133 16 28 -33 38 97 -4 205 -59 82 33 -93 27 -96 -87 29 -120
7120 -120 -158 -115 -114 -36 -32 -6 75 16 27 18 -61 74 26 -43 29 -15 8 23 41 32 84 -99 -136 -29 -14 -65 -51 -43 39 -93
$$ packed form
6941A06j11l7Q6q8M3j05J86j21J35l3k2l4k31K52J05k35M8J05j11j0K3Rmm8J06
6966A4J04j58J29k6j5o2L7O8q6P9O3j38m1O0j93Q5j1R6O0q3K0L0q0J21j09J29
6992I3m8RK1q6M9m0j0L0K13j93j83J18j32Q8O6J39rk04J14J6l6Q0j67j3J75o2
7018B8nJ87k73J97k24P2R1o5J01j00P5j73K64k39L9P5q7J59r3n8L6n4K68p0k07
7043e6l1J70k2P6j92K5Q2j46J16Pk82K93j25O5J16j86K42j47J8N3m3j41J08J0
7067A0J08q5r1N8qJ4qr8P4L6J17k9k4p7O6Mo5j9n2J88j15l1J30j49Q9n5N7J69
7095B14l18M6MQ6K8k4n9K39l49J49J2o1P1N9j01K09k64J41m9j26J20j23RJ16j49
7120a20l8M3JP8MK6Q1n9J1rp9J35m8o9P2m4K3J5J8rN2j83l7J07J5n1J4QQ2j32
$$ plain form
7150 -93 68 -97 1 58 -17 17 82 -46 74 40 -10 190 -5 -94 77 33 48 -162 18 23 -144 -105 125 22 6
7175 6 48 -2 115 -99 -49 27 -2 -31 -89 22 96 -70 129 11 -102 -23 2 -80 -40 -84 30 52 -57 -104 -85 -49
7201 -49 73 64 -147 -26 -10 -14 -31 -19 -139 -96 -173 188 66 122 -45 -29 99 -116 53 26 -190 37 4 -100 55
7226 55 120 -39 132 -14 -91 -47 -37 94 -103 -143 34 109 36 -48 -102 89 -45 -88 92 -3 145 135 -64 55
7250 55 32 22 18 -61 110 -9 -101 -10 17 -5 -26 -56 -21 123 26 81 55 59 92 35 62 -73 -51 62 124 -261 -40 116
7278 116 48 189 -84 -9 -10 -53 230 -65 140 49 -176 54 -72 23 248 65 39 30 -53 -75 -66 24 -40 -101 17 28
7304 28 32 -21 71 -164 55 -18 -95 39 -201 -87 -56 -139 69 -30 -216 136 108 11 28 -119 -48 29 9 80 14 -25
7330 -25 97 -91 -14 81 -238 -4 -69 149 1 -195 -14 60 -54 121 -140 -116 158 -27 17 -75 -44 128 8
$$ packed form
7150i3J61j65R8N7p5L4O5j28J20l4n0K00j95q9J71m4J5k10J80Nj67L9K30j03j6
7175FM2n0J17k14N0P6k9k9n8J11P4j66J99j18j13P9K5q2M0m4J14K2j09m7J9L6
7201d9J22rk11J21J6mj7J2j20M3p7L61j22N6j67J6J28k15J69k7k16K27l3j04J55
7226E5O5j59J71j46p7M4J0J31j97m0J77P5p3q4n4J91j34m3J80r5J48j0j99J19
7250E5k3j0mp9J71j19r2R1K7k2k1l0L5J44r7N5k6ML3n7K7j35K2J13O2l85K21J56
7278A16o8J41k73P5jm3K83k95K05r1k25K30j26R5K25j83k6rq3k2RR0o4o1J18J1
7304B8Mn3R2k35K19p3p7J34k40J14L1q3K08r9j86L52k8r7J7j47P1P7k0P1o6l9
7330b5J22j88P7R5l19K34o5K18j48j96J81P4j14J75k61K4K74j85M4r2L1J72j20
$$ plain form
7353 8 -126 220 -62 -28 -24 -3 -18 -87 -55 -16 2 30 9 -5 -9 24 -25 203 29 85 99 -112 159 26 -44 0 26 0
7381 0 177 -48 -144 42 -97 142 -4 -51 -39 -122 -34 -8 -19 84 -70 -141 77 -124 -12 -94 55 210 14 -16
7405 -16 107 -3 -69 -100 -75 59 -93 45 57 -150 158 18 -4 79 56 -13 12 49 36 116 -157 100 -41 -6 57
7430 57 -99 142 57 -21 22 59 -58 40 -44 -17 -35 89 156 -106 27 104 19 106 73 100 128 6 -10 -31 -92 137
7456 137 11 -47 -31 -87 80 -36 -12 77 110 159 -52 87 60 -9 -20 2 229 -139 5 -121 -14 202 -77 49
7480 49 -97 -66 151 -55 21 164 -65 -187 -29 -131 -185 125 15 250 -153 -209 -52 -8 -90 90 -42 -11 7
7503 7 -84 128 -88 -33 -124 39 124 -53 18 -105 0 106 -38 -12 -23 -96 -110 31 26 -5 48 49 116 -12 -116 40
7529 40 -33 140 154 -5 112 38 -26 -15 -36 -124 19 -45 -49 -25 -157 -150 -53 -62 1 -13 101 11 -74 183 -1 -96 -79 -7
$$ packed form
7353Hj34L46k82L4MK1j5o9L2L9J8K8k1j4mL3m9K28j74N6J4k11K71j33p0M4K6k6
7381@J77k25r6J86j39K39j46m7J2q3Q8K6j1J03j54p1K18k01J12q2J49J55j96l0
7405a6J23j10o6l1K5J34j52J38J2k07L08j40k2Q3k3o9K5L7j3Q0k73K57j41L5O3
7430E7j56K41q5p8M3L7j17R8q4K7j8J24O7k62J33P7q5Q7l3K7K8j22j6k1o1K29
7456A37j26n8J6n6J67j16K4Q9L3M9k11J39k7o9j1K2K27l68J44j26J07K16k79J26
7480D9j46L1K17k06P6J43k29j22J58j02n4L10j10K35m03n6J57M4q2J80j32L1J8
7503Gr1K12k16N5r1J63Q5j77P1j23J05J06j44K6j1p3j4J41nl1N3JO7j28j04J56
7529D0p3J73J4j59J17p4o4J1k1q8J43o4mK4j32PR7rO3j4J14r0q5K57j84r5J7P2
$$ plain form
7557 -7 8 -85 -92 0 -62 54 25 -42 -58 -29 -160 48 81 -102 86 63 -18 -49 -67 137 -34 33 -15 -3 137 -152 -110
7584 -110 15 64 89 -77 -20 128 -97 -283 102 -17 -144 97 -87 149 148 21 124 193 -99 -41 -91 -24 -6
7607 -6 48 30 23 19 -34 18 -3 -34 81 -183 44 -13 37 152 64 71 -186 0 81 48 122 -1 -35 121 -67 164 -210
7634 -210 69 84 -69 40 -39 -152 -103 0 74 101 -193 86 -102 14 112 68 43 108 26 41 69 -102 6 10 26
7659 26 90 -73 3 145 -55 -6 95 40 116 3 117 -15 2 141 100 20 150 46 -130 21 -176 32 14
7682 14 -182 131 -143 41 183 16 -80 -67 -125 -15 12 41 -42 7 89 48 -40 86 -75 -11 -1 140 80 -118 -163
7707 -163 27 15 27 80 -183 34 21 -233 -75 -59 -3 -42 4 -21 2 -38 95 72 -80 -8 31 -27 144 -121 101
7732 101 20 32 89 -39 -15 52 73 93 7 -71 -111 79 -46 -48 -27 -33 1 117 186 -12 -93 56 -12 100 -78 61
$$ packed form
7557gJ5r3pR2o2J16k9o7j6K9j31K08L3j83J88k3q1l1j8K04j71O7m8J2J40k89M2
7584a10J25M9K5j66N7J48k25j86L85j19j27K41j84K36jj27J03O9k92N8n0O7J8
7607fN4j8pmn3N2k1l1J15k64K27n7N0J15q8Pk57J86Q1l3P4j23l4J56j88K31l74
7634b10K79J5j53J09p9j13M9J03P4K7k94K79j88J16R8m4k5O5q2J5K8j71J08MJ6
7659B6O4j63P6J42k00M9J01n5P6j13J14j32J7J39m1q0J30j04j76J51j97K08j8
7682A4j96L13k74J84J42j67r6J3n8J10K7K9q3M9Q2m1q8J26j61O4J0J41o0j98m5
7707a63J90j2J2N3k63K17j3k54J58J6N6l9M6k5K3m0J33k3j52P2L9n8J71k65K22
7732A01q1J2N7j28K4O7K1K0q6p8m0J90j25kK1oL4J16O9j98q1J49o8J12j78J39
$$ plain form
7758 61 115 17 151 -55 44 122 44 -42 97 -129 -56 87 -36 135 -29 -67 66 -97 -145 67 -87 90 95 -95
7782 -95 0 55 89 109 -61 124 -137 -87 64 144 17 -26 -109 -137 114 -126 118 110 -102 95 40 13 -116 -103 91
7807 91 53 31 -16 144 13 -48 -48 95 -110 -19 109 -49 76 195 -138 -5 116 -172 227 114 -18 157 43
7830 43 190 -19 69 44 21 -43 62 -92 1 -82 -91 29 61 199 24 -67 -35 -3 103 130 -142 91 47 68 -8 -95
7856 -95 -33 -32 -96 -119 -30 -50 -8 38 -18 -105 37 23 128 95 20 23 -31 32 -23 5 -21 -174 -13 139 -68 249 -47
7883 -47 -81 94 66 48 106 -75 93 -105 -117 49 32 20 -31 -5 -4 -84 -41 -49 59 19 41 -8 164 179 -62 87 2
7910 2 150 73 110 87 -166 -22 -20 18 -190 153 -72 78 30 -12 -37 -70 -23 98 88 161 126 -102 228 -94 -58 71
7936 71 -132 -41 171 -32 106 -92 -49 117 118 147 95 32 55 -65 -21 172 -72 98 92 -95 27 72 -4 247 -36
$$ packed form
7758F1N4r8J34k06R9P8p8q6J39k26P3J43j23J71j64l8J33j63m8K12j54J77Nj90
7782i5R5N5L4K0j70J85k61N0J51Q0j27m3q3k8K51k40K44qk12J97n5k7j29J3J94
7807I1l8k2m7J60j31o1%J43k05R1J28j58J25J19l33J33J21k88L99j13j32J75j14
7830D3J47k09Q8k5k3o4J05j54R3q3rJ20L2J38j75r1L2L2J06K7k72K33m4K1p6q7
7856i5O2Jo4k3Q9k0M2M6n6q7J42j4J05l3p5Ln4O3n5K8k6j53J61J52k07L17k96
7883d7l4J75k8j8N8j81J68j98j2J66j7j2n1K6Jq0M3qJ08m0K2m9J72J5k41J49q5
7910BJ48p7L7k3k53J44KL8k08L43k25J50m8m2k5l3M7J21j0P3l5k28L30l22L6J29
7936G1k03R1K12k03J38j98M3J66JK9n2o3K3j20M4J93k44J70oj87J22M5p6K51k83
$$ plain form
7961 -36 55 -19 -97 7 -66 42 -70 77 -56 179 -141 -10 -22 29 176 51 57 -27 -117 -74 -39 -224 -81 61
7985 61 -51 74 27 61 -93 21 224 -87 10 1 -82 -64 -33 61 55 -76 87 -15 -9 -8 17 -67 -16 -124 48 152
8011 152 44 -21 50 -43 -146 -7 -79 -49 -90 -100 -68 -66 26 -44 -64 7 -19 -101 100 77 138 -36 88 -13 -54 80
8037 80 217 -212 -149 -41 -44 46 -2 149 2 114 123 157 -79 74 80 149 88 38 116 34 -161 234 -59 191 93 -151
8063 -151 124 -21 -110 6 -135 -125 6 -27 113 155 -145 82 -144 91 -3 100 101 -41 -91 -101 78 34 130 -32
8087 -32 85 175 20 -27 96 -5 -13 -4 10 -13 107 -21 -151 129 8 -58 96 57 -65 -57 66 -101 97 135 -29
8112 -29 60 112 49 -68 -54 -17 -70 -154 -26 83 -73 57 -173 -47 -70 5 17 -11 -72 -3 -157 -21 -124 58 60
8137 60 37 80 -7 -35 94 2 -89 76 -97 -26 -92 -19 190 -41 -85 295 -84 41 99 27 39 -45 51 -55 -144 29
$$ packed form
7961c6R1p4p8J04p3J08j12J47j33K35l20J31j2N1J47j25Oq4r0M3L5j85J43J42
7985F1j12J25m7L4j54J14K03l11R7rq3J8L1R4oj31J63j02OJK5q4N1j08J72J04
8011A52j08o5P1r3j03J39p2L0m1j0L2KR2p0k0P1k6q2K01k3O1j74J24j01m1J34
8037H0J37m29O3J08lR0m8J51j47J12RL4k36J53OO9o1n0P8q2j95L95k93K50r8k44
8063a51K75j45q9J16j41J0J31l3J40M2l00K27k26K35r4J03Jj42n0j0J79m4R6j62
8087c2J17R0j55m7J23j01qRJ4k3J20j28j30K80j21o6J54l9j22QJ23j67J98L8j64
8112b9Q9N2o3j17J4L7n3q4J28J09j56J30k30J26k3P5J2k8o1O9j54J36j03J82K
8137F0k3M3q7k8J29r2r1J65j73P1o6P3K09k31m4L80l79J25N8p2J2q4R6j06q9J73
$$ plain form
8163 29 -67 -91 34 103 -16 38 9 -176 -31 4 63 126 -107 -1 -31 11 -67 -109 -76 -15 165 -24 165 -30 -19
8188 -19 -154 32 -19
$$ packed form
8163B9r6k4J25O9j19N4k9j85J45L5N9O3k33J06l0M2p8m2L3O1J80j89J89j95J1
8188a9j35J86n1
8191a9
$$ Imaginary data points
##PAGE= N=2
##DATA TABLE= (X++(I..I)), XYDATA
$$ plain form
0 0 0 0 0 0 0 0 8 -4 0 0 8 -8 16 -16 16 -24 28 -32 40 -46 56 -64 78 -88 102 -121 140 -161 182 -209 237 -270
32 -270 305 -342 382 -431 483 -539 599 -665 739 -820 906 -998 1100 -1215 1340 -1476 1623
49 1623 -1786 1969 -2173 2399 -2649 2933 -3260 3637 -4078 4598 -5223 5999 -6978 8258 -9997
64 -9997 12495 -16362 23008 -36462 73510 -368826 -935813 693042 302681 -749619 393804
75 393804 524834 -767649 -49696 753454 -401704 -491833 626730 115086 -476301 270220
85 270220 176942 -495017 60118 467361 -158913 -271315 235926 38893 -316738 148061
95 148061 283068 -320130 -101605 397521 -149549 -314958 326478 32293 -393196 308947
105 308947 300865 -533846 -21023 503340 -340748 -198806 548365 -233703 -417930 577481
$$ packed form
0@%%%%%%Qj2M%Qj6K4l2L2m0N2o0P2q6J02j20J42j66J90k23K61l01L43l91M46n07
32b70N75o47P24q13R14j022J138j264J404j559J726j904K098k315K555k816L099
49A623l409L755m142M572n048N582o193O897p715Q676r821J1222j2977J5236j8255
64i997K2492k8857L9370n9470J09972m42336n66987J628855l90361j052300J143423
75C93804J31030j292483P17953Q03150j155158r0129J118563n11644n91387P46521
85B70220r3278o71959N55135M07243o26274j12402N07241j97033l55631M64799
95A48061J35007o03198K18525M99126n47070j65409O41436k94185m25489P02143
105C08947q082q34711N12823N24363q44088J41942P47171p82068j84227R95411
$$ plain form
115 577481 58434 -620274 306944 350876 -493720 80418 458349 -430277 -209237 535272
125 535272 -150934 -390416 411324 109129 -425650 152970 240584 -311229 -37657 334244
135 334244 -108909 -245456 228136 93011 -318234 62047 305691 -180407 -155755 266674
145 266674 -54039 -292091 245057 198877 -367024 30480 366820 -285044 -190887 396167
155 396167 -115006 -304595 367982 72920 -418653 173646 253887 -340692 6420 343474
165 343474 -235419 -164027 339342 -87044 -264166 250526 60543 -247819 148806 154171
175 154171 -230086 -38015 184043 -74076 -83287 165662 -7278 -178247 82844 100261
185 100261 -151372 -14754 173009 -38291 -127440 89471 15349 -176472 99457 199704
$$ packed form
115E77481n19047o78708R27218M3932q44596N74138L77931q88626K21040P44509
125E35272o86206k39482Q01740l02195n34779N78620Q7614n51813K73572L71901
135C34244m43153j36547M73592j35125m11245L80281K43644m86098K4652M22429
145B66674l20713k38052N37148m6180n65901L97504L36340o51864R4157N87054
155C96167n11173j89589O72577k95062m91573N92299Q0241n94579L47112L37054
165C43474n78893P1392N03369m26386j77122N14692j89983l08362L96625N365
175A54171l84257J92071K22058k58119r211K48949j72940j70969K61091J7417
185A00261k51633J36618J87763k11300q9149K16911p4122j91821K75929J00247
$$ plain form
195 199704 -177423 -77625 194974 -122225 -144380 241331 25377 -208960 143573 104806
205 104806 -258148 20529 231952 -144506 -61566 235545 -116409 -202716 191193 41155
215 41155 -163145 129367 93195 -195790 -14289 146913 -86868 -68517 153099 -7567
225 -7567 -132790 71386 38154 -118242 37960 119088 -59348 -69621 74520 2372 -97589
236 -97589 65538 88421 -109548 -7563 121460 -81993 -77710 121465 -6068 -105993 93081
247 93081 59652 -140752 14865 117345 -110072 -39844 151844 -59060 -99905 122619 -7247
258 -7247 -127969 80857 73231 -99609 14742 92015 -88114 -56553 111680 -12638 -74540
269 -74540 88318 21197 -102452 22332 58079 -51511 -7753 74307 -19046 -72075 40871
$$ packed form
195A99704l77127R9798K72599l17199k2155L85711k15954k34337L52533l8767
205A04806l62954K78677K11423l76458Q2940K97111l51954q6307L93909j50038
215D1155k04300K92512l6172k88985J81501J61202k33781J8351K21616j60666
225g567j25223K04176l3232j56396J56202Q1128j78436j0273J44141p2148r9961
236i7589J63127K2883j97969J01985J29023k03453M283J99175j27533r9925J99074
247I3081l3429k00404J55617J02480k27417P0228J91688k10904m0845K22524j29866
258g247j20722K08826p626j72840J14351P7273j80129L1561J68233j24318o1902
269g4540J62858o7121j23649J24784L5747j09590M3758Q2060r3353n3029J12946
$$ plain form
280 40871 26154 -72474 29017 72253 -60901 -30634 60166 -28561 -54720 62325 34663
291 34663 -70659 17027 61288 -74577 -22209 89606 -36071 -45428 83098 -6216 -77273
302 -77273 43653 35105 -67704 13752 75926 -48346 -40348 64321 -30276 -59583 70016
313 70016 20765 -57108 28350 23858 -62807 -13626 55940 -3627 -25614 45158 -2063 -69162
325 -69162 17997 38539 -27816 18490 45167 -33532 -43882 21681 13321 -23915 35144 43092
337 43092 -54693 -25729 36232 -31389 -14059 65365 3696 -47267 8574 3617 -45269 15617
349 15617 61607 -25230 -27484 38206 -31353 -43696 52919 19608 -29335 24254 11216 -45327
361 -45327 -7254 38936 -3798 -13606 36621 -5112 -44980 18829 15781 -26557 15075 25902
$$ packed form
280D0871j4717r8628J01491M3236j33154L0267R0800q8727k6159J17045k7662
291C4663j05322Q7686M4261j35865N2368J11815j25677r357J28526q9314p1057
302g7273J20926q548j02809Q1456O2174j24272P998J04669r4597k9307J29599
313G0016m9251p7873Q5458m492q6665M9181O9566n9567k1987P0772m7221o7099
325f9162Q7159K0542o6355M6306K6677p8699j0350O5563q360l7236N9059P948
337D3092r7785K8964O1961o7621J7330P9424o1669n0963N5841m957m8886O0886
349A5617M5990q6837k254O5690o9559j2343R6615l3311m8943N3589j3038n6543
361d5327L8073M6190m2734r808N0227m1733l9868O3809l048m2338M1632J0827
$$ plain form
373 25902 -18941 -19057 11626 370 -23123 16247 24866 -29640 -2862 27569 -26777 -16866 29734
386 29734 -709 -16191 22403 11910 -35585 -3913 33132 -17323 -7165 40162 -15780 -26298
398 -26298 27968 -7777 -27612 26162 21866 -19224 -6577 10405 -21141 -12752 32843 2550
410 2550 -21011 15477 -2679 -25321 7679 12971 -4280 424 12339 -1218 -23409 4105 17063
423 17063 -12889 8968 22493 -20421 -13681 16657 -1218 -12443 13361 11810 -19695 3032
435 3032 20152 -30237 -12631 33869 -8551 -11052 23502 -13109 -23518 14339 6180 -13837 10071
448 10071 20944 -14982 -14311 12518 -10984 -6317 29348 5642 -11721 1089 -8963 -10727 4121
461 4121 18180 13574 -11300 -6869 -3440 -18580 6154 21518 -3541 -2454 7603 -12877 -25536
$$ packed form
373B5902m4843j16L0683j1256k3493L9370Q619n4506K6778L0431n4346R911M6600
386B9734l0443j5482L8594j0493m7495L1672L7045n0455J0158M7327n5942j0518
398b6298N4266l5745j9835N3774m296m1090J2647J6982l1546Q389M5595l0293
410B550k3561L6488j8156k2642L3000N292j7251M704J1915j3557k2191K7514J2958
423A7063k9952K1857J3525m2914O740L0338j7875j1225K5804j551l1505K2727
435C032J7120n0389J7606M6500m2420k501L4554l6611j0409L7857q159k0017K3908
448A0071J0873l5926O71K6829k3502M667L5665k3706j7363J2810j0052j764J4848
461D121J4059m606k4874M431L429j5140K4734J5364k5059J087J0057k0480j2659
$$ plain form
474 -25536 5400 22649 -2229 7834 11287 -35397 -12894 28364 -5552 1262 27304 -11628
486 -11628 -21717 8614 1526 -9738 16149 19609 -15363 -8024 8648 -18935 -3895 26000 -318
499 -318 -6276 2114 -13553 -7549 6244 8067 1354 -9297 3128 6133 -11485 -3926 4065 -995
513 -995 6338 11228 -3682 -18557 3074 16067 -10841 2421 18311 -16299 -2016 20344 -18369
526 -18369 -12492 19819 1369 -4716 11553 -5731 -23615 4551 17632 -8260 2074 10999 -19581
539 -19581 -4002 15464 -11457 -3874 13964 1666 671 -2591 -10802 -4322 8052 16360 2165
552 2165 -13021 -4082 2096 2483 1044 -104 1644 -2815 5729 5120 -21206 -3183 18370 -6300
566 -6300 1731 11005 -18985 -7799 17494 -2184 -10559 10228 6891 -10118 5404 6217 -21245
$$ packed form
474b5536L0936J7249k4878J0063L453m6684K2503M1258l3916O814K6042l8932
486a1628j0089L0331p088j1264K5887L460l4972P339J6672k7583J5040K9895k6318
499c18n958Q390j5667O004J3793J823o713j0651J2425L005j7618P559P991n060
513i95P333M890j4910j4875K1631J2993k6908J3262J5890l4610J4283K2360l8713
526a8369N877L2311j8450o085J6269j7284j7884K8166J3081k5892J0334Q925l0580
539a9581J5579J9466k6921P583J7838j2298r95l262q211O480J2374Q308j4195
552B165j5186Q939O178L87j439j148J748m459Q544o09k6326J8023K1553k4670
566f300Q031R274k9990J1186K5293j9678q375K0787l337j7009J5522Q13k7462
$$ plain form
579 -21245 2049 22898 -6038 122 8149 -18116 -5611 13502 1015 -1042 4072 655 -6499
592 -6499 -6890 -1385 -1943 6148 12483 -2471 -10344 -9926 -3621 9141 4826 6002 5636 -14586 -4927
607 -4927 6826 -8299 6762 18523 -4076 -6315 412 -8767 -5289 14939 11964 -8669 290
620 290 1831 -20053 1430 17403 -6677 2195 8131 -15821 -8177 6374 -653 305 7157 2330
634 2330 -9472 -4165 4136 -4244 3034 10386 -1786 -1660 -658 -3722 2892 932 3766 5557 -5907
649 -5907 1686 3464 -9921 935 6699 -3429 1117 4552 -4849 -9110 2407 4105 -7088 5594
663 5594 8226 -12931 -672 6327 -11815 2806 13206 -3968 -2375 3884 -3916 -6009 4897
676 4897 8272 -2326 1849 4500 -10729 -2679 7916 -1799 2039 4154 -3263 -3533 -4140 977 1891
$$ packed form
579b1245K3294K0849k8936O160Q027k6265J2505J9113j2487k057N114l417p154
592f499l91N505n58Q091O335j4954p873M18O305J2762m315J176l66k0222R659
607d927J1753j5125J5061J1761k2599k239O727r179L478K0228k975k0633Q959
620B90J541k1884K1483J5973k4080Q872N936k3952P644J4551p027R58O852m827
634B330j1802N307Q301q380P278P352j2172J26J002l064O614j960K834J791j1464
649e907P593J778j3385J0856N764j0128M546L435r401m261J1517J698j1193J2682
663E594K632k1157J2259O999j8142J4621J0400j7174J593O259p800k093J0906
676D897L375j0598M175K651j5229Q050J0595r715L838K115p417k70o07N117R14
$$ plain form
691 1891 -2355 5648 903 -8368 858 255 -4045 3225 5200 -101 -3664 1738 828 -7425 5397
706 5397 7701 -7792 4179 7256 -9788 -1869 4136 -3645 2673 7866 -889 -9087 -1396 3104
720 3104 -6088 2899 9084 -5876 -1584 1945 -9372 -2209 6906 4824 2200 -1735 -2301 -6435 -3391
735 -3391 9757 4356 -289 4900 -4831 -8245 889 3842 3564 2279 3303 -2503 -10805 201 2825
750 2825 -3250 9543 4933 -11668 -4528 387 -2219 2848 6575 1099 -6187 -383 1492 -7693 3784
765 3784 10395 -3043 853 2516 -7507 -1461 5540 3429 212 170 1912 -5449 -3538 5514 -2273
780 -2273 -1382 6231 -2993 -4455 675 -2054 -2197 522 4926 718 -5659 2080 -877 -5473 6104
795 6104 2922 -3309 4189 1587 -4413 -1975 2335 2905 -564 4386 2352 -8840 -97 3847 -4302
$$ packed form
691A891m246Q003m745r271R226o03m300P270J975n301l563N402r10q253J2822
706E397K304j5493J1971L077j7044P919O005p781O318N193q755q198P691M500
720C104r192Q987O185j4960M292L529j1317P163R115k082k624l935n66m134L044
735c391J3148n401m645N189r731l414R134K953k78j285J024n806q302J1006K624
750B825o075J2793m610j6601P140M915k606N067L727n476p286N804J875r185J1477
765C784O611j3438L896J663j0023O046P001k111l217m2J742p361J911R052p787
780b273Q91P613r224j462N130k729j43K719M404m208o377P739k957m596J1577
795F104l182o231P498k602o000K438M310N70l469M950k034j1192Q743L944q149
$$ plain form
810 -4302 3552 4804 -4514 -2779 -429 -1557 -2236 2096 4794 -3651 -1879 3353 -6327 -2026 7037
825 7037 314 138 1899 -2176 -2252 553 4372 -94 -1929 5943 -739 -5142 3396 -1335 -2996 5280
841 5280 2074 -2569 -2407 -705 -1077 -3175 3513 2290 -4488 2869 906 -7650 252 2838 79 2926
857 2926 1940 -1787 -5231 -599 4597 -521 3137 5251 -5466 -2292 1990 -3336 1279 5661 2155
872 2155 -2633 -4306 -1236 -2995 115 7687 -876 -4138 1217 -5193 -3467 4455 2523 1234 527
887 527 -764 -3183 -4010 4145 4041 -830 4491 -635 -5803 1158 1507 367 3048 1952 -531 -4222
903 -4222 -1045 1801 -2977 2522 3963 -4391 -1311 418 -3605 181 1979 793 -720 -566 1355
918 1355 -3627 -1537 5185 -1096 -116 4484 -2716 -1743 1818 -733 553 1993 2544 -515 -3183 1224
$$ packed form
810d302P854J252r318J735K350j128o79M332K698q445J772N232r680M301R063
825G037o723j76J761m075p6K805L819m466j835P872o682m403Q538m731j661Q276
841E280l206m643J62J702l72k098O688j223o778P357j963q556P902K586k759K847
857B926r86l727l444M632N196n118L658K114j0717L174M282n326M615M382l506
872B155m788j673L070j759L110P572q563l262N355o410J726P922j932j289p07
887E27j291k419q27Q155j04m871N321n126n168O961L49j140K681j096k483l691
903d222L177K846m778N499J441q354L080J729m023L786J798j186j513J54J921
918A355m982K090O722o281R80M600p200R73L561k551J286J440N51l059k668M407
$$ plain form
934 1224 -1387 -2293 4635 191 -2513 1246 -2394 -2605 -125 1078 2305 -812 -307 -438 -4220 1632
950 1632 3098 -1708 2556 1748 -2147 -681 -178 902 697 1580 3298 -2939 -1728 2523 -2812 415
966 415 3722 -2173 -689 902 -2099 -1651 -675 1327 -206 -672 2012 -2701 -2977 2398 -1022 394
982 394 3386 -999 -293 18 -970 482 -311 2996 3043 -1904 -530 -1553 -2379 2731 2183 281 -344 -1870
1000 -1870 -951 -2695 -526 3515 -783 584 1352 -5610 -2246 1978 245 2526 1986 -1557 -2333 -1192
1016 -1192 1585 796 1833 3882 -2020 -1807 996 -2521 1014 3545 332 810 -1623 -2884 -588 -212
1032 -212 2186 1131 -1816 -300 -1732 -1748 622 -333 1076 706 -626 511 -2646 -663 3163 -614
1048 -614 1470 2350 -2671 293 1485 -1021 806 1582 1147 -356 -501 412 -2524 -156 2963 -1511
$$ packed form
934A224k611r06O928m444k704L759l640k11K480J203J227l117N05j31l782N852
950A632J466m806M264q08l895J466N03J080k05Q83J718o237J211M251n335L227
966D15L307n895J484J591l001M48R76K002j533m66K684m713k76N375l420J416
982C94K992m385P06L11r88J452p93L307M7m947J374j023q26N110n48j902o25j526
1000a870R19j744K169M041m298J367P68o962L364M224j733K281n40l543p76J141
1016a192K777p89J037K049n902K13K803l517L535K531l213M78k433j261K296L76
1032b12K398j055k947J516j432j6K370r55J409l70j332J137l157J983L826l777
1048f14K084Q80n021K964J192k506J827P76m35j503j45R13k936K368L119m474
$$ plain form
1064 -1511 307 933 -3741 -461 742 -1100 1389 445 -471 -278 -1752 44 403 802 2431 -88
1080 -88 -503 -232 -1373 1610 1109 607 2435 -1899 -908 1305 -2124 573 2165 -1128 127 -338 -1764
1097 -1764 -817 15 899 -583 -27 1050 -2735 -185 1576 -2259 1506 2045 -1773 966 245 -1490
1113 -1490 1005 845 885 989 -38 141 -1548 -397 1046 -312 1716 253 -2062 234 -2087 -1274
1129 -1274 2217 -347 301 1091 -3043 -1192 373 -346 1819 1367 257 -1276 -1006 602 -578 1972
1145 1972 3470 -1495 -131 228 -2774 1429 2440 -659 1085 -393 -2346 -1053 -457 679 449 639
1161 639 -257 -2593 -754 114 -963 2228 501 -1499 917 -1425 -563 1898 -69 1343 1877 -943
1177 -943 -60 -90 -108 985 1030 1012 -780 -494 450 -1907 289 1410 -1965 821 784 -2805 -359 -153 -1292
$$ packed form
1064a511J818O26m674L280J203j842K489r44r16J93j474J796L59L99J629k519
1080h8m15K71j141K983n01n02J828m334R91K213l429K697J592l293J255m65j426
1097a764R47Q32Q84j482N56J077l785K550J761l835L765N39l818K739p21j735
1113a490K495j60M0J04j027J79j689J151J443j358K028j463k315K296k321Q13
1129a274L491k564O48P90m134J851J565p19K165m52j110j533K70J608j180K550
1145A972J498m965J364L59l002M203J011l099J744j478j953J293N96J136k30J90
1161F39q96k336J839Q68j077L191j727k000K416k342Q62K461j967J412N34k820
1177i43Q83l0j8J093M5j8j792K86R44k357K196J121l375K786l7l589K446K06j139
$$ plain form
1196 -1292 1459 632 -798 -549 -493 324 -470 1069 1425 -729 1138 161 -1896 1311 508 219 2262
1213 2262 -788 -1226 164 -1051 684 850 -464 159 -896 -835 -1004 -570 1029 -610 218 819 -2203
1230 -2203 -174 962 -1389 1677 1252 -1486 919 345 -814 791 638 523 136 575 234 -1371 504
1247 504 533 -1057 1471 159 -1998 467 -946 -1166 1070 -328 189 292 -1251 -615 -682 211 1033 559
1265 559 990 -469 -1030 561 -444 1317 2307 -743 387 73 -2151 961 946 -64 1170 -291 -1206
1282 -1206 -1160 -490 476 108 1130 78 -2312 -245 -208 -1098 2084 530 -799 801 -1015 -595 1045
1299 1045 497 1056 829 -96 -236 -807 574 803 223 1233 -442 -802 450 -1256 -19 852 -1053
1316 -1053 429 -140 -1661 -5 -452 -486 696 84 -53 -542 -421 255 -568 1104 903 -591 1245 -94
$$ packed form
1196a292K751q27j430K49N6Q17p94J539L56k154J867r77k057L207q03k89K043
1213B262l050m38J390j215J735J66j314O23j055O1j69M34J599j639Q28O01l022
1230b203K029J136k351L066m25k738K405n74j159J605j53j15l87M39l41j605J875
1247E04K9j590K528j312k157K465j413k20K236j398N17J03j543O36o7Q93Q22m74
1265E59M31j459n61J591j005J761R90l050J130l14k224L112j5j010J234j461r15
1282a206M6O70R66l68J022j052k390K067L7q90L182j554j329J600j816M20J640
1299A045n48N59k27r25j40n71J381K29n80J010j675l60J252j706J237Q71j905
1316a053J482n69j521J656m47l4J182o12j37m89J21O76q23J672k01j494J836j339
$$ plain form
1334 -94 -1185 1174 278 96 1421 -263 -705 -148 -436 403 50 310 33 -1178 74 -919 -866 1028
1352 1028 -244 -3 545 -1391 -92 394 -575 1055 568 -147 472 -323 83 416 420 1113 -307 162 168
1371 168 -1128 620 344 -825 1108 -217 -1172 522 -732 -651 567 -242 173 -152 -314 -370 -793 666
1389 666 436 -247 1191 -148 -594 850 -481 300 1566 -123 309 -115 -975 344 111 463 613 -407
1407 -407 -202 -946 -866 283 -334 791 351 -1685 -203 -623 -720 1424 263 -234 705 -704 -494 195
1425 195 412 1073 352 444 -303 -795 657 114 -54 1405 -368 -820 118 -1134 -135 651 -465 37 -482
1444 -482 -737 -259 -676 279 178 -35 394 -591 -135 350 -561 989 893 -302 812 -193 -528 913 50
1463 50 201 698 -249 -23 -354 -368 -188 -519 841 -72 -1118 167 -1174 -709 847 -423 -114 428 -782
$$ packed form
1334i4j091K359q96j82J325j684m42N57k88Q39l53K60k77j211J252r93N3J894
1352A028j272K41N48j936J299M86r69J630m87p15O19p95M06L33MO93j420M69O
1371A68j296J748k76j169J933j325r55J694j254Q1J218q09M15l25j62n6m23J459
1389F66k30o83J438j339m46J444j331P81J266j689M32m24q60J319k33L52J50j020
1407d07K05p44Q0J149o17J125m40k036J482m20r7K144j161m97R39j409K10O89
1425A95K17O61p21R2p47m92J452n43j68J459j773m52R38j252R99P86j116N02n19
1444d82k55M78m17R55j01k13M29r85M56M85r11J550r6j195J114j005l35J441q63
1463E0J51M97r47K26l31j4J80l31J360r13j046J285j341M65J556j270L09N42j210
$$ plain form
1482 -782 -210 250 -237 476 430 470 -19 -534 446 41 339 1085 -368 166 331 -889 261 291 -578 724
1502 724 -354 -621 -179 -704 -241 149 -146 -77 -491 -117 -246 -395 789 -61 -172 1075 -304 -356 871
1521 871 -463 379 1090 -112 200 58 -343 35 43 429 7 -102 166 -1087 -642 204 -641 571 567 -933
1541 -933 150 -568 -747 723 132 402 275 -468 -15 43 360 737 277 643 -94 -683 558 -223 218
1560 218 1021 -314 -350 82 -1009 -84 293 -285 -158 -215 -394 -548 -365 383 -80 240 579 -867 -214 466
1580 466 -539 672 735 -211 555 -144 -253 418 127 369 243 -32 -83 -448 33 -236 -333 489 -134 -658
1600 -658 177 -862 -325 535 -706 182 486 -585 95 31 -132 481 374 479 -72 -59 403 -319 502 947
1620 947 -235 262 185 -938 218 -16 -286 493 -256 -575 -506 -481 -16 -278 -30 91 -462 156 -129 -469
$$ packed form
1482g82N72M60m87P13m6M0m89n15R80m05K98P46j453N34J65j220J150L0q69J302
1502G24j078k67M42n25M63L90k95O9m14L74j29j49J184q50j11J247j379n2J227
1521H71j334Q42P11j202L12j42m01L78QL86m22j09K68j253M45Q46q45J212mj500
1541i33J083p18j79J470n91K70j27p43M53N8L17L77m60L66p37n89J241p81M41
1560B18Q03j335l6M32j091R25L77n78J27n7j79j54J83P48m63L20L39j446O53O80
1580D66j005J211O3r46P66o99j09O71k91K42j26k75n1l65M81k69r7Q22o23n24
1600f58Q35j039N37Q60j241Q88L04j071O80o4j63O13j07J05n51J3M62p22Q21M45
1620I47j182M97p7j123J156k34k70P79p49l19O9K5M65k62K48J21n53O18k85l40
$$ plain form
1640 -469 690 -81 79 903 -427 12 630 -334 366 535 -23 288 -109 -77 -163 12 294 -281 -100 186
1660 186 -1128 -379 219 -740 400 183 -699 208 -326 -375 331 87 466 139 -138 255 -199 322 647 20
1680 20 651 73 -400 505 -116 40 834 -279 105 81 -798 -183 -59 -165 112 -249 -193 -599 -451 357 -240
1701 -240 237 554 -465 85 217 -448 559 599 3 485 -138 -96 59 -28 463 83 164 235 -614 -87 -114
1722 -114 -462 394 -172 -496 -22 -794 -249 244 -325 278 164 -252 54 -63 222 408 317 556 -8 -38 472
1743 472 -308 509 577 -329 345 31 -514 211 -10 -126 20 -233 -175 -216 -486 -23 -288 -19 181 -460 85
1764 85 -125 -357 563 216 37 510 -268 95 167 -147 287 294 46 240 -174 170 -255 -329 353 38 -254 78
1786 78 -712 -295 77 -572 139 -50 -250 -4 -419 -172 91 -18 393 56 102 295 -208 409 439 -15 564
$$ packed form
1640d69J159p71J60Q24j330M39O18r64P00J69n58L11l97L2q6J75K82n75J81K86
1660A86j314P49N98r59J140k17q82R07n34m9P06k44L79l27k77L93m54N21L25o27
1680B0O31n78m73R05o21J56P94j113L84k4q79O15J24j06K77l61N6m06J48Q08n97
1701b40M77L17j019N50J32o65J007M0n96M82o23M2J55q7M91l80Q1P1q49N27k7
1722a14l48Q56n66l24M74p72N45M93n69O03j14m16L06j17K85J86r1K39n64l0N10
1743D72p80Q17O8r06O74l14n45P25k21j16J46k53N8m1k70M63k65K69K00o41N45
1764H5k10k32R20l47j79M73p78L63P2l14M34Pk48J94m14L44m25p4O82l15k92L32
1786G8p90M17L72o49P11j89k00K46m15K47K63j09M11l37M6J93n03O17L0m54N79
$$ plain form
1807 564 4 -409 278 -168 -17 473 -310 63 -408 -645 -148 -242 129 45 -387 16 -449 -150 205 -86 146
1828 146 397 -209 24 97 -48 354 302 345 366 -63 65 113 -130 314 -157 172 -52 -638 -37 -82 -334 259
1850 259 -162 -301 156 -444 -292 -37 -189 134 114 -5 276 -132 297 167 108 436 69 4 192 -111 317
1871 317 351 64 312 -144 -354 -35 -165 61 -71 -296 -120 -415 -207 107 -413 76 -15 -302 152 -122 -120
1892 -120 434 296 7 348 -28 181 124 -21 325 -50 201 74 -192 265 -199 -66 97 -231 -38 72
1912 72 -380 -155 -153 -327 14 -39 -148 40 -393 -20 125 -99 452 -87 110 239 -103 350 117 117 519 -25
1934 -25 -185 36 -295 107 45 -145 -30 -454 -295 -339 -279 -94 -43 -289 -79 -445 -136 154 -169 127 162 -104
1956 -104 254 -4 -32 361 222 216 193 -79 35 -111 19 398 -146 80 -54 -506 10 -120 -148 122 -216 -65
$$ packed form
1807E64n60m13O87m46J51M90p83L73m71k37M97r4L71q4m32M03m65K99L55k91K32
1828A46K51o06K33P3j45M02n2M3K1m29J28M8k43M44m71L29k24n86O01m5k52N93
1850B59m21j39M57o00J52K55j52L23k0j19K81m08M29j30n9L28l67o5J88l03M28
1871C17L4k87K48m56k10L19j30K26j32k25J76k95K08L14n20M89r1k87M54k74K
1892a20N54j38k89L41l76K09n7j45L46l75K51j27k66M57m64J33J63l28J93J10
1912G2m52K25Kj74L41n3j09J88m33L73J45k24N51n39J97J29l42M53k33%M02n44
1934b5j60K21l31M02o2j90J15m24J59m4O0J85N1k46K10l66L09K90l23K96L5k66
1956a04L58k58k8L93j39ok3k72J14j46J30L79n44K26j34m52N16j30k8K70l38J51
$$ plain form
1978 -65 -144 -185 -75 -126 -74 49 -103 40 14 8 240 2 30 247 -125 -43 131 -123 361 61 17 121 -177 -248
2002 -248 65 -125 67 -53 -28 -79 -493 -150 -108 -351 90 61 -91 157 -158 24 314 60 264 131 23
2023 23 253 49 235 368 177 358 -60 -127 95 -200 69 103 -322 -49 -125 -320 -40 -255 -31 -21 -244 5
2045 5 -97 -48 76 -119 110 173 68 107 147 -87 109 173 75 349 -69 66 212 -69 88 37 -97 6 -353
2068 -353 -177 -359 -264 -34 -257 -98 97 -279 -42 68 -22 277 -68 194 123 108 214 139 174 306 259 -91
2090 -91 179 -82 168 110 -156 -2 -152 -312 -3 -208 52 -111 -266 -240 -201 0 24 -322 123 62 -109 121
2112 121 -65 271 273 66 232 162 254 294 48 -35 192 122 100 130 -334 -154 -278 -65 -26 -122 -36 -173 -236 -192 -154
2137 -154 -79 82 -110 -53 -98 -59 105 173 231 203 38 145 53 110 355 -129 62 110 -19 74 -35 -154 203 -32
$$ packed form
1978f5p9m1J10n1N2J23j52J43k6oK32k38K8K17l72Q2J74k54M84l00m4J04k98p1
2002b48L13j90J92j20K5n1m14L43M2k43M41k9j52K48l15J82K90k54K04j33j08
2023B3K30k04J86J33j91J81m18o7K22k95K69L4m25K73p6j95K80k15K24J0k23K49
2045Ej02M9J24j95K29O3j05L9M0k34J96O4r8K74m18J35J46k81J57n1j34J03l59
2068c53J76j82R5K30k23J59J95l76K37J10r0K99l45K62p1j5J06p5L5J32m7l50
2090i1K70k61K50n8k66J54j50j60L09k05K60j63j55K6L9K01K4l46M45o1j71K30
2112A21j86L36Kk07J66p0R2M0k46q3K27p0k2L0m64J80j24K13L9r6Q6j37o3M4L8
2137a54P5J61j92N7m5L9J64O8N8k8j65J07r2N7K45m84J91M8j29R3j09j19L57k35
$$ plain form
2161 -32 -219 -69 -226 4 -155 -279 114 -152 -285 1 -117 4 54 12 146 47 21 280 38 283 283 156
2183 156 147 -34 105 117 43 171 40 -256 101 -153 -164 -89 -321 -122 -128 -313 -19 12 -176 -87 -177 52 57 198
2207 198 48 8 86 216 -34 229 239 66 287 -70 -135 201 213 19 -61 -179 -126 -136 -203 191 -58 -171 -16
2230 -16 -341 -104 -27 -187 171 -62 -74 167 -70 94 311 134 389 111 98 69 19 102 -11 101 214 -262
2252 -262 -56 -41 -294 3 -104 -198 -180 -239 -392 -142 -334 -4 3 -145 73 -35 51 2 -52 189 224 -7 262
2275 262 15 88 339 -60 228 137 -178 -129 -224 -231 -61 -51 58 -233 -473 -123 -205 -43 137 -136 -183 11 -261
2298 -261 206 6 48 154 81 -41 119 194 355 46 68 253 -106 124 10 -66 144 -144 -77 55 -389 52
2320 52 17 -168 -126 -157 -21 107 72 8 21 -128 125 11 68 263 -5 69 305 -208 173 280 -19 211 136
$$ packed form
2161c2j87J50j57K30j59j24L93k66j33K86j18J21N0m2J34r9k6K59k42K45%j27
2183A56rj81J39J2p4J28j31k96L57k54j1P5k32J99oj85K94L1j88Q9r0K29NJ41
2207A98j50m0P8J30k50K63J0j73K21l57o5L36J2j94q0j18N3j0o7L94k49j13J55
2230a6l25K37P7j60L58k33j2K41k37J64K17j77K55k78j3k9n0Q3j13J12J13m76
2252b62K06J5k53K97j07r4J8n9j53K50j92L30Pj48K18j08Q6m9n4K41L5k31K69
2275B62k47P3K51l99K88r1l15M9r5pJ70J0J09k91k40L50q2J62J80k73m7J94k72
2298b61M67k00M2J06p3j22J60P5J61l09K2J85l59K30j14p6K10k88O7J32m44M41
2320E2l5j85M2l1J36J28l5o4J3j49K53j14N7J95k68P4K36n13L81J07k99K30p5
$$ plain form
2343 136 -148 63 48 97 -51 62 -81 -149 -126 -3 -197 -41 -122 -256 239 -293 8 177 -144 176 146 -14
2365 -14 269 133 122 328 -24 197 -160 77 164 -141 150 101 -308 -38 -83 -260 191 -237 -323 -73 -175 -203
2387 -203 -222 -140 139 -253 56 -91 -320 375 81 -144 374 -92 70 216 -108 216 376 14 98 133 -48
2408 -48 181 -152 23 -54 -195 199 -231 -184 205 -377 57 11 -110 78 -55 -96 131 -72 129 358 66 -19
2430 -19 4 -181 325 57 272 207 -315 123 17 -151 361 -107 -159 157 -445 -71 -46 -200 -51 -138 -20 104
2452 104 -128 112 -108 -195 389 -153 72 171 -248 319 205 -180 493 76 -90 173 -105 88 59 -356 333
2473 333 -219 -68 -40 -388 -80 60 -384 332 -203 -419 38 -236 131 315 -121 57 -113 -28 76 -5 272
2494 272 119 81 371 42 -104 383 -216 105 264 -350 73 -12 -301 139 -246 -170 -68 -358 -118 -270 -114
$$ packed form
2343A36k84K11j5M9j48J13j43o8K3J23j94J56q1j34M95n32L01J69l21L20l0j60
2365a4K83j36j1K06l52K21l57K37Q7l05K91m9m09K70m5j77M51m28q6K50j02k8
2387b03j9Q2K79l92L09j47k29O95k94k25N18m66J62J46l24L24J60l62Q4L5j81
2408d8K29l33J75p7j41L94m30M7L89n82M34m6j21J88j33m1K27k03K01K29k92q5
2430a9K3j85N06k68K15o5n22M38j06j68N12m68n2L16o02L74K5j54J49q7J18J24
2452A04k32K40k20q7N84n42K25R9m19N67j14l85O73m17j66K63k78J93k9m15O89
2473C33n52J51K8l48L08J40m44P16n35k16M57k74L67J84m36J78j70Q5J04q1K77
2494B72j53l8K90l29j46M87n99L21J59o14M23q5k89M40l85P6J02k90K40j52J56
$$ plain form
2515 -114 244 -291 12 66 -420 201 109 -199 426 49 38 274 -8 -11 269 127 193 -64 -54 51 -469 98
2537 98 -17 -302 326 -337 -147 208 -240 34 94 -335 172 47 -304 55 -14 179 12 -101 312 -168 72
2558 72 413 -192 422 113 -335 289 -63 -55 261 -147 -86 -65 -236 24 -206 -137 -20 -66 163 -39 -264 291
2580 291 -260 -93 554 -174 52 175 -149 196 309 -148 343 -46 95 4 -111 218 -76 -179 271 -270
2600 -270 -85 176 -425 201 -70 -329 321 -157 -411 205 -195 176 142 72 216 -137 189 168 3 445 184
2621 184 -232 488 -231 -17 309 -21 -85 306 -213 -38 -87 -250 -7 -31 111 -158 -222 178 -258 -48 250
2642 250 -257 144 302 -411 232 59 -211 422 49 41 275 -80 230 95 160 131 -296 176 83 -409 327 40
2664 40 -258 410 -388 -26 139 -504 -68 132 -232 98 -215 -6 126 -241 380 -69 -2 416 -256 295 190
$$ packed form
2515a14L58n35L03N4m86O21r2l08O25l77j1K36k82lK80j42O6k57J0J05n20N67
2537I8j15k85O28o63J90L55m48K74O0m29N07j25l51L59o9J93j67j13M13m80K40
2558G2L41o05O14l09m48O24l52QL16m08O1K1j71K60k30O9J17m6K29k02k25N55
2580B91n51J67O47p28K26J23l24L45J13m57M91l89J41r1j15L29k94j03M50n41
2600b70J85K61o01O26k71k59O50m78k54O16m00L71l4p0J44l53L26k1j65M42k61
2621A84m16P20p19K14L26l30o4L91n19J75m9j63K43k4J42k69o4M00m36K10K98
2642B50n07M01J58p13O43j73k70O33l73qK34l55L10j35O5k9m27M72r3m92P36k87
2664D0k98O68p98L62J65o43M36K00l64L30l13K09J32l67O21m49O7M18o72N51j05
$$ plain form
2685 190 -173 427 196 -270 353 -248 -20 203 -140 23 -176 -87 107 -272 -81 174 -356 354 17 -381
2705 -381 467 -174 -174 536 -163 16 245 -348 112 109 157 308 2 169 -78 -314 330 -311 -5 408 -545 -58
2727 -58 156 -338 156 119 -392 222 -57 -110 110 -214 135 -76 37 353 -273 188 54 -342 550 96 -168
2748 -168 496 -115 -57 424 -357 102 177 -84 39 -317 0 39 -287 217 -273 -515 182 -313 35 297 -383
2769 -383 175 230 -465 281 -18 -55 166 -26 76 -13 -37 167 -104 135 255 -320 268 47 -584 295 46
2790 46 -214 278 -438 -155 7 -280 38 -99 28 53 -151 49 35 -178 422 -85 -157 414 -340 203 397
2811 397 -282 492 117 -258 219 -184 -116 -79 -90 125 -173 -209 229 -621 65 213 -407 338 -125 -412 317
2832 317 -328 -131 593 -244 59 178 35 184 15 228 83 -113 310 -124 -245 303 -216 -89 423 -421
$$ packed form
2685A90l63O00k31m66O23o01K28K23l43J63j99Q9J94l79J91K55n30P10l37l98
2705c81Q48o41%P10o99J79K29n93M60lM8J51l06J67k47k36O44o41L06M13r53M87
2727e8K14m94M94l7n11O14k79n3K20l24L49k11J13L16o26M61j34l96Q92m54k64
2748a68O64o11N8M81p81M59P5k61J23l56L17L9l26N04m90k42O97m95L48K62o80
2769c83N58N5o95P46k99l7K21j92J02q9k4K04k71K39J20n75N88k21o31Q79k49
2790D6k60M92p16K83J62k87L18j37J27K5k04K00j4k13O00n07p2N71p54N43J94
2811C97o79P74l75l75M77m03O8L7j1K15k98l6M38q50O86J48o20P45m63k87P29
2832C17o45J97P24q37L03J19j43J49j69K13j45j96M23m34j21N48n19J27N12q44
$$ plain form
2852 -421 19 -27 -405 251 166 -218 9 -237 -91 -108 -159 153 -210 54 452 -407 260 105 -525 479 -58
2873 -58 -200 350 -182 -188 204 -131 197 101 -72 42 -343 54 -28 -492 291 -288 -280 326 -527 35 391 -445
2895 -445 174 174 -279 107 -108 25 304 12 203 -244 -89 348 -260 292 396 -438 190 -7 -608 438
2915 438 4 -225 263 -293 -46 38 -157 146 -153 8 139 -334 195 -106 -307 408 -55 -88 482 -334 169
2936 169 419 -287 199 25 32 247 -312 18 -108 -129 192 -381 -253 164 -402 -6 125 -460 347 59 -211
2957 -211 312 -188 -27 265 -34 283 -68 -15 229 -212 221 263 -310 408 -127 -562 388 -198 19 225 -457
2978 -457 75 2 -416 -97 -53 2 -149 -228 110 -181 -394 290 -346 106 436 -421 282 67 -223 398 -15
2999 -15 -134 250 -182 54 2 -50 254 -45 -40 46 -406 253 17 -446 424 -278 -329 318 -390 -36 156 -149
$$ packed form
2852d21M40m6l78O56q5l84K27k46J46j7n1L12l63K64L98q59O67j55o30J004n37
2873e8j42N50n32oL92l35L28r6j73J14l85L97q2m64P83n79QO06q53N62L56q36
2895d45O19%m53L86k15J33K79k92J91m47J55M37o08N52J04q34O28j97o01J046
2915D38m34k29M88n56K47Q4j95L03k99J61J31m73N29l01k01P15m63l3N70q16N03
2936A69K50p06M86j74PK15n59L30j26k1L21n73J28M17n66L96J31n85Q07k88k70
2957b11N23n00J61K92k99L17l51N3K44m41M33M2n73P18n35m35R50n86K17K06o82
2978d57N32p3m18L19M4N5j51p9L38k91k13O84o36M52L30q57P03k15k90O21m13
2999a5j19L84m32K36n2n2L04k99NQ6m52O59k36m63Q70p02n1O47p08L54J92l05
$$ plain form
3021 -149 177 119 -91 154 -148 119 111 -79 338 -324 -178 378 -301 109 215 -278 191 23 -320 210 -126
3042 -126 33 1 -170 105 -193 -4 26 -218 185 236 -364 291 -29 -197 530 50 -95 422 -231 169 116
3063 116 -81 282 -138 69 140 -283 317 -226 -355 291 -248 -123 349 -389 54 204 -428 349 -173 -184 -23
3084 -23 -144 174 44 -281 308 -170 53 244 -312 222 150 -203 382 -137 -221 430 -199 27 118 -342 114
3105 114 44 -162 96 -305 246 -109 -239 292 -246 -322 324 -146 159 185 -369 246 171 -45 383 -39 162
$$ packed form
3021a49L26n8k10K45l02K67qj90M17o62J46N56o79M10J06m93M69j68l43N30l36
3042a26J59l2j71K75k98J89L0k44M03N1o00O55l20j68P27m80j45N17o53M00n3
3063A16j97L63m20K07P1m23O00n43j29O46n39J25M72p38M43J50o32P77n22j1J61
3084b3j21L18j30l25N89m78K23J91n56N34p2l53N85n19q4O51o29K26R1m60M56
3105A14p0k06K58m01N51l55j30N31n38p6O46m70L05K6n54O15p5k16M28m22K01
$$ [...]
8191A2
##END NTUPLES=NMR FID
##END=
