##TITLE=1H_8-2021
 CDCl3,8 sc, 
 8.02.2021
##JCAMPDX= 6.0         $$ Bruker NMR JCAMP-DX V2.0
##DATA TYPE= NMR FID
##DATA CLASS= NTUPLES
##ORIGIN= UXNMR, Bruker Analytische Messtechnik GmbH
##OWNER= root
$$ XWIN-NMR		Version 3.5
$$ Mon Feb  8 11:32:38 2021 Russian Standard Time (UT+4h)  she@DPX200
##.OBSERVE FREQUENCY= 200.1315066352
##.OBSERVE NUCLEUS= ^1H
##.DELAY= (6, 6)
##.ACQUISITION MODE= SIMULTANEOUS
##.ACQUISITION SCHEME= undefined
##.AVERAGES= 8
##.DIGITISER RES= 18
##SPECTROMETER/DATA SYSTEM= spect
##.PULSE SEQUENCE= zg30
##.SOLVENT NAME= CDCl3
##.SHIFT REFERENCE= (INTERNAL, CDCl3, 0, 15.7039)
##AUDIT TRAIL= $$ (NUMBER, WHEN, WHO, WHERE, WHAT)
$$ ##TITLE= Audit trail, XWIN-NMR		Version 3.5
$$ ##JCAMPDX= 5.01
$$ ##ORIGIN= Bruker BioSpin GmbH
$$ ##OWNER= she
$$ F:/spectra/data/she/nmr/H-F/1/audita.txt
$$ ##AUDIT TRAIL=  $$ (NUMBER, WHEN, WHO, WHERE, WHAT)
(   1,<2021-02-08 11:31:47.14 +0400>,<she>,<DPX200>,
      <created by zg, POWCHK disabled, PULCHK disabled
       configuration hash MD5:
       00 E9 B6 7A A2 85 ED C7 34 08 36 98 17 FE 4E 26
       data hash MD5: 16K
       3A A5 AB B4 4B 8F 78 65 BF CF 82 CA A5 99 3F 2F>)
$$ ##END=
$$ 
$$ hash MD5
$$ 09 BB 73 6D 7C B7 05 AB 7B D6 85 F8 C7 60 B7 BF
##$RELAX= 
##$RELAX= 
##$RELAX= 
##$RELAX= 
##$RELAX= 
##$RELAX= 
$$ Bruker specific parameters
$$ --------------------------
##$DU= <F:/spectra>
##$EXPNO= 1
##$NAME= <H-F>
##$PROCNO= 1
##$TYPE= <nmr>
##$USER= <she>
##$AMP= (0..31)
100 100 100 100 100 100 100 100 100 100 100 100 100 100 100 100 100 100 
100 100 100 100 100 100 100 100 100 100 100 100 100 100 
##$AQSEQ= 0
##$AQ_mod= 1
##$AUNM= <au_zg>
##$AUTOPOS= <>
##$BF1= 200.13
##$BF2= 200.13
##$BF3= 200.13
##$BF4= 200.13
##$BF5= 200.13
##$BF6= 200.13
##$BF7= 200.13
##$BF8= 200.13
##$BYTORDA= 1
##$CFDGTYP= 0
##$CFRGTYP= 5
##$CHEMSTR= <none>
##$CNST= (0..31)
1 1 145 1 1 1 1 1 1 1 1 1 1 1 1 1 1 1 1 1 1 1 1 1 1 1 1 1 1 1 1 1 
##$CPDPRG= <>
##$CPDPRG1= <>
##$CPDPRG2= <>
##$CPDPRG3= <>
##$CPDPRG4= <mlev>
##$CPDPRG5= <mlev>
##$CPDPRG6= <mlev>
##$CPDPRG7= <mlev>
##$CPDPRG8= <mlev>
##$CPDPRGB= <>
##$CPDPRGT= <>
##$D= (0..31)
0 1.2 0 0 0 0 0 0 0 0.06 0 0.03 0 0 0 0 0.0002 0 0 0 0 0 0 0 0 0 0 0 0 
0 0 0 
##$DATE= 1612769506
##$DBL= (0..7)
120 120 120 120 120 120 120 120 
##$DBP= (0..7)
150 150 150 150 150 150 150 150 
##$DBP07= 0
##$DBPNAM0= <>
##$DBPNAM1= <>
##$DBPNAM2= <>
##$DBPNAM3= <>
##$DBPNAM4= <>
##$DBPNAM5= <>
##$DBPNAM6= <>
##$DBPNAM7= <>
##$DBPOAL= (0..7)
0.5 0.5 0.5 0.5 0.5 0.5 0.5 0.5 
##$DBPOFFS= (0..7)
0 0 0 0 0 0 0 0 
##$DE= 6
##$DECBNUC= <off>
##$DECIM= 32
##$DECNUC= <off>
##$DECSTAT= 4
##$DIGMOD= 1
##$DIGTYP= 9
##$DL= (0..7)
0 120 120 120 120 120 120 120 
##$DP= (0..7)
150 150 150 150 150 150 150 150 
##$DP07= 0
##$DPNAME0= <>
##$DPNAME1= <>
##$DPNAME2= <>
##$DPNAME3= <>
##$DPNAME4= <>
##$DPNAME5= <>
##$DPNAME6= <>
##$DPNAME7= <>
##$DPOAL= (0..7)
0.5 0.5 0.5 0.5 0.5 0.5 0.5 0.5 
##$DPOFFS= (0..7)
0 0 0 0 0 0 0 0 
##$DQDMODE= 0
##$DR= 18
##$DS= 0
##$DSLIST= <SSSSSSSSSSSSSSS>
$$ [...]
##$SUBNAM2= <"">
##$SUBNAM3= <"">
##$SUBNAM4= <"">
##$SUBNAM5= <"">
##$SUBNAM6= <"">
##$SUBNAM7= <"">
##$SUBNAM8= <"">
##$SUBNAM9= <"">
##$SW= 16.9725356469052
##$SWIBOX= (0..15)
0 0 2 0 0 0 0 0 0 0 0 0 0 0 0 0 
##$SW_h= 3396.73913043478
##$TD= 16384
##$TD0= 1
##$TE= 0
##$TE2= 300
##$TE3= 300
##$TEG= 300
##$TL= (0..7)
0 120 120 120 120 120 120 120 
##$TP= (0..7)
150 150 150 150 150 150 150 150 
##$TP07= 0
##$TPNAME0= <>
##$TPNAME1= <>
##$TPNAME2= <>
##$TPNAME3= <>
##$TPNAME4= <>
##$TPNAME5= <>
##$TPNAME6= <>
##$TPNAME7= <>
##$TPOAL= (0..7)
0.5 0.5 0.5 0.5 0.5 0.5 0.5 0.5 
##$TPOFFS= (0..7)
0 0 0 0 0 0 0 0 
##$TUNHIN= 0
##$TUNHOUT= 0
##$TUNXOUT= 0
##$USERA1= <user>
##$USERA2= <user>
##$USERA3= <user>
##$USERA4= <user>
##$USERA5= <user>
##$V9= 5
##$VALIST= <valist>
##$VCLIST= <CCCCCCCCCCCCCCC>
##$VD= 0
##$VDLIST= <DDDDDDDDDDDDDDD>
##$VPLIST= <PPPPPPPPPPPPPPP>
##$VTLIST= <TTTTTTTTTTTTTTT>
##$WBST= 1024
##$WBSW= 4
##$XGAIN= (0..3)
0 0 0 0 
##$XL= 0
##$YL= 0
##$YMAX_a= 177820
##$YMIN_a= -190320
##$ZGOPTNS= <>
##$ZL1= 120
##$ZL2= 120
##$ZL3= 120
##$ZL4= 120
##$ABSF1= 10
##$ABSF2= 0
##$ABSG= 5
##$ABSL= 3
##$ALPHA= 0
##$AQORDER= 0
##$ASSFAC= 0
##$ASSFACI= 0
##$ASSFACX= 0
##$ASSWID= 0
##$AUNMP= <proc_1d>
##$AZFE= 0.1
##$AZFW= 0.1
##$BCFW= 1
##$BC_mod= 2
##$BYTORDP= 1
##$COROFFS= 0
##$CY= 11.3945322036743
##$DATMOD= 1
##$DC= 2
##$DFILT= <>
##$DTYPP= 0
##$F1P= 15.9154993809931
##$F2P= -4.1035820241983
##$FCOR= 0.5
##$FTSIZE= 0
##$FT_mod= 4
##$GAMMA= 1
##$GB= 0.15
##$INTBC= 1
##$INTSCL= 1
##$ISEN= 128
##$LB= 0.24
##$LEV0= 0
##$LPBIN= 0
##$MAXI= 10000
##$MC2= 0
##$MEAN= 0
##$ME_mod= 0
##$MI= 1.114404
##$NCOEF= 0
##$NC_proc= 0
##$NLEV= 6
##$NOISF1= 3.799351
##$NOISF2= 2.8
##$NSP= 1
##$NTH_PI= 0
##$NZP= 0
##$OFFSET= 15.70392
##$PC= 1
##$PHC0= -10755.96
##$PHC1= 10.40094
##$PH_mod= 1
##$PKNL= yes
##$PPARMOD= 0
##$PSCAL= 0
##$PSIGN= 0
##$REVERSE= no
##$SF= 200.130013532006
##$SI= 16384
##$SIGF1= 3
##$SIGF2= 2
##$SINO= 400
##$SIOLD= 16384
##$SREGLST= <1H.CDCl3>
##$SSB= 0
##$STSI= 0
##$STSR= 0
##$SW_p= 3612.71676300578
##$SYMM= 0
##$S_DEV= 0
##$TDeff= 0
##$TDoff= 0
##$TI= <>
##$TILT= no
##$TM1= 0
##$TM2= 0
##$TOPLEV= 0
##$USERP1= <user>
##$USERP2= <user>
##$USERP3= <user>
##$USERP4= <user>
##$USERP5= <user>
##$WDW= 1
##$XDIM= 8192
##$YMAX_p= 0
##$YMIN_p= 0
$$ End of Bruker specific parameters
$$ ---------------------------------
##NTUPLES= NMR FID
##VAR_NAME=  TIME,          FID/REAL,        FID/IMAG
##SYMBOL=    X,             R,               I
##VAR_TYPE=  INDEPENDENT,   DEPENDENT,       DEPENDENT
##VAR_FORM=  AFFN,          ASDF,            ASDF
##VAR_DIM=   8192,          8192,            8192
##UNITS=     SECONDS,       ARBITRARY UNITS, ARBITRARY UNITS
##FACTOR=    0.0002944,     1,               1
##FIRST=     0,             0,               0
##LAST=      2.4114304,     0,               0
##MIN=       0,             -190320,         0
##MAX=       2.4114304,     177820,          0
$$ Real data points
##PAGE= N=1
##DATA TABLE= (X++(R..R)), XYDATA
0 0 0 0 0 0 0 0 0 0 0 0 -7 8 -8 8 -8 16 -16 24 -24 32 -39 40 -48 61 -72 80 -95 109 -125 143 -162 183 -207
33 -207 236 -263 297 -333 371 -412 460 -512 567 -626 694 -766 845 -931 1026 -1129 1241 -1366
51 -1366 1504 -1659 1832 -2026 2243 -2497 2785 -3126 3532 -4026 4634 -5410 6436 -7854 9931
66 9931 -13263 19397 -34129 132943 91724 -190320 177820 -50379 1564 133471 -89080
77 -89080 55777 72092 -137622 93438 17271 -64377 80458 -79845 31707 -5846 -81511
88 -81511 71216 -14953 -49108 38723 -5668 -44848 68348 -58293 44376 66882 -107893
99 -107893 107339 20960 -73954 104374 -2578 -28963 96722 -79337 41769 70727 -128725
110 -128725 117373 -23734 -50833 69804 -74576 47467 -8590 -57938 68480 -32266
120 -32266 -42369 62412 -58561 23776 13827 -66812 85786 -56019 -18283 52138 -41201
131 -41201 -1874 10756 -14014 -7672 10546 -41369 30604 -12149 -39108 34067 -21632 -11682
143 -11682 1764 -3037 -2689 3818 -25582 32365 -10168 -26210 50221 -43569 35040 -8375 -21432
156 -21432 56608 -45205 9961 33119 -31958 13691 15747 -29832 41211 -27257 -4691 42832
168 42832 -52265 34213 -10264 -7277 15537 -26818 18769 -6724 -15648 3642 3341 -24699 12037
181 12037 -16925 -5438 7177 -33026 18659 -13252 -10561 -1111 4044 -13560 2810 5445 -16399
194 -16399 28405 -28472 18869 9924 -19864 26055 -8577 4458 9757 -6310 4155 15733
206 15733 -25153 24138 -3850 -18574 32397 -35388 23389 -4534 -17812 24888 -17572 1435
218 1435 9571 -7430 219 14420 -18962 22339 -4956 -7522 25907 -21695 18806 -2917 -377
231 -377 7202 -560 -777 4195 3774 -12152 20564 -19002 10182 3279 -13283 16197 -10818 3324
245 3324 3450 -867 -5332 15020 -15280 9639 7244 -19791 28144 -21917 10465 5361 -14926
258 -14926 14953 -6566 -4433 6091 -2550 -10118 15797 -20830 9832 467 -19276 21311 -21129
271 -21129 6027 -451 -8053 3091 -2485 -5536 1541 2125 -14194 17417 -16537 5066 3235 -11875
285 -11875 12915 -10123 4090 823 2076 -6780 11424 -6461 770 11471 -16188 20780 -12831
298 -12831 4488 8402 -8805 7625 291 -267 1474 6487 -10854 17781 -10916 2666 11544
311 11544 -17195 18095 -10594 4072 4113 -5086 2277 3222 -4073 -312 8727 -12733 16592 -9964
325 -9964 3971 7680 -11411 12156 -6278 3512 -111 2959 -5339 5147 -4496 -4543 8198 -16938
339 -16938 11279 -11332 -2789 975 -9473 812 -4749 -2362 -6428 6071 -14705 10057 -6475
352 -6475 -5203 11851 -15360 13217 -5528 2131 5341 -592 2290 5883 887 -1413 12621 -11745
366 -11745 13861 -5207 492 8727 -10530 10265 -4684 2950 -1951 3909 -2822 4110 496 -3678
380 -3678 12327 -11365 11386 -1395 1011 5218 -1573 4997 -555 3558 -4744 11233 -10492 6404
394 6404 900 -7832 10695 -12945 8137 -4254 -4115 1440 -892 -4210 74 1491 -6868 9252
408 9252 -13032 10108 -3952 -5207 8696 -8508 6952 -5551 4076 -1575 1692 -3389 1650
421 1650 2887 -9225 8483 -8053 4058 -5723 -1547 400 -4934 -885 -5794 4779 -13568 4711
435 4711 -8521 -2584 -828 -11873 7489 -12549 -348 -3218 -2248 -2432 -1419 -1449 956 1908 -7180
450 -7180 14821 -8989 7130 2867 -511 10736 -6375 11825 -328 4077 -19 4975 2140
463 2140 -2039 3786 -2824 4906 -8958 5470 -4060 -408 -815 -3001 5873 -8402 7650 -5229
477 -5229 7643 -2765 9 10081 -7009 8327 -1735 4313 509 1299 -870 3248 -3442 -4510
491 -4510 6808 -12296 5944 -10359 1093 -1917 -10917 8200 -9451 3122 -2542 1825 2554
504 2554 1640 2334 6139 6372 -1473 13371 -1494 10654 1134 5505 7276 -2776 9261 -5725
518 -5725 8486 -6665 943 1752 -6076 1970 -5974 1944 -5744 57 -4162 2785 -4132 1214 2781
533 2781 -5236 10014 -8269 11952 -2400 283 8765 -5474 7447 -3520 3771 -1016 -80 -3200
547 -3200 2031 -3170 -4151 2559 -7279 5709 -9607 4508 -4232 -3562 4067 -7706 7271 -6592
561 -6592 3451 -623 -356 1020 -2725 1723 -3606 1761 -4523 2546 -6921 1506 -3988 -3791 1562
576 1562 -11098 6993 -10196 1302 -2593 -5756 3882 -7124 3299 -3066 263 -1987 1938 -3492
590 -3492 3010 -522 -2396 6270 -8083 10175 -5893 3842 3338 -3962 8567 -5158 6737 -1166
604 -1166 3938 1467 2898 2707 1473 3986 -1629 6269 -3444 6565 -3253 3592 1882 -3959 6909
619 6909 -8231 7489 -5583 433 1610 -4710 3400 -3845 1734 -2356 1597 -3494 4690 -3997
633 -3997 1513 1987 -5574 8614 -9057 7563 -2868 -2068 4125 -5243 3978 -4484 1656 -3104 1438
648 1438 -3696 1056 -910 -3250 2791 -5300 5391 -6727 4710 -2079 -493 3360 -5024 7932
662 7932 -6255 4807 -954 365 2050 -2223 3578 -1866 1603 -2182 4589 -5229 4626 -2221 -968
677 -968 4907 -7916 9225 -6140 2777 893 -1376 3848 -2948 3421 -1173 3170 -2875 4905 -2096
692 -2096 1659 1178 -2193 6072 -6559 6581 -3665 2634 -380 -1848 4766 -5652 4989 -4002
706 -4002 3180 -2281 -288 977 -1678 519 -3084 3284 -5957 4514 -5522 1978 -708 -5368 5953
721 5953 -8139 4416 -4243 456 225 -3014 1427 -1771 1238 -3347 4140 -4559 4084 -2305 367
736 367 3250 -5489 6461 -5079 4176 -2420 921 1601 -2785 3321 -3543 4368 -4105 2943 -1362
751 -1362 1123 466 -1086 3516 -4051 5370 -4594 5553 -2143 454 4521 -3989 6516 -3641 5228
766 5228 -742 1405 1245 480 1324 -1378 3782 -4137 4656 -5131 2844 -942 -3215 3851 -6378 4348
782 4348 -5274 1484 -1760 -1404 300 -2846 2067 -4451 3235 -4405 2880 -2783 458 1200 -3480 4362
798 4362 -5261 4776 -4595 2176 -785 -2053 2562 -5011 3501 -4618 2200 -2567 546 -918 -850
813 -850 1412 -3273 4593 -4945 5379 -3020 2070 2647 -2790 6297 -3806 5395 -1551 2917 403
828 403 993 1516 -824 3454 -3570 4976 -4358 3343 -1596 -1121 2716 -4371 4275 -5190 3488 -3171
844 -3171 566 62 -2088 2490 -3886 3785 -3450 2848 -2189 1793 -398 -1138 2720 -3918 5246 -5264
860 -5264 3824 -1834 -1213 2467 -4466 3649 -4558 2391 -2701 515 -2054 -325 -373 -3443 2721 -5521
876 -5521 3915 -5018 1367 -596 -3077 2864 -4311 4576 -3554 2562 164 944 539 -935 4088 -2304
892 -2304 4394 -2679 3958 -1212 1343 1472 -1651 3921 -4819 5258 -3849 1933 131 -1452 3082
907 3082 -3124 4059 -2073 3051 -1465 3018 219 1055 2875 -1484 6146 -3991 6208 -1522 1533
922 1533 2175 -2406 4400 -4052 2875 -3075 1106 -2483 -1164 -416 -3351 801 -5000 2567 -5587 1857
938 1857 -2584 -629 1430 -4165 4920 -4681 4215 -1927 1313 987 -1521 3355 -2604 2803 -2972
953 -2972 2413 -2769 1134 -1983 -1524 1383 -5596 4221 -5691 2401 -2126 -1159 2476 -3569 3791 -2594
969 -2594 3331 -1257 2627 311 1734 1707 -435 4554 -3532 5562 -3166 2945 92 -1293 3538 -3970
985 -3970 3991 -4287 2540 -1772 -356 744 -1751 2298 -2359 3238 -2604 3467 -2215 2230 -9
1000 -9 -1841 3777 -4640 5078 -3931 2109 -576 -2099 2091 -3486 2312 -3073 1373 -2335 1378 -2537
1016 -2537 -1 135 -3425 3682 -5368 4061 -3611 719 459 -3248 3283 -4465 3052 -2831 1418
1031 1418 -1343 37 -29 -1514 2152 -2905 3395 -3734 3502 -2071 990 1456 -2828 5128 -3831 5083
1047 5083 -1898 1230 1047 -1187 2468 -2046 2737 -1671 2549 -2041 2742 -1161 115 2839 -3788
1062 -3788 4995 -4409 3835 -1265 -249 2804 -2751 3727 -2523 2911 -1390 1929 -478 897 336
1077 336 -1417 2681 -3865 3973 -3992 2341 -1745 -1602 2494 -4338 3022 -4307 1973 -1769 -683
1092 -683 279 -2050 1164 -2277 1308 -3125 2618 -2760 2030 -691 -2142 3472 -4814 4524 -3523
1107 -3523 2148 -155 -1399 1835 -2632 2429 -1989 1669 -1688 2590 -1413 1129 1150 -2197 3746
1122 3746 -3207 4931 -2460 1867 1031 -1073 3993 -2814 3532 -1909 1918 -400 596 310 -199 1831
1138 1831 -1653 3223 -2989 3784 -1893 1265 1390 -2734 4211 -3994 3741 -2538 1202 66 -1817
1153 -1817 1416 -2217 1601 -2729 2030 -3150 1557 -1872 -609 1803 -3942 3727 -4496 2868 -875
1168 -875 -216 959 -2008 2790 -3002 2430 -1261 1371 -1308 248 -322 -1054 2170 -3324 3372 -3072
1184 -3072 2008 -538 452 1883 -3160 3348 -3302 2287 -1325 1105 793 -368 1980 -1139 2256
1199 2256 -2053 4562 -1708 3239 290 -904 3330 -2993 4373 -2323 2303 -77 -549 1477 -2015
1214 -2015 1720 -932 2234 -2266 2266 -1452 201 -79 -1752 3746 -3567 3719 -3454 2146 312
1229 312 -1753 1893 -1918 3056 -1527 1697 -743 118 -131 -280 607 -2029 2637 -3893 2139 -2040
1245 -2040 77 345 -1814 3445 -3801 1687 -1920 1620 -618 -97 865 -1232 2155 -2109 3168 -2438
1261 -2438 1802 -293 -290 1931 -2671 3914 -2850 2823 -1605 942 960 -836 2170 -1669 1359 -1457
1277 -1457 2816 -907 1478 168 -10 2788 -1997 3851 -2261 3251 -320 323 1601 -2184 3882
1292 3882 -2216 2739 -1091 700 428 -412 687 -1233 1745 -2885 2856 -2393 716 -319 -2033
1307 -2033 1423 -3651 2037 -3307 1452 -1699 -434 -537 -1861 973 -2208 1474 -2287 1691 -1283
1322 -1283 -496 376 -1751 2929 -3009 2729 -2044 1293 -201 -1093 1349 -2289 2628 -2152 1728 -1932
1338 -1932 1705 -666 -405 1472 -1714 3054 -2571 2746 -629 1017 1094 -586 2593 -2555 1952 -1024
1354 -1024 1394 -513 760 616 -794 2267 -1393 2573 -2670 1905 -98 1 1764 -1950 2717 -2397
1370 -2397 2615 -1309 466 611 -501 2034 -1306 2283 -1523 2229 -1136 1374 141 -462 1838
1385 1838 -2469 3173 -2672 1842 -1352 -359 1080 -2417 1602 -2622 1628 -2126 536 -1140 -774
1400 -774 65 -2051 1734 -2850 2327 -2448 730 -87 -1102 2197 -2541 2699 -1670 1540 -1330 -41
1416 -41 82 -916 1338 -1571 2204 -1802 2141 -790 908 300 -1110 2821 -2704 2114 -1385 1392
1432 1392 -133 -879 1518 -1302 1541 -1749 1919 -1345 1194 -294 35 861 -2045 2512 -3117 2214
1448 2214 -2139 -103 287 -2234 1939 -2814 1515 -2255 759 -957 -385 -5 -1310 1003 -2167 1748
1464 1748 -2442 1574 -1104 -295 1059 -2180 2428 -2887 1806 -1314 408 423 -1165 1441 -1418 1456
1480 1456 -1843 1628 -1371 1329 -499 -504 1472 -2519 2851 -2551 1803 -561 -248 1259 -1532 2141
1496 2141 -1642 1625 -991 1205 -370 550 531 -690 1972 -1966 2782 -1778 1707 31 -646 2095
1512 2095 -2252 2666 -1541 1737 -388 310 775 -596 1153 -1199 1596 -1957 2064 -1633 691
1527 691 -39 -1518 1966 -3002 2251 -2265 534 -240 -1241 950 -1917 948 -1973 1025 -1636 526
1543 526 -1106 -303 528 -1933 1916 -2918 2085 -1986 483 115 -1785 1718 -2207 1680 -1396 1100
1559 1100 -475 249 299 -648 1420 -1417 2437 -1577 2219 -950 757 1651 -1301 2859 -1785 2428
1575 2428 -710 953 639 -40 1161 -938 2173 -1445 2135 -973 1553 26 112 2084 -1683 2849
1591 2849 -2021 1979 -517 146 1108 -1172 1774 -1422 1526 -962 743 -791 -24 49 -1223 1340
1607 1340 -2192 1862 -2302 974 -660 -1018 1399 -2543 2077 -2196 601 -1062 -430 -256 -1017 278
1623 278 -1549 1096 -1950 1589 -1752 548 -128 -1237 1811 -2596 1999 -1801 881 -106 -459 692
1639 692 -1258 1401 -1452 1361 -1186 1389 -845 260 991 -1160 2110 -2253 2305 -1374 765
1654 765 439 -808 1648 -1839 1753 -1152 1351 -486 325 131 -100 798 -1337 2001 -1919 2049
1670 2049 -680 924 1593 -2138 1981 -2459 1691 -875 246 342 -79 770 -1500 1170 -1334 1569
1686 1569 -1767 1230 -199 -303 1248 -2105 2186 -1887 1214 -865 -165 414 -1537 1734 -1533 884
1702 884 -1802 884 -1110 -104 103 -1154 1539 -1524 2692 -2204 901 -397 -469 989 -1981 1790
1718 1790 -1418 1509 -538 1120 638 151 1155 -209 1394 -1623 2250 -851 1340 921 -164 1553
1734 1553 -1746 2443 -1370 1555 385 211 952 -271 1122 -1731 1768 -1028 1354 -818 216
1749 216 216 -1589 1819 -1980 1474 -2185 580 -897 -1230 882 -1940 621 -2121 73 -1398 281
1765 281 -885 -341 1148 -1584 1781 -1925 1381 -546 85 719 -992 1735 -2127 1965 -966 615
1781 615 -8 175 908 -452 1800 -1238 1424 -1960 1178 -192 -293 772 -1532 1898 -1859 1568
1797 1568 -814 85 671 -690 1300 -1039 1702 -1064 1477 -503 530 456 -701 1565 -1751 1919
1813 1919 -1728 1263 -174 -375 1155 -1424 1387 -1496 1153 -986 772 -290 -74 989 -1197
1828 -1197 1779 -1807 1845 -1521 559 137 -971 1095 -1866 1420 -2002 742 -837 -324 -190 -1713
1844 -1713 595 -2071 656 -2039 796 -1391 -459 -115 -1609 1123 -2276 1425 -1707 563 -218 -795
1860 -795 1048 -1003 1408 -1034 1157 -825 805 89 -164 1105 -1150 2073 -1558 1730 -486 511
1876 511 969 -810 2014 -1231 2092 -534 1163 -233 475 798 -611 1427 -1241 1680 -1482 1156
1892 1156 -420 -171 511 -1562 1726 -1653 1268 -1015 251 3 -833 730 -1253 1204 -1423 1214
1908 1214 -1143 462 -81 -958 1156 -2185 1503 -1867 860 -723 -492 599 -1461 1444 -1644 975
1924 975 -1014 474 -474 -229 455 -1138 1616 -1661 1484 -1337 545 55 -829 1384 -1603 1741
1940 1741 -1305 942 -592 195 199 -600 898 -1403 1627 -1145 1380 -741 560 580 -817 1954 -1189
1957 -1189 2160 -1009 1030 89 -115 1099 -532 1556 -842 1396 -973 995 -198 -62 996 -1004
1973 -1004 1710 -1589 1581 -830 344 476 -930 1293 -1730 1308 -1123 730 -646 62 117 -1042
1989 -1042 712 -1534 1385 -1751 1024 -646 -405 680 -1374 1651 -1895 1366 -959 279 -47
2004 -47 -552 891 -1121 1105 -968 1406 -736 673 77 -367 999 -1373 1976 -1582 1145 -403
2020 -403 -43 720 -930 1305 -1041 1493 -708 998 -85 504 388 -862 1626 -1381 1903 -1135
2036 -1135 764 -370 -751 1119 -1660 1652 -1340 741 -848 -67 -85 -668 575 -1340 1201 -1935
2052 -1935 867 -1145 -134 303 -1424 992 -1905 1124 -1679 372 -264 -663 394 -1444 704 -1273
2068 -1273 1051 -1240 407 -797 -342 386 -1462 1302 -1727 1404 -1335 398 14 -805 1320 -1116
2084 -1116 1258 -706 897 -296 487 317 -269 1264 -1011 1927 -951 1575 -421 54 1095 -767
2100 -767 1818 -1364 1583 -655 584 44 -261 777 -766 1237 -1066 1164 -1171 1049 245 -152
2116 -152 1293 -1278 1840 -1013 1573 -189 170 576 -785 1280 -1195 1204 -806 1278 -601 200
2132 200 235 -1080 1117 -1847 1533 -1648 872 -603 -683 578 -1262 1520 -1806 1101 -1023 92
2148 92 -168 -474 569 -897 1336 -1740 1066 -1079 210 46 -1207 1148 -1632 1142 -1346 512
2164 512 -311 -382 542 -869 1266 -1208 1219 -968 883 -316 72 763 -535 1820 -1343 1732 -711
2181 -711 690 575 -301 1364 -851 1665 -865 915 -449 808 -48 -546 716 -1444 1261 -1678
2197 -1678 1068 -999 -39 268 -1345 1142 -1690 920 -1139 344 -348 -302 412 -844 850 -1283
2213 -1283 1192 -1400 564 -428 -260 683 -1367 1385 -1471 939 -860 56 94 -702 517 -759 921
2230 921 -891 761 -570 603 100 -583 1052 -1297 1603 -1027 847 132 -112 902 -630 1271
2246 1271 -1048 1030 -594 418 -373 -198 418 -867 1282 -1510 1215 -779 390 82 -407 1125
2262 1125 -1298 1152 -1108 849 -151 262 563 -549 1126 -841 1046 -998 807 -911 139
2277 139 369 -1115 1226 -1742 1219 -1300 620 -65 -754 691 -1190 890 -1388 892 -963 22
2293 22 -432 -392 528 -1205 1273 -1736 666 -768 -172 156 -1121 702 -1416 838 -1195 449 -345
2310 -345 160 462 -432 1113 -572 1439 -763 881 -100 153 1073 -666 1631 -1173 1171 -363 436
2327 436 487 -222 923 -1052 1121 -917 1149 -547 230 96 -547 723 -1209 1392 -1359 888 -93
2344 -93 -22 753 -915 1099 -1085 863 -1048 494 -553 -208 396 -990 703 -1740 936 -1395 311
2361 311 -74 -389 624 -1228 936 -1404 745 -458 28 501 -475 714 -943 1206 -784 1084
2377 1084 -435 153 351 -862 1158 -1236 853 -973 253 -64 37 508 -1040 834 -965 1389
2393 1389 -979 723 -41 53 1005 -147 1781 -728 1404 -424 158 613 -383 955 -256 1056 -468
2410 -468 639 -209 244 30 -709 985 -685 1258 -1613 734 -365 -49 401 -781 792 -1358 689
2427 689 -979 -129 -56 -106 -157 -766 1125 -1277 503 -1443 7 178 -671 399 -1351 740 -638 462
2445 462 -676 -278 457 -887 634 -1196 356 -597 -290 -284 -387 739 -797 426 -1220 998 -1336
2462 -1336 706 367 -628 46 -1372 1378 -422 429 -744 469 657 578 775 -1287 904 -741 796
2479 796 -999 215 564 -677 957 -696 1094 -1257 1175 -61 -12 580 -560 937 -894 1186
2495 1186 -738 750 -439 -17 609 -910 978 -1101 1039 -747 183 180 -575 536 -1051 865 -1067
2512 -1067 605 -696 150 -194 -693 623 -883 1079 -1029 937 -280 -238 383 -615 906 -899 1002
2529 1002 -451 543 127 -165 667 -481 780 -809 958 -682 684 -35 -298 884 -1056 1091
2545 1091 -751 746 -523 223 542 -520 991 -584 999 -384 651 -217 431 714 -339 1265
2561 1265 -922 846 -672 477 -85 -289 593 -844 810 -1121 256 -614 -45 -221 -354 226 -721
2578 -721 820 -948 789 -802 204 246 -569 617 -992 801 -988 509 -182 -299 104 -560 577
2595 577 -917 536 -945 11 -569 9 92 -993 772 -1216 774 -644 449 42 -568 993 -548
2612 -548 1055 -708 953 -325 467 105 -136 904 -730 1070 -695 873 -270 4 538 -777
2628 -777 957 -891 832 -550 692 40 -25 572 -496 1000 -791 1032 -377 630 -80 -165 612
2645 612 -850 1103 -1096 733 -501 71 103 -515 372 -802 719 -624 416 -642 -198 -217 -641
2662 -641 757 -1163 766 -947 531 -199 -467 485 -834 846 -887 802 -549 104 -69 -95 276
2679 276 -698 695 -915 711 -573 585 202 -512 680 -871 758 -530 570 -66 -37 426 -219
2696 -219 731 -594 747 -457 460 -225 243 394 -573 1079 -628 1100 -835 382 327 -248 872
2713 872 -544 579 -475 364 -659 364 -36 -180 610 -755 718 -991 522 -219 -68 170 -559
2730 -559 642 -1033 927 -1143 450 -588 -41 400 -557 313 -1128 953 -1190 231 -401 -424 557
2747 557 -858 1094 -953 834 -564 147 193 -254 505 -498 447 -505 846 -686 245 116 -284 584
2765 584 -602 359 -1135 1248 -87 28 368 -614 882 -529 665 -286 334 -784 414 672 -358
2782 -358 634 183 957 -436 705 506 -257 645 -900 636 -765 754 -570 -110 -35 -414 367 -447
2800 -447 6 -911 267 -207 1483 -286 -668 1406 -349 792 -439 242 -181 -862 351 -1144 511
2817 511 -817 645 -985 1583 -1319 -1319 -405 -833 766 -1383 338 -387 -136 -173 -287 424 -886 680
2835 680 -630 -76 180 -144 300 -1483 390 -1285 338 -376 620 33 -508 -40 -663 445 -941 578
2853 578 -69 217 4 -521 668 -675 1590 19 1246 -519 206 352 -696 487 -897 865 -1564
2870 -1564 351 17 1354 15 -690 518 64 306 -336 789 294 -257 62 -455 266 -776 1180
2887 1180 -600 -240 -23 -1524 249 -1848 1166 -1825 -1053 -191 621 -740 580 -386 -1308 1565 -953
2904 -953 1289 -358 159 384 -557 678 -862 541 -1087 1484 901 -200 428 -937 1028 -248
2920 -248 740 -382 1142 -38 536 534 -274 1385 -686 303 116 68 404 -43 975 -515 1129 -580
2938 -580 749 -484 406 400 -770 565 -1188 1041 -641 698 -206 119 62 -1032 432 -629 538
2955 538 -732 206 161 148 -55 -794 531 -629 1057 -372 360 41 -516 511 -1211 963 -1487 737
2973 737 -470 -240 -158 -658 761 -1125 966 -827 510 -500 39 217 -301 1057 -732 935 -632
2990 -632 594 -169 -156 868 -302 1151 -380 786 32 788 -256 280 468 -504 671 -589 580
3007 580 -790 -59 668 -218 1098 -984 563 -263 550 -391 -362 394 -729 337 -642 834 -920 966
3025 966 -406 -315 901 -776 649 -836 219 -446 -259 45 -834 622 -1547 71 -748 24 -613
3042 -613 -58 706 -751 522 -216 359 -754 738 -130 -272 334 -734 433 -464 457 8 226 -63
3060 -63 -186 56 -333 817 -441 344 -253 475 441 -686 294 -474 825 -437 406 -219 245 327 -180
3079 -180 825 -73 1154 -762 738 -138 -220 287 -359 675 -1137 1139 -1128 210 -116 -212 504 -658
3097 -658 1033 -703 726 -803 28 -123 -306 456 -819 1017 -970 306 -748 19 -133 -648 887
3114 887 -1070 607 -879 366 97 564 554 -222 678 -865 348 -905 521 61 305 573 -793
3131 -793 662 -730 822 -525 -26 -331 -464 228 -969 457 -438 289 -558 88 -788 -620 1175 -252
3149 -252 1541 -490 938 -415 -54 -263 -53 724 -1221 585 209 75 -304 510 466 -233 641 -832
3167 -832 589 -998 258 -33 -332 348 -861 564 -677 761 -410 201 171 453 178 -379 756
3184 756 -336 424 -51 446 61 -586 659 -812 1119 -593 -219 62 -211 686 -887 553 -819
3201 -819 348 -497 348 271 512 555 -451 491 -1220 589 12 166 466 -257 905 -720 626 -484
3219 -484 756 46 -80 -2 -430 42 -210 1145 -575 193 -418 -182 36 -678 949 -798 855 -661
3237 -661 1067 57 438 110 -159 476 -667 584 -388 453 -395 -674 291 -715 725 -982 798
3254 798 -262 -13 128 114 938 -202 394 -867 368 -46 335 -534 -1013 275 -880 385 -687 144
3272 144 604 485 378 -989 223 -1809 688 100 467 114 -415 224 91 447 -846 376 -230 369
3290 369 915 -771 193 -206 957 -81 896 -651 192 558 -735 -738 -390 720 385 559 -187 -4 442
3309 442 -985 811 -852 26 -1159 39 -182 -540 441 -574 719 -969 270 -597 -165 -179 -366
3326 -366 168 -1028 -463 -376 611 -356 -177 288 -646 672 -780 1134 -827 91 -558 73 -170 -163 396
3345 396 -1133 359 -600 117 -486 -514 108 -659 1037 -691 324 -416 132 744 -665 474 -273 879
3363 879 -138 339 -112 100 343 -34 722 -604 727 -801 423 39 -59 502 -222 1064 -351 784
3381 784 -154 567 -694 -472 709 -587 559 -548 670 -343 289 147 -520 804 -670 758 -167
3398 -167 597 90 -9 201 -391 499 -656 1095 -312 208 -240 -275 -57 -617 434 -898 272 -704 153
3417 153 -45 -141 476 -662 335 -738 188 -644 -170 -536 -3 451 -728 721 -741 511 -79 626
3435 626 -59 -689 458 -237 550 -766 184 10 -327 288 -29 551 -619 930 -275 342 1 -238
3453 -238 695 -785 662 -1095 382 299 165 483 -257 641 -841 653 -657 -48 -291 -138 -38 -495
3471 -495 537 -511 586 -1189 -338 -860 -166 32 -1096 -184 -816 587 -388 246 -246 285 179 -747
3489 -747 369 -402 580 -625 -90 294 -485 445 -1028 549 -737 529 -279 -448 376 -596 346 -511
3507 -511 288 -190 676 -259 -759 308 -525 617 -301 457 -334 417 97 11 373 -80 571 -613 412
3526 412 -122 149 166 -468 651 -553 433 -555 553 381 51 24 -172 341 -624 424 -305 337 32
3545 32 164 112 -514 -145 -1043 -25 -652 -57 -476 -672 180 -797 856 -1196 375 -927 -151 -342 51
3564 51 45 23 993 -467 123 -451 -364 91 -112 66 -565 -135 -1155 215 -1211 85 -214 -924 405 -571
3584 -571 1157 -596 407 -172 -617 724 -469 877 -257 874 -139 -455 487 -16 1152 -919
3600 -919 601 -398 588 -22 701 -191 -792 955 97 706 -726 -306 -588 -199 -6 372 810 -918 123
3619 123 -892 441 -207 334 286 -503 850 -529 91 -784 305 -141 -364 226 -1021 721 -304 150
3637 150 -432 -436 128 -569 -240 -530 -19 -323 242 24 -39 797 -17 432 -218 276 -1132 313 -452 -35
3657 -35 452 -300 602 -325 446 -112 453 -308 -368 455 -700 593 -687 430 -185 307 582 -111 681
3676 681 -402 600 -231 664 -417 -52 407 -330 383 -580 610 -600 193 -211 -23 254 -504 600
3694 600 -424 599 -547 345 388 -418 248 -623 631 -704 405 -289 116 -83 -321 664 -532 389
3712 389 -987 642 -614 235 -89 -500 190 -628 490 -414 297 -176 52 229 -73 221 -549 520
3730 520 -248 201 -295 7 263 -506 934 -633 368 -393 169 196 -268 673 -560 476 -449 325 -132
3749 -132 191 78 -232 593 -548 551 -603 290 -201 105 128 -622 422 -678 578 -209 150 3
3767 3 57 391 -415 449 -425 367 -460 125 -194 -96 446 -633 667 -594 317 -345 86 63 -321 321 -532
3788 -532 373 -173 126 -118 -52 93 -547 428 -511 717 -767 369 -10 -51 488 -495 694 -517 533
3807 533 -425 257 8 -9 144 -419 493 -229 661 -154 136 275 -35 561 -383 732 -531 373 -301 -202
3827 -202 218 -269 349 -378 537 -388 244 0 235 274 -332 491 -536 390 -338 -38 91 -76 212 -645
3847 -645 573 -665 376 -356 -10 -143 -485 262 -597 362 -589 317 -495 -78 -85 -271 208 -793 577
3866 577 -506 124 -292 -236 109 -291 244 -772 406 -39 102 5 -316 -16 -551 281 -639 463 -723
3885 -723 111 122 -158 481 -310 939 -811 244 -275 193 273 -311 400 -217 -127 -788 258 -38 -72 719
3905 719 -1191 375 -1033 311 -1091 275 471 -344 86 -7 714 -383 -331 -434 1227 54 -231 661
3923 661 -800 354 -796 -186 -795 -313 112 -337 784 58 282 -695 506 19 -196 326 -785 169
3941 169 -64 477 -435 446 108 64 -48 -882 -119 -1014 280 -358 -623 -94 -380 244 -417 1257 -743
3960 -743 -893 -202 -318 -551 -161 1130 26 182 -403 785 544 24 -63 -434 140 -320 564 -771 701
3979 701 596 247 196 71 427 -759 61 -723 -132 302 -301 733 -89 135 -121 450 347 -244 554 -256
3999 -256 961 -431 447 -871 521 -198 100 424 -836 122 -695 -258 -337 466 -749 -692 -135 -322 -138
4018 -138 -715 -137 -800 252 -33 -231 710 -252 466 -737 780 -635 95 192 -148 618 -736 959
4036 959 -613 832 240 235 762 -598 283 -585 153 -133 4 -175 -70 482 -338 250 -270 460 -263 322
4056 322 108 -158 394 -454 519 -700 500 -206 98 98 -126 586 -562 507 -524 173 -206 -109 133
4075 133 -556 316 -642 483 -549 106 -146 -63 121 -726 634 -573 281 -303 179 78 -328 141 -563
4094 -563 719 -421 464 -312 -13 65 -398 155 -38 690 -566 533 -41 112 152 -232 646 -376 297
4113 297 -349 198 -7 199 38 -358 447 -715 278 -197 476 82 336 232 -658 934 -512 640 -145
4132 -145 191 371 -420 221 -469 505 -220 148 25 184 778 -177 275 -731 150 18 113 -239 -20 134
4152 134 -83 264 -948 122 -579 694 20 51 102 -469 294 -268 297 -187 11 -114 -476 738 -575
4171 -575 510 -431 384 -113 -186 483 64 167 -297 665 -787 108 35 31 375 -286 449 -360 610 -269 63
4192 63 338 -27 382 -401 708 -270 454 -267 2 180 -48 396 -395 676 -352 413 -279 194 269 -205
4212 -205 559 -504 576 -342 19 14 -63 301 -305 302 -734 283 -535 110 55 -72 165 -517 352 -491
4232 -491 269 -338 95 92 -204 22 -511 347 -398 320 -349 -103 -62 -410 326 -727 338 -297 239 -194
4252 -194 -227 263 -632 484 -330 330 -135 189 159 -312 367 -204 539 -202 559 -261 217 -15 -395 464
4272 464 -465 511 -310 331 -33 180 11 -373 388 -233 340 -148 250 -134 61 165 -232 580 -399 336
4292 336 -417 128 -68 -26 165 -658 382 -507 395 -498 191 -16 -171 341 -509 293 -525 266 -249 -33
4312 -33 48 -182 336 -491 145 -296 148 -42 -223 154 -423 456 -470 403 -195 396 -258 27 168 -591 519
4333 519 -428 273 -246 64 59 -7 256 -228 614 -355 438 -316 184 167 -230 483 -174 605 -321 248 61
4354 61 37 102 -187 369 -290 532 -338 158 -93 -52 371 -255 509 -682 597 -474 356 -36 -199 160
4374 160 -416 315 -487 24 -116 -30 -184 -405 498 -685 519 -331 159 -376 -171 119 -264 201 -484 414
4394 414 -377 -204 25 40 137 -333 297 -365 301 -357 50 27 -177 496 -147 515 -315 429 -137 145 159
4415 159 -153 483 -515 353 -296 138 -160 135 226 -302 428 -183 498 -138 292 58 56 125 -312 351 -443
4436 -443 323 -82 52 207 -260 362 -265 493 -377 251 -323 177 -25 -440 356 -283 490 -349 256 -253
4456 -253 20 139 -262 404 -220 111 -410 97 -253 -64 177 -449 461 -644 671 -472 329 28 -239
4475 -239 123 -526 446 -355 193 -291 86 -108 -44 429 -457 387 -436 368 -81 220 231 -175 420 -259 272
4496 272 -305 302 117 -86 66 -334 356 -535 449 -256 115 -122 -270 273 -328 465 -279 300 -148 68
4516 68 -51 -89 350 -257 254 -404 129 -262 24 -332 -452 506 -730 259 -445 72 -318 40 4 -253 470
4537 470 -171 71 -329 98 -172 -342 209 -92 481 -362 494 -185 123 219 -219 88 -593 540 -289 40
4557 40 -275 -49 -22 -65 213 -586 612 -413 301 41 47 133 -116 602 -415 408 -198 345 46 23 104 -390
4579 -390 346 -227 406 -201 103 16 -188 358 -284 322 -359 400 -61 -90 -71 -300 430 -487 341 -334 102
4600 102 -200 56 -51 -164 294 -504 353 -318 274 -11 -117 -89 -396 324 -359 367 -132 81 -145 -77 280
4621 280 -441 165 -333 116 -203 -61 -67 -223 104 -352 424 -361 269 -266 -145 187 -224 176 -339 458 -355
4642 -355 64 -49 -107 246 -70 471 -458 320 -202 372 35 22 535 -212 346 -405 253 -309 171 -173 -351
4663 -351 200 -502 382 -250 179 2 179 -74 -252 343 -414 435 -315 243 -132 -49 159 -497 228 -450
4683 -450 285 -355 353 -229 -157 270 -211 187 -502 179 -268 72 -130 -337 233 -502 354 -79 69 -181
4703 -181 -87 246 -108 200 -412 496 -322 41 -96 -152 230 -126 381 -283 383 -236 309 286 0 242 -136
4724 -136 333 -700 348 -271 414 73 -335 327 -268 159 -170 326 53 11 6 -231 151 -358 161 -372
4744 -372 -26 -82 -9 141 -300 193 -629 371 -124 -1 -212 139 96 -493 75 -448 290 -198 42 -226 1
4765 1 127 -642 208 -498 231 -164 41 115 -180 266 -426 412 -16 116 -150 -13 116 37 340 -359 558
4786 558 -328 196 50 48 228 -123 493 -376 314 -86 191 208 -175 254 -132 578 -295 352 -231 126 7
4807 7 -196 456 -153 336 -409 -40 57 -29 203 -175 312 -457 247 -145 150 1 -207 74 -213 468 -404
4828 -404 151 -157 151 80 -50 57 -200 445 -388 87 -272 15 93 -137 196 -514 76 -163 179 16 -3
4849 -3 165 -392 196 -172 387 -407 101 -204 8 212 -248 319 -140 360 -79 64 -104 -191 263 39 146
4870 146 -384 439 -14 166 173 -141 369 -195 127 -340 177 -172 94 398 -200 380 -390 325 -189 244 5
4891 5 -255 44 -210 492 -357 532 -167 52 11 -23 381 -445 253 -367 267 -306 51 -67 -274 247 -310
4912 -310 89 -404 252 -293 -109 -268 -411 45 -472 153 -354 205 19 -10 21 -352 304 -334 268 -4 249
4933 249 -20 20 -11 -347 442 -369 108 -299 -54 18 -149 310 -316 578 -339 228 -64 19 234 -274 339
4954 339 -190 195 -288 272 34 -44 137 -167 265 -594 274 -255 51 33 -268 255 -373 420 -332 295 -46
4975 -46 -39 -37 -268 279 -351 396 -321 275 -160 -144 58 -300 397 -220 379 -218 201 -224 -7 209 -137 508
4997 508 -207 503 -292 -174 -140 -269 191 -440 365 -289 134 -269 126 -23 117 246 -200 343 -466 231
5017 231 -246 160 -28 0 291 -522 305 -358 84 106 163 273 -263 331 -196 324 -295 184 17 48 287
5038 287 -265 363 -580 295 -97 2 -4 -182 31 -65 -210 -328 180 -409 1 214 -389 244 -253 356 -249
5059 -249 -1 -108 -45 145 90 -22 -310 104 -375 313 -350 -53 146 -444 156 -308 10 -338 291 53 -277
5080 -277 -207 -131 11 -340 -31 -252 -262 362 102 183 -250 553 -218 317 352 334 174 166 330 -318 160 -125 -304
5103 -304 -259 99 2 -84 706 -669 223 95 701 -603 -714 -83 -349 226 -1398 456 324 54 110 -489
5123 -489 228 -383 904 9 -202 53 -4 -52 111 118 -988 362 -343 221 -148 -457 -430 -167 318 -417 253
5144 253 70 197 -563 -148 -430 -229 410 12 127 132 -22 -11 -251 399 -352 362 -154 286 -222 7 228
5165 228 -124 304 -369 321 -134 296 82 107 189 -182 434 -309 524 -41 284 -4 -72 84 -341 265 -318
5186 -318 617 80 102 67 -124 380 -271 338 -327 -91 -95 -40 74 -170 373 -457 330 -394 208 -192 -64 194
5208 194 -384 536 -377 221 -298 149 -57 -90 121 -102 610 -272 224 -266 31 -64 -104 552 -295 245 -193
5229 -193 214 -209 77 77 -238 499 -517 380 -429 344 -17 8 35 -127 174 -130 270 -246 40 -15 -28 -17
5251 -17 -95 252 -136 117 -234 -41 -133 -14 327 -407 398 -369 230 -145 114 114 -196 163 -305 410 -318 92
5273 92 -196 -227 17 -321 143 -350 212 -4 109 -344 -171 162 -290 308 -269 397 -220 209 168 62 77
5294 77 -322 164 -378 317 -268 58 -13 -12 188 -322 352 -426 48 33 86 104 -101 364 -245 397 -185 98
5316 98 123 -112 -91 -253 477 -319 566 -251 386 196 -248 245 -395 353 -327 52 -19 332 13 -311 472
5337 472 -177 196 -53 236 -66 -125 72 -64 237 -255 437 -440 -156 -224 -142 205 -353 90 -274 -71 -255
5358 -255 167 -43 0 -57 -317 302 -291 240 -225 286 89 -279 199 -338 512 -124 130 -160 37 162 -372
5379 -372 189 -215 378 -445 112 -35 -378 214 -412 309 -173 410 -232 172 245 158 196 -213 468 -215 386
5400 386 -34 403 120 -185 275 -139 385 -206 417 -31 177 -105 -159 344 -268 109 -243 16 -27 -16 74
5421 74 -180 354 -246 426 -282 251 125 -145 370 -291 226 -172 198 30 -82 46 -233 66 -343 49
5441 49 -428 366 -270 -203 316 -39 136 -127 192 -47 232 -33 101 322 -91 334 -438 264 -169 71 16
5462 16 166 279 -689 323 -421 102 -252 277 191 -138 110 -163 321 -340 186 10 115 140 -80 280 -354
5483 -354 339 -213 94 -160 152 -65 -67 373 -119 262 4 220 65 -126 99 -307 349 -327 134 -187 -114
5504 -114 27 113 272 -270 271 -477 310 -215 116 115 -198 367 -309 358 -272 157 105 55 23 -372 199 -506
5526 -506 24 -205 50 27 -38 41 -324 306 -72 242 -102 198 38 -400 306 -279 185 -259 159 -260 126
5547 126 -36 97 610 -410 459 -323 381 75 128 177 -208 96 -241 332 -295 158 -51 -153 51 101 193
5568 193 39 -264 -492 219 27 120 235 -61 50 -101 166 -89 158 -203 -173 472 -281 -11 -65 -300 47
5589 47 312 -277 -269 263 -432 248 421 -40 42 119 935 -54 348 -614 150 75 254 302 228 148 -196 337 -250
5612 -250 357 -216 136 102 46 246 -31 190 -215 340 -34 278 43 31 232 -382 373 -16 -2 -214 -34
5633 -34 266 -243 270 -41 149 -93 -78 39 -134 294 -405 289 -134 52 -244 -9 -232 -157 4 -388 304
5654 304 -240 139 -211 -15 65 -180 295 -145 116 -293 244 -348 -192 25 -291 178 -482 349 -97 125
5674 125 63 -85 4 -87 207 -319 306 -329 248 43 -54 259 -67 472 -162 241 -115 207 153 -55 119 -129
5696 -129 107 -63 385 -44 -39 478 -114 418 -45 190 -145 285 -145 195 268 -268 157 -122 625 -203 -187
5717 -187 89 -314 -47 -191 99 -222 316 -155 61 95 -165 232 -257 104 -66 19 -70 -277 32 -545 221
5738 221 -241 230 -239 100 -201 -219 268 -230 367 -279 3 -216 85 72 -23 392 -247 48 -259 134 -52
5759 -52 135 173 -142 308 -355 499 -244 168 -218 -38 -43 -161 363 -221 208 -269 142 -45 -124 92 6 275
5781 275 -232 438 -62 -114 24 -384 288 -281 474 -676 -45 -521 91 453 -455 556 -330 487 355 -76
5801 -76 -575 267 270 509 359 -247 212 5 -66 -91 -229 395 -243 222 -252 114 -222 -67 61 -38 275 -133
5823 -133 186 -37 262 11 102 169 138 373 -204 46 -195 227 -145 -78 247 -76 170 -173 354 -242 125
5844 125 -351 -38 90 -135 154 84 350 -113 329 -39 -318 133 -185 482 -337 145 -115 -20 197 -69 167
5865 167 -312 116 -274 83 -14 -64 209 -247 214 -417 -30 -103 76 -61 9 12 -169 -29 -135 186 -431 249
5887 249 -32 -228 -83 -248 397 -242 29 -157 -37 288 24 269 -257 39 -232 255 -208 -119 151 -195
5907 -195 192 -300 453 -342 156 179 13 161 -229 302 61 453 -78 247 -189 -40 118 -55 431 -148
5927 -148 411 -140 37 214 -32 194 -13 179 -107 110 95 36 32 52 341 -371 208 -143 114 -25 48 -170
5949 -170 -521 84 -246 81 -6 143 -207 -107 -130 -202 271 -331 137 -58 -32 -39 -229 39 -65 333 -206 202
5971 202 44 -205 42 -263 163 -363 290 38 50 -75 145 37 -248 77 58 142 -156 54 -59 11 0 -215
5993 -215 247 -162 -64 55 116 217 -178 277 -107 261 -305 483 -177 230 216 116 250 -456 133 -331 156
6014 156 108 15 173 -301 292 -81 82 -412 -64 44 -93 69 -307 206 47 150 -178 -42 74 -75 244
6035 244 -277 110 -132 288 -291 -171 -58 -83 -12 -229 -140 -337 101 -228 16 118 -475 88 -27 375 -405
6056 -405 159 242 -30 171 -224 350 -434 319 -493 -92 -180 -190 271 -152 209 -23 249 -8 212 166 -130
6077 -130 189 -273 -5 -301 171 -280 326 -178 357 98 -331 124 31 319 -492 225 92 -161 252 -359
6097 -359 302 -95 116 180 -282 368 -171 332 -348 397 126 304 18 77 497 206 529 55 272 -228 -360
6118 -360 498 183 364 67 302 -697 470 315 -89 519 -258 -40 -644 72 -1202 -65 -552 -265 -121
6137 -121 -583 771 -262 249 -633 505 728 -80 712 193 303 186 -102 26 284 971 -715 344
6155 344 -439 -632 -58 234 671 331 227 -748 -400 -284 1072 -450 -258 -307 399 26 -499 -167 12 673
6175 673 -45 -159 -482 -629 535 -830 517 -565 27 -374 290 14 -225 261 144 78 4 101 -80 -31
6195 -31 319 195 448 -11 96 -172 79 750 -134 -145 -376 617 -20 109 -356 507 306 -114 654 -455
6215 -455 -100 -87 644 -300 356 272 -338 240 -183 -72 242 224 -24 82 183 -504 479 -212 219 -232 642
6236 642 251 122 152 -150 70 -427 745 -52 759 320 260 445 -529 179 -234 69 -385 15 -152 -166 -180
6257 -180 -95 220 -574 273 154 -96 13 -183 248 -161 4 -334 -124 184 -508 273 95 854 216 5
6277 5 -354 245 -316 116 206 563 722 -654 -445 608 412 -60 -85 465 -149 -78 -99 -189 -49 -103 210 -354
6299 -354 -303 343 441 255 690 -326 -1030 629 136 -131 -207 576 -362 -56 37 337 433 -353 -395 -223 120
6320 120 -162 -179 -26 -408 -73 -248 821 254 -116 -352 -317 159 -134 398 -274 193 -663 334 281 -131 -507
6341 -507 87 -174 -6 47 -56 118 -92 -55 268 -65 212 69 356 -140 -210 -211 -375 346 -293 287 -218 371
6363 371 -50 -15 254 -178 86 -211 339 -321 255 -284 -47 -63 -156 263 -234 415 23 159 -22 -11 167
6384 167 -129 196 -269 601 -121 37 303 -208 149 -349 66 -369 190 -188 12 24 -451 21 -314 95
6404 95 -280 209 -14 -77 137 -71 65 -315 308 -113 150 -11 71 -32 -282 164 -391 -131 53 51 71 -264
6426 -264 58 -234 220 -106 176 -34 -151 -136 -108 408 -309 124 -230 275 279 105 -83 -522 297 -150 277
6447 277 -29 275 72 -96 97 -167 295 -240 99 -122 2 173 -104 16 -287 52 -297 99 133 -94
6467 -94 207 -339 243 -183 -1 -187 156 -60 -252 -101 -315 0 -213 336 -195 163 -97 -155 -40 -31 70
6488 70 -275 285 -352 151 159 -199 92 -287 306 -293 24 -48 57 33 -265 154 -320 231 -244 96 -70 -6
6510 -6 -285 -192 316 -164 137 -313 7 71 -42 55 20 474 -225 172 -173 294 -159 -72 251 -162 -7 -217
6532 -217 309 -33 -339 -254 -320 283 -207 -140 -106 5 -541 28 -574 -803 666 -301 38 -368 -15 -267 -45
6553 -45 -577 -354 480 -669 -102 147 -20 -5 -154 -142 -442 -213 -135 26 -228 510 -932 123 821 -459
6573 -459 535 66 314 -859 228 214 -113 14 -294 1310 331 -54 554 -49 -286 -1037 29 -634 137
6592 137 3 249 -62 -1054 -58 229 366 -101 978 2 565 54 -200 395 -896 482 -47 -358 -11
6611 -11 -157 -245 169 -192 -76 499 -479 164 -355 210 211 -29 413 -595 -209 52 5 31 -211 -24 31 474
6633 474 -115 407 241 -209 -227 -377 8 -469 -120 -194 -249 -515 -30 -24 29 425 28 -155 -372 338 477 -36
6655 -36 226 -64 210 -112 -166 -227 28 263 -10 548 -24 -85 -196 519 583 -55 -99 -86 34 -638 -73 -495
6677 -495 636 14 -428 225 -389 351 85 -48 423 228 145 -428 166 -293 251 -104 220 34 -73 -149
6697 -149 -103 51 -432 265 -186 139 75 300 32 -84 -180 -486 309 -426 363 -334 233 -255 190 130 -288
6718 -288 447 -87 4 -47 129 -41 -173 306 -368 -88 -237 -175 212 200 102 -30 169 70 177 21 -32 101
6740 101 191 7 -46 395 -214 156 161 190 175 -113 -53 -180 -26 -180 39 32 -135 339 -356 285 -235 201 -101
6763 -101 -172 -123 -117 180 -316 63 -135 295 85 -1 -33 28 166 -203 -33 -157 79 -212 83 -137 -96 96 -119
6786 -119 225 -368 120 210 -100 -47 -175 -59 -422 460 -332 -12 -316 9 -205 34 460 -148 276 -127 243
6807 243 12 -160 238 -50 0 282 268 -351 97 -459 -281 91 -13 67 145 419 -20 -154 -19 -359 393
6828 393 -215 165 184 468 146 100 -204 3 456 -34 612 262 651 192 -226 -116 -304 495 37 17 -268
6849 -268 -210 -254 -129 97 -57 -152 -1 -110 -210 -448 -19 -70 -219 -592 488 -202 358 179 -3 -139 -482
6870 -482 -42 -208 331 -74 67 -105 -180 85 -68 107 221 -33 317 -255 -100 -162 219 -351 -428 -230 259
6891 259 -157 153 337 152 199 73 273 101 62 169 -788 133 -20 438 -196 76 -12 -70 290 -407 -483 -951
6913 -951 219 -528 -904 -38 -97 342 151 -19 -60 -805 317 -24 -538 -433 -168 209 -65 -552 -77 -355
6933 -355 -145 742 -88 245 -466 -144 -1384 -8 -241 99 729 -654 366 -952 393 153 52 -81
6951 -81 -654 -649 -970 266 -338 -781 407 105 -131 -146 -99 -590 -154 -723 -1477 -758 408 -299 1 -526 -161
6972 -161 182 334 765 -478 235 383 201 -175 -271 435 225 507 736 173 -670 131 410 -275 559 -93
6992 -93 -226 -516 -38 218 296 109 -583 162 -196 369 75 612 -133 -241 193 -248 -75 77 -192 -195 -2
7013 -2 -167 -305 519 -304 -62 -304 396 140 -217 -138 -329 248 5 -517 -438 258 -85 -386 316 -115 238
7034 238 172 -61 136 100 220 -84 191 -204 250 -279 16 105 -214 -9 -12 -167 -583 161 -68 3 -55 68
7056 68 220 -337 158 -126 1 -40 -117 190 110 68 -268 69 -455 -106 55 26 123 -75 136 -320 -128 -274
7078 -274 -14 111 -51 18 58 358 -213 347 -154 92 -56 -134 -7 -208 159 -100 -101 -122 140 -184 -83 256
7100 256 -149 145 -132 131 76 -125 -71 105 22 -294 377 -125 6 71 -104 414 189 -244 -465 -172 -115 -66
7122 -66 33 75 234 -139 -2 43 383 98 -79 2 30 -265 -165 425 -159 598 -85 -85 -105 121 42 -651 239
7145 239 240 136 -707 -959 -308 69 280 781 370 181 -691 -226 -297 651 -482 329 109 -139 -230 565 88
7166 88 -278 -47 -422 425 -479 -358 -101 -24 217 143 -122 472 -546 80 -394 -623 2 311 342 550 -702
7187 -702 273 -157 447 296 195 280 -119 390 293 -202 -239 -36 -280 -258 -307 316 407 -311 491 -389 -136 -540
7209 -540 -57 319 9 141 103 -22 194 162 -31 -538 -261 -97 125 -218 -97 97 -184 23 -201 581 -258
7230 -258 -31 45 35 -39 -128 137 -63 207 -170 -15 -515 -20 -78 -74 348 -266 204 -134 13 -319 168 -74
7252 -74 -142 277 -168 120 -368 57 -44 174 185 -114 242 -186 336 -193 226 134 5 364 -193 101 61 24
7274 24 -84 130 155 -144 267 -335 271 6 26 46 17 140 7 142 -110 55 -43 84 149 83 169 -266 242
7297 242 -243 -91 -250 35 233 112 54 -76 -43 -354 4 26 83 -60 148 46 265 30 73 118 39 -304
7319 -304 115 -142 43 -23 181 448 386 209 -162 -94 -447 -77 -258 21 -50 -165 316 528 -103 41 -54 -73
7341 -73 425 120 471 212 -162 328 -185 -98 -303 377 193 570 322 180 -414 -281 351 -353 233 -399 -365
7362 -365 706 118 -354 194 -346 -253 1074 -86 521 14 618 488 806 634 624 351 -339 99 -7 -113
7382 -113 355 -586 -258 38 -408 445 -395 -344 -488 178 -529 33 -151 538 -133 28 -283 -104 422 -170
7402 -170 28 560 -406 382 107 498 -180 238 -161 114 69 -18 160 -423 173 -42 -84 -248 -58 4 -204
7423 -204 65 13 66 -113 181 -53 -68 13 64 310 -268 326 -105 148 -85 152 103 -48 178 -189 87 -191
7445 -191 -136 -178 128 168 -168 135 -173 171 -201 -13 76 56 223 -21 120 62 -44 -156 -160 48 -102 143 -65
7468 -65 -75 -34 -234 -23 -81 65 -109 137 -164 47 -213 83 151 -86 254 -177 186 -182 201 -60 -28 160
7490 160 146 72 -389 137 -84 220 204 -141 138 82 355 -443 238 -168 -28 -201 -53 172 -103 -28 -184 149
7512 149 -201 -59 -122 -62 17 -352 42 -269 -25 9 152 135 -58 277 -39 203 -83 126 -255 218 -140 -232
7534 -232 132 -49 167 -73 -14 -41 -153 163 -168 315 -176 164 126 -173 9 -92 52 -282 199 -340 341
7555 341 -175 -287 -38 73 96 15 121 28 197 -7 -18 212 46 400 -189 187 -166 298 -3 204 36
7576 36 -108 350 -50 116 -84 -140 123 -46 87 -75 234 -108 117 23 67 -234 -256 164 -153 0 -81 117
7598 117 -26 164 -21 -44 150 13 137 -298 -410 -115 24 321 -135 57 28 -254 -7 -77 -256 211 293
7619 293 -166 -152 -212 241 -171 -30 2 -61 474 -433 491 -353 462 -106 -72 334 -173 -124 -198 266 -739 -30
7641 -30 55 -159 91 117 -267 -185 188 135 -5 -167 325 273 189 400 186 279 -207 251 314 -197 102 40 239
7664 239 73 272 147 -9 -165 520 201 273 -205 -373 618 75 305 -148 351 1057 -363 -66 -760 -564
7684 -564 2 -602 98 64 80 -338 80 67 1 -207 302 203 251 -44 -320 -34 118 -25 47 -158 -35 -89 145
7707 145 11 57 -263 -89 218 213 28 29 256 123 8 -98 -139 97 -148 140 -147 52 -163 -13 -38 7 159
7730 159 -307 -24 -221 82 243 209 -53 -17 184 -154 78 -32 -8 -5 -78 -165 -243 186 -33 158 103 118 -84
7753 -84 -152 -149 -217 72 -299 24 48 89 -56 265 196 -78 59 -29 262 -240 -310 -74 85 268 -167 264 -274
7776 -274 145 104 -111 51 -256 -85 -359 65 -218 -7 123 46 223 -3 84 -62 191 -43 243 32 -138
7797 -138 227 -78 192 54 66 -217 64 2 101 -38 -145 138 -14 35 -215 143 -61 -18 268 -401 239 -91
7819 -91 -90 24 27 -37 -47 397 85 331 -284 -5 -305 242 70 241 29 -179 304 -64 32 199 -97 -105 -93 355
7843 355 168 177 298 520 -605 254 -79 -96 211 55 73 99 -91 -301 600 234 -149 -488 -528 294 208 -388
7865 -388 466 -482 202 -449 119 -424 -146 36 -357 -261 -439 401 -123 -46 -73 -90 -130 -228 -117 -157 84 -236
7887 -236 458 219 -39 -39 -433 131 182 -98 19 -19 113 107 -51 -423 -73 -204 61 351 -106 27 385 285
7909 285 271 226 194 244 -184 -383 -360 -246 -116 544 1030 -60 -251 -331 -8 31 -618 -17 -62 984 60 -459
7931 -459 290 404 -639 -271 -303 14 126 -355 209 -108 172 213 324 -167 -708 -352 526 -22 139 -662
7951 -662 71 435 1236 -67 343 -714 -807 -349 -370 294 -526 -228 -688 -274 64 -40 -226 -493 -358 201
7971 201 -26 -951 -997 2 -72 285 -226 -245 -145 538 -314 133 202 154 -114 -244 182 -55 78 -173 -23 -244
7993 -244 -322 505 -213 218 -320 110 -115 -220 -142 194 158 -218 56 -447 501 20 409 -64 -200 496 -628
8014 -628 154 -302 121 -62 115 838 -470 56 28 478 56 -75 69 -116 133 -526 -210 493 229 -405
8034 -405 -4 337 35 -40 -874 343 -1045 543 2 883 -179 -165 663 -572 359 -453 7 632 -42
8053 -42 -52 -184 -109 -39 -278 175 88 78 5 -60 -85 119 -39 -31 -240 195 214 324 -191 199 -157 -510 148 43
8077 43 -208 -179 -374 886 244 340 -395 180 -72 11 27 -330 1005 338 225 -232 334 235 635 -714 141
8098 141 -201 -560 -322 -208 671 167 -64 -94 113 84 -6 140 165 248 -215 -323 103 -25 -39 -11 37 -219 -21
8121 -21 -41 65 158 -218 198 -376 -76 201 -145 317 -176 134 45 100 -348 -35 9 -479 80 -340 -121 203
8143 203 352 -132 189 48 27 188 -362 246 -73 94 -9 -221 73 -279 -31 113 216 -93 -188 74 -118
8164 -118 396 43 45 36 112 -5 -15 26 -142 23 -117 478 65 -73 -135 -167 94 19 64 -293 237 -243 259 -176
8188 -176 -30 224 -137
8191a37
$$ Imaginary data points
##PAGE= N=2
##DATA TABLE= (X++(I..I)), XYDATA
0 0 0 0 0 0 0 0 0 0 0 0 0 8 -8 8 -8 16 -16 24 -24 32 -40 48 -56 64 -76 89 -104 121 -140 161 -185 212 -242
33 -242 275 -311 351 -396 444 -499 557 -620 691 -767 852 -944 1044 -1154 1273 -1402 1546
50 1546 -1703 1875 -2063 2275 -2510 2772 -3067 3401 -3784 4229 -4752 5375 -6139 7094 -8335
65 -8335 10018 -12449 16363 -24185 79309 -135106 91853 87473 -148731 133862 -63464
76 -63464 -11286 123128 -105179 -4310 83376 -133478 63706 -13712 -23426 61879 -93074
87 -93074 39803 20795 -65790 39082 34232 -49881 37748 -9875 -43491 92155 -100606 26055
99 26055 72538 -127291 40088 22972 -96334 55852 -35079 -63497 94485 -132645 18086
110 18086 60251 -126456 79727 -38873 -13943 44571 -73155 53854 20753 -61779 66638
121 66638 -5655 -27692 66652 -65547 56770 13266 -66166 77636 -28970 -20237 24003
132 24003 -7979 -15014 13218 -24320 -40 20054 -55421 30688 -2393 -28708 9464 -3760
144 -3760 -6910 131 -13927 4825 17575 -49225 42487 -17601 -14192 32948 -49328 49645 -19224
157 -19224 -25668 49515 -25803 -6994 32773 -25635 17618 13268 -35558 57394 -33189 2160
169 2160 31826 -32679 30432 -19947 8709 10498 -18352 5962 9662 -15928 2073 8199 -19348
182 -19348 22178 -23729 9108 9915 -19719 11127 2104 -411 -7526 18513 -18286 18062 -5618
195 -5618 -10941 30721 -31608 17324 1771 -11484 11617 -6361 -3832 13703 -14463 694 22387
208 22387 -32786 33033 -11668 -3644 29209 -29242 30426 -1222 -5515 19939 -99 -1446 18145
221 18145 -7132 4823 17400 -23767 27727 -13363 -2020 12389 -17230 9794 -8119 -1779
233 -1779 -5305 4310 -16415 8256 -6073 -13914 16706 -23719 11333 -5307 -7709 5951 -4329
246 -4329 -5645 5879 -3155 -10547 20071 -25414 16049 -3008 -14599 21650 -22894 10807 134
259 134 -9439 5108 2213 -11457 10674 -4406 -9027 19998 -25368 18576 -4173 -9119 16079
272 16079 -13008 7524 -254 -568 -944 8973 -11118 10669 1442 -10124 19200 -15414 12864
285 12864 -1910 -1914 8314 -254 -130 3737 6025 -10720 18017 -13441 8649 4329 -12734 17952
299 17952 -12442 4387 1614 -2467 -2206 4885 -8680 3915 2740 -16323 19364 -19903 6625
312 6625 1165 -11635 10566 -9821 2332 687 -1104 -5845 10074 -10288 4386 3779 -12558
325 -12558 16240 -14727 7521 -677 -4783 3256 -2858 57 -2533 4517 -11072 12067 -11024
338 -11024 1802 4554 -13056 11026 -8149 3882 88 823 -1776 6568 -2693 335 10363 -13408
352 -13408 17708 -9616 3822 6598 -8683 10006 -5382 1641 87 2297 -7810 9017 -7575
365 -7575 -917 6894 -12955 14603 -11025 5383 3013 -3669 5116 -58 4426 -1465 9164 -6081
379 -6081 12282 -3858 1780 9658 -8105 9560 -5307 3560 -2666 856 -5418 1882 -3613 -8960
393 -8960 8873 -17812 6717 -9925 -5075 2513 -13177 2216 -5805 -3038 -6387 2596 -9968
406 -9968 3684 -6318 -3701 7276 -15328 11397 -7531 860 191 -3103 4322 -4021 2765 -3513
420 -3513 8744 -8824 6797 273 -1695 5466 -5346 8247 -4352 3784 -2311 6881 -3558
433 -3558 266 6772 -7370 10796 -9231 9647 -240 -3344 8215 -2559 4442 -839 4632 -911
447 -911 6666 -5947 9208 149 -6343 11891 -10365 8933 -7253 1135 2409 -6585 1627 -4191
461 -4191 3351 -7738 3900 -2840 3311 -3679 968 6799 -4349 8894 -2772 11000 -1440
474 -1440 5884 6063 1180 8787 -5301 14116 -5391 3194 3646 -3048 1783 -5337 -438 -4208 -1185
489 -1185 -10639 5517 -9926 -2365 159 -8941 8543 -13180 8677 -1875 -1418 5631 -1549 7029
503 7029 -666 4262 1278 7072 -5057 6782 821 -2653 4066 -6862 7600 -9627 3446 -4508
517 -4508 -1346 567 -8031 7972 -8183 3915 -2066 1991 955 -312 3567 1131 3358 -2877
531 -2877 8891 -6385 6569 -2928 -1005 4802 -13244 8847 -10770 -1304 -3791 -7026 -978 -7733
545 -7733 -3579 -5781 -2034 -9797 2145 -7713 806 -2600 -3948 6668 -9295 8760 -5361 3917
559 3917 303 -2734 6296 -4516 4742 -1969 4528 -1639 1434 441 616 648 -1798 5802 -6118 8448
575 8448 -6119 4895 1990 -3604 9744 -7305 8402 -2945 2392 2788 -1133 2172 500 1300
589 1300 -1108 5132 -6038 8075 -4925 2921 2848 -5854 9255 -7549 6977 -2134 337 3245
603 3245 -2132 4178 -2110 3491 -2452 4271 -3294 3273 -1134 -449 2059 -5185 6292 -7872 6211
618 6211 -4776 414 2797 -7009 7238 -6465 3145 -1686 -195 112 -276 -622 -91 1471 -5309
633 -5309 6277 -8475 4886 -4206 -2948 4692 -10003 6460 -6839 1096 -1958 -1863 708 -2033
647 -2033 792 -2468 4341 -4725 5075 -2544 3706 379 -514 6663 -5073 8135 -4483 6170
661 6170 86 -1069 5679 -4008 5527 -3300 3476 -526 771 -834 2072 -698 -1625 4689 -6510
676 -6510 7791 -6954 3636 1380 -5365 6536 -5813 4686 -3658 1194 -207 -268 -1051 -707 1607
691 1607 -4810 4108 -5998 4590 -4751 -299 1784 -5197 4260 -6260 5235 -4910 878 20
705 20 -2468 2287 -4856 3737 -3640 1490 -3084 2330 -2495 -221 1340 -3835 5976 -7638 6737
720 6737 -3120 -474 3690 -4133 5686 -4261 3535 -565 2265 -1266 2711 588 -688 4270 -4153
735 -4153 7132 -5816 4371 -155 -1436 3560 -4437 5483 -4546 3583 -1949 1740 75 -1404
749 -1404 2903 -3230 3458 -3433 4165 -3226 2488 -166 -1059 3545 -5624 6824 -5662 3259 -1145
764 -1145 -1620 2359 -4757 3031 -3639 1625 -3932 1877 -3366 9 -448 -3694 4235 -7485 5213
779 5213 -4430 990 631 -2934 4027 -4142 3916 -3063 3234 -1877 1943 458 -1103 3133 -3837
794 -3837 4981 -4673 3789 -2602 356 839 -3353 4289 -5679 4288 -3963 1958 -322 -1064 2738 -2525
810 -2525 3480 -2634 4492 -2569 4084 -543 1281 3550 -3374 7165 -4699 5439 -938 774
824 774 2344 -2302 3048 -3136 2634 -3501 2820 -3128 1019 -524 -2745 3106 -5735 4597 -4817
839 -4817 2133 -1433 -1073 1823 -4257 3888 -4576 3305 -3046 1215 -533 -1529 1814 -3132 2947 -4461
855 -4461 3476 -4102 1391 -1180 -2098 3472 -6159 4868 -4733 2227 -1165 -903 1603 -2084 1996
870 1996 -2634 3701 -3525 4055 -1468 1474 2156 -2116 6461 -3439 5775 -1742 2846 1109 219 4083
886 4083 -759 4099 -2953 3163 -2314 1476 7 -684 1695 -3852 3640 -4718 3283 -3206 633
901 633 871 -3975 4308 -4606 4304 -2604 1976 649 -316 1786 -777 2962 -2887 3953 -3498 3461
917 3461 -2417 -1065 2399 -5596 3904 -6063 1954 -3532 -1657 -565 -3491 701 -4292 2279 -3955
932 -3955 1955 -3051 1484 18 -1329 3851 -3665 5233 -3558 4081 -719 -346 2864 -3098 3926
947 3926 -4130 2911 -2613 111 -987 -1080 309 -2651 2489 -3684 4218 -4171 3065 324 -869 4658
963 4658 -3333 6277 -2319 3582 978 1137 2122 -400 2956 -1532 3115 -3222 3461 -3079 1109 267
979 267 -3405 3307 -5670 3647 -4034 1025 -522 -2117 2221 -3777 3223 -3123 2229 -1929 1389
994 1389 -532 -397 1168 -2691 3641 -4952 4074 -3501 463 235 -3530 3583 -5221 3060 -3201 588
1010 588 -542 -756 402 -1535 1628 -2710 3426 -3685 3839 -1745 255 2336 -3546 5190 -4169
1025 -4169 4039 -1664 1108 1375 -1442 2778 -2231 3116 -2169 2836 -1638 2083 378 -19 3090
1040 3090 -2750 5244 -3693 4339 -1450 124 2796 -3048 4385 -3396 2574 -1593 792 -330 330
1055 330 211 -1359 1862 -4142 4051 -4157 2099 -756 -1442 3181 -4823 4284 -3911 1930 -975 -709
1071 -709 400 -1863 1155 -2624 1724 -3403 2482 -3094 153 -217 -2398 2871 -4726 4394 -3952
1086 -3952 1803 -675 -1317 2723 -3010 2741 -2393 2116 -1501 1634 -60 364 1393 -1627 3835
1101 3835 -4362 4573 -2599 1667 993 -2389 4411 -3476 3201 -2079 1616 555 553 354 -678 1496
1117 1496 -1825 3595 -2796 3400 -1942 600 1690 -3438 4609 -4107 3648 -1575 788 707 -1530
1132 -1530 2091 -2112 1874 -2275 1826 -1973 2124 -1439 -577 1136 -3126 3482 -4556 3125 -2192
1147 -2192 -1114 1484 -3413 2594 -3310 2100 -2295 196 -974 344 -204 -851 1612 -3275 4111
1162 4111 -3976 2567 -269 -818 3475 -3349 3354 -2916 1950 -848 551 1331 -1191 1600 -1489
1177 -1489 2514 -1842 2214 -1819 1550 368 -969 3084 -4027 3997 -2134 2510 -6 -713 2163
1192 2163 -2233 2756 -1780 1932 -1573 2461 -1301 1298 1038 -1856 3107 -3985 3872 -2550 1209
1207 1209 77 -2659 2704 -3632 2721 -1603 1741 -2156 510 51 -462 527 -3956 1814 -3054 1633
1223 1633 -2124 56 886 -2697 3040 -3895 2369 -2861 25 -685 -326 1244 -2667 1959 -2400 1618
1239 1618 -1686 998 -394 -209 1415 -2207 3642 -3572 3405 -760 798 1690 -1721 3052 -1742
1254 -1742 2812 -688 3076 -489 1314 734 -1043 2597 -2380 3452 -2868 1535 -288 -29 1670
1269 1670 -2788 2997 -2881 1453 -2086 -7 -685 -923 1235 -1441 2112 -2584 2449 -3016 1322
1284 1322 7 -1281 2077 -3654 2658 -2923 1278 -961 -1165 1036 -2400 1820 -2571 1530 -2322
1299 -2322 1111 -1510 -648 74 -2269 2534 -4121 2092 -2134 -1 -263 -1216 1850 -2914 2233 -2500
1315 -2500 1425 -1401 1098 -564 -908 1706 -3218 2982 -2819 2596 -1021 123 1451 -2032 2644
1330 2644 -2820 3062 -1757 1616 130 368 1695 -233 2403 -1808 2922 -1891 1535 594 786 1604
1346 1604 -1265 4240 -1491 2293 -674 919 1231 -1513 1235 -1797 1954 -2440 1893 -1688 712
1361 712 -226 -1507 1071 -3667 2286 -3524 1162 -1424 -1425 1252 -2454 2008 -2698 1734 -1960 492
1377 492 -875 -892 577 -2047 1936 -2531 2396 -2380 1444 26 -1520 2281 -2933 2656 -2349 1543
1393 1543 -373 -333 679 -1111 1696 -1594 2217 -1942 2310 -1105 1035 819 -1671 2619 -2583 2808
1409 2808 -1685 618 298 -994 1962 -2035 2117 -2196 2029 -943 563 -241 -831 1157 -2089 2343
1425 2343 -2387 2168 -1833 206 760 -1457 2656 -2360 2899 -1658 107 -451 -240 795 -961 1197
1441 1197 -2410 2081 -2392 1715 -969 -400 1208 -2572 2279 -2981 1653 -1513 -144 283 -1572
1456 -1572 781 -1869 1533 -1992 1469 -1321 717 -42 -1083 1550 -2551 2480 -2623 1797 -560
1471 -560 -54 1653 -1769 2511 -1690 1863 -662 1113 105 565 1352 -570 2427 -1616 2871 -1518
1487 -1518 1755 595 -479 2362 -2010 2860 -1594 1624 -296 32 934 -866 1245 -1304 1735
1502 1735 -1851 1760 -1351 345 238 -1785 1925 -2864 2197 -2241 786 -401 -1485 1196 -2284
1517 -2284 1155 -1789 708 -1383 417 -882 -491 537 -2024 2004 -2937 2143 -1562 161 562
1532 562 -1463 2069 -2575 1876 -1225 827 -406 -54 412 -529 1222 -1627 2190 -1787 2153 -773
1548 -773 145 1379 -1691 2682 -2279 2188 -1048 483 779 -723 1555 -1084 1960 -1158 1817 -810
1564 -810 1285 138 -151 1805 -1845 2783 -2226 1886 -797 -500 1373 -1638 1983 -1599 1338 -830
1580 -830 610 -584 -165 243 -967 1624 -2499 1693 -1963 1037 -624 -1232 1352 -2534 1918 -2165
1596 -2165 999 -837 -313 -137 -1413 452 -1701 1179 -2277 1282 -1689 379 -66 -1578 1981 -2869
1612 -2869 2098 -2227 653 -26 -1063 1390 -1566 1505 -1559 1509 -1033 1052 -468 221 668 -1503
1628 -1503 2179 -1918 2173 -1268 508 763 -1072 2081 -1755 1684 -909 861 -294 627 780 -454
1644 -454 1471 -1130 2135 -1497 1829 -841 23 1206 -1470 2397 -1959 2132 -983 687 263 -802
1660 -802 874 -1329 924 -1521 961 -1876 794 -691 -841 949 -2361 1625 -2648 295 -434 -632
1676 -632 645 -1305 1146 -2141 1447 -837 1212 -1133 -150 867 -1230 1259 -2008 1907 -2173
1691 -2173 1236 -407 -150 1608 -1572 2230 -930 1556 -25 597 325 -432 1459 -1149 1408 -1916
1707 -1916 1942 -859 1187 479 -559 1988 -2088 2583 -1530 1120 -524 -1033 1404 -1613 1499
1722 1499 -1773 1473 -1132 676 -788 155 199 -2545 1659 -2654 1371 -1251 508 130 -1693 1077
1738 1077 -1760 1022 -976 734 -246 -6 -406 -1004 596 -1864 2066 -1879 1155 -1390 -302 463
1754 463 -2201 1689 -2011 1326 -1161 499 -299 -1319 955 -1179 1182 -2144 1102 -1317 1078
1769 1078 -253 -676 1210 -1464 1814 -1738 1119 -151 46 598 -936 1617 -567 1373 -793 1982
1785 1982 33 619 512 -577 1900 -1507 2570 -1348 1245 -112 82 1258 -1421 1594 -1458 1317
1801 1317 -652 294 -112 -647 515 -1463 1027 -2106 980 -1870 48 -495 -1702 927 -2451 992
1817 992 -2120 176 -752 -649 277 -1406 835 -1710 982 -1786 833 -848 -219 600 -1470 1748
1833 1748 -2026 1571 -1362 532 341 -617 1054 -1225 1417 -1206 1576 -662 728 200 -37 1357
1849 1357 -1090 2102 -1383 1660 -719 356 1032 -900 1643 -1349 1480 -953 755 -24 -38 656
1865 656 -741 1678 -1362 1564 -1222 1202 113 91 1520 -1414 2032 -1555 1673 -410 36 610
1881 610 -635 1236 -1219 1472 -1099 1231 -663 232 125 -826 1330 -1771 1849 -1864 830 -348
1897 -348 -636 965 -1528 1405 -1617 824 -1187 353 -468 -578 182 -1547 1094 -2131 1251 -1668
1913 -1668 474 -112 -972 1167 -1904 1631 -1285 1020 -242 367 688 -427 1377 -827 1869 -990
1929 -990 1457 -258 408 915 -1045 2133 -1250 1897 -999 840 337 -529 1407 -1091 1280 -953
1945 -953 1525 -626 554 37 -374 945 -1256 1836 -1808 1457 -760 199 524 -1269 1309 -1471
1961 -1471 1224 -1279 490 -583 -361 172 -1146 1051 -1451 1446 -1376 853 -651 -432 916 -1559
1977 -1559 1558 -1861 1301 -712 145 17 -765 924 -1070 1087 -1273 1026 -681 443 468 -613
1993 -613 1270 -1632 1618 -1735 1060 -321 -423 912 -1340 1125 -1274 1204 -1014 739 -230 -186
2009 -186 591 -801 1455 -1753 1686 -1133 672 39 -755 1372 -1571 1590 -1593 955 -489 102
2025 102 351 -841 869 -1457 1106 -1669 1063 -1089 -14 38 -1470 1256 -2089 1457 -1853 434
2041 434 -538 -776 635 -1320 941 -1438 989 -975 799 -177 -407 532 -1424 1609 -1659 1447
2057 1447 -1076 222 422 -969 1022 -1463 1153 -1208 841 -195 150 366 -613 1395 -1119 1732
2073 1732 -1303 1142 -379 264 1162 -852 1835 -1185 1855 -354 914 388 -269 1334 -351 1369
2089 1369 -699 1752 -435 946 304 -370 1460 -1231 1930 -1359 1201 48 30 777 -849 1452
2105 1452 -1284 1082 -785 870 -460 26 509 -846 1142 -1721 1385 -1630 633 -333 -728 677
2121 677 -1754 1107 -1608 698 -984 -438 -248 -1164 390 -1437 799 -1738 1037 -1068 283 191
2137 191 -923 1112 -1696 1688 -1080 545 -493 -372 299 -1063 1215 -869 933 -663 930 -192
2153 -192 91 809 -1064 1502 -1259 1405 -919 101 358 -936 1169 -977 1334 -982 733 -395
2169 -395 234 353 -413 757 -1129 1352 -1334 1134 -589 -45 755 -1124 1159 -1397 1151 -841
2185 -841 273 -245 -464 642 -1042 1073 -1330 1113 -964 713 -89 -494 977 -1500 1441 -1434
2201 -1434 857 -877 -121 308 -861 904 -1694 1014 -959 505 -637 281 153 -958 912 -1748
2217 -1748 951 -1349 671 -439 -636 786 -1105 1174 -1274 1235 -287 628 245 -10 1035 -847
2233 -847 1364 -753 1643 -608 543 536 -547 1358 -1297 1621 -759 619 -3 -78 365 -679 955
2250 955 -1015 746 -1067 721 -515 140 255 -1099 1531 -1632 1268 -969 424 52 -686 661
2266 661 -979 856 -1125 531 -725 121 -178 -888 542 -1464 1336 -1212 674 -644 -91 501
2282 501 -753 1293 -1128 1161 -719 760 250 -72 630 -710 1253 -993 1158 -878 568 -428
2298 -428 -381 957 -1129 1319 -1142 1100 -280 287 184 -320 897 -605 1035 -623 862 -485
2314 -485 424 463 -593 1031 -1238 1687 -1080 961 -42 -630 1013 -800 1187 -1025 836 -852
2330 -852 674 -144 -361 470 -690 927 -1553 1330 -825 526 238 -505 919 -1387 1211 -1295
2346 -1295 451 -710 -278 49 -1033 735 -1493 494 -1324 619 -522 -158 542 -859 1581 -1546
2362 -1546 1017 -790 459 71 -715 711 -812 1111 -681 935 -597 500 -178 -307 958 -759
2378 -759 1699 -1156 1105 -273 606 891 -932 1374 -711 1344 -413 766 227 197 448 -486 709
2395 709 -1012 965 -1085 760 -276 -356 684 -997 1186 -1277 1123 -452 -103 -2 -565 669
2411 669 -1390 602 -1084 1214 -730 186 108 -714 681 -1392 1282 -1495 534 -395 -358 136 -764
2428 -764 686 -1373 660 -889 116 -52 -301 439 -913 646 -1103 611 -1048 70 623 -624
2444 -624 966 -1017 1177 -666 704 -437 165 239 -390 1027 -423 1051 57 820 -376 -51 57
2461 57 -1301 1668 -935 838 -219 181 -295 103 1187 -859 992 -864 1007 -910 803 -138
2477 -138 -583 414 -853 1128 -1058 987 -1088 -71 449 -1028 827 -1269 948 -988 514 -287
2493 -287 25 118 -651 782 -969 640 -1095 615 -402 -226 293 -927 809 -1104 711 -569 78
2510 78 4 -535 501 -668 858 -1052 981 -287 342 77 -259 1067 -709 1145 -881 824 -47
2527 -47 -96 622 -598 1133 -690 765 -682 295 -103 91 131 -735 1055 -1166 1067 -684 517 348
2545 348 -306 548 -999 831 -891 756 -295 -35 40 -294 585 -655 703 -1064 493 -629 -9
2562 -9 141 -1019 282 -1637 785 -1042 338 -181 -545 364 -1072 787 -1231 713 -757 554 -244
2579 -244 55 335 -757 1188 -881 930 -474 216 265 -455 838 -902 761 -655 540 -319 33
2596 33 302 -436 754 -827 1082 -850 881 -193 291 676 -328 1107 -975 834 -305 458 293
2613 293 61 448 -413 773 -815 905 -816 356 -148 -411 601 -870 936 -1054 905 -273
2629 -273 64 80 -584 723 -695 726 -754 644 -170 -76 261 -540 846 -1240 904 -1024 451
2646 451 -241 -540 393 -1018 786 -969 374 -482 87 -11 -219 279 -878 787 -906 675 -649
2663 -649 315 0 -619 867 -847 1161 -819 715 -305 -252 440 -768 702 -656 980 -287 431
2680 431 -383 -113 377 -738 1107 -969 1042 -659 332 510 -296 816 -637 867 -325 578 -261
2697 -261 312 73 -361 526 -729 783 -821 658 -491 -419 229 -1163 711 -1050 765 -703 -102
2714 -102 -422 -383 365 -669 719 -985 692 -1172 385 -342 -219 458 -938 842 -1017 573 -633
2731 -633 -10 476 -115 422 -1044 808 -784 567 -76 430 73 -312 673 -657 1259 -874 1075
2748 1075 -12 -378 542 -424 847 -421 904 -169 386 179 0 571 -835 1122 -1020 1116 -147
2765 -147 419 501 -644 1046 -719 948 -763 1075 -384 88 36 -286 770 30 584 -201 549 -392
2783 -392 122 393 -1027 424 -1051 614 -353 -66 -332 101 348 -1038 393 -1896 -193 -790 85
2800 85 -139 -167 166 -1044 626 -301 225 -275 -4 1005 -146 -30 -1300 1129 -1116 -1 -101 269
2818 269 1302 -313 968 -622 95 -771 491 -291 358 -324 -669 1188 -1572 503 -624 443 78
2835 78 -386 679 -289 1356 -264 335 -875 35 263 -552 1213 -1002 966 -257 535 -65 -285 485
2853 485 -1341 422 -975 818 -833 184 -504 181 234 -312 843 -565 1213 -289 573 -698 -197
2870 -197 490 -707 284 -910 -310 -654 468 -179 -224 268 -286 1398 -1581 -448 -164 -934 561 1035
2888 1035 835 -723 674 417 -225 523 -598 1132 -597 898 -861 1704 -316 -20 692 -296 1507
2905 1507 -546 1199 -860 269 -449 560 594 -830 735 -651 1096 -1448 -42 -162 331 311 -593
2922 -593 1315 -552 813 -167 641 -578 -854 205 -961 1105 -955 614 -322 -241 -117 -916 524
2939 524 -241 421 -1464 263 -1069 -6 -364 -800 279 -559 1643 -1160 480 -425 430 697 -354
2956 -354 672 -489 395 -428 386 -353 31 -24 -594 880 -483 565 -551 163 264 -439 569 -824
2974 -824 1169 -477 686 -129 278 -29 106 645 -1047 800 -626 645 -165 85 296 -560 950
2991 950 -554 615 -647 473 -216 64 267 -1010 757 -985 246 -646 94 -24 -654 812 -1400
3008 -1400 1044 -1430 340 -367 -499 17 -473 879 -294 735 -818 549 -283 -327 -384 -126 447 -1014
3026 -1014 -161 -151 17 -362 -671 649 -619 364 -938 659 -746 900 -81 -54 928 -432 1547 -961
3044 -961 687 -117 698 655 380 1345 -432 931 -571 575 -241 26 367 142 760 -873 458 -765
3062 -765 440 163 253 557 -240 1410 -273 729 -732 295 -153 -183 921 -489 327 -1342 1339
3079 1339 -492 472 -174 -588 620 -721 1008 -787 688 -743 288 344 -972 1608 -1054 635
3095 635 -894 -150 -174 -168 709 -716 338 -540 518 -378 304 -291 451 376 -435 1352 -272 617 -773
3114 -773 291 -205 -158 733 -722 413 -427 683 -417 471 166 -103 567 -776 1330 -1029 1068
3131 1068 -207 -638 179 -759 879 -605 767 -283 128 141 -623 196 -1125 651 -1426 934 -176
3148 -176 -331 489 -702 1006 -1370 1193 -630 1305 -692 54 304 -592 121 -574 516 -1062 763
3165 763 120 -27 19 -835 377 -1136 383 -669 -16 -315 -296 213 -493 452 -402 638 -464 268 -141
3184 -141 98 306 -484 1073 -339 652 -937 682 211 -295 1210 -303 1049 -522 433 -215 463
3201 463 -67 -48 1208 -323 548 -1276 619 270 43 938 -754 694 -872 815 82 333 312 -33
3219 -33 448 -848 750 -671 422 -567 -141 -224 -455 336 -985 1072 -751 786 -757 808 335
3236 335 -796 596 -585 819 -811 363 -290 -266 -235 -314 -91 -1023 339 -901 -520 -193 2 275
3254 275 -838 691 -599 381 56 -125 235 -427 495 -483 565 -937 784 -326 292 -204 -391 1026
3272 1026 -676 366 -1108 1125 -634 128 315 -788 784 -1211 1703 -418 -27 210 475 377 -580
3289 -580 595 -862 312 -568 868 -90 -532 858 -1223 131 -1136 446 -705 512 101 -187
3305 -187 922 -1121 1096 -638 405 -438 -224 203 -1098 317 -577 579 -937 328 182 -319 548
3322 548 -634 -434 -128 429 -457 -221 -245 -190 713 -552 1357 -793 1177 448 55 -45 -28 895 -812
3341 -812 742 -314 523 32 323 521 -48 634 -434 1019 -640 1172 334 238 630 -489 853 -537
3359 -537 278 -263 302 -38 30 629 -564 1000 -713 465 -318 199 10 -76 891 -422 660 -852
3377 -852 -154 -548 -205 377 -442 416 -448 398 -614 277 110 -56 178 -669 694 -554 553 -632
3395 -632 -273 -15 -78 458 -564 912 -69 297 -1061 353 -438 -686 139 -848 714 -624 843 -610
3413 -610 -192 117 -341 226 -685 498 -141 357 -342 19 720 -672 1049 -366 431 -541 327 169 -94
3432 -94 522 -876 723 -502 83 14 289 652 -1354 892 -654 221 -597 15 -634 -146 198 -710 730
3451 730 -260 483 -264 48 -39 -196 -72 -1139 485 -388 219 -371 -296 -435 -611 224 -609 234 -609 361
3471 361 -658 -99 -652 -714 382 -418 550 -585 433 -351 -336 547 -551 437 -849 -56 -100 216 -495
3490 -495 -24 370 -739 995 -741 958 -404 464 -273 -115 988 -806 495 -493 1142 285 311
3507 311 87 -247 649 -102 779 -649 312 -331 -104 277 -272 396 -996 1039 -263 322 -246 -156 311
3526 311 -455 202 -827 502 -363 68 17 -291 267 -690 767 -280 281 -547 -93 19 -793 -64 -709
3545 -709 413 -798 613 -215 91 -390 -250 556 -1318 667 -812 217 109 -195 307 -700 640
3562 640 -321 933 -469 459 -160 -210 425 -695 15 -563 -40 -258 83 -182 -18 474 -1188 766 319
3581 319 89 -328 878 -248 -441 190 -826 494 -286 305 447 -371 857 -703 618 -1873 277
3598 277 -610 -126 -469 -1059 -78 119 2 -333 129 -904 519 -1087 -780 718 -154 378 -400 350 -541
3617 -541 244 414 -444 160 -547 738 -257 -79 -264 -414 31 -396 695 -605 181 -759 249 -305 -543
3636 -543 279 -589 770 -702 712 -586 -371 219 251 660 -206 667 -594 451 -698 324 251 99
3654 99 364 -388 668 -630 446 439 -544 -67 -746 484 -570 506 3 363 -84 123 494 -222 449
3673 449 -360 692 -380 290 50 -308 324 -479 477 -510 256 -411 42 -161 -482 300 -644 1139 -160
3692 -160 -147 -631 -55 -61 -534 441 -355 90 -574 366 -149 -95 309 -317 710 -576 312 -181 419 -227 59
3713 59 189 -682 462 -482 475 -200 183 360 -337 413 -613 729 -376 313 -381 -75 429 -133 213
3732 213 -499 710 -510 497 200 82 334 -341 615 -597 571 -301 395 174 -125 268 -488 620
3750 620 -365 467 -187 42 -23 -153 320 -375 470 -500 368 77 -86 167 -320 383 -549 332 -558 403
3770 403 141 35 233 -309 443 -449 420 -467 201 48 -119 488 -481 510 -494 306 -170 70 129 -150
3790 -150 451 -528 685 -132 564 -115 152 273 -198 723 -323 642 -481 376 -105 -19 356 -287 426
3809 426 -465 535 -465 282 -31 19 220 -70 548 -520 567 -409 190 193 -175 369 -546 590 -683
3828 -683 260 -205 27 142 -190 316 -762 189 -518 350 -276 -189 428 -549 513 -488 349 -416 -35
3847 -35 133 -369 301 -436 600 -465 432 -339 44 196 -292 105 -452 585 -409 509 -108 161 -226
3866 -226 -292 263 -500 428 -265 386 -122 -87 57 -64 864 -501 674 -370 107 332 -252 470 -422 369
3886 369 -438 681 -585 378 598 -18 253 -930 900 -602 -192 -142 316 246 -734 150 -880 702
3904 702 -600 -130 158 -875 287 -281 200 -436 227 69 -288 626 -421 478 -403 53 -1423 -137
3922 -137 -647 -109 488 -497 446 -866 253 109 306 -238 23 330 59 -311 -344 395 -532 713 -351
3941 -351 164 283 -65 237 -328 406 -240 762 -100 -947 691 255 140 -179 805 -1205 364 104 -944
3960 -944 98 -293 917 -26 330 -408 287 -218 -656 -32 -253 -110 -896 -263 -301 12 132 -35 195 -348
3980 -348 390 -574 244 177 -787 54 -768 327 -589 -97 -646 -39 -169 -315 268 -635 133 -762 233 -802
4000 -802 -454 257 -265 597 9 479 -743 908 -491 -14 -180 -369 656 -397 638 -1124 753
4017 753 143 -366 -470 -439 395 -255 1132 142 837 313 -70 -529 -316 171 -643 649 172 485 1029 119
4037 119 374 -80 927 -180 969 139 73 221 -175 626 -744 101 -747 252 126 -342 186 -325 334
4056 334 -468 289 -565 6 -292 -201 239 -475 408 -535 356 -337 115 -20 -254 264 -361 423 -488 285
4076 285 -115 234 -15 -238 342 -578 389 -591 229 -246 101 124 -161 521 -222 385 -359 222 59 -96
4096 -96 119 -214 665 -280 809 -486 236 70 -155 317 -568 352 -617 339 -52 -21 151 -99 197 -393
4116 -393 -37 -239 254 -54 127 166 113 599 -526 333 -530 22 98 -292 118 -573 768 -768 411 -170
4136 -170 155 208 -185 -22 -228 404 -351 492 -76 -142 177 -221 45 -256 410 -284 384 -678 -176 251
4156 251 -40 985 133 688 -241 -319 -311 -111 159 93 55 -366 776 -434 -342 -143 24 353 -114 1106 -411
4177 -411 277 -357 -544 333 -10 298 -363 358 -371 112 -125 -187 370 -318 322 -377 252 -451 117 11
4197 11 136 226 -380 401 -406 276 -336 132 -134 -311 380 -725 228 -200 217 -26 -232 115 -54 401
4217 401 -424 430 -493 291 -231 -9 256 -436 432 -671 142 -429 155 -183 -196 537 -223 427 -285 438
4237 438 -194 182 -138 -163 426 -270 498 -542 556 -254 242 321 -403 393 -257 556 -145 190 -88 12
4257 12 29 -144 460 -364 551 -517 174 90 -51 211 -272 425 -471 417 -408 15 -90 -118 115 -537 139
4278 139 -393 334 -265 230 -39 -294 542 -253 267 -603 269 59 -16 195 -559 202 -560 320 -343 174
4298 174 100 -355 83 -348 279 -527 452 -362 206 -37 -162 307 -483 539 -425 634 -107 -1 225 -106
4318 -106 234 -354 698 -342 214 -106 226 130 -310 610 -197 672 -308 311 -114 28 266 -388 622
4337 622 -256 321 -503 151 -53 -24 456 -395 533 -316 579 -205 33 -240 -400 -25 -518 426 -456 386
4357 386 -181 -22 5 -216 361 -452 277 -410 208 -399 6 102 -393 660 -532 495 -384 188 -166 -197
4377 -197 320 -284 276 -451 130 -213 167 91 -319 280 -287 409 -432 487 -308 56 286 -300 489 -376
4397 -376 427 -164 318 -282 246 158 -168 472 -274 389 -268 534 39 34 231 -540 463 -268 161 -137 83
4418 83 308 -118 360 -115 522 -446 446 -302 189 280 -297 319 -423 482 -439 234 -142 -70 193 -352 348
4439 348 -314 285 -312 -36 -348 -22 329 -457 537 -662 499 -431 -12 227 -159 321 -266 366 -470
4458 -470 261 -129 27 55 -206 187 -484 437 -375 348 84 44 17 -300 549 -528 455 -354 112 168 17
4479 17 183 -307 372 -312 145 -226 130 -18 -288 422 -369 431 -364 387 -9 34 197 -155 289 -383 369
4500 369 -535 146 -415 -197 108 -253 222 -225 395 -642 161 -22 -228 -11 -225 260 -367 479 -371 -1
4520 -1 20 -98 62 -562 148 -581 230 -232 197 -161 -373 349 -347 507 -122 122 -123 21 -142 -258 557
4541 557 -279 532 -289 333 -214 11 92 -140 323 -391 439 86 332 41 -211 303 -34 271 -392 180
4561 180 -115 392 67 27 273 -500 504 -470 102 -114 363 70 -188 -114 -601 238 -481 31 54 36 -2
4582 -2 -131 224 -475 160 -294 135 115 -104 9 -433 284 -442 261 -292 62 -60 -252 0 -505 436 -294
4603 -294 202 -291 142 74 -236 169 -325 501 -270 245 -132 -139 319 -103 530 -485 291 83 132 -57 -75
4624 -75 222 6 257 -355 150 -350 93 106 -14 419 -288 326 -231 305 23 65 284 -208 563 -347 403
4645 403 -197 131 -126 -18 -16 -123 190 -375 419 -506 137 -335 -196 2 -257 536 -299 289 -281 45 34
4666 34 -212 365 -399 145 -561 368 -207 2 77 -348 340 -407 374 -58 251 -263 2 56 -195 438 -299
4687 -299 271 -234 288 -41 -92 267 -240 321 -217 306 -111 160 97 -30 276 -61 303 -270 309 -209 75
4708 75 -218 -239 194 -388 565 -435 342 -112 171 43 -245 548 -429 306 -295 112 83 32 4 -114 224
4729 224 -501 77 -177 104 -8 -35 303 -430 282 -327 184 -417 77 263 -101 339 -332 234 -418 250
4749 250 -168 147 141 -163 220 -314 371 -393 221 101 -144 -17 -215 265 -433 315 -565 213 31 -36 390
4770 390 -257 106 -179 534 -163 400 306 -56 340 -228 187 -99 334 -226 -35 349 -37 58 -313 205 -328
4791 -328 397 -97 -151 314 -264 199 -474 360 -160 242 -12 -60 265 -266 99 88 342 -210 -60 92 90 229
4813 229 -233 116 -437 113 -340 -160 98 -192 263 -352 117 -117 146 -60 -126 285 -115 374 -117 212
4833 212 -219 348 -4 92 63 -331 487 -206 166 -223 14 -67 20 354 -108 409 -322 496 -39 247 252 -81
4855 -81 256 -334 201 -272 463 29 86 54 -223 212 -421 91 -462 188 -98 -179 146 -99 228 -203 247
4876 247 -368 -47 -123 -179 248 -261 227 -375 156 -209 -64 1 -141 316 -466 469 -552 133 -36 185 -77
4897 -77 -612 155 -205 196 -485 -79 -227 22 94 -247 342 -198 216 -281 -22 34 -160 283 -248 376 -128
4918 -128 510 -241 143 -177 -145 246 -177 340 -408 235 -179 47 69 -304 466 -383 495 -232 250 3 3
4939 3 240 -431 368 -273 266 -318 273 -24 -53 -4 -382 206 -234 525 -414 250 42 -510 188 -334 90
4960 90 -292 38 129 -168 230 -113 249 -441 369 -424 99 -142 40 161 -366 236 -481 378 -46 36 111
4981 111 65 242 -233 332 3 92 -136 177 218 -89 341 -408 247 -274 236 -322 21 133 -415 155 -374
5002 -374 271 -282 161 -124 -15 47 -55 435 -322 191 -212 256 -36 -119 187 -208 424 -358 476 -234 -183
5023 -183 202 -198 222 -356 556 -489 313 -132 98 20 -529 103 -356 208 -543 117 -239 -21 142 -209
5043 -209 359 -311 199 -113 -65 -312 -259 283 -201 190 -384 280 -203 58 -495 -63 296 -221 115 -367 113
5064 113 339 -70 -25 -98 -151 -185 -38 -254 182 -321 301 80 -465 408 20 782 94 158 116 -641 545 -266
5086 -266 187 -304 76 -424 9 -231 55 557 161 203 -854 517 -387 -319 112 -310 -363 -303 490 -521
5106 -521 32 -373 -660 303 -843 518 -166 -155 73 374 -228 201 395 -1176 -486 -449 -108 -758 34 -295
5126 -295 -279 164 -233 -489 -539 156 -329 19 211 97 200 -233 414 -215 210 -23 -403 223 -554 -137 -602
5147 -602 320 -415 -571 117 -66 92 -214 539 -310 260 -238 52 53 -77 58 -552 480 -161 245 -167
5167 -167 -147 -57 -138 202 -129 317 -509 235 -79 211 -68 -285 440 -397 444 -265 177 63 -19 72 -379 133
5189 133 -365 177 -262 87 -3 -251 148 -198 292 -310 346 -200 -50 33 -59 259 -199 475 -244 359 -201
5210 -201 33 118 -170 435 -290 414 -63 334 72 -297 186 -248 276 -185 270 -249 -30 -54 -77 164 -96
5231 -96 377 -212 79 -158 123 2 -180 146 -240 277 -356 60 -20 44 205 -162 270 -376 273 -245 75
5252 75 -416 10 110 -478 47 -562 83 -278 209 21 52 223 -177 182 -317 203 -369 180 -145 -189 26
5273 26 -499 218 -336 395 153 91 37 -373 192 -423 311 -201 293 171 -15 94 -192 383 -400 302 -226
5294 -226 255 70 10 218 -335 332 -186 357 -197 372 14 -69 389 -229 285 -287 314 -386 246 217 -387
5315 -387 307 -341 318 -272 244 -178 -44 92 -235 217 -339 240 -187 154 -72 -81 75 -211 362 -362 244
5336 244 -209 331 90 -183 240 -338 38 -170 150 -98 -134 66 -114 418 -426 326 -292 -89 69 -82
5356 -82 89 81 197 -239 189 -297 319 -57 -32 170 -449 342 -229 267 -183 184 224 -95 324 -148 380 -423
5378 -423 254 -163 68 60 -101 164 -226 442 -31 159 -192 262 376 10 199 -190 378 -284 174 51 86
5399 86 186 -505 323 -181 423 -287 -119 -17 -145 178 -219 447 -351 308 -174 -79 -16 -268 146 -324 543
5420 543 -224 55 -475 48 178 -121 261 -418 232 -415 19 -180 -18 237 -99 175 -312 233 -47 134
5440 134 -148 -448 329 -362 246 53 152 0 -56 264 -176 187 84 33 -235 -96 -256 81 4 -320 187
5461 187 -320 377 -290 349 -30 -50 -19 -243 262 -388 139 -208 75 68 -36 -219 -319 414 -306 235 -9
5482 -9 -64 266 -349 232 15 197 -113 190 130 -89 169 -215 419 -489 281 -360 72 -141 43 128 -169 318
5504 318 -282 98 -110 415 -68 -64 86 -393 216 -281 116 -207 149 67 -210 268 -143 154 -334 306 -284
5525 -284 51 80 -204 264 -325 427 -178 144 -55 -48 129 29 101 -216 178 -332 297 -218 -15 364 -218
5546 -218 283 -130 287 -149 32 -48 -329 33 -169 466 -187 23 -120 23 105 -400 -77 -127 192 -266 -188
5567 -188 42 -407 -90 -143 148 -32 180 -610 -364 -284 68 47 220 285 -369 416 -29 214 266 -166 360 -210
5589 -210 294 -401 343 -321 935 716 -439 1062 468 516 69 335 241 120 -351 -197 171 -265 494 -178
5609 -178 87 93 85 84 -297 160 -192 277 -216 168 -188 -46 334 -174 -155 -403 163 -322 69 -143 -299 113
5631 113 -2 396 -176 -91 -425 -80 -131 -289 240 -317 248 -166 113 -114 175 178 -146 408 -148 116 -201
5652 -201 190 -82 -2 9 -326 544 -110 -17 -358 221 78 -321 101 -302 379 -263 412 -13 94 304 -173
5673 -173 184 -148 289 -201 168 78 -3 -19 -18 37 -446 272 -91 167 214 19 322 -131 295 -171 -62 -65 -66 96
5697 96 -233 12 -418 307 -249 -6 -72 -129 -32 41 177 -440 47 -195 -50 -65 -129 47 -109 257 -430 47
5719 47 -99 35 -109 91 213 -55 262 -190 157 63 74 32 -202 110 -272 328 -499 334 -152 -13 67 -223
5741 -223 414 -229 266 24 91 -125 114 235 -75 348 -402 313 -126 92 -23 -155 66 -362 328 -179
5761 -179 348 -152 143 105 22 277 -126 192 -300 117 56 161 159 58 262 -161 139 -382 206 -50 89 -53
5783 -53 -121 53 -113 188 -324 -31 162 -27 439 -263 344 -644 -407 136 35 -24 -691 438 -148 471 -414
5804 -414 371 -243 48 -53 -61 213 -217 317 -117 204 7 -72 89 -258 166 -256 124 94 250 -99 -31 300
5826 300 -174 257 -356 32 -69 149 -7 -253 291 -188 249 -303 107 -229 160 -23 -362 324 -218 251
5846 251 -174 66 123 -6 -2 -216 245 -426 197 -242 64 0 -134 15 -325 90 -365 207 -48 37 126 -78
5868 -78 129 -157 169 -225 240 -404 -6 -120 -259 56 -105 128 -261 257 33 -143 299 -196 262 -117
5888 -117 315 -85 175 -104 -325 119 -262 479 -262 262 -247 358 127 -207 125 -21 336 35 -78 -217
5908 -217 -22 124 -173 301 -362 145 -264 99 138 8 -25 -134 276 -238 206 -216 28 103 -292 55 -173
5929 -173 351 -357 275 -155 149 -111 -21 134 -101 97 -517 366 -340 144 -1 -48 237 -354 243 -78 198
5950 198 -211 -330 174 -158 -68 -289 128 -41 -12 -150 -25 97 -364 167 -148 278 -153 252 48 -186 164
5971 164 -203 383 -303 213 -160 69 135 -135 78 -358 359 -284 141 -225 -42 91 -288 245 -26 202
5991 202 -40 367 -92 30 184 -228 414 -159 390 40 123 -5 77 353 -248 173 -346 209 -26 -20 113
6012 113 -292 22 -284 199 -189 153 -179 -78 134 -170 -76 -368 31 -145 -13 -152 -260 32 -54 22 -63
6033 -63 233 -339 143 -18 -28 -149 261 388 -241 -69 141 205 -50 47 195 -177 306 -360 148 -121 77
6054 77 -280 -67 2 -248 -84 -334 231 -245 -31 9 -209 200 -362 66 -364 124 152 -216 196 -119 120
6075 120 -368 290 -199 127 153 -80 199 6 247 -531 300 -352 -83 264 -220 911 -477 15 -250 -1
6095 -1 -227 -506 150 -377 309 -423 84 35 141 -242 -14 278 29 664 -278 608 235 -159 395 -174 -46
6116 -46 -369 269 181 622 -414 -468 -184 45 388 -373 292 -346 609 80 -722 -276 -106 414 -536 -724 -156
6137 -156 -384 -235 -212 249 -660 317 -727 449 -87 84 564 -63 93 -117 715 -605 885 -180 -145
6156 -145 -221 430 -270 -803 -167 -786 419 -751 155 -270 -415 -196 -407 -8 -567 -82 -586 188 599 -253
6176 -253 699 -248 -122 60 24 -269 381 228 -504 414 -96 248 19 156 -52 169 29 -464 375 -592
6196 -592 -79 -130 -27 273 -334 525 -150 428 241 -185 -596 -442 -140 93 736 46 179 -368 204 254 -197
6217 -197 -294 -318 -118 -283 392 140 25 556 -341 -78 -263 320 -73 59 -434 69 275 96 -448 -404 136
6238 136 -346 284 -124 316 -94 -197 21 -210 216 -273 -27 129 53 137 140 -140 -323 313 -430 -174 -172 154
6260 154 -89 -149 594 82 -27 -10 -402 -327 -1 -16 -199 395 -254 134 -35 -250 197 -245 -391 -673 -64
6281 -64 14 158 -174 401 173 -235 861 -269 514 -222 -346 186 -320 -590 -157 47 -22 -329 -394 -76 969
6302 969 -354 -492 -526 -296 -820 -202 -516 614 114 276 -316 -338 275 -388 -94 484 24 630 41 625
6322 625 -288 278 81 -431 41 346 494 -386 773 64 598 -310 -314 291 37 238 -472 99 -339 67
6342 67 -140 40 178 -414 -94 7 240 -378 22 -209 -208 75 95 106 -521 261 67 276 -80 -95 19 -145
6364 -145 345 -395 116 -147 120 -6 -85 -48 -222 196 -431 -11 -18 24 -109 -99 100 -282 146 -493 276 -210
6386 -210 -146 -12 89 302 -340 269 -179 -128 222 7 -176 -223 -68 -127 76 62 229 -130 -92 152 -38 232
6408 232 -310 296 177 -8 152 16 324 -182 164 -189 246 67 184 78 -346 29 -144 149 -5 225
6428 225 -68 57 73 -232 272 -70 133 -272 329 12 -143 152 -600 190 -153 208 -132 -12 -16 -283 436
6449 436 -468 169 -150 146 237 -33 -37 -214 -3 -248 64 -258 -13 109 -196 -93 -149 96 -136 114 -70
6470 -70 166 -10 -323 251 -471 237 -158 49 -134 87 74 -174 174 -247 -48 -134 0 -62 15 113 -17 134
6492 134 -268 321 -77 232 -16 211 313 -330 278 76 73 -64 -71 115 -24 13 -278 49 -232 255 124 -53
6514 -53 110 -186 326 -172 272 -41 -37 -305 198 110 -188 144 -50 436 -379 114 -3 84 39 -609 273 -832
6536 -832 -10 -766 -214 -51 107 205 -88 -76 -143 997 336 -456 125 30 146 -460 476 -395 142 575 -156
6557 -156 -73 18 402 -703 -790 188 -292 -138 516 -411 -244 238 -365 127 -760 36 -151 -126 535 -572 153
6578 153 -376 -5 -765 -186 -214 562 97 101 566 -55 -363 615 -2 -139 -290 -52 -354 796 -34 -455 363
6599 363 151 -344 -152 199 -603 -226 327 -19 453 306 -105 -429 573 -945 808 471 -408 190 98
6618 98 -29 -404 -154 -237 -53 -37 511 -174 165 152 -28 283 -703 -395 -1 236 -152 -169 -55 -332 424 -392
6640 -392 390 -55 -177 42 -58 168 -348 404 125 15 -149 -269 557 -452 492 -214 176 523 33 68
6660 68 16 488 -252 165 -445 -116 -120 -289 402 -282 -38 180 -38 -373 274 161 -264 -103 -382 143 -396
6681 -396 293 -387 426 552 126 318 -96 168 -633 638 -272 -243 62 77 75 -576 -109 -215 -12 -193 235
6702 235 230 -131 166 -442 585 67 131 -617 -76 -240 -31 513 -110 442 -483 -49 54 45 551 23 130
6723 130 -131 124 4 11 545 -431 314 -275 287 145 -178 103 375 433 -229 305 -237 396 -242 250 99
6744 99 -308 110 -159 -216 -179 177 -51 135 25 -198 139 -204 232 -402 61 -329 -29 157 -182 150 -113
6765 -113 123 -302 379 4 23 283 -334 421 -48 387 -217 -37 -53 -165 37 -296 428 -299 124 -226 311
6786 311 -98 22 -352 65 -8 -93 505 -34 257 -145 -63 189 -339 -50 332 -28 -16 -4 -273 -59 301 117
6808 117 532 144 -126 102 -258 -127 -200 165 -54 345 -360 712 40 -678 467 194 738 29 54 -29
6828 -29 17 359 -76 -105 -55 390 412 611 217 -77 493 -108 460 -347 97 -212 -273 -234 364 586 -411 5
6850 5 291 715 -500 262 178 155 436 147 7 23 -202 81 587 649 226 -141 138 44 -114 607 -79 -44
6872 -44 232 -199 528 115 16 -50 641 -93 -166 214 -491 276 -339 -340 -17 98 131 -94 431 -577 536 -370
6894 -370 -264 197 -140 -39 -222 137 -794 68 -24 21 277 165 64 187 205 -95 117 150 98 -114 175 1126
6916 1126 -156 609 -412 -203 -119 -134 171 111 275 -387 203 285 997 158 468 -353 517 121 -133 212
6936 212 31 576 497 -228 -38 -170 -169 358 130 -496 106 -331 -799 81 160 34 57 1470 303 78 176
6957 176 -60 -258 -1186 -64 308 550 -379 -5 -13 -152 24 469 586 -47 491 -496 283 110 -455 83
6977 83 44 302 -123 298 -403 781 81 -683 652 -8 -393 -35 603 116 -216 -62 403 1438 824 745
6997 745 -535 -337 42 -145 509 375 -109 11 -165 -55 -60 -510 -625 309 -53 -26 412 -72 112 -270 120
7018 120 410 856 -701 496 -375 450 -138 27 102 159 44 -91 107 -3 -301 25 188 -69 74 161
7038 161 -62 -98 -278 -177 424 42 347 -128 -49 106 -179 62 -248 194 -384 333 -203 139 -94 155 149
7059 149 57 214 -267 158 -69 202 -106 199 -55 -113 199 -47 5 -157 24 93 -171 165 62 160 -152 117
7081 117 -119 106 -53 -53 40 -186 117 -287 73 -53 176 -121 -180 56 -168 256 -195 261 -82 -100 154 84
7103 84 -39 -59 205 -60 -96 -245 -72 -69 -6 116 -324 -4 -768 -60 -180 236 -5 29 -138 -358 227 -685
7125 -685 -58 59 332 157 -483 42 -351 -190 -209 -31 127 -127 533 -652 49 -326 -258 278 -199 -513
7145 -513 -262 -38 -494 502 194 480 -844 613 -179 214 470 -232 -161 443 -15 -182 703 -237 -55 263
7165 263 -133 706 587 -446 -640 -765 325 -265 348 80 -72 -272 304 623 100 212 468 -103 100
7184 100 447 320 -219 126 258 638 232 4 -36 -122 -364 6 298 -57 103 -273 -370 -212 63 184 -320
7205 -320 444 134 50 -189 117 388 -327 292 102 -2 13 221 -364 -70 -323 -285 108 -303 143 -820 -65
7226 -65 -506 336 -15 77 169 -254 192 -199 160 -463 238 -230 -5 338 208 225 -261 10 221 270 37 -207
7248 -207 -51 -564 198 -80 24 79 176 49 -165 346 -303 307 -258 6 -97 224 138 -87 156 -138 98
7269 98 -111 -46 -407 167 -19 51 -140 -67 -38 28 -26 -165 44 176 -156 141 -248 271 -5 57 141 -1 235
7292 235 -102 168 -85 257 199 -96 -20 -345 493 -293 122 -260 264 -254 -349 41 -279 371 -107 14 -107
7313 -107 84 270 -62 4 135 121 -385 186 190 -210 -399 0 225 7 90 13 -27 149 -303 -145 -224 -33 -192
7336 -192 144 166 -5 -631 119 106 -101 163 -316 154 -233 163 -368 -343 -206 217 76 -542 -214 623 176
7357 176 -312 12 -9 -234 -636 169 -187 67 37 11 -647 -75 -758 -162 -446 -103 -8 -334 -500 -834 202
7378 202 88 453 265 -151 466 -304 -918 430 38 -798 -518 -29 -156 -422 465 114 125 -435 -693 -161
7398 -161 -700 113 -125 104 45 -138 -1 -10 410 -132 -57 236 293 287 -375 387 -34 212 -20 32 25 -456 182
7421 182 -233 351 65 -150 -316 -43 -5 -420 193 -102 129 -81 -154 207 -205 88 -171 157 -100 174 -160
7442 -160 67 -17 -237 49 -232 83 249 -36 321 -25 166 -200 103 24 37 -100 -78 158 -46 100 -42
7463 -42 43 -214 55 -63 -111 174 -142 141 -108 167 42 -20 175 66 247 -206 129 -213 203 42 87 -34
7485 -34 123 148 -94 196 -130 17 0 -125 367 -279 38 67 366 -198 -121 -131 -85 -13 47 302 -210 82 -252
7508 -252 67 255 -254 -73 -24 -7 -255 19 13 164 152 -10 135 -212 56 -26 13 25 105 10 -19 -61 -328 74
7532 74 -259 -53 -169 78 76 -27 130 -185 122 -17 58 138 164 174 -95 72 -74 386 -207 45 -52 -103 297
7555 297 -322 129 -25 196 -185 301 71 78 163 -126 229 -163 97 99 -113 -9 -6 -3 -288 162 -114 48 -18
7578 -18 25 -17 -134 156 -219 246 57 -42 -267 160 -62 -224 -70 -150 191 -165 0 -75 -149 233 -139 133
7600 133 -126 266 -59 -103 339 -214 -43 -61 625 -211 -159 -556 15 177 455 -48 -211 -98 -165 101 -258
7621 -258 -114 61 -459 226 -598 -76 -524 310 430 -190 252 -342 -80 -48 -251 -183 306 -19 63 199 -357
7642 -357 285 -243 -304 162 -256 -95 -25 -237 139 6 -348 96 157 -229 -145 60 81 -280 -30 31 494 -29
7664 -29 -971 128 160 67 -207 -510 254 1081 -259 -488 504 -340 327 -325 69 -481 -351 -501 -23 -459
7684 -459 -300 783 -308 6 -351 467 2 -97 23 -507 235 -51 287 134 -44 287 -196 308 229 -70
7704 -70 152 -43 82 -92 221 -87 96 -307 -22 43 -21 37 -139 275 -355 112 -172 5 -245 -53 139
7725 139 97 374 -215 276 -44 7 -171 -178 189 -468 142 -44 89 173 -60 -132 -93 -57 222 145 -61 101 81
7748 81 237 -49 -433 119 -47 139 -345 5 -75 -164 19 81 243 -249 132 -40 -112 74 -64 109 -171 314
7770 314 -163 134 -201 43 79 -4 -35 60 247 -92 209 -70 189 -49 -62 233 -161 202 -308 90 0 148
7792 148 -74 -376 181 -126 25 -157 -78 -27 -83 219 -217 158 -105 -78 42 -106 47 -228 -78 -91 305 68
7814 68 -47 -1 63 -321 -94 64 -195 230 -330 32 -20 -94 150 91 195 169 -320 45 -265 64 60 157 -16
7837 -16 23 -8 -185 -249 84 382 -272 -172 -377 143 421 197 -612 -390 -107 -525 123 -502 -966 -422 -172
7858 -172 -116 -98 472 -807 -3 271 -288 -321 83 525 114 12 236 -479 -255 -173 47 -31 -118 99 -213 85
7880 85 273 -269 -258 -612 28 -447 -77 -89 -89 -38 -138 -5 143 432 37 -260 418 177 125 -117 15 -193
7902 -193 -24 191 -172 13 -157 246 94 114 147 -271 583 512 -436 57 -650 285 -12 78 -153 -164 -273 -213
7924 -213 243 -163 -262 -381 505 231 572 -364 445 203 244 -63 137 234 -135 -329 -293 -189 78 259 351 -442
7946 -442 1 -7 224 201 67 127 -286 -450 71 556 -227 27 -155 0 46 -254 228 -407 -568 -70 748 414
7968 414 -60 650 -379 -866 -238 53 976 381 -263 396 170 -246 106 -91 515 28 -301 369 -330 152
7988 152 376 516 -113 29 51 59 -158 390 252 107 90 44 255 -86 40 -196 -455 -148 -323 601 -878
8009 -878 776 167 461 -546 -469 -639 -538 659 -336 511 -725 959 441 -298 687 -334 -480 -790
8027 -790 -333 -664 -83 1 -116 436 -167 -662 305 -642 -201 -241 -222 -432 -856 -232 266 155 -266 189 466
8048 466 61 -571 387 105 308 -164 -165 -181 784 152 -309 -4 316 25 -255 -54 40 100 193 -111 299 -158
8070 -158 -210 82 -89 358 -454 320 -367 188 -23 106 -13 -180 327 -399 842 169 -376 -195 39 14
8090 14 251 106 -821 -51 1045 -67 30 314 448 -689 -254 -320 -238 -366 140 -408 -243 136 27 67 164
8111 164 -30 -33 -65 -3 -323 307 -235 154 -126 -37 -240 25 -106 -34 148 -209 53 -267 2 -99 -18 8 -148
8134 -148 164 138 83 9 81 -231 -27 266 -74 51 -168 68 -173 84 255 -161 173 -92 15 -299 324
8155 324 206 -9 78 -2 80 -325 178 -271 142 104 -145 -63 -80 157 50 -101 -224 34 -109 -148 141 -116
8177 -116 227 -309 147 33 164 -155 -110 184 -120 409 -241 -93 -13 -30
8191c0
##END NTUPLES=NMR FID
##END=
