##TITLE=1H_79-2022
 CDCl3
 8 sc, 
 26.09.2022
##JCAMPDX= 6.0         $$ Bruker NMR JCAMP-DX V2.0
##DATA TYPE= NMR SPECTRUM
##DATA CLASS= NTUPLES
##ORIGIN= UXNMR, Bruker Analytische Messtechnik GmbH
##OWNER= root
$$ XWIN-NMR		Version 3.5
$$ Mon Sep 26 14:04:17 2022 Russian Standard Time (UT+4h)  she@DPX200
##.OBSERVE FREQUENCY= 200.1313499994
##.OBSERVE NUCLEUS= ^1H
##.ACQUISITION MODE= SIMULTANEOUS
##.ACQUISITION SCHEME= undefined
##.AVERAGES= 8
##.DIGITISER RES= 18
##SPECTROMETER/DATA SYSTEM= spect
##.PULSE SEQUENCE= zg30
##.SOLVENT NAME= CDCl3
##.SHIFT REFERENCE= (INTERNAL, CDCl3, 0, 15.7634)
##AUDIT TRAIL= $$ (NUMBER, WHEN, WHO, WHERE, WHAT)
$$ ##TITLE= Audit trail, XWIN-NMR		Version 3.5
$$ ##JCAMPDX= 5.01
$$ ##ORIGIN= Bruker BioSpin GmbH
$$ ##OWNER= she
$$ F:/spectra/data/she/nmr/H-F/1/pdata/1/auditp.txt
$$ ##AUDIT TRAIL=  $$ (NUMBER, WHEN, WHO, WHERE, WHAT)
(   1,<2022-09-26 14:01:53.03 +0400>,<she>,<DPX200>,
      <created by zg, POWCHK disabled, PULCHK disabled
       configuration hash MD5:
       00 E9 B6 7A A2 85 ED C7 34 08 36 98 17 FE 4E 26
       data hash MD5: 16K
       7F BC 6C 90 4F 74 F2 78 B2 D9 39 AF DE 35 DE 14>)
(   2,<2022-09-26 14:01:56.57 +0400>,<she>,<DPX200>,
      <Start of raw data processing
       efp BC_mod = 2 LB = 0.24 FT_mod = 6 PKNL = 1 PHC0 = -17947.57 PHC1 = 11.00069 SI = 16K 
       data hash MD5: 16K
       39 B6 AA 77 BB 7D A1 61 2A 75 3A AA A2 EE 69 7A>)
(   3,<2022-09-26 14:02:21.65 +0400>,<she>,<DPX200>,
      <pk PHC0 = -80.11404 PHC1 = -1.8 
       data hash MD5: 16K
       AA 52 9E C8 7C 5B 09 E7 CC 42 3E B6 CB BF E2 93>)
(   4,<2022-09-26 14:02:25.07 +0400>,<she>,<DPX200>,
      <abs ABSG = 5 
       data hash MD5: 16K
       AC 50 E5 39 6D 15 8F F1 86 D1 E3 DA 39 B3 94 A4>)
$$ ##END=
$$ 
$$ hash MD5
$$ 8B 1D BC AA F5 F8 60 80 94 18 3F 15 81 C1 46 38
##$RELAX= 
##$RELAX= 
##$RELAX= 
##$RELAX= 
##$RELAX= 
##$RELAX= 
$$ Bruker specific parameters
$$ --------------------------
##$DU= <F:/spectra>
##$EXPNO= 1
##$NAME= <H-F>
##$PROCNO= 1
##$TYPE= <nmr>
##$USER= <she>
##$AMP= (0..31)
100 100 100 100 100 100 100 100 100 100 100 100 100 100 100 100 100 100 
100 100 100 100 100 100 100 100 100 100 100 100 100 100 
##$AQSEQ= 0
##$AQ_mod= 1
##$AUNM= <au_zg>
##$AUTOPOS= <>
##$BF1= 200.13
##$BF2= 200.13
##$BF3= 200.13
##$BF4= 200.13
##$BF5= 200.13
##$BF6= 200.13
##$BF7= 200.13
##$BF8= 200.13
##$BYTORDA= 1
##$CFDGTYP= 0
##$CFRGTYP= 5
##$CHEMSTR= <none>
##$CNST= (0..31)
1 1 145 1 1 1 1 1 1 1 1 1 1 1 1 1 1 1 1 1 1 1 1 1 1 1 1 1 1 1 1 1 
##$CPDPRG= <>
##$CPDPRG1= <>
##$CPDPRG2= <>
##$CPDPRG3= <>
##$CPDPRG4= <mlev>
##$CPDPRG5= <mlev>
##$CPDPRG6= <mlev>
##$CPDPRG7= <mlev>
##$CPDPRG8= <mlev>
##$CPDPRGB= <>
##$CPDPRGT= <>
##$D= (0..31)
0 1.2 0 0 0 0 0 0 0 0.06 0 0.03 0 0 0 0 0.0002 0 0 0 0 0 0 0 0 0 0 0 0 
0 0 0 
##$DATE= 1664186512
##$DBL= (0..7)
120 120 120 120 120 120 120 120 
##$DBP= (0..7)
150 150 150 150 150 150 150 150 
##$DBP07= 0
##$DBPNAM0= <>
##$DBPNAM1= <>
##$DBPNAM2= <>
##$DBPNAM3= <>
##$DBPNAM4= <>
$$ [...]
##$SUBNAM3= <"">
##$SUBNAM4= <"">
##$SUBNAM5= <"">
##$SUBNAM6= <"">
##$SUBNAM7= <"">
##$SUBNAM8= <"">
##$SUBNAM9= <"">
##$SW= 18.0517283424941
##$SWIBOX= (0..15)
0 0 2 0 0 0 0 0 0 0 0 0 0 0 0 0 
##$SW_h= 3612.71676300578
##$TD= 16384
##$TD0= 1
##$TE= 0
##$TE2= 300
##$TE3= 300
##$TEG= 300
##$TL= (0..7)
0 120 120 120 120 120 120 120 
##$TP= (0..7)
150 150 150 150 150 150 150 150 
##$TP07= 0
##$TPNAME0= <>
##$TPNAME1= <>
##$TPNAME2= <>
##$TPNAME3= <>
##$TPNAME4= <>
##$TPNAME5= <>
##$TPNAME6= <>
##$TPNAME7= <>
##$TPOAL= (0..7)
0.5 0.5 0.5 0.5 0.5 0.5 0.5 0.5 
##$TPOFFS= (0..7)
0 0 0 0 0 0 0 0 
##$TUNHIN= 0
##$TUNHOUT= 0
##$TUNXOUT= 0
##$USERA1= <user>
##$USERA2= <user>
##$USERA3= <user>
##$USERA4= <user>
##$USERA5= <user>
##$V9= 5
##$VALIST= <valist>
##$VCLIST= <CCCCCCCCCCCCCCC>
##$VD= 0
##$VDLIST= <DDDDDDDDDDDDDDD>
##$VPLIST= <PPPPPPPPPPPPPPP>
##$VTLIST= <TTTTTTTTTTTTTTT>
##$WBST= 1024
##$WBSW= 4
##$XGAIN= (0..3)
0 0 0 0 
##$XL= 0
##$YL= 0
##$YMAX_a= 603675
##$YMIN_a= -524721
##$ZGOPTNS= <>
##$ZL1= 120
##$ZL2= 120
##$ZL3= 120
##$ZL4= 120
##$ABSF1= 15.91437
##$ABSF2= -2.137484
##$ABSG= 5
##$ABSL= 3
##$ALPHA= 0
##$AQORDER= 0
##$ASSFAC= 0
##$ASSFACI= 0
##$ASSFACX= 0
##$ASSWID= 0
##$AUNMP= <proc_1d>
##$AZFE= 0.1
##$AZFW= 0.1
##$BCFW= 0
##$BC_mod= 2
##$BYTORDP= 0
##$COROFFS= 0
##$CY= -3
##$DATMOD= 1
##$DC= 0
##$DFILT= <>
##$DTYPP= 0
##$F1P= 0
##$F2P= 0
##$FCOR= 1
##$FTSIZE= 16384
##$FT_mod= 6
##$GAMMA= 0
##$GB= 0
##$INTBC= 1
##$INTSCL= 3.70164e-10
##$ISEN= 128
##$LB= 0.24
##$LEV0= 0
##$LPBIN= 0
##$MAXI= 10000
##$MC2= 0
##$MEAN= 0
##$ME_mod= 0
##$MI= 1.114404
##$NCOEF= 0
##$NC_proc= -6
##$NLEV= 6
##$NOISF1= 3.799351
##$NOISF2= 2.8
##$NSP= 0
##$NTH_PI= 0
##$NZP= 0
##$OFFSET= 15.76342
##$PC= 1
##$PHC0= -18027.68
##$PHC1= 9.20069
##$PH_mod= 1
##$PKNL= yes
##$PPARMOD= 0
##$PSCAL= 0
##$PSIGN= 0
##$REVERSE= no
##$SF= 200.130001625947
##$SI= 16384
##$SIGF1= 3
##$SIGF2= 2
##$SINO= 5.538805
##$SIOLD= 16384
##$SREGLST= <1H.CDCl3>
##$SSB= 0
##$STSI= 16384
##$STSR= 0
##$SW_p= 3612.71676300578
##$SYMM= 0
##$S_DEV= 0
##$TDeff= 16384
##$TDoff= 0
##$TI= <>
##$TILT= no
##$TM1= 0
##$TM2= 0
##$TOPLEV= 0
##$USERP1= <user>
##$USERP2= <user>
##$USERP3= <user>
##$USERP4= <user>
##$USERP5= <user>
##$WDW= 1
##$XDIM= 16384
##$YMAX_p= 336872977
##$YMIN_p= -449822
$$ End of Bruker specific parameters
$$ ---------------------------------
##NTUPLES= NMR SPECTRUM
##VAR_NAME=  FREQUENCY,     SPECTRUM/REAL,   SPECTRUM/IMAG
##SYMBOL=    X,             R,               I
##VAR_TYPE=  INDEPENDENT,   DEPENDENT,       DEPENDENT
##VAR_FORM=  AFFN,          ASDF,            ASDF
##VAR_DIM=   16384,         16384,           16384
##UNITS=     HZ,            ARBITRARY UNITS, ARBITRARY UNITS
##FACTOR=    0.220516191357247, 1,           1
##FIRST=     3154.73329124023, 0,            0
##LAST=      -457.983471765554, 0,           0
##MIN=       -457.983471765554, -449822,     0
##MAX=       3154.73329124023, 336872977,    0
$$ Real data points
##PAGE= N=1
##DATA TABLE= (X++(R..R)), XYDATA
$$ [...]
$$ plain form
11912 34077 -39983 9681 96468 35909 47454 98085 69566 -100193 -186992 -60462 -41659
11901 -41659 -67901 -27190 21444 -1576 182261 292344 230470 151633 196675 237252 51789
11890 51789 -31879 81913 -11502 -28777 49085 -146335 31275 -3192 -85923 -27740 193732
11879 193732 31463 -88482 -13499 -53419 -121202 -57013 47354 9958 -156472 -191719 -52391
11868 -52391 9004 -40701 -70286 -62586 5769 2718 -23434 27252 -642 18245 3025 -69501
11856 -69501 -2706 -175418 66694 200547 44371 -28953 -9246 -456 -213003 -79491 102976
11845 102976 175197 127648 -36025 -20575 50601 -44176 -11378 -33227 -183756 -248164 -147417
11834 -147417 -71167 8490 32165 26113 -92691 -58940 60376 70280 89276 170953 142009
$$ packed form
11912C4077p4060M9664Q6787o0559J1545N0631k8519j69759q6799J26530J8803
11901d1659k6242M0711M8634k3020J83837J10083o1874p8837M5042M0577j85463
11890E1789q3668J13792r3415j7275P7862j95420J77610l4467q2731N8183K21472
11879A93732j62269j19945P4983l9920o7783O4189J04367l7396j66430l5247J39328
11868e2391O1395m9705k9585P700O8355l051k6152N0686k7894J8887j5220p2526
11856f9501O6795j72712K42112J33853j56176p3324J9707Q790k12547J33512J82467
11845A02976P2221m7549j63673J5450P1176r4777L2798k1849j50529o4408J00747
11834a47417P6250P9657K3675o052j18804L3751J19316R904J8996Q1677k8944
$$ plain form
11823 142009 206471 134927 149823 104970 116905 6965 -143207 -90387 13324 -102294 -110404
11812 -110404 -68408 -161329 689 72562 -65695 -121371 62001 102622 20162 -85568 48961
11801 48961 68844 35906 -52950 57810 88432 6870 -33704 10329 -31633 -53304 -120493
11790 -120493 -50187 -20570 -125143 -182566 -118779 -49864 -165928 -78850 -6310 -6041 96357
11779 96357 -106039 -153226 111459 38082 74615 15888 64667 136798 -12466 55957 36915
11768 36915 37481 -41426 -18807 -53666 120150 -67285 -5207 -2138 -170478 -133425 -144732 -130278
11756 -130278 -4092 19545 52300 70906 -59444 68660 132431 7496 -82796 -25332 -106557
11745 -106557 -240076 -101056 40424 -168619 -130455 -150422 -104187 -226343 -82799 -10428
$$ packed form
11823A42009O4462p1544J4896m4853J1935j09940j50172N2820J03711j15618q110
11812a10404M1996r2921J62018P1873j38257n5676J83372M0621q2460j05730J34529
11801D8961J9883l2938q8856J10760L0622q1562m0574M4033m1962k1671o7189
11790a20493P0306K9617j04573n7423O3787O8915j16064Q7078P2540K69J02398
11779I6357k02396m7187K64685p3377L6533n8727M8779P2131j49264O8423j9042
11768C6915N66p8907K2619l4859J73816j87435O2078L069j68340L7053j1307J4454
11756a30278J26186K3637L2755J8606j30350J28104O3771j24935r0292N7464q1225
11745a06557j33519J39020J41480k09043L8164j9967M6235j22156J43544P2371
$$ plain form
11735 -10428 -7238 -47519 63539 163609 51429 -83725 -21263 -21625 -56094 116090 100263
11724 100263 164333 115335 70619 139753 73625 128348 34022 -2214 43942 -49644 -122833
11713 -122833 -199467 -7932 -60992 -47489 -9201 -55829 -75390 -83830 -85517 -144324 -99169 -10121
11701 -10121 -75708 -118652 -94306 -91416 -70458 -85315 -72787 905 -67641 -36419 75334 248236
11689 248236 307130 24259 85806 115112 69403 122943 67859 -56267 -40682 32539 88651
11678 88651 76062 127909 34314 144116 66020 -54432 -26492 -75468 -25053 94819 437
11667 437 -7688 -41813 -119055 -76951 -15539 -16802 -163046 -117786 -157600 -215893 -284418 -243914
11655 -243914 -149842 -58579 -57787 -103687 1830 95771 75486 64086 73892 -51016 -134201 -87430
$$ packed form
11735a0428L190m0281J11058J00070j12180j35154O2462l62l4469J72184j5827
11724A00263O4070m8998m4716O9134o6128N4723r4326l6236M6156r3586p3189
11713a22833p6634J91535n3060J3503L8288m6628j9561q440j687n8807M5155Q9048
11701a0121o5587m2944K4346K890K0958j4857J2528P3692o8546L1222J11753J72902
11689B48236N8894k82871O1547K9306m5709N3540n5084j24126J5585P3221N6112
11678H8651j2589N1847r3595J09802p8096j20452K7940m8976N0415J19872r4382
11667D37q125l4125p7242M2104O1412j263j46244M5260l9814n8293o8525M0504
11655b43914R4072R1263P92m5900J05517R3941k0285j1400R806j24908q3185M6771
$$ plain form
11643 -87430 -27997 -63108 -95846 -3725 117143 248379 347803 295625 90618 75876 65223
11632 65223 -31017 -62045 -28703 -87616 39922 88733 229034 197486 -111769 -150225 -129264
11621 -129264 -33953 -36087 -98560 -85836 -194620 -64965 -108021 -79401 -53940 -80573 -125535
11610 -125535 -10732 97702 22369 161529 160699 151723 76518 136472 179575 8290 19240
11599 19240 59952 66983 -23957 97796 -3838 14990 112738 117443 165770 -33757 -90913
11588 -90913 -146232 -75219 -225601 -185847 -37416 39010 119887 142395 87425 93799 28517
11577 28517 147958 111913 -94433 -45419 119016 132982 132155 172325 133628 -16055 48607
11566 48607 68257 -261337 -95405 57122 -65557 -6382 -20330 -44895 -56520 -95116 -75701
$$ packed form
11643h7430N9433l5111l2738R2121J20868J31236R9424n2178k05007j4742j0653
11632F5223r6240l1028L3342n8913J27538M8811J40301l1548l09255l8456K0961
11621a29264R5311k134o2473J2724j08784J29655m3056K8620K5461k6633m4962
11610a25535J14803J08434p5333J39160q30q976p5205N9954M3103j71285J0950
11599A9240M0712P031r0940J21753j01634J8828R7748M705M8327j99527n7156
11588i0913n5319P1013j50382L9754J48431P6426Q0877K2508n4970O374o5282
11577B8517J19441l6045k06346M9014J64435J3966q27M0170l8697j49683O4662
11566D8607J9650l29594J65932J52527j22679N9175j3948k4565j1625l8596J9415
$$ plain form
11555 -75701 -29725 -33588 2759 12477 43726 -46041 -142902 7097 94616 98741 -52044 16526
11543 16526 54545 11152 -63349 -159973 -237417 -17512 41801 121960 165476 15697 -91807
11532 -91807 -119960 -157828 -152658 -59725 18543 -8947 -46930 -10469 29167 -4710 -24419 -8352
11520 -8352 -177934 -133693 -11142 -14309 70294 42677 -2522 -1457 -17359 60898 124746 143252
11508 143252 14196 -10215 137790 143693 22194 10774 191243 171916 112310 105245 74459
11497 74459 113839 113108 229242 197974 116271 48419 161787 26838 62356 -129512 -110180
11486 -110180 15887 17850 -6986 -18753 -61212 -158799 -122406 -45548 121905 21619 101567
11475 101567 120563 31224 85042 -28716 -77609 -10232 -14786 81062 239046 167691 176554
$$ packed form
11555g5701M5976l863L6347R718L1249q9767r6861J49999Q7519M125j50785O8570
11543A6526L8019m3393p4501r6624p7444K19905N9313Q0159M3516j49779j07504
11532i1807k8153l7868N170R2933P8268k7490l7983L6461L9636l3877j9709J6067
11520h352j69582M4241J22551l167Q4603k7617m5199J065j5902P8257O3848J8506
11508A43252j29056k4411J48005N903j21499j1420J80469j9327n9606p065l0786
11497G4459L9380p31J16134l1268q1703o7852J13368j34949L5518j91868J9332
11486a10180J26067J963k4836j1767m2459r7587L6393P6858J67453j00286P9948
11475A01567J8996q9339N3818j13758m8893O7377m554R5848J57984p1355Q863
$$ plain form
11464 176554 84073 12886 -36795 -76237 18427 107232 132088 -63792 -181747 -167495 -167984
11453 -167984 -26511 18209 -249203 -61092 -144613 -157492 -88010 -241444 -119712 -56259
11443 -56259 -30651 -36138 -118741 126404 51974 734 -35591 -48076 -40600 99042 65629 67616
11431 67616 -22540 -42584 -90438 -116408 -80316 26106 13403 -144494 122585 127083 -60171
11420 -60171 -187548 -123256 -28135 21357 45198 186673 -30095 13148 16263 -102788 -16272
11409 -16272 -91648 -166467 -120340 -59333 -150253 -154335 -21700 -183158 -85660 -25888 36424
11398 36424 -80538 -75637 161296 50941 -15161 6828 6295 108832 84741 -2504 102065
11387 102065 65242 8747 172038 153369 132169 146192 -9429 -9181 27638 -41362 89977
$$ packed form
11464A76554r2481p1187m9681l9442R4664Q8805K4856j95880j17955J4252m89
11453a67984J41473M4720k67412J88111q3521j2879O9482j53434J21732O3453
11443e6259K5608n487q2603K45145p4430n1240l6325j2485P476J39642l3413J987
11431F7616r0156k0044m7854k5970L6092J06422j2703j57897K67079M498j87254
11420f0171j27377O4292R5121M9492K3841J41475k16768M3243L115j19051Q6516
11409a6272p5376p4819M6127O1007r0920m082J32635j61458R7498N9772O2312
11398C6424j16962M901K36933j10355o6102K1989n33J02537k4091q7245J04569
11387A02065l6823n6495J63291j8669k1200J4023j55621K48L6819o9000J31339
$$ plain form
11376 89977 56687 -92811 -215027 -176429 -106683 -156284 -77544 -27289 -83346 -105445 -201004
11365 -201004 -120368 -46594 -97395 -29097 -6736 93633 -39874 -105240 97603 65076 -74865
11354 -74865 -47315 -172355 -96856 -200432 -95908 68467 30481 83269 71974 -4824 51727
11343 51727 37163 -96863 -197839 -120314 -4588 109309 55032 -114813 -75561 -105951 -182402
11332 -182402 -87032 -134950 -132053 160559 -24680 91465 76859 -122936 -91826 -40129 51225
11321 51225 47354 120868 92448 51546 -128018 -97778 79927 147750 300390 165917 -93698
11310 -93698 -34531 -89809 27881 3319 168561 -14706 -82409 -30343 -199191 -208895 -118159
11299 -118159 -62856 -254446 -150907 -251821 -312950 -67081 -5676 -41099 80000 151219
$$ packed form
11376H9977l3290j49498j22216L8598O9746m9601P8740N0255n6057k2099r5559
11365b01004Q0636P3774n0801O8298K2361J00369j33507o5366K02843l2527j39941
11354g4865K7550j25040P5499j03576J04524J64375l7986N2788j1295p6798N6551
11343E1727j4564j34026j00976P7525J15726J13897n4277j69845L9252l0390p6451
11332a82402R5370m7918K897K92612j85239J16145j4606j99795L1110N1697R1354
11321E1225l871P3514k8420m0902j79564L0240J77705O7823J52640j34473k59615
11310i3698N9167n5278J17690k4562J65242j83267o7703N2066j68848r704R0736
11299a18159N5303j91590J03539j00914o1129K45869O1405l5423J21099P1219
$$ plain form
11289 151219 237087 112815 -69147 -119380 -197876 -150235 -120097 -110773 -22398 -70902 -128430
11278 -128430 -66243 -4582 -61362 -114621 -150429 -37310 -20197 6146 -12175 -36535 -239272
11267 -239272 -250619 27023 -10543 -73062 102980 21488 -151602 -53109 -51906 -94814 -64949
11256 -64949 -56314 -12327 -67945 -83855 -21125 65856 40611 -66707 -130233 -76081 -159675 -118818
11244 -118818 -174501 -202665 -138646 -154437 -77464 53976 104591 30648 39106 -14963 -106385
11233 -106385 -62947 -56151 20595 197557 162995 22819 140059 86293 125756 147766 32345
11222 32345 121859 143395 -31533 -29067 53078 -103774 -52454 -530 -55287 -108697 -35706
11211 -35706 -70486 -2564 -16699 -193242 -31450 103911 123702 104276 110303 19350 38386
$$ packed form
11289A51219Q5868j24272j81962n0233p8496M7641L0138R324Q8375m8504n7528
11278a28430O2187O1661n6780n3259l5808J13119J7113K6343j8321k4360k02737
11267b39272j1347K77642l7566o2519J76042q1492j73090R8493J203m2908K9865
11256f4949Q635M3987n5618j5910O2730Q6981k5245j07318o3526N4152q3594M0857
11244a18818n5683k8164O4019j5791P6973J31440N0615p3943Q458n4069r1422
11233a06385M3438O796P6746J76962l4562j40176J17240n3766L9463K2010j15421
11222C2345Q9514K1536j74928K466Q2145j56852N1320N1924n4757n3410P2991
11211c5706l4780O7922j4135j76543J61792J35361J9791j9426O027r0953J9036
$$ plain form
11200 38386 40758 -86391 -33614 20485 41630 -233751 -107962 102710 -13706 -174328 -18345
11189 -18345 25556 118148 149414 108025 163484 161371 -54104 111752 169059 148115 157
11178 157 19400 -154232 -122167 -86804 -28928 100889 74649 62860 122040 187704 164680 167256
11166 167256 77301 20035 113133 116066 -13838 17355 -71935 -85132 22679 151017 83210
11155 83210 121394 -6667 40047 63216 94452 13608 144385 102168 10439 69955 61852
11144 61852 -30427 113065 91375 172339 93069 102818 16738 132120 39107 -115750 -113311
11133 -113311 -64490 70758 -35530 11768 92384 -90713 -147832 -39212 -78493 12111 -79507
11122 -79507 -10959 -97467 -64108 -32678 67085 37295 -27735 -8249 -300333 -296948 127321
$$ packed form
11200C8386K372j27149N2777N4099K1145k75381J25789K10672j16416j60622J55983
11189a8345M3901R2592L1266m1389N5459k113k15475J65856N7307k0944j47958
11178A57J9243j73632L2065L5363N7876J29817k6240j1789N9180O5664k3024K576
11166A67256q9955n7266R3098K933j29904L1193q9290j3197J07811J28338o7807
11155H3210L8184j28061M6714K3169L1236q0844J30777m2217r1729N9516q103
11144F1852r2279J43492k1690Q0964p9270R749q6080J15382r3013j54857K439
11133a13311M8821J35248j06288M7298Q0616j83097n7119J08620l9281R0604r1618
11122g9507O8548q6508L3359L1430R9763k9790o5030J9486k92084L385M24269
$$ plain form
11111 127321 92588 38612 -43187 -125594 -63985 -6078 7307 -67254 98406 84334 -40824
11100 -40824 -152636 -62271 -20633 -74302 -58148 -207150 -138467 50494 -64322 -8255 -139327
11089 -139327 -101421 -53544 29773 -30606 5188 64010 -14792 -34252 165424 186218 22951
11078 22951 35740 -151405 35424 -95735 -103806 -203474 -44917 -84870 -196099 -73569 -73922
11067 -73922 -52170 -111544 66312 -14491 -106531 35927 131472 -98648 53886 9868 22543
11056 22543 -10653 -24525 97346 64203 22584 -84192 -162314 -109356 -14439 -90954 66883
11045 66883 -93006 -54031 -113539 10075 -41747 -65054 32417 51228 20101 34020 28361
11034 28361 57615 6064 -20587 -201039 -178204 -72057 -92982 -206596 -67316 96991 45515
$$ packed form
11111A27321l4733n3976q1799q2407O1609N7907J3385p4561J65660j4072j25158
11100d0824j11812R0365M1638n3669J6154j49002O8683J88961j14816N6067j31072
11089a39327L7906M7877Q3317o0379L5794N8822p8802j9460J99676K0794j63267
11078B2951J2789j87145J86829j31159q071r9668J58557l9953j11229J22530l53
11067g3922K1752n9374J77856q0803r2040J42458R5545k30120J52534m4018J2675
11056B2543l3196j3872J21871l3143m1619j06776p8122N2958R4917p6515J57837
11045F6883j59889L8975n9508J23614n1822k3307R7471J8811l1127J3919n659
11034B8361K9254n1551k6651j80452K2835J06147k0925j13614J39280J64307n1476
$$ plain form
11023 45515 -32179 -31014 92812 5079 186378 178455 181948 69072 49172 31483 48760 -44508
11011 -44508 -15956 -104134 -186610 53549 -51791 -96578 -96571 -33166 31044 35074 69589 130868
10999 130868 80750 96474 135324 98462 66268 34669 47103 -112486 16243 199 32003
10988 32003 -10052 -90474 -56121 31051 43097 43056 87109 196033 2752 -131123 -9257
10977 -9257 35985 121427 163996 243678 34616 43364 27335 27514 12278 -32370 -49998 -84664
10965 -84664 -22546 79672 138336 81409 120170 96733 -25593 95594 128280 160165 21580
10954 21580 -44398 -131948 -90695 -125393 -112315 94649 2272 5145 -76208 -2577 109580
10943 109580 191424 171234 29554 -43247 -58102 -85029 -29046 1363 40437 -17593 -25417
$$ packed form
11023D5515p7694J165J23826q7733J81299p923L493j12876j9900j7689J7277r3268
11011d4508K8552q8178q2476K40159j05340m4787PO3405O4210M030L4515O1279
10999A30868n0118J5724L8850l6862l2194l1599J2434j59589J28729j6044L1804
10988C2003m2055q0422L4353Q7172J2046m1M4053J08924j93281j33875J21866
10977i257M5242Q5442M2569P9682k09062Q748j6029J79j5236m4648j7628l4666
10965h4664O2118J02218N8664n6927L8761k3437j22326J21187L2686L1885j38585
10954B1580o5978q7550M1253l4698J3078K06964r2377K873q1353P3631J12157
10943A09580Q1844k0190j41680p2801j4855k6927N5983L0409L9074n8030p824
$$ plain form
10932 -25417 -43135 33278 106555 210254 1611 -77711 -128693 -147753 -105786 -128996 -112064
10921 -112064 -161336 -129672 -14619 93225 132111 89507 85879 51668 -15054 37243 27124
10910 27124 -114417 -132850 -161432 -101684 -259739 -266181 -86814 -38106 20563 38162 150338
10899 150338 115222 99251 69583 121228 21223 -48714 35239 90068 6506 -26862 4850
10888 4850 -24525 81349 181755 130128 37971 -42631 -81364 -89084 -15846 -15975 -21010 78055
10876 78055 27379 87806 145017 120017 213251 153453 167757 99011 145454 202272 221554 238103
10864 238103 80867 55601 51277 -65070 -22176 -137621 -183454 10245 82212 131705 205811
10853 205811 -13153 -13915 105333 64191 95101 9990 -56346 94791 113770 187300 178145
$$ packed form
10932b5417j7718P6413P3277J03699k08643p9322n0982j9060M1967k3210J6932
10921a12064m9272L1664J15053J07844L8886m2604l628l4211o6722N2297j0119
10910B7124j41541j8433k8582N9748j58055o442J79367M8708N8669J7599J12176
10899A50338l5116j5971k9668N1645j00005o9937Q3953N4829q3562l3368L1712
10888D850k9375J05874J00406n1627r2157q0602l8733p720P3238j29n035R9065
10876G8055n0676O0427N7211k5000R3234n9798J4304o8746M6443N6818J9282J6549
10864B38103j57236k5266m324j16347M2894j15445m5833J93699P1967M9493P4106
10853B05811k18964p62J19248m1142L0910q5111o6336J51137J8979P3530r155
$$ plain form
10842 178145 81765 -129891 -247208 -191000 -95332 44786 51909 124212 77283 78882 -1459
10831 -1459 37820 56826 20091 -2916 37140 20645 -71460 31420 -84512 -872 26241
10820 26241 46874 103697 83206 -9810 -98010 -178925 -141688 -193071 -195931 43503 -50887 7666
10808 7666 -35597 -26164 -43139 -68526 15403 -77224 -4904 -62312 -112097 -144953 -114172 -105493
10796 -105493 -67056 -60700 -215961 -95538 -96842 -210971 -112279 89034 -2473 -9626 -52805
10785 -52805 -93808 -98779 -75460 97375 135772 46720 -1318 -88580 -65719 -92024 -115326 -251096
10773 -251096 -213928 -8592 -106734 52748 39227 77519 38757 -146619 -29158 184654
10763 184654 150393 105499 -10016 17075 -87536 -209001 -122046 75056 194766 199425 192138
$$ packed form
10842A78145r6380k11656j17317N6208R5668J40118P123P2303m6929J599q0341
10831a459L9279J9006l6735k3007M0056j6495r2105J02880j15932Q3640K7113
10820B6241K0633N6823k0491r3016q8200q0915L7237n1383k860K39434r4390N8553
10808G666m3263R433j6975k5387Q3929r2627P2320n7408m9785l2856L0781Q679
10796a05493L8437O356j55261J20423j304j14129R8692K01313r1507p153m3179
10785e2805m1003m971K3319J72835L8397q9052m8038q7262K2861k6305k3302j35770
10773b51096L7168K05336r8142J59482j3521L8292l8762j85376J17461K13812
10763A84654l4261m4894j15515K7091j04611j21465Q6955J97102J19710M659p287
$$ plain form
10752 192138 -100196 -67281 76164 114008 135451 153935 5613 43630 -44875 -105868 12076
10741 12076 20163 8738 42137 49195 -38658 -19827 -55424 -116039 -71191 -52228 -45173 73310
10729 73310 57536 35338 72409 67312 66508 -3274 -50802 -75695 -62411 112691 142411 52344
10717 52344 47125 39792 -142991 -194624 -129996 -105569 29112 -144095 -10005 119120 19229
10706 19229 -6304 -36911 -149089 -114156 -5791 -45932 55026 104331 -121742 -76057 -133839
10695 -133839 -110368 -39184 13942 88786 -24488 -20781 150278 138590 63491 107652 188328
10684 188328 124646 -1741 -96614 -57052 -88168 -2785 84031 138116 -35134 -68991 -184644
10673 -184644 -105011 -58064 -85736 20760 -82725 -60858 -4110 -18478 -111409 -50220 -176340
$$ packed form
10752A92138k92334L2915J43445L7844K1443J8484j48322L8017q8505o0993J17944
10741A2076Q087j1425L3399P058q7853J8831l5597o0615M4848J8963P055J18483
10729G3310j5774k2198L7071n097q04o9782m7528k4893J3284J75102K9720r0067
10717E2344n219p333j82783n1633O4628K4427J34681j73207J34090J29125r9891
10706A9229k5533l0607j12178L4933J08365m0141J00958M9305k26073M5685n7782
10695a33839K3471P1184N3126P4844j13274L707J71059j1688p5099M4161Q0676
10684A88328o3682j26387r4873L9562l1116Q5383Q6816N4085j73250l3857j15653
10673a84644P9633M6947k7672J06496j03485K1867N6748j4368r2931O1189j26120
$$ plain form
10662 -176340 -45188 25146 -22374 -88725 -67560 -3770 90491 -63504 106269 144244 256029
10651 256029 141320 -71003 -135859 -185592 -79596 -221526 -317135 -137460 11520 27028
10641 27028 -181848 -245111 -206098 -60946 58763 114532 98670 254974 125625 10955
10631 10955 52916 -6402 4070 66788 60441 23438 -60831 -182093 56712 55151 -120836
10620 -120836 -121070 -68338 -28262 18284 20073 -109580 45907 127899 -60287 38167 80471
10609 80471 84971 -21302 -101826 51072 44216 -28781 6006 32943 123845 -2076 36982
10598 36982 73664 12288 42897 184710 204284 -54914 89552 13372 63754 46995 -54772
10587 -54772 71760 -139708 -121844 147252 94350 5358 87820 138992 96866 -93949 -228567
$$ packed form
10662a76340J31152P0334m7520o6351K1165O3790R4261j53995J69773L7975J11785
10651B56029j14709k12323o4856m9733J05996j41930r5609J79675J48980J5508
10641B7028k08876o3263L9013J45152J19709N5769j5862J56304j29349j14670
10631A0955M1961n9318J0472O2718o347l7003q4269j21262K38805j561j75987
10620a20836k34N2732M0076M6546J789j29653J55487Q1992j88186R8454M2304
10609H0471M500j06273q0524J52898o856p2997L4787K6937R0902j25921L9058
10598C6982L6682o1376L0609J41813J9574k59198J44466p6180N0382j6759j01767
10587e4772J26532k11468J7864K69096n2902q8992Q2462N1172m2126j90815j34618
$$ plain form
10576 -228567 -185845 -91457 -10408 118343 41447 74888 51208 -225774 -326121 -268439 -185537
10565 -185537 -204948 -168299 -86140 -62992 -682 77389 7863 -63668 -186750 6561 82447
10554 82447 23785 73405 -74087 129653 113059 -162019 -167607 -100872 -202759 101661 87782
10543 87782 -38427 -187494 -115248 -83065 -146624 -80848 11970 -47237 -16781 79903 101501
10532 101501 32456 -106788 -100843 3267 -72083 -220506 -156638 -1883 62195 86063 28283
10521 28283 47724 111881 116091 142422 -45007 -67346 6266 76057 130164 -54840 -148891
10510 -148891 -7358 666 -149361 -327898 -294821 -236339 -348351 -267074 -86931 -54196 -55509
10499 -55509 -83070 -250434 -221352 14292 -28778 -98574 106262 36505 9184 -74015 -100280
$$ packed form
10576b28567M2722R4388Q1049J28751p6896L3441k3680k76982j00347N7682Q2902
10565a85537j9411L6649Q2159K3148O2310P8071o9526p1531j23082J93311P5886
10554H2447n8662M9620j47492K03740j6594k75078n588O6735j01887L04420j3879
10543H7782j26209j49067P2246L2183o3559O5776R2818n9207L0456R6684K1598
10532A01501o9045j39244N945J04110p5350j48423O3868J54755O4078K3868n7780
10521B8283J9441O4157M210K6331j87429k2339P3612O9791N4107j85004r4051
10510a48891J41533Q024j50027j78537L3077N8482j12012Q1277J80143L2735j313
10499e5509k7561j67364K9082K35644m3070o9796K04836o9757k7321q3199k6265
$$ plain form
10488 -100280 -119302 -74626 82065 84809 58244 -136393 -125432 -110178 58806 33062 90115
10477 90115 260578 280652 256135 152158 28627 53710 78623 8828 17701 73795 48286
10466 48286 -74904 -150066 -221188 -115183 55496 104041 98575 35633 78807 74954 28152
10455 28152 42900 -74057 -21235 30543 147008 140125 -43814 -104914 -71064 37589 -62043
10444 -62043 87408 -49524 -16703 -7262 -18580 -71444 -99250 43111 -7775 -38062 -68059
10433 -68059 -101727 114319 82742 2304 -126957 -164142 -102572 -217582 -119713 56727 -157646
10422 -157646 -180170 -88327 56387 -3187 -208034 -167651 -25932 -85134 -114476 66807 102179
10411 102179 182146 15534 -210428 -303723 -82282 80756 48335 -57137 -2806 68387
$$ packed form
10488a00280j9022M4676J56691K744k6565j94637J0961J5254J68984k5744N7053
10477I0115J70463K0074k4517j03977j23531K5083K4913o9795Q873N6094k5509
10466D8286j23190p5162p1122J06005J70679M8545n466o2942M3174l853m6802
10455B8152J4748j16957N2822N1778J16465o883j83939o1100L3850J08653r9632
10444f2043J49451j36932L2821R441j1318n2864k7806J42361n0886l0287k9997
10433f8059l3668K16046l1577q0438j29261l7185O1570j15010R7869J76440k14373
10422a57646k2524R1843J44714n9574k04847M0383J41719n9202k9342J81283L5372
10411A02179P9967j66612k25962r3295K21441J63038l2421j05472N4331P1193
$$ plain form
10401 68387 128970 -50953 -151787 -195725 -82030 -28114 -205779 -37610 -109378 -88753 14311
10390 14311 119667 63957 -51215 -23216 33485 130321 4593 -162676 -78976 52238 92249
10379 92249 140604 178659 158974 43137 -34425 -88563 79285 205865 109513 50755 56596
10368 56596 19131 24695 3027 144978 -50154 -46920 24731 -38936 99188 97540 -40305
10357 -40305 -80204 15329 210844 242496 52117 36590 53850 79237 106129 145717 171167
10346 171167 54215 29730 122218 110947 62519 115982 2577 37369 -3425 -6007 -34825
10335 -34825 -3672 -103183 -60869 6257 1715 26485 -151378 -5960 27386 -180757 -231388
10324 -231388 -84259 -12337 22277 -21868 -29957 11443 50333 177191 77775 -82302 -46844
$$ packed form
10401F8387O0583j79923j00834m3938J13695N3916j77665J68169p1768K0625J03064
10390A4311J05356n5710j15172K7999N6701R6836j25728j67269Q3700J31214M0011
10379I2249M8355L8055j9685j15837p7562n4138J67848J26580r6352n8758N841
10368E6596l7465N564k1668J41951j95132L234P1651o3667J38124j648j37845
10357d0305l9899R5533J95515L1652j90379j5527J7260K5387K6892L9588K5450
10346A71167j16952k4485R2488j1271m8428N3463j13405L4792m0794k582k8818
10335c4825L1153r9511M2314O7126m542K4770j77863J45418L3346k08143n0631
10324b31388J47129P1922L4614m4145q089M1400L8890J26858r9416j60077L5458
$$ plain form
10313 -46844 -24748 -42146 -77499 70205 25370 80885 210256 228803 145520 61804 27628
10302 27628 28406 -74232 -202962 -158709 -54397 93661 38883 -108534 9818 135560 68169
10291 68169 189710 203380 133046 93164 -30787 -99587 7037 52966 -68533 -155718 -91193
10280 -91193 -113582 -127355 -112307 -9643 23799 261511 109535 -982 -2556 -97668 -45751
10269 -45751 -44923 -117618 -148996 -57373 22548 122967 -36421 -66171 7021 22343 -96651
10258 -96651 -68747 -10238 123953 15943 28321 66864 58586 -32035 -176894 -168316 -65116
10247 -65116 64430 65957 198044 200031 35517 26335 10136 -57325 -75551 -18164 -7569 22191
10235 22191 108000 10188 -31957 -11191 -146069 -120517 31834 66286 76684 -33282 -55088
$$ packed form
10313d6844K2096j7398l5353J47704m4835N5515J29371J8547q3283q3716l4176
10302B7628P78j02638j28730M4253J04312J48058n4778j47417J18352J25742o7391
10291F8169J21541J3670p0334l9882j23951o8800J06624M5929j21499q7185O4525
10280i1193k2389j3773J5048J02664L3442K37712j51976j10517j574r5112N1917
10269d5751Q28p2695l1378R1623P9921J00419j59388k9750P3192J5322j18994
10258i6651K7904N8509J34191j08010J2378L8543q278r0621j44859Q578J03200
10247f5116J29546J527J32087J987j64514r182j6199o7461j8226N7387J0595K9760
10235B2191Q5809r7812m2145K0766j34878K5552J52351L4452J0398j09966k1806
$$ plain form
10224 -55088 -88499 -219742 -83558 -146734 -43880 -24025 37956 75912 57028 17062 -73543
10213 -73543 -61450 -51737 -166124 -43785 45547 174976 342986 315253 136682 26012 168699
10202 168699 171296 171490 218463 57752 94076 109400 -166553 -157320 -44837 57719 64740 -97248
10190 -97248 -133857 -22465 -61312 121004 198593 24752 49076 75088 25749 -144859 -6750
10179 -6750 306125 170171 208055 66462 -17851 -63214 -44082 21928 -126147 -44921 -24187
10168 -24187 -17733 137510 178178 142095 233837 265701 138411 41842 88228 140827 95685
10157 95685 143738 159625 203333 174247 127020 -62374 -179750 -33119 10464 42232 7815
10146 7815 99085 62004 98793 169096 223074 172134 129297 97491 221776 322347 -8537
$$ packed form
10224e5088l3411j31243J36184o3176J02854J9855O1981L7956j8884l9966r0605
10213g3543J2093R713j14387J22339Q9332J29429J68010k7733j78571j10670J42687
10202A68699K597J94M6973j60711L6324J5324k75953R233J12483J02556P021j61988
10190i7248l6609J11392l8847J82316P7589j73841K4324K6012m9339j70608J38109
10179f750L12875j35954L7884j41593q4313m5363J9132O6010j48075Q1226K0734
10168b4187O454J55243M0668l6083R1742L1864j27290r6569M6386N2599m5142
10157I5685M8053J5887M3708k9086m7227j89394j17376J46631M3583L1768l4417
10146G815R1270l7081L6789P0303N3978n0940m2837l1806J24285J00571l30884
$$ plain form
10135 -8537 10693 -5327 149958 302768 132178 56284 211363 186412 117379 -10991 196905
10124 196905 232744 171969 161728 256303 42744 112964 114485 118665 15372 128269 182027
10113 182027 147137 163476 -46040 -105041 -51174 62656 -1053 31823 -36572 121076 176136
10102 176136 76962 73354 62173 -41395 -95634 -52891 31543 29955 71161 83432 124395 -35533
10090 -35533 48344 -8314 48534 2426 122114 78480 -78209 -18025 71869 100566 29215
10079 29215 1323 10471 2669 70422 50970 121153 5347 -115557 -71496 -49720 -78756 -41358
10067 -41358 14726 51173 70886 56679 116182 99052 -85212 -1038 -74941 -73989 -25339 -157769
10055 -157769 -15735 180241 80595 -36717 35564 122001 -28018 -21567 83946 84836 86136
$$ packed form
10135h537J9230j6020J55285J52810j70590p5894J55079k4951o9033j28370K07896
10124A96905L5839o0775j0241R4575k13559P0220J521M180j03293J12897N3758
10113A82027l4890J6339k09516n9001N3867J13830o3709L2876o8395J57648N5060
10102A76136r9174l608j1181j03568n4239M2743Q4434j588M1206J2271M0963j59928
10090c5533Q3877n6658N6848m6108J19688m3634j56689O0184Q9894K8697p1351
10079B9215k7892R148p802O7753j9452P0183j15806j20904M4061K1776k9036L7398
10067d1358N6084L6447J9713j4207N9503j7130j84264Q4174p3903R52M8650j32430
10055a57769J42034J95976r9646j17312P2281Q6437j50019O451J05513Q90J300
$$ plain form
10044 86136 60783 84225 127284 120087 2933 15797 -117365 29494 4224 89614 76005
10033 76005 115702 12773 -56828 -138491 210031 107056 -45154 -66290 -81016 64773 -97622
10022 -97622 -28632 8154 7014 -28050 -92959 -57180 21661 102976 -132301 -209022 -11552
10011 -11552 -107159 -79132 -84854 70800 68606 -36479 -10167 -82089 1932 158747 80132
10000 80132 94471 181194 274440 290390 285071 215182 187448 68759 23188 -55958 -63349 -7805
9988 -7805 85890 78283 55305 114120 55830 -41387 -58229 86852 19575 24775 164725 141548
9976 141548 78453 50513 53561 36178 -27365 35036 58409 -16042 22551 19294 9014 -51253
9964 -51253 -7817 128291 193034 203896 37071 118428 57968 58385 96874 52204 -25382 2156
$$ packed form
10044H6136k5353K3442M3059p197j17154J2864j33162J46859k5270Q5390j3609
10033G6005L9697j02929o9601q1663L48522j02975j52210k1136j4726J45789j62395
10022i7622O8990L6786j140l5064o4909L5779P8841Q1315k35277p6721J97470
10011a1552r5607K8027n722J55654k194j05085K6312p1922Q4021J56815p8615
10000H0132J4339Q6723R3246J5950n319o9889k7734j18689m5571p9146p391N5544
9988g805R3695p607k2978N8815n8290r7217j6842J45081o7277N200J39950k3177
9976A41548o3095k7940L048j7383o3543O2401K3373p4451L8593l257j0280o0267
9964e1253M3436J36108O4743J0862j66825Q1357o0460M17L8489m4670p7586K7538
$$ plain form
9952 2156 22827 40682 -45643 -142434 102406 235777 354321 280896 191481 117300 46133
9941 46133 -62975 -81209 -97651 -51360 8194 36455 23931 -49747 -187645 -192717 -128502 -21990
9929 -21990 54172 153137 218421 156546 57189 -58623 123221 123172 62759 78392 -10715 143863
9917 143863 115599 28095 168926 113409 209971 302297 158370 -36406 117336 107905 -81134
9906 -81134 -32007 -12810 106484 119188 155760 217357 -7055 70257 38238 -7272 -107881
9895 -107881 -85094 23260 20497 -6802 -71993 -48564 61413 31249 25299 5132 -29502 21021
9883 21021 -117260 24147 -88608 -50001 -106073 -55913 -48114 57099 113661 14516 -85271
9872 -85271 -49703 -50488 -130832 -21361 -41702 -9625 -44291 -58947 12843 97124 -1146 -122137
$$ packed form
9952B156K0671J7855q6325r6791K44840J33371J18544p3425q9415p4181p1167
9941D6133j09108j8234j6442M6291N9554K8261j2524p3678j37898n072O4215J06512
9929b1990P6162R8965O5284o1875r9357j15812J81844m9o0413J5633q9107J54578
9917A43863k8264q7504J40831n5517R6562R2326j43927j94776J53742r431j89039
9906h1134M9127J9197J19294J2704L6572O1597k24412P7312l2019m5510j00609
9895a07881K2787J08354k763k7299o5191K3429J09977l0164n950k0167l4634N0523
9883B1021j38281J41407j12755L8607n6072N0160P799J05213N6562r9145r9787
9872h5271L5568p85q0344J09471k0341L2077l4666j4656P1790Q4281r8270j20991
$$ plain form
9860 -122137 -182124 -30253 1751 89690 122668 -59251 -45610 79841 95408 52142 -606
9849 -606 17807 -27506 -24692 69743 134466 139503 282371 361583 201604 205668 91688 -86762
9837 -86762 -93512 44916 190385 249195 189317 106847 231931 167015 142928 132860 18864
9826 18864 9599 16904 -75197 117143 131866 94482 21350 -152346 -76890 42715 37634 11242
9814 11242 -28660 -24450 -8523 152673 204372 46064 24393 93406 40872 49811 -178448 -78171
9802 -78171 -87601 -2080 -56205 -103587 -6387 -119435 107700 183940 350949 260626 182155
9791 182155 138417 30828 61451 89088 190364 207981 211606 167874 61306 -11302 -58749
9780 -58749 54627 65920 305036 168534 65353 -138310 -71961 43798 -36414 16449 89463
$$ packed form
9860a22137n9987J51871L2004Q7939L2978j81919J3641J25451J5567m3266n2748
9849f06J8413m5313K814R4435O4723N037J42868P9212j59979M064j13980j78450
9837h6762o750J38428J45469N8810n9878q2470J25084o4916k4087j0068j13996
9826A8864r265P305r2101J92340J4723l7384p3132j73696P5456J19605n081k6392
9814A1242l9902M210J5927J61196N1699j58308k1671O9013n2534Q939k28259J00277
9802g8171r430Q5521n4125m7382R7200j13048K27135P6240J67009r0323p8471
9791A82155m3738j07589L0623K7637J01276J7617L625m3732j06568p2608m7447
9780e8749J13376J1293K39116j36502j03181k03663O6349J15759q0212N2863P3014
$$ plain form
9769 89463 104592 53179 127280 155915 12302 -50685 34868 -52476 -145556 70424 101560
9758 101560 87737 39217 54333 31415 -13626 3508 108796 -29470 -47541 194383 311228
9747 311228 123275 88175 -52989 -9419 54842 -21180 22724 75746 29501 86465 20024
9736 20024 18969 13078 56169 150515 126106 59213 29642 70208 -27104 19092 56009 125550
9724 125550 78116 30773 8365 80502 40141 71471 -88369 -6265 84768 129425 30566
9713 30566 -15111 91184 190032 33454 96958 146829 129440 231954 47703 77406 140659
9702 140659 70039 154025 214053 10881 89471 98860 123577 138331 129338 68775 -133411 20753
9690 20753 47391 59357 -49959 -88314 121180 221283 111281 334460 162124 164577 264307
$$ packed form
9769H9463J5129n1413P4101K8635j43613o2987Q5553q7344r3080K15980L1136
9758A01560j3823m8520J5116k2918m5041J7134J05288j38266j8071K41924J16845
9747C11228j87953l5100j41164M3570O4261p6022M3904N3022m6245N6964o6441
9736B0024j055n891M3091R4346k4409o6893k9571M0566r7312M6196L6917O9541
9724A25550m7434m7343k2408P2137m0361L1330j59840Q2104R1033M4657r8859
9713C0566m5677J06295R8848j56578O3504M9871j7389J02514j84251K9703O3253
9702A40659p0620Q3986O0028k03172P8590R389K4717J4754q993o0563k02186J54164
9690B0753K6638J1966j09316l8355K09494J00103j10002K23179j72336K453R9730
$$ plain form
9679 264307 308723 233381 170624 156795 238446 154757 16868 2677 130503 85008 -37928
9668 -37928 78765 224585 322216 173013 189842 254352 320239 131230 143010 104698 86835
9657 86835 217062 143800 54392 181336 231564 213579 261431 354537 166049 219360 120164
9646 120164 250229 324257 161702 134028 128713 199717 303198 424931 151037 186817 126819
9635 126819 48559 103599 238416 199436 259517 273280 124872 130543 66240 63106 65317 90099
9623 90099 116046 87159 115737 176772 314393 205782 56898 143273 291692 148387 205599
9612 205599 186425 250580 303437 246328 25608 -28515 154391 225202 82353 48109 159968
9601 159968 224984 234905 104352 265664 240263 168967 131039 252347 169916 217825 161544
$$ packed form
9679B64307M4416p5342o2757j3829Q1651q3689j37889j4191J27826m5495j22936
9668c7928J16693J45820R7631j49203J6829O4510O5887j89009J1780l8312j7863
9657H6835J30227p3262q9408J26944N0228j7985M7852R3106j88488N3311r9196
9646A20164J30065P4028j62555k7674n315P1004J03481J21733k73894L5780n9998
9635A26819p8260N5040J34817l8980O0081J3763j48408N671o4303l134K211K4782
9623I0099K5947k8887K8578O1035J37621j08611j48884Q6375J48419j43305N7212
9612B05599j9174O4155N2857n7109k20720n4123J82906P0811j42849l4244J11859
9601A59968O5016R921j30553J61312k5401p1296l7928J21308q2431M7909n6281
$$ plain form
9590 161544 251502 336421 123694 261228 343483 260933 35351 34849 319741 375895 171164
9579 171164 96383 93780 339732 366682 352333 394046 199188 234961 241550 248357 304923 412413
9567 412413 259889 262989 189061 297575 176046 106684 154679 154520 -14300 218999 221996
9556 221996 242479 279482 295835 192952 199021 230546 274242 88751 106092 237771 177443
9545 177443 255520 305108 148910 163193 173180 278664 165834 255340 296083 198891 297598
9534 297598 274620 238090 211174 258404 211185 369469 324296 387536 401216 439826 287332
9523 287332 418454 472133 386074 252232 252622 247857 257877 300466 145072 146079 164867 105600
9511 105600 144528 258949 255309 406076 587672 435736 567837 371310 359267 466069
$$ packed form
9590A61544Q9958Q4919k12727J37534Q2255q2550k25582n02K84892N6154k04731
9579A71164p4781k603K45952K6950j4349M1713j94858L5773O589O807N6566J07490
9567D12413j52524L100p3928J08514j21529o9362M7995j59j68820K33299K997
9556B21996K0483L7003J6353j02883O069L1525M3696j85491J7341J31679o0328
9545A77443P8077M9588j56198J4283R987J05484j12830Q9506M0743r7192R8707
9534B97598k2978l6530k6916M7230m7219J58284m5173O3240J3680L8610j52494
9523B87332J31122N3679q6059j33842L90m765J0020M2589j55394J007J8788n9267
9511A05600L8928J14421l640J50767J81596j51936J32101j96527j2043J06802
$$ plain form
9501 466069 369047 364609 413814 346143 486011 290509 402878 594451 491611 391278 358328
9490 358328 438342 423269 383207 399509 225788 238039 267547 343660 441650 309643 424044
9479 424044 282550 196050 304815 366428 295188 306792 379840 167885 224150 328571 426500
9468 426500 348930 444763 451110 576752 547504 333807 323644 331580 395271 468366 428937 503694
9456 503694 515417 635047 708663 649260 569884 613168 521601 558113 686686 651753 661765
9445 661765 627876 702519 682522 802922 961672 988341 969406 1049064 1108697 1108407 1187815 1220200
9433 1220200 1131793 1161227 1093285 1243937 1411777 1625666 1572395 1370461 1392995 1600533
9423 1600533 1544190 1422976 1282397 1284187 1382188 1336198 1315843 1341625 1233568 1092652 1126712
$$ packed form
9501D66069r7022m438M9205o7671J39868j95502J12369J91573j02840j00333l2950
9490C58328Q0014j5073m0062J6302j73721J2251K9508P6113R7990j32007J14401
9479D24044j41494q6500J08765O1613p1240J1604P3048k11955N6265J04421R7929
9468D26500p7570R5833O347J25642k9248k13697j0163P936O3691P3095l9429P4757
9456E03694J1723J19630P3616n9403p9376M3284r1567L6512J28573l4933J0012
9445F61765l3889P4643j9997J20400J58750K6669j8935P9658N9633k90P9408L2385
9433A220200q8407K9434o7942J50652J67840K13889n3271k01934K2534K07538
9423A600533n6343j21214j40579J790R8001m5990k0355K5782j08057j40916L4060
$$ plain form
9412 1126712 1089467 839569 853350 976230 1081049 1144629 999064 990154 1038393 1053549 1303525
9401 1303525 1289079 1269562 1400324 1446655 1560636 1842436 2004143 1860708 1824634 1887948
9391 1887948 1856924 1928332 1955110 1946760 2039941 2066662 1909739 2030948 2032324 2058303 1984761
9380 1984761 1861593 1713097 1852829 1895726 2059649 2109715 2090344 2037827 1947760 1970068 1772501
9369 1772501 1820934 1715592 1645414 1695388 1609497 1534674 1460520 1375875 1425314 1454204 1328613
9358 1328613 1419649 1470744 1303458 1345392 1381955 1337665 1190582 1331324 1219921 1287128 1469574
9347 1469574 1610904 1795288 1943060 1959391 1874504 2191388 2173300 2135703 2079433 2072259 2008953
9336 2008953 1881270 1814512 1916866 2016525 1955077 1799255 1733689 1729580 1592095 1651810 1420428
$$ packed form
9412A126712l7245k49898J3781J22880J04819O3580j45565q910M8239J5156K49976
9401A303525j4446j9517J30762M6331J13981K81800J61707j43435l6074O3314
9391A887948l1024P1408K6778q350R3181K6721j56923J21209J376K5979p3542
9380A984761j23168j48496J39732M2897J63923N0066j9371n2517r0067K2308j97567
9369A772501M8433j05342p0178M9974q5891p4823p4154q4645M9439K8890j25591
9358A328613R1036N1095j67286M1934L6563m4290j47083J40742j11403O7207J82446
9347A469574J41330J84384J47772J6331q4887L16884j8088l7597n6270p174o3306
9336B008953j27683o6758J02354R9659o1448j55822o5566m109j37485N9715k31382
$$ plain form
9325 1420428 1320723 1111414 1280948 1361147 1337463 1393313 1530848 1643216 1672145 1587528 1395107
9314 1395107 1477799 1430980 1444130 1565811 1655470 1746873 1803032 1784721 1735283 1422323 1377433
9303 1377433 1463486 1522599 1473007 1487060 1480348 1439836 1519052 1584882 1650852 1644256 1577241 1615374
9291 1615374 1837658 2042275 1936420 1857673 1948171 2012806 2057543 2068325 2024518 2159509 2343963
9280 2343963 2513552 2643308 2485996 2482903 2485696 2491071 2405843 2468097 2515759 2578906 2585518 2489891
9268 2489891 2378306 2489597 2316639 2334191 2249698 2292897 2247685 2168635 2150941 2125275 2065491
9257 2065491 2179099 2404947 2365626 2246966 2129804 2270033 2425752 2490312 2446316 2568633
9247 2568633 2542644 2529042 2583108 2597749 2582144 2558225 2708002 2828245 2855446 2746779 2790381
$$ packed form
9325A420428r9705k09309J69534Q0199k3684N5850J37535J12368K8929q4617j92421
9314A395107Q2692m6819J3150J21681Q9659R1403N6159j8311m9438l12960m4890
9303A377433Q6053N9113m9592J4053o712m0512P9216O5830O5970o596o7015L8133
9291A615374K22284K04617j05855p8747R0498O4635M4737J0782m3807J34991J84454
9280B343963J69589J29756j57312l093K793N375q5228O2254M7662O3147O612r5627
9268B489891j11585J11291j72958J7552q4493M3199m5212p9050j7694k5666n9784
9257B065491J13608K25848l9321j18660j17162J40229J55719O4560m3996J22317
9247B568633k5989j3602N4066J4641j5605k3919J49777J20243K7201j08667M3602
$$ plain form
9236 2790381 2704338 2711071 3038471 3084674 3019840 2920630 2950413 2940088 2999232 2962107 3013127
9225 3013127 2930714 2947797 3168616 3095384 2994496 2980584 3054438 3023641 3170739 3239913 3296665
9214 3296665 3253944 3140013 3147732 3183943 3409312 3439679 3615504 3630742 3704327 3738941 3901223
9203 3901223 4013930 4038252 4094859 4066342 4198243 4234099 4396238 4567719 4663462 4921917
9193 4921917 5042672 4931573 5044356 5146220 5071798 4963260 4994823 5150432 5299683 5525155
9183 5525155 5426451 5427151 5571620 5636063 5758783 5769330 5855134 6046818 6176195 6327233 6354572
9172 6354572 6425030 6377370 6406272 6590213 6556853 6841938 6996694 7093943 7243185 7394036
9162 7394036 7654430 7628593 7840590 8123695 8347590 8350464 8435706 8517850 8680297 8961609
$$ packed form
9236B790381q6043O733L27400M6203o4834r9210K9783j0325N9144l7125N1020
9225C013127q2413J7083K20819p3232j00888j3912P3854l0797J47098O9174N6752
9214C296665m2721j13931P719L6211K25369L0367J75825J5238P3585L4614J62282
9203C901223J12707K4322N6607k8517J31901L5856J62139J71481R5743K58455
9193D921917J20755j11099J12783J01864p4422j08538L1563J55609J49251K25472
9183E525155r8704P00J44469O4443J22720J0547Q5804J91684J29377J51038K7339
9172F354572P0458m7660K8902J83941l3360K85085J54756R7249J49242J50851
9162G394036K60394k5837K11997K83105K23895K874Q5242Q2144J62447K81312
$$ plain form
9152 8961609 9073093 9133835 9308322 9328635 9454356 9687242 9844919 9927418 10026597 10112635
9142 10112635 10227698 10442210 10484315 10603085 10764469 10836389 10929262 11116877 11297086 11439415
9132 11439415 11845227 11988656 12230785 12472472 12754632 13169173 13655698 13909164 14274599
9123 14274599 14615137 14995609 15493536 15887640 16212635 16403190 16766142 17074320 17540166
9114 17540166 18013619 18569799 18793932 19227442 19766153 20092055 20438653 21036395 21465816
9105 21465816 22096452 22626591 23329455 23898700 24659599 25362599 26027146 26838225 27867433
9096 27867433 28639738 29664278 30940931 32087828 33209383 34550660 36124505 37473301
9088 37473301 39037193 40697191 42533656 44327892 46509240 48877323 51356888 54120683
$$ packed form
9152H961609J11484O0742J74487K0313J25721K32886J57677Q2499R9179Q6038
9142A0112635J15063K14512M2105J18770J61384P1920R2873J87615J80209J42329
9132A1439415M05812J43429K42129K41687K82160M14541M86525K53466L65435
9123A4274599L40538L80472M97927L94104L24995J90555L62952L08178M65846
9114A7540166M73453N56180K24133M33510N38711L25902L46598N97742M29421
9105B1465816O30636N30139P02864N69245P60899P03000O64547Q11079J029208
9096B7867433P72305J024540J276653J146897J121555J341277J573845J348796
9088C7473301J563892J659998J836465J794236K181348K368083K479565K763795
$$ plain form
9080 54120683 57111626 60423971 64237655 68473387 73316994 78586872 84398356 90651293
9072 90651293 97613967 105434495 114800269 126150926 139663079 155107748 171001685 184390963
9064 184390963 194264365 202427571 210166577 217847072 223870947 225095995 219630686 209776990
9056 209776990 198710918 188081689 179091150 171997282 164718403 156296802 147706401 139981064
9048 139981064 133892573 130042676 128177670 128082566 129464269 132187203 136106582 141196193
9040 141196193 147777902 155413810 163384330 171213416 179495745 189578204 202255308 217750187
9032 217750187 235645272 255404427 275192022 292339736 302024254 302204453 296911391 291582816
9024 291582816 289418904 291137979 294227533 292434077 282812925 268046077 252792909 240517679
$$ packed form
9080E4120683K990943L312345L813684M235732M843607N269878N811484O252937
9072I0651293O962674P820528R365774J1350657J3512153J5444669J5893937J3389278
9064A84390963R873402Q163206P739006P680495O023875J225048n465309r853696
9056B09776990j1066072j0629229q990539p093868p278879q421601q590401p725337
9048A39981064o088491l849897j865006r5104J381703K722934L919379N089611
9040A41196193O581709P635908P970520P829086Q282329J0082459J2677104J5494879
9032B17750187J7895085J9759155J9787595J7147714R684518J80199n293062n328575
9024B91582816k163912J719075L089554j793456r621152j4766848j5253168j2275230
$$ plain form
9016 240517679 233472028 232442906 236619675 242874270 248346334 251924797 254934134 258154095
9008 258154095 261314623 263507917 261006576 252138248 239457128 226101323 213508232 202735497
9000 202735497 193538240 184204792 173980093 163812761 154718757 147594014 142690180 139759807
8992 139759807 138432065 138634104 140399472 143194950 147209592 152499432 158616901 164970635
8984 164970635 171692546 179160772 188110535 199462056 213856296 230975121 249284475
8977 249284475 267228247 281999072 288373560 285342433 277431181 269963916 265419407 264261490
8969 264261490 262869814 255044633 238797056 217449169 195318581 175400186 159801548
8962 159801548 148560447 140935167 135910800 132073288 129276214 127329231 126610980 126894880
$$ packed form
9016B40517679p045651j029122M176769O254595N472064L578463L009337L219961
9008B58154095L160528K193294k501341q868328j2681120j3355805j2593091j0772735
9000B02735497r197257r333448j0224699j0167332r094004p124743m903834k930373
8992A39759807j327742K02039J765368K795478M014642N289840O117469O353734
8984A64970635O721911P468226Q949763J1351521J4394240J7118825J8309354
8977B49284475J7943772J4770825O374488l031127p911252p467265m544509j157917
8969B64261490j391676p825181j6247577k1347887k2130588j9918395j5598638
8962A59801548j1241101p625280n024367l837512k797074j946983p18251K83900
$$ plain form
8954 126894880 127795742 128503898 128464588 127290390 125715625 124369132 123594346 122806999 121478156
8945 121478156 119355280 116254044 112864921 109464921 106616520 104751812 103745021 102821696
8937 102821696 102158831 101888131 102333223 103359544 105473697 108302475 111336043 114558524
8929 114558524 118017596 121997949 127065742 133343673 141262696 150725707 160944220 171897386
8921 171897386 182701804 191820207 198399228 202006706 203379532 203411566 203118970 203048861 202510601
8912 202510601 200193727 195669926 188807189 179590343 168661573 157248059 147065147 138980810
8904 138980810 132765474 128476590 125897224 124112748 122409487 121232206 121057954 122222562
8896 122222562 124933855 129542204 135632574 142042856 147869985 152999262 158199204 164701118
$$ packed form
8954A26894880R00862P08156l9310j174198j574765j346493p74786p87347j328843
8945A21478156k122876l101236l389123l400000k848401j864708j006791r23325
8937A02821696o62865k70700M45092J026321K114153K828778L033568L222481
8929A14558524L459072L980353N067793O277931P919023R463011J0218513J0953166
8921A71897386J0804418R118403O579021L607478J372826L2034k92596p0109n38260
8912B02510601k316874m523801o862737r216846j0928770j1413514j0182912q084337
8904A38980810o215336m288884k579366j784476j703261j177281j74252J164608
8896A22222562K711293M608349O090370O410282N827129N129277N199942O501914
$$ plain form
8888 164701118 172327379 180564050 187418601 191045137 190712742 187611265 183730955 180426384
8880 180426384 177749552 174654542 169331643 160927264 150512158 139905663 130129400 121618481
8872 121618481 114473367 107869261 101380395 94810960 88713119 83351757 78988780 75417277
8864 75417277 72635815 70140371 68404114 66968205 65678148 64684687 63948066 63375109 62856896
8855 62856896 62636472 62828973 63021830 63414470 63950065 64687772 65307835 66315116 67499678
8846 67499678 68969735 70645318 72463738 74438868 76627270 79327926 82022676 85162948
8838 85162948 88663546 92799025 97389217 102595302 108746575 115821394 124284745 134056046
8830 134056046 145041203 157183307 170545110 184708727 199858217 215667592 230612253
$$ packed form
8888A64701118P626261Q236671O854551L626536l32395l101477l880310l304571
8880A80426384k676832l095010n322899q404379j0415106j0606495r776263q510919
8872A21618481p145114o604106o488866o569435o097841n361362m362977l571503
8864G5417277k781462k495444j736257j435909j290057r93461p36621n72957n18213
8855F2856896k20424J92501J92857L92640N35595P37707O20063J007281J184562
8846F7499678J470057J675583J818420J975130K188402K700656K694750L140272
8838H5162948L500598M135479M590192N206085O151273P074819Q463351R771301
8830A34056046J0985157J2142104J3361803J4163617J5149490J5809375J4944661
$$ plain form
8823 230612253 244090324 255231321 262844543 265745846 264607485 261828997 259360873 258407048
8815 258407048 259620475 262631891 266390659 271208448 276441088 281038341 284703412 286536275
8807 286536275 285266140 279386094 269897796 259103206 249260089 241289217 235508814 231822452
8799 231822452 229957039 230347715 233819336 240943313 250906337 262664613 274302633 284479519
8791 284479519 293808653 303604962 314200297 324621370 332952112 336872977 335528468 329955795
8783 329955795 323510158 318609275 316712313 317463340 318823534 318880361 317641526 316830933 316117283
8774 316117283 314553077 310384563 301660626 287057055 268351769 248478385 229558461
8767 229558461 213854681 201493293 191832005 184408131 178332353 173424746 169458705 166671531
$$ packed form
8823B30612253J3478071J1140997P613222K901303j138361k778488k468124r53825
8815B58407048J213427L011416L758768M817789N232640M597253L665071J832863
8807B86536275j270135n880046r488298j0794590r843117p970872n780403l686362
8799B31822452j865413L90676L471621P123977R963024J1758276J1638020J0176886
8791B84479519R329134R796309J0595335J0421073Q330742L920865j344509n572673
8783C29955795o445637m900883j896962P51027J360194N6827j238835q10593p13650
8774C16117283j564206m168514q723937j4603571j8705286j9873384j8919924
8767B29558461j5703780j2361388r661288p423874o075778m907607l966041k787174
$$ plain form
8759 166671531 165534973 166187325 168451639 171586409 174411905 175892856 176037069 175593111
8751 175593111 174480694 172927023 170861092 166413023 160636086 154116920 148065843 143562820
8743 143562820 140935656 139121168 136448729 132048399 126036139 119510748 113245493 107369601
8735 107369601 101476870 95251069 88381890 81388602 74603083 68338838 62834100 58253615
8727 58253615 54640895 51569322 48952107 46534693 44511834 42596063 40856181 39313430
8719 39313430 37854359 36514894 35260206 34273651 33339063 32510227 31588655 30873952 30187714
8710 30187714 29830317 29421906 29273131 29135163 29279791 29977271 31535561 33581420 36210744
8701 36210744 38847011 40194719 39065224 34585694 29985536 26899431 24980849 23458607
$$ packed form
8759A66671531j136558O52352K264314L134770K825496J480951J44213m43958
8751A75593111j112417j553671k065931m448069n776937o519166o051077m503023
8743A43562820k627164j814488k672439m400330o012260o525391o265255n875892
8735A07369601n892731o225801o869179o993288o785519o264245n504738m580485
8727E8253615l612720l071573k617215k417414k022859j915771j739882j542751
8719C9313430j459071j339465j254688r86555r34588q28836r21572p14703o86238
8710C0187714l57397m08411j48775j37968J44628O97480J558290K045859K629324
8701C6210744K636267J347708j129495m479530m600158l086105j918582j522242
$$ plain form
8693 23458607 22037240 20965773 20073248 19342310 18651859 18145842 17689133 17036448 16457094
8684 16457094 15928149 15570973 15076878 14680605 14285145 13796363 13488858 13128574 12805389
8675 12805389 12320391 12004112 11687564 11405319 11152137 10884004 10882757 10383369 10175996 10179963
8665 10179963 9775863 9735146 9697708 9447237 9113510 8892447 8712257 8557136 8358076 8148567
8655 8148567 8090188 7953810 7844217 7777624 7942170 7848260 7722640 7524304 7286521 7319407
8645 7319407 7292234 7211582 7118403 7043076 6860117 6961772 6895751 6854804 6933216 6818574 6793142
8634 6793142 6686646 6491077 6323389 6207293 6208480 6043394 5902087 5679597 5671512 5395122
8624 5395122 5131226 4713149 4657484 4570904 4409551 4443500 4208328 4155111 4106132 4016332 4231427
$$ packed form
8693B3458607j421367j071467q92525p30938o90451n06017m56709o52685n79354
8684A6457094n28945l57176m94095l96273l95460m88782l07505l60284l23185
8675A2805389m84998l16279l16548k82245k53182k68133j247m99388k07373L967
8665A0179963m04100m0717l7438k50471l33727k21063j80190j55121j99060k09509
8655H148567n8379j36378j09593o6593J64546r3910j25620j98336k37783L2886
8645G319407k7173q0652r3179p5327j82959J01655o6021m0947P8412j14642k5432
8634F793142j06496j95569j67688j16096J187j65086j41307k22490q085k76390
8624E395122k63896m18077n5665q6580j61353L3949k35172n3217m8979q9800K15095
$$ plain form
8613 4231427 4311493 4225560 4202073 4055181 4018396 4034122 4029018 4124730 4084814 3971659 4029041
8602 4029041 4149639 4236926 4017184 4054483 4183627 4024029 3953005 4082845 4004628 3992766
8592 3992766 3762646 3620973 3362668 3378427 3379310 3296465 3393746 3314140 3264088 3283227 3317397
8581 3317397 3515497 3478354 3256036 3247080 3260658 3272214 3173786 3060261 3051608 2875807 2795097
8570 2795097 2749793 2862268 3223779 3070780 2858767 2723396 2573241 2703977 2682920 2561929
8560 2561929 2505167 2591939 2595940 2653207 2737346 2852446 2658031 2618535 2678305 2770179 2816738
8549 2816738 2659083 2751691 2769621 2788423 2826758 2785476 2774171 2607841 2485182 2459612 2500476
8538 2500476 2584621 2446565 2372983 2185698 2016959 2063870 2234532 2211082 2247583 2034805
$$ packed form
8613D231427Q0066q5933k3487j46892l6785J5726n104R5712l9916j13155N7382
8602D029041J20598Q7287k19742L7299J29144j59598p1024J29840p8217j1862
8592C992766k30120j41673k58305J5759Q83q2845R7281p9606n0052J9139L4170
8581C317397J98100l7143k22318q956J3578J1556r8428j13525q653j75801q0710
8570B795097m5304J12475L61511j52999k12013j35371j50155J30736k1057j20991
8560B561929n6762Q6772M001N7267Q4139J15100j94415l9496N9770R1874M6559
8549B816738j57655R2608J7930J8802L8335m1282j1305j66330j22659k5570M0864
8538B500476Q4145j38056p3582j87285j68739M6911J70662k3450L6501k12778
$$ plain form
8528 2034805 1909717 1921116 2025249 1967434 1849999 1809198 1742568 1732182 1791079 1765855 1701357
8517 1701357 1806355 1793986 1789316 1761978 1688882 1594448 1677573 1806384 1849906 1856403 1879282
8506 1879282 1821671 1808612 1678124 1473906 1391951 1324993 1367980 1406996 1327209 1213282 1399837
8495 1399837 1374184 1337633 1294322 1239979 1233470 1205181 1317180 1122783 1205143 1241756 1264680
8484 1264680 1263211 1210953 1181501 1218791 1028175 1154435 1245109 1264836 1239130 1166863 1151918
8473 1151918 1167580 1247037 1231386 1199499 1319154 1301957 1358247 1449619 1327612 1516205 1563409
8462 1563409 1701610 1557066 1581870 1656027 1801290 1735079 1857653 1837032 1744207 1967869
8452 1967869 1973888 1969120 1897338 1806656 1832088 1841148 1907996 1650307 1694302 1808469 1855016 2032538
$$ packed form
8528B034805j25088J1399J04133n7815j17435m0801o6630j0386N8897k5224o4498
8517A701357J04998j2369m670k7338p3096r4434Q3125J28811M3522O497K2879
8506A879282n7611j3059j30488k04218q1955o6958M2987L9016p9787j13927J86555
8495A399837k5653l6551m3311n4343o509k8289J11999j94397Q2360L6613K2924
8484A264680j469n2258k9452L7290j90616J26260R0674J9727k5706p2267j4945
8473A151918J5662P9457j5651l1887J19655j7197N6290R1372j22007J88593M7204
8462A563409J38201j44544K4804P4157J45263o6211J22574k0621r2825K23662
8452A967869O019m768p1782r0682K5432R060O6848k57689M3995J14167M6547J77522
$$ plain form
8440 2032538 1991590 1881083 1807232 1778614 1693380 1629533 1774760 1876766 1753398 1753021 1741641
8429 1741641 1909550 2033336 2163189 2217871 2246134 2367593 2373919 2401258 2463120 2407744 2427763
8418 2427763 2593040 2503510 2375897 2487892 2583235 2356752 2424701 2441696 2326935 2311677
8408 2311677 2385209 2250728 2303017 2362968 2152221 2003100 1867241 1928591 1794152 1811592
8398 1811592 1666123 1514575 1474056 1571734 1652201 1455181 1400074 1195953 1223112 1306039 1267599
8387 1267599 1274603 1383473 1570552 1489769 1652287 1677577 1525239 1535318 1452456 1374217 1444030
8376 1444030 1392224 1193235 1272968 1273056 1264024 1171371 1129288 1023932 892324 1034933 1093907
8365 1093907 966916 780435 783720 864104 844269 795466 810996 636161 621988 650097 710593
$$ packed form
8440B032538m0948j10507p3851k8618q5234o3847J45227J02006j23368l77j1380
8429A741641J67909J23786J29853N4682K8263J21459O326K7339O1862n5376K0019
8418B427763J65277q9530j27613J11995R5343k26483O7949J6995j14761j5258
8408B311677P3532j34481N2289N9951k10747j49121j35859O1350j34439J7440
8398A811592j45469j51548m0519R7678Q0467j97020n5107k04121K7159Q2927l8440
8387A267599P004J08870J87079q0783J62518K5290j52338J0079q2862p8239O9813
8376A444030n1806j98989P9733Q8r032r2653m2083j05356j31608J42609N8974
8365A093907j26991j86481L285Q0384j9835m8803J5530j74835j4173K8109O0496
$$ plain form
8354 710593 708456 813329 766273 477658 504118 608860 438019 412556 198585 298776 439034
8343 439034 333545 233311 85756 219378 262473 379228 508215 427941 422790 331694 406211
8332 406211 446219 516600 402982 356477 262800 159045 336586 396664 456668 447095 365232
8321 365232 312113 306600 509674 461711 346452 455688 443117 270697 105629 205449 258644
8310 258644 443781 472069 408211 477578 332821 203704 152809 173831 284311 235914 162539
8299 162539 295832 315951 385080 261422 252622 246845 137113 256248 411350 251189 132889
8288 132889 420372 275692 162348 207433 215864 217735 215997 209596 273411 234091 237040 244037
8276 244037 166131 205908 457783 361389 331782 330144 197324 239471 226549 146160 297281
$$ packed form
8354G10593k137J04873m7056k88615K6460J04742j70841k5463k13971J00191J40258
8343D39034j05489j00234j47555J33622M3095J16755J28987q0274n151r1096P4517
8332D06211M0008P0381j13618m6505r3677j03755J77541O0078O0004r573q1863
8321C65232n3119n513K03074m7963j15259J09236j2571j72420j65068R9820N3195
8310B58644J85137K8288o3858O9367j44757j29117n0895K1022J10480m8397p3375
8299A62539J33293K0119O9129j23658q800n777j09732J19135J55102j60161j18300
8288A32889K87483j44680j13344M5085Q431J871j738o401O3815l9320K949O997
8276B44037p7906L9777K51875r6394k9607j638j32820M2147j2922q0389J51121
$$ plain form
8265 297281 242230 104295 206051 224080 164161 304624 275427 222566 201674 145746 85718
8254 85718 58543 -141555 -49607 150602 267148 201427 22807 102292 177216 188459 177707
8243 177707 181002 62040 64826 237574 277484 193984 121039 169127 186371 222047 208325 147917
8231 147917 239753 217262 201372 163708 221823 262613 220525 171967 173304 195403 207334 23590
8219 23590 123959 186932 236205 282353 249839 168276 115218 171892 119962 24040 -45750 -14772
8207 -14772 -10625 64669 279105 183065 150282 254003 243303 148565 274679 281133 362980 232740
8195 232740 350018 518955 979916 722755 -392334 -292074 -116749 -133395 709 102589
8185 102589 -16753 154943 190650 -4516 -91756 80899 54197 157256 195375 305356
$$ packed form
8265B97281n5051j37935J01756J8029n9919J40463k9197n2861k0892n5928o0028
8254H5718k7175k00098R1948K00209J16546o5721j78620P9485P4924J1243j0752
8243A77707L295j18962K786J72748L9910q3500p2945M8088J7244L5676j3722o0408
8231A47917R1836k2491j5890l7664N8115M0790m2088m8558J337K2099J1931j83744
8219B3590J00369O2973M9273M6148l2514q1563n3058N6674n1930r5922o9790L0978
8207a4772M147P5294K14436r6040l2783J03721j0700r4738J26114O454Q1847j30240
8195B32740J17278J68937M60961k57161j115089J00260J75325j6646J34104J01880
8185A02589j19342J71696L5707j95166q7240J72655k6702J03059L8119J09981
$$ plain form
8175 305356 231221 147578 139490 127134 100800 144784 6141 -66293 -26095 48885 -149975
8164 -149975 -76516 118623 118936 253158 201785 178530 130013 58494 83297 80650 -159167 -145918
8152 -145918 -121362 -136781 -7864 86686 62988 34033 160463 355300 280366 237597 93805
8141 93805 -136710 4218 8774 -34243 118493 80148 -5514 -50826 24245 -2727 1818 -242247
8129 -242247 -257797 -170786 16327 -18928 121927 104265 77340 117144 174477 153081 137116
8118 137116 163019 35433 -120619 22935 127558 116221 78207 101967 149777 211703 186236
8107 186236 218570 95702 88657 155909 9194 49378 11741 -27320 94940 133523 28053
8096 28053 119683 -129028 -105726 -27451 228824 98581 -111302 60244 -70522 19857 -1117
$$ packed form
8175C05356p4135q3643q088j2356k6334M3984j38643p2434M0198P4980j98860
8164a49975P3459J95139L13J34222n1373k3255m8517p1519K4803k647k39817J3249
8152a45918K4556j5419J28917R4550k3698k8955J26430J94837p4934m2769j43792
8141I3805k30515J40928M556m3017J52736l8345q5662m5312P5071k6972M545k44065
8129b42247j5550Q7011J87113l5255J40855j7662k6925L9804N7333k1396j5965
8118A37116K5903j27586j56052J43554J04623j1337l8014K3760M7810O1926k5467
8107A86236L2334j22868p045O7252j46715M0184l7637l9061J22260L8583j05470
8096B8053R1630k48711K3302P8275K56275j30243k09883J71546j30766R0379k0974
$$ plain form
8085 -1117 -232497 -168433 -131673 -57880 -86826 86731 93938 15121 5792 86861 126796 -32422
8073 -32422 -176549 -265121 -38163 36845 47918 96959 49730 131407 41110 39597 80249 65999
8061 65999 198174 133758 24940 -25408 -53159 -18369 -9020 100329 125 30236 56300
8050 56300 74654 150839 156237 47107 -117574 82524 2568 837 25727 39326 196291
8039 196291 313728 8471 -137701 101989 203449 111874 -107352 -16626 43889 -14631
8029 -14631 -88912 -281712 -290049 -250045 -219796 -82624 -180230 -124239 -33948 -902 46816 -87808
8017 -87808 -143002 -107837 68996 82214 7879 -11963 -54633 -43323 -42395 -37495 -164300 -115343
8005 -115343 -9025 -152488 -114000 72886 23656 29253 40470 -226508 -210190 -93748 -73596
$$ packed form
8085a117k31380O4064L6760P3793k8946J73557P207p8817r329Q1069L9935j59218
8073c2422j44127q8572K26958P5008J1073M9041m7229Q1677r0297j513M0652j4250
8061F5999J32175o4416j08818n0348k7751L4790R349J09349j00204L0111K6064
8050E6300J8354P6185N398j09130j64681K00098p9956j731K4890J3599J56965
8039A96291J17437l05257j46172K39690J01460r1575k19226R0726O0515n8520
8029a4631p4281j92800q337M0004L0249J37172r7606N5991R0291L3046M7718j34624
8017h7808n5194L5165J76833J3218p4335j9842m2670J1310R28M900j26805M8957
8005a15343J06318j43463L8488J86886m9230N597J1217k66978J6318J16442K0152
$$ plain form
7994 -73596 -135554 -155065 -102586 -147374 -15198 29897 37351 -97825 82283 44226 -101138
7983 -101138 -180736 -19127 -154420 -59892 67501 76329 96995 2845 -60626 -142258 -213892
7972 -213892 -104330 58399 20174 35087 -88828 -224500 -135899 -124385 -264619 -223215 -109510
7961 -109510 195317 187590 116871 -54453 -123888 -105250 156226 57889 -13097 -35714 19180
7950 19180 72805 52173 -82428 -211960 -163346 -79676 -120174 11366 154128 -101537 -121608
7939 -121608 -214904 -337024 -225271 -14366 -6231 -13576 -76389 -83034 47919 60975 97705
7928 97705 40066 50820 49727 25000 25618 -11604 -167106 -159045 46424 162862 137634 32172
7916 32172 -5660 -96650 -107072 88712 53696 56623 82803 33594 50181 194576 68790
$$ packed form
7994g3596o1958j9511N2479m4788J32176M5095P454j35176J80108l8057j45364
7983a01138p9598J61609j35293R4528J27393Q828K0666r4150o3471q1632p1634
7972b13892J09562J62729l8225J4913j23915j35672Q8601J1514j40234M1404J13705
7961a09510L04827p727p0719j71324o9435J8638K61476r8337p0986k2617N4894
7950A9180N3625k0632j34601j29532M8614Q3670m0498J31540J42762k55665k0071
7939a21608r3296j22120J11753K10905Q135p345o2813o645J30953J3056L6730
7928I7705n7639J0754j093k4727O18l7222j55502Q061K05469J16438k5228j05462
7916C2172l7832r0990j0422J95784l5016K927K6180m9209J6587J44395j25786
$$ plain form
7905 68790 -48795 76188 -8733 29323 58298 -32402 -34827 16219 -139891 -84810 -85112 -167175
7893 -167175 -65061 -57893 -106648 -77575 -95368 17040 24777 56236 -58211 -46213 -82067
7882 -82067 -83236 -33378 -120022 -152167 -163847 -151061 -220888 -269536 -41811 10045 -42754 -27125
7870 -27125 -151480 -3650 63653 69675 132977 30904 -91356 21172 -36139 33370 -24032
7859 -24032 -45024 17409 -38156 -23532 52038 71655 -17698 46627 -1273 -6062 -159084 -243813
7847 -243813 -78883 -104118 -45064 -68176 36891 52438 87305 -5745 65132 44501 -105696
7836 -105696 18740 3557 -35665 -156132 -194415 -70024 -76938 -114635 -12480 39403 98745
7825 98745 -77972 4356 -48903 -167620 -106207 79554 150379 -47003 -239102 -448334 -116752
$$ packed form
7905F8790j17585J24983q4921L8056K8975r0700k425N1046j56110N5081l02q2063
7893a67175J02114P168m8755K9073j7793J12408P737L1459j14447J1998l5854
7882h2067j169M9858q6644l2145j1680J2786o9827m8648K27725N1856n2799J5629
7870b7125j24355J47830O7303O022O3302j02073j22260J12528n7311O9509n7402
7859b4032k0992O2433n5565J4624P5570J9617q9353O4325m7900m789j53022q4729
7847b43813J64930k5235N9054k3112J05067J5547L4867r3050P0877k0631j50197
7836a05696J24436j5183l9222j20467l8283J24391o914l7697J02155N1883N9342
7825I8745j76717Q2328n3259j18717O1413J85761P0825j97382j92099k09232L31582
$$ plain form
7814 -116752 113825 9325 -71128 -76686 -64837 60416 -81 21505 -101833 -109856 -159401
7803 -159401 -166321 -192704 -168669 33155 63395 160213 206291 77121 -6467 -41547 -123329
7792 -123329 -45100 45620 145073 -41746 18234 14517 -66374 -119302 10684 -50612 -4568
7781 -4568 -8137 -39729 8996 -2079 -30023 -11022 -43352 -141489 -126655 -1253 57916 -135679
7769 -135679 -145610 -190814 -63700 -204721 -146633 -107439 -23007 -156652 -225806 -135610 -98597
7758 -98597 -10894 -81238 -119464 -73471 85980 -10813 87219 -42952 -10491 38815 -80884
7747 -80884 -162865 -103757 -284420 -265189 -157857 -226040 -304421 -151227 -58907 -126761 -69687
7736 -69687 -92047 -279618 -252245 -106555 -20813 -250091 -154745 -81042 184 -49437 -41984
$$ packed form
7814a16752K30577j04500q0453n558J1849J25253o0497K1586j23338q023m9545
7803a59401o920k6383K4035K01824L0240R6818M6078j29170q3588l5080q1782
7792a23329P8229R0720R9453j86819N9980l717q0891n2928J29986o1296M6044
7781d568l569l1592M8725j1075k7944J9001l2330r8137J4834J25402N9169j93595
7769a35679r931m5204J27114j41021N8088L9194Q4432j33645o9154R0196L7013
7758i8597Q7703p0344l8226M5993J59451r6793R8032j30171L2461M9306j19699
7747h0884q1981N9108j80663J9231J07332o8183p8381J53194R2320o7854N7074
7736f9687k2360j87571K7373J45690Q5742k29278R5346P3703Q1226m9621P453
$$ plain form
7725 -41984 85 -114206 -83467 -62919 32167 52591 -28841 -160235 -128145 -825 -20178
7714 -20178 -258829 -221218 -192979 -83992 -15402 -25097 17362 -15637 54045 -40700 -135458 -23372
7702 -23372 90219 77056 -34372 17985 -95073 -29006 77135 28081 -24244 -125870 15862
7691 15862 138217 72348 22870 -21435 -84782 -41305 -123797 -204453 -85494 -13026 18693
7680 18693 -90193 -89273 -93845 22607 24062 27786 17280 -25554 -96872 -34966 -96419 -73468
7668 -73468 -126167 -71979 30094 -66742 -296216 -178849 -140591 84998 95641 17641 -5926
7657 -5926 -37951 146460 157506 -86221 -156511 -186576 -133252 -150442 -149998 -183909 -50162 -21367
7645 -21367 -71580 -104666 -41676 -139806 -138401 -74504 -26557 31613 15890 1661 -33168 66128
$$ packed form
7725d1984M2069j14291L0739K0548R5086K0424q1432j31394L2090J27320j9353
7714b0178k38651L7611K8239J08987O8590r695M2459l2999O9682r4745r4758J12086
7702b3372J13591j3163j11428N2357j13058O6067J06141m9054n2325j01626J41732
7691A5862J22355o5869m9478m4305o3347M3477q2492q0656J18959P2468L1719
7680A8693j08886R20m572J16452J455L724j0506m2834p1318O1906o1453K2951
7668g3468n2699N4188J02073r6836k29474J17367L8258K25589J0643p8000k3567
7657e926l2025J84411J1046k43727p0290l0065N3324j7190M44l3911J33747K8795
7645b1367n0213l3086O2990r8130J405O3897M7947N8170j5723j4229l4829R9296
$$ plain form
7633 66128 12899 -7238 -159496 -193436 -33267 -22274 -7045 -199466 -304997 -140925 -204127
7622 -204127 39620 -104441 -203810 -174786 -75954 -203646 -61152 -58436 -97519 -55724 -104750
7611 -104750 -21575 124719 90540 156663 156010 192695 2759 -82107 -227392 -142290 23089
7600 23089 94963 179892 -81635 -136639 -217710 -187821 -81006 -136185 47944 -71571 -864
7589 -864 -138623 -159838 83289 77179 71651 -22628 98832 42620 -112014 -237634 -328219 -190650
7577 -190650 -67042 -113279 -171596 -39021 160495 100805 -78838 -155420 -146612 -149892 -150878 -148239
7565 -148239 -53021 -100550 -95368 -77384 26973 94753 -8946 -71291 -85169 -106468 -106668 -189724
7553 -189724 -45613 64902 3446 -238263 -365124 -146072 -31133 -57356 -64610 3494 -35170
$$ packed form
7633F6128n3229k0137j52258l3940J60169J0993J5229j92421j05531J64072o3202
7622b04127K43747j44061r9369K9024R8832j27692J42494K716l9083M1795m9026
7611a04750Q3175J46294l4179O6123o53L6685j89936q4866j45285Q5102J65379
7600B3089P1874Q4929k61527n5004q1071K9889J06815n5179J84129j19515P0707
7589h64j37759k1215K43127o110n528r4279J21460n6212j54634j25620r0585J37569
7577a90650J23608m6237n8317J32575J99516n9690j79643p6582Q808l280r86K639
7565a48239R5218m7529N182J7984J04357O7780j03699o2345j3878k1299k00q3056
7553a89724J44111J10515o1456k41709j26861K19052J14939k6223p254O8104l8664
$$ plain form
7542 -35170 -153245 -250917 -28571 -139934 -139428 -64571 52911 -86244 -97092 -75622 -109805
7531 -109805 50475 -4052 -108764 -71224 -81263 -236475 -195674 -108482 -117892 -164751 -73260
7520 -73260 -164760 -178043 -22842 95761 4364 11257 11669 -67377 -124261 -105724 -140879 -38051
7508 -38051 53343 36880 -198970 45981 -19521 -55917 -2894 122524 97147 44068 -13491
7497 -13491 -102234 -124479 -31642 -274199 -283127 -154290 -203678 -129535 -227388 -138806 -283898
7486 -283898 -233339 -155738 -133619 -198793 -138824 -272567 -284896 -266818 -206884 -106382 -10593
7475 -10593 -134464 -51360 162889 39445 -36337 -31327 91321 -154929 -187831 -90902 -108844
7464 -108844 -154392 -189535 -248672 -321705 -188569 -227659 -171048 -123241 -222416 -135569 -14551
$$ packed form
7542c5170j18075r7672K22346j11363N06P4857J17482j39155j0848K1470l4183
7531a09805J60280n4527j04712L7540j0039j55212M0801Q7192r410m6859R1491
7520g3260r1500j3283J55201J18603r1397O893M12p9046n6884J8537l5155J02828
7508c8051R1394j6463k35850K44951o5502l6396N3023J25418k5377n3079n7559
7497a3491q8743k2245R2837k42557q928J28837m9388P4143r7853Q8582j45092
7486b83898N0559P7601K2119o5174N9969j33743j2329J8078N9934J00502R5789
7475a0593j23871Q3104K14249j23444p5782N010J22648k46250l2902R6929j7942
7464a08844m5548l5143n9137p3033J33136l9090N6611M7807r9175Q6847J21018
$$ plain form
7453 -14551 -53050 -6946 -67358 3391 120515 9671 -106095 -89060 -120704 -167555 -160199
7442 -160199 -59448 109885 117450 4249 23919 -64332 -146459 74126 33715 -70476 -83194
7431 -83194 -41385 -70600 -186253 -146577 -17862 -22316 -54394 -52309 -85275 -101176 19137 -13254
7419 -13254 -7139 78678 818 32253 -217189 -128987 33512 174617 8607 -113572 7300
7408 7300 -61541 -37059 -76455 -208701 -298236 -385684 -280868 -210623 -279138 -398619 -334470
7397 -334470 -15717 221148 158112 69919 52496 -82523 -16920 -145260 -119280 -47750 -56866
7386 -56866 -219898 -190470 -91 -35208 -230939 -237265 -26156 -128698 -206971 -195123 -183685
7375 -183685 -115785 -77065 -149373 -115503 -92931 -98558 -113775 -57074 -85087 -185436 -316421
$$ packed form
7453a4551l8499M6104o0412P0749J17124j10844j15766J7035l1644m6851P356
7442a60199J00751J69333P565j13201J9670q8251q2127K20585m0411j04191j2718
7431h3194M1809k9215j15653L9676J28715m454l2078K085l2966j5901J20313l2391
7419a3254O115Q5817p7860L1435k49442Q8202J62499J41105j66010j22179J20872
7408G300o8841K4482l9396j32246q9535q7448J04816P0245o8515j19481O4149
7397c34470L18753K36865o3036q8193j7423j35019O5603j28340K5980P1530r116
7386e6866j63032K9428J90379l5117j95731o326K11109j02542p8273J1848J1438
7375a83685O7900L8720p2308L3870K2572n627j5217N6701k8013j00349j30985
$$ plain form
7364 -316421 -250498 -193619 -129389 -37652 -218407 -252271 -281525 -92422 -177292 -192517 -228757
7353 -228757 -124062 -105689 -115452 -268556 -260952 -161928 -73196 -59125 117182 196681 -15362
7342 -15362 -197534 -156716 -164664 -133564 -125770 -128174 -115948 -61607 60724 85311 167192 -72741
7330 -72741 -86843 30079 40692 -106492 -219605 -162240 -156826 -212070 -187380 -270403 -150904
7319 -150904 64265 96914 22276 -15829 -10486 -5514 -208457 -165990 -160778 -125312 -161179 -84544
7307 -84544 -72574 -78013 -120172 -302587 -319447 -76371 -27189 -118305 30684 15216 -22453
7296 -22453 -80622 -196546 -52584 -96603 -72019 -81292 -182444 -231058 -50385 -35069 25672
7285 25672 -164247 -145617 -70806 -115334 1293 -125672 -168867 43847 110361 -137622 -214213
$$ packed form
7364c16421O5923N6879O4230R1737j80755l3864k9254J89103q4870j5225l6240
7353b28757J04695J8373r763j53104P604R9024Q8732J4071J76307P9499k12043
7342a5362j82172M0818p948L1100P794k404J2226N4341J22331K4587Q1881k39933
7330g2741j4102J16922J0613j47184j13113N7365N414n5244K4690q3023J19499
7319a50904K15169L2649p4638l8105N343M972k02943M2467N212L5466l5867P6635
7307h4544J1970n439m2159j82415j6860K43076M9182r1116J48989j5468l7669
7296b2453n8169j15924J43962m4019K4584r273j01152m8614J80673J5316O0741
7285B5672j89919J8630P4811m4528J16627j26965m3195K12714O6514k47983p6591
$$ plain form
7274 -214213 -159189 -143273 -257391 -158550 -53429 -105244 -22563 51103 -13923 -36247 25986
7263 25986 16953 8074 21992 75559 9069 -122423 -185319 -67088 -1523 -121464 -80305 -54800
7251 -54800 -18771 -43271 30585 13706 -63618 -135515 -209055 -253449 -295177 -220492 -85991 -6803
7239 -6803 8204 101642 200620 -23794 89783 167986 -46237 -76698 -181057 -85364 -78337
7228 -78337 -292434 -323826 -205605 -211347 -191998 -98023 -146847 -90971 -118408 -135493 -246362
7217 -246362 -136067 -309256 -359695 -410951 -148104 -143830 -157098 -112705 -278792 -377650 -266038
7206 -266038 -84958 -77230 -220830 -223915 -122664 -203689 -60193 -46832 -81204 82691 -115566
7195 -115566 -179454 -261626 -259329 -279215 -326455 -188201 -81285 151418 46265 -164685 -64726
$$ packed form
7274b14213N5024J5916j14118R8841J05121n1815Q2681P3666o5026k2324O2233
7263B5986r033q879J3918N3567o6490j31492o2896J18231O5565j19941M1159K5505
7251e4800L6029k4500P3856j6879p7324p1897p3540m4394m1728P4685J34501P9188
7239f803J5007R3438R8978k24414J13577P8203k14223l0461j04359R5693P027
7228g8337k14097l1392J18221n742J9349R3975m8824N5876k7437j7085j10869
7217b46362J10295j73189n0439n1256K62847M274j3268M4393j66087r8858J11612
7206b66038J81080P728j43600l085J01251q1025J43496J3361l4372J63895j98257
7195a15566o3888q2172K297j9886m7240J38254J06916K32703j05153k10950R9959
$$ plain form
7184 -64726 -51505 -217796 -159574 27370 -143474 -134665 -72707 80172 201062 15020 -12417
7173 -12417 -20053 -176067 -212766 -23759 -44840 -42447 -40565 29502 -6467 -98170 -205386 -142829
7161 -142829 -104194 -140202 -228861 -102757 -161176 -228932 -191604 -89600 -197735 -205414 -156588
7150 -156588 -158057 -155777 -67476 -45621 -95226 -338507 -245463 -185587 -110959 -76754 -43802 -104085
7138 -104085 -203465 -146358 -167682 -122556 -83473 44505 198728 134574 -938 -70872 -24186
7127 -24186 -113356 -190507 -170349 -109075 -88268 9650 95247 -23741 -131272 -90225 -45094
7116 -45094 -46863 -34669 -21235 890 55316 29424 9274 -39039 -78046 -77919 -164138 -252401
7104 -252401 -203175 -8530 -82300 -94770 -103879 -101424 -241193 -108375 -179978 -93823 -135567
$$ packed form
7184f4726J3221j66291N8222J86944j70844Q809O1958J52879J20890j86042k7437
7173a2417p636j56014l6699J89007k1081K393J882P0067l5969r1703j07216O2557
7161a42829L8635l6008q8659J26104n8419o7756L7328J02004j08135p679M8826
7150a56588j469K280Q8301K1855m9605k43281R3044N9876P4628L4205L2952o0283
7138a04085r9380N7107k1324M5126L9083J27978J54223o4154j35512o9934M6686
7127b4186q9170p7151K0158O1274K0807R7918Q5597j18988j07531M1047M5131
7116d5094j769J2194J3434K2125N4426k5892k0150m8313l9007J27q6219q8263
7104b52401M9226J94645p3770j2470r109K455j39769J32818p1603Q6155m1744
$$ plain form
7093 -135567 -96398 -46120 -72206 -57567 -9023 140351 -8572 -253936 -188031 -37588 -4617
7082 -4617 -102485 -161296 64026 202661 235731 9607 -114723 -89170 -137100 -219757 -221499
7071 -221499 -223618 -290648 -184974 -33926 -38600 -164146 -169511 -138375 -67233 -89169 -232874
7060 -232874 -147576 -111138 -119776 -53142 -29527 -60816 -119279 -115414 -225448 -168896 -157420 -122666
7048 -122666 -56501 -147060 -103564 172806 114833 -131512 -182662 -152542 -30070 -75182 -56852
7037 -56852 -18690 -94638 -141637 -129111 -193499 -154227 -28759 -114725 -72565 -98391 -137465 -79085
7025 -79085 -35930 -113130 -63051 -18760 67657 92749 -8234 37689 -164761 -103849 -37347
7014 -37347 -83437 -223333 -60009 4641 -82521 -75144 -221249 -210216 -203533 -100022 -68155
$$ packed form
7093a35567L9169N0278k6086J4639M8544J49374j48923k45364O5905J50443L2971
7082d617r7868n8811K25322J38635L3070k26124j24330K5553m7930q2657j742
7071b21499k119o7030J05674J51048m674j25546n365L1136P1142k1936j43705
7060b32874Q5298L6438q638O6634K3615l1289n8463L865j10034N6552J1476L4754
7048a22666O6165r0559M3496K76370n7973k46345n1150L0120J22472m5112J8330
7037e6852L8162p5948m6999J2526o4388L9272J25468q5966M2160k5826l9074N8380
7025g9085M3155p7200N0079M4291Q6417K5092j00983M5923k02450O0912O6502
7014c7347m6090j39896J63324O4650q7162P377j46105J1033O683J03511L1867
$$ plain form
7003 -68155 -22033 175958 105534 47379 11432 -84331 -37520 132454 10221 129046 19140
6992 19140 -41810 -145184 -195146 -212338 -144137 35743 72481 86661 5599 109787 99220
6981 99220 58870 -25138 -44606 35491 65818 -13772 67746 -11828 -101745 7983 122157
6970 122157 13417 -66934 -200621 -77016 -54502 -142616 -91865 -469 35284 66315 -66102
6959 -66102 -186961 -91625 -134805 -144353 -47463 -62278 -92234 -76203 -94038 -198626 -102621 62801
6947 62801 -80228 -35687 26128 -33552 -22246 66109 45919 52977 -3872 -6407 60442 -12998
6935 -12998 -19959 -231881 -146979 -132167 -169093 61764 -34410 -33149 -53092 -165045 -91091 -197974
6923 -197974 -230600 -95299 -128968 -54779 -83118 -62514 -86260 10367 17644 -48056 -48256 -137695
$$ packed form
7003f8155M6122J97991p0424n8155l5947r5763M6811J69974j22233J18825j09906
6992A9140o0950j03374m9962j7192O8201J79880L6738J4180q1062J04188j0567
6981I9220m0350q4008j9468Q0097L0327p9590Q1518p9574q9917J09728J14174
6970A22157j08740q0351j33687J23605K2514q8114N0751R1396L5753L1031j32417
6959f6102j20859R5336m3180r548R6890j4815k9956J6031j7835j04588R6005J65422
6947F2801j43029M4541O1815n9680J1306Q8355k0190P058n6849k535O6849p3440
6935a2998o961k11922Q4902J4812l6926K30857r6174J261j9943j11953P3954j06883
6923a97974l2626J35301l3669P4189k8339K0604k3746R6627P277o5700k00q9439
$$ plain form
6911 -137695 -79323 -106664 -44833 -4110 -77000 -162361 -75565 -14841 3656 -82396 65954
6900 65954 182873 23745 -73435 -302650 -277508 -103632 99162 240993 -96092 -123756
6890 -123756 64123 161726 148214 88081 206260 287489 119785 -99138 9570 45054 -76432
6879 -76432 -213729 -190050 -228750 -84128 23043 -185056 -167352 -177787 -95344 -128044 -256336
6868 -256336 -227931 -230626 -72786 7057 -160887 -70199 24166 -81669 -20964 -20444 -138086
6857 -138086 -192625 -230726 -249368 -373448 -280241 -162816 -116436 -217798 -2196 37973 -147911
6846 -147911 -168157 -84860 -28666 28818 90735 -4175 13974 62022 157006 794 -39432
6835 -39432 -52389 -39742 -62901 -109927 -104265 -64537 -185236 -81085 -72664 40420 -107253
$$ packed form
6911a37695N8372k7341O1831M0723p2890q5361Q6796O0724J8497q6052J48350
6900F5954J16919j59128r7180k29215K5142J73876K02794J41831l37085k7664
6890a23756J87879R7603j3512o0133J18179Q1229j67704k18923J08708L5484j21486
6879g6432j37297K3679l8700J44622J07171k08099J7704j0435Q2443l2700j28292
6868b56336K8405k695J57840P9843j67944R0688R4365j05835O0705N20j17642
6857a38086n4539l8101j8642j24080R3207J17425M6380j01362K15602M0169j85884
6846a47911k0246Q3297N6194N7484O1917r4910J8149M8048R4984j56212m0226
6835c9432j2957J2647k3159m7026N662L9728j20699J04151Q421J13084j47673
$$ plain form
6824 -107253 -139351 -95198 -64303 -64061 -103636 -124138 -56161 45355 -86104 -86034 -166236 -154651
6812 -154651 -171561 -199681 23856 76246 84183 -80005 -168764 -309669 -156169 -82830 -24272
6801 -24272 -66414 -46284 -86278 -92099 -86897 -231646 -149406 -221175 102605 14220 101205 41368
6789 41368 -121131 88343 88426 -38649 -53891 -84675 -137983 -17531 -41057 -20697 67868 169009
6777 169009 122503 -25811 -111303 -121961 -91177 10334 77486 49725 -44526 -120938 -183248
6766 -183248 -223851 -178208 -161578 -9703 51443 74432 121164 60593 48949 53495 70926 218210
6754 218210 103666 135896 37144 63838 88774 27532 66796 130065 219054 316860 154069
6743 154069 60921 83368 -19671 31119 149343 27052 113487 91725 41846 -23869 55219
$$ packed form
6824a07253l2098M4153L0895K42l9575k0502O7977J01516j31459P0q0202J1585
6812a54651j6910k8120K23537N2390P937j64188q8759j40905J53500P3339N8558
6801b4272m2142K0130l9994n821N202j44749Q2240p1769L23780q8385Q6985n9837
6789D1368j62499K09474Q3j27075j5242l0784n3308J20452k3526K0360Q8565J01141
6777A69009m6506j48314q5492j0658L0784J01511O7152k7761r4251p6412o2310
6766a83248m0603M5643J6630J51875O1146K2989M6732o0571j1644M546J7431J47284
6754B18210j14544L2230r8752K6694K4936o1242L9264O3269Q8989R7806j62791
6743A54069r3148K2447j03039N0790J18224j22291Q6435k1762m9879o5715P9088
$$ plain form
6732 55219 64775 10223 59694 66918 -22384 -66028 49418 77251 -71067 -206495 -336245
6721 -336245 -217599 -83651 -172031 -156679 -159924 -35168 -119830 -45026 -10149 -47337 58437
6710 58437 132486 276776 35006 98491 91576 72327 150520 102973 -13041 -26945 -110820
6699 -110820 -241022 -369294 -262910 -126860 -73311 51825 -51972 -97758 -221493 -187959
6689 -187959 -77186 10763 196246 172129 66964 66260 78361 26493 -72729 -83935 -47583
6678 -47583 15824 12947 8534 -8067 -20038 -175262 -23826 -30135 -237208 -307536 -59347 -44100
6666 -44100 -92600 -135061 -211380 -213173 -96776 -87274 -68862 -169090 -38503 -125288 -110328 -62091
6654 -62091 30755 166426 71275 19435 -148259 -157825 35389 12257 -94566 -128276 49682
$$ packed form
6732E5219R556n4552M9471P224q9302m3644J15446K7833j48318j35428j29750
6721c36245J18646J33948q8380J5352l245J24756q4662P4804L4877l7188J05774
6710E8437P4049J44290k41770O3485o915j9249P8193m7547j16014j3904q3875
6699a10820j30202j28272J06384J36050N3549J25136j03797m5786j23735L3534
6689a87959J10773Q7949J85483k4117j05165p04J2101n1868r9222j1206L6352
6678d7583O3407k877m413j6601j1971j55224J51436o309k07073p0328K48189J5247
6666d4100m8500m2461p6319j793J16397R502J8412j00228J30587q6785J4960M8237
6654f2091R2846J35671r5151n1840j67694r566J93214k3132j06823l3710J77958
$$ plain form
6643 49682 109578 -34246 -93480 127004 38915 21549 -21863 43019 -120583 -148096 -21269
6632 -21269 -75600 100269 74033 108297 120623 66975 39995 142162 49031 66969 68806 29503
6620 29503 -147686 -192148 -80220 3673 -147872 -50200 41483 -42637 30277 38924 -44602
6609 -44602 82085 -20399 -102809 46119 86332 -28806 -128928 -133597 -62372 -61005 -152972
6598 -152972 -143621 -18214 39781 48186 120976 229876 109248 -53538 -71302 86306 32969
6587 32969 -4467 -42536 -75258 55735 28903 -110822 -234691 -75750 -118428 -78402 127494
6576 127494 82513 -172700 -114962 -86353 4205 -77600 -212985 -97081 -76079 -75857 -96855
6565 -96855 28440 87104 -143936 -48666 103078 116436 21560 -108632 69179 64385 50858
$$ packed form
6643D9682N9896j43824n9234K20484q8089j7366m3412O4882j63602k7513J26827
6632b1269n4331J75869k6236L4264J2326n3648k6980J02167r3131J7938J837l9303
6620B9503j77189m4462J11928Q3893j51545R7672R1683q4120P2914Q647q3526
6609d4602J26687j02484q2410J48928M0213j15138j00122m669P1225J367r1967
6598a52972R351J25407N7995Q405P2790J08900j20628j62786j7764J57608n3337
6587C2969l7436l8069l2722J30993k6832j39725j23869J58941m2678M0026K05896
6576A27494m4981k55213N7738K8609R0558q1805j35385J15904K1002K22k0998
6565i6855J25295N8664k31040R5270J51744J3358r4876j30192J77811m794j3527
$$ plain form
6554 50858 39367 36514 27204 -70575 -73389 -105742 -467 130537 -17588 60891 40454 135218
6542 135218 190434 101320 25855 -98321 -33582 98479 177248 232101 31840 -34114 47996
6531 47996 85577 71592 73553 144079 19043 95347 126226 72532 61088 60034 -14886 -129106
6519 -129106 -36805 -103231 107508 66881 99894 214727 140432 75344 35806 85793 62854
6508 62854 47156 62032 140017 134549 55522 159027 92292 46684 122450 3434 -34595 202182
6496 202182 287374 206043 237746 191216 55773 59269 210521 52842 -32485 73923 66864
6485 66864 -45936 133024 302637 101185 54174 111431 175683 246275 161363 207347 274406
6474 274406 256281 104173 198588 319199 353950 313263 371882 351294 376597 415340 320903
$$ packed form
6554E0858j1491k853r310r7779k814l2353J05275J31004j48125P8479k0437R4764
6542A35218N5216q9114p5465j24176O4739J32061P8769N4853k00261o5954Q2110
6531D7996L7581j3985J961P0526j25036P6304L0879n3694j1444j054p4920j14220
6519a29106R2301o6426K10739m0627L3013J14833p4295o5088l9538M9987k2939
6508F2854j5698J4876P7985n468p9027J03505o6735m5608P5766j19016l8029K36777
6496B02182Q5192q1331L1703m6530j35443L496J51252j57679q5327J06408p059
6485F6864j12800J78960J69613k01452m7011N7257O4252P0592q4912M5984O7059
6474B74406j8125j52108R4415J20611L4751m0687N8619k0588K5303L8743r4437
$$ plain form
6463 320903 463593 511969 343564 290554 404060 419524 447493 560773 538226 457902 458964
6452 458964 454843 646762 698229 798655 703048 665265 643121 705097 700383 709731 869048 1009020
6440 1009020 1148221 1319552 1479065 1496269 1665517 1641327 1757554 1494794 1461234 1407290
6430 1407290 1206474 1198164 1011031 882009 926425 862506 919280 1006732 966964 967825 1090097
6419 1090097 995398 833415 954763 1066130 1057228 1318602 1331264 1358399 1545890 1684162
6409 1684162 1811941 1713363 1502935 1326981 1182239 1177084 1097925 1049576 914575 696427
6399 696427 798139 778513 810448 768404 685192 844348 790993 731620 708327 622958 609344
6388 609344 637333 666224 637513 531950 482264 666717 555485 592493 546407 459037 421622
$$ packed form
6463C20903J42690M8376j68405n3010J13506J5464K7969J13280k2547q0324J062
6452D58964m121J91919N1467J00426r5607l7783k2144O1976m714R348J59317J39972
6440A009020J39201J71331J59513J7204J69248k4190J16227k62760l3560n3944
6430A407290k00816q310j87133j29022M4416o3919N6774Q7452l9768Q61J22272
6419A090097r4699j61983J21348J11367q902K61374J2662K7135J87491J38272
6409A684162J27779r8578k10428j75954j44742n155p9159m8349j35001k18148
6399F96427J01712j9626L1935m2044q3212J59156n3355n9373k3293q5369j3614
6388F09344K7989K8891k8711j05563m9686J84453j11232L7008m6086q7370l7415
$$ plain form
6377 421622 391729 365242 342130 476215 525669 560471 621317 628404 609218 669766 571398 376269
6365 376269 405680 583379 607693 627849 504953 660782 646622 598463 743192 661985 639830
6354 639830 687922 745328 712968 728855 626394 720525 619298 617123 710858 655906 579639
6343 579639 546169 647318 613558 462097 540670 590159 754725 775458 810582 734817 605252
6332 605252 600551 546816 671445 717426 735235 847002 666371 710064 856726 831099 1000478
6321 1000478 838164 725301 825740 1001807 1018685 1069935 1042651 978305 933327 966624 864167
6310 864167 823286 830447 836116 787683 785464 917340 864948 884364 828645 955191 1064310 1215564
6298 1215564 1232091 1176009 1243038 1245221 1207869 1214707 1173550 1160244 1210608 1220218 1138726 1277353
$$ packed form
6377D21622k9893k6487k3112J34085M9454L4802O0846P087j9186O0548r8368j95129
6365C76269K9411J77699K4314K0156j22896J55829j4160m8159J44729q1207k2155
6354F39830M8092N7406l2360J5887j02461R4131j01227k175R3735n4952p6267
6343E79639l3470J01149l3760j51461P8573M9489J64566K0733L5124p5765j29565
6332F05252m701n3735J24629M5981J7809J11767j80631M3693J46662k5627J69379
6321A000478j62314j12863J00439J76067J6878N1250k7284o4346m4978L3297j02457
6310H64167m0881P161N669m8433k219J31876n2392J9416n5719J26546J09119J51254
6298A215564J6527n6082O7029K183l7352O838m1157j3306N0364R610q1492J38627
$$ plain form
6286 1277353 1396265 1341519 1289827 1428974 1471728 1635924 1786795 1701467 1741044 1829147 1886847
6275 1886847 1836707 1817999 1774219 1737318 1675219 1648091 1747359 1768288 1706759 1695468 1607275
6264 1607275 1596432 1688264 1659967 1915690 2098243 2220288 2324100 2201131 2176259 2189251
6254 2189251 2297798 2402118 2408416 2298291 2365359 2492310 2383540 2424768 2620867 2488651
6244 2488651 2414910 2543447 2695837 2704006 2638757 2454236 2692562 2982043 2949555 2922369 2996637
6233 2996637 2826363 2821389 3010488 2920250 2974121 3026674 3013575 3239621 3518860 3535752 3463097
6222 3463097 3501822 3592960 3647691 3671038 3681152 3781116 3816965 3971728 4005740 4168063 4296418
6211 4296418 4200971 4255716 4391848 4487422 4651556 4793639 4978860 5285296 5485843 5427328
$$ packed form
6286A277353J18912n4746n1692J39147M2754J64196J50871q5328L9577Q8103N7700
6275A886847n0140j8708m3780l6901o2099k7128R9268K0929o1529j1291q8193
6264A607275j0843R1832k8297K55723J82553J22045J03812j22969k4872J2992
6254B189251J08547J04320O298j10125O7068J26951j08770M1228J96099j32216
6244B488651p3741J28537J52390Q169o5249j84521K38326K89481l2488k7186P4268
6233B996637j70274m974J89099r0238N3871N2553j3099K26046K79239J6892p2655
6222C463097L8725R1138N4731K3347J0114R9964L5849J54763L4012J62323J28355
6211D296418r5447N4745J36132R5574J64134J42083J85221L06436K00547n8515
$$ plain form
6201 5427328 5455403 5628658 5716095 5762081 5722614 5799013 5938144 6159428 6306303 6407973
6191 6407973 6465989 6650014 6630363 6693245 7108722 7399848 7660775 8016483 8173614 8354983
6181 8354983 8690479 8807195 9248665 9565951 9853207 10290740 10552880 10788753 11098922 11496359
6171 11496359 11918410 12315082 12627274 12874326 13169718 13501478 13909174 14509024 14796758
6162 14796758 15352683 15944472 16538477 17152006 17635808 18181630 18848671 19649396 20513812
6153 20513812 21229291 22089594 22799953 23714069 24570256 25665010 26633155 27868258 29274942
6144 29274942 30353000 31556547 32869149 34307854 35757836 37346383 39083043 41012553
6136 41012553 42982162 44913822 47036376 49418437 51909107 54827386 58058109 61906251
$$ packed form
6201E427328K8075J73255Q7437M5986l9467P6399J39131K21284J46875J01670
6191F407973N8016J84025j9651O2882M15477K91126K60927L55708J57131J81369
6181H354983L35496J16716M41470L17286K87256M37533K62140K35873L10169L97437
6171A1496359M22051L96672L12192K47052K95392L31760M07696N99850K87734
6162A4796758N55925N91789N94005O13529M83802N45822O67041Q00725Q64416
6153B0513812P15479Q60303P10359R14116Q56187J094754R68145J235103J406684
6144B9274942J078058J203547J312602J438705J449982J588547J736660J929510
6136D1012553J969609J931660K122554K382061K490670K918279L230723L848142
$$ plain form
6128 61906251 66096431 70475220 75519323 81307868 87944582 95651461 104577137 115446038
6120 115446038 128387632 143739358 161868718 182812546 206296726 232059301 258482879
6113 258482879 282170313 297408055 298419312 284171313 260020741 232455687 206575439
6106 206575439 184833487 167753870 154779506 145403101 138774667 134149357 131349692 130295540
6098 130295540 130977797 133367387 137655332 144119423 153044955 164630114 179234102 196603599
6090 196603599 216663748 239254267 262353919 282770607 294606198 291833894 274386175
6083 274386175 247364687 216526188 187266253 162019624 141375657 124821870 111392576
6076 111392576 100383787 91134851 83246567 76591424 70737237 65563896 61277270 57459786
$$ packed form
6128F1906251M190180M378789N044103N788545O636714P706879Q925676J0868901
6120A15446038J2941594J5351726J8129360K0943828K3484180K5762575K6423578
6113B58482879K3687434J5237742J011257j4247999k4150572k7565054k5880248
6106B06575439k1741952j7079617j2974364r376405o628434m625310k799665j054152
6098A30295540O82257K389590M287945O464091Q925532J1585159J4603988J7369497
6090A96603599K0060149K2590519K3099652K0416688J1835591k772304j7447719
6083B74386175k7021488l0838499k9259935k5246629k0643967j6553787j3429294
6076A11392576j1008789r248936p888284o655143n854187n173341m286626l817484
$$ plain form
6068 57459786 54086505 51058612 48300119 45732905 43413754 40911102 38825493 37052790
6060 37052790 35393860 33780964 32188577 30858504 29596767 28258374 26843699 25951307
6052 25951307 25119221 24201301 23414516 22578849 21936757 21153837 20394700 19699574 19147788
6043 19147788 18541386 17834252 17188258 16724183 16325608 15921733 15485456 14904549 14367055
6034 14367055 13934429 13548879 13168106 12540716 12196818 12025719 11610416 11271788 11085134
6025 11085134 10632216 10219368 9959686 9655504 9472797 9296191 8976697 8790938 8605435
6016 8605435 8436523 8253271 8076762 7692710 7372666 7239557 7294468 7311921 6934688 6651510
6006 6651510 6419656 6268125 6170208 5854079 5699446 5698941 5390286 5255615 5016333 5041060
$$ packed form
6068E7459786l373281l027893k758493k567214k319151k502652k085609j772703
6060C7052790j658930j612896j592387j330073j261737j338393j414675q92392
6052B5951307q32086r17920p86785q35667o42092p82920p59137o95126n51786
6043A9147788o06402p07134o45994m64075l98575m03875m36277n80907n37494
6034A4367055m32626l85550l80773o27390l43898j71099m15303l38628j86654
6025A1085134m52918m12848k59682l04182j82707j76606l19494j85759j85503
6016H605435j68912j83252j76509l84052l20044j33109N4911J7453l77233k83178
6006F651510k31854j51531r7917l16129j54633n05l08655j34671k39282K4727
$$ plain form
5996 5041060 5098290 4781203 4690265 4688575 4525321 4413510 4286417 4179810 4137719 4050282 3891621
5985 3891621 3744370 3803270 3698954 3627618 3567476 3455686 3405007 3179617 3291949 3204071
5975 3204071 3104221 3145271 3104024 2981428 2940427 2923491 2862943 2761102 2739500 2625254 2624016
5964 2624016 2585524 2657640 2572046 2435674 2444425 2471531 2399501 2193587 2151046 2059207 1960727
5953 1960727 1763873 1724570 1685557 1777344 1638129 1786907 1810413 1762172 1581181 1607199 1536420
5942 1536420 1537587 1622854 1582443 1665123 1661519 1725520 1833701 1727621 1823339 1670506 1463010
5931 1463010 1568763 1522812 1402988 1484299 1398482 1240165 1414215 1253263 1123874 1082350
5921 1082350 1059115 1064109 1105954 1064841 985862 1066372 1179057 1160989 1187694 1222256 1088092
$$ packed form
5996E041060N7230l17087r0938j690j63254j11811j27093j06607m2091q7437j58661
5985C891621j47251N8900j04316p1336o0142j11790n0679k25390J12332q7878
5975C204071r9850M1050m1247j22596m1001j6936o0548j01841k1602j14246j238
5964B624016l8492P2116q5594j36372Q751K7106p2030k05914m2541r1839r8480
5953A960727j96854l9303l9013R1787j39215J48778K3506m8241j80991K6018p0779
5942A536420J167Q5267m0411Q2680l604O4001J08181j06080R5718j52833k07496
5931A463010J05753m5951j19824Q1311q5817j58317J74050j60952j29389m1524
5921A082350k3235M994M1845m1113p8979Q0510J12685j8068K6705L4562j34164
$$ plain form
5910 1088092 988404 1040992 1161254 1242615 1232581 1032172 971671 1053446 914574 994305 968202
5899 968202 886623 1018185 1110227 984217 931397 798222 823384 843628 866145 983557 826479
5888 826479 694825 859651 816859 822309 698889 647301 585455 504919 665464 925301 907927
5877 907927 759555 731637 506207 633917 712889 823248 905369 978856 710663 614257 712266
5866 712266 677999 626347 682795 627763 585362 575674 365776 505624 607770 458626 352277
5855 352277 544317 663306 560120 527208 610412 559091 446676 598884 558664 402879
5845 402879 683332 559854 500205 483091 434720 576235 688643 684741 781252 789628 727462
5834 727462 595675 461761 564521 695366 585584 541870 566678 582462 748917 622012
$$ packed form
5910A088092r9688N2588J20262Q1361j0034k00409o0501Q1775j38872P9731k6103
5899I68202q1579J31562R2042j26010n2820j33175K5162K0244K2517J17412j57078
5888H26479j31654J64826m2792N450j23420n1588o1846q0536J60545K59837j7374
5877I07927j48372k7918k25430J27710P8972J10359Q2121P3487k68193r6406R8009
5866G12266l4267n1652N6448n5032m2401r688k09898J39848J02146j49144j06349
5855C52277J92040J18989j03186l2912Q3204n1321j12415J52208m0220j55785
5845D02879K80453j23478n9649j7114m8371J41515J12408l902R6511Q376o2166
5834G27462j31787j33914J02760J30845j09782m3714K4808J5784J66455j26905
$$ plain form
5824 622012 517581 524256 574628 517722 480320 562610 783900 677644 603603 536843 474861
5813 474861 465876 516603 515192 472766 608396 593693 654668 627895 605180 678052 602078 708836
5801 708836 622088 571045 728962 723029 824390 895060 907105 746704 842875 960312 1030035
5790 1030035 1069767 1183685 1257660 1428072 1553443 1579550 1579670 1515325 1565683 1365991 1199035
5779 1199035 1184229 1131876 928950 800564 944268 896421 711233 706295 829086 935800
5769 935800 1022237 1084043 990714 924502 1001963 1119500 1321895 1439138 1408380 1549930 1615972
5758 1615972 1577920 1695662 1586436 1394551 1179112 860921 873449 789567 877720 779820
5748 779820 673834 726434 646393 549221 523046 533789 625075 499032 416214 366105 323297
$$ packed form
5824F22012j04431O675N0372n6906l7402Q2290K21290j06256p4041o6760o1982
5813D74861q985N0727j411m2426J35630j4703O0975k6773k2715P2872p5974J06758
5801G08836q6748n1043J57917n933J01361P0670J2045j60401R6171J17437O9723
5790A030035L9732J13918P3975J70412J25371K6107J20o4345N0358j99692j66956
5779A199035j4806n2353k02926j28386J43704m7847j85188m938J22791J06714
5769I35800Q6437O1806r3329o6212P7461J17537K02395J17243l0758J41550O6042
5758A615972l8052J17742j09226j91885k15439l18191J2528q3882Q8153r7900
5748G79820j05986N2600q0041r7172k6175J0743R1286j26043q2818n0109m2808
$$ plain form
5737 323297 475242 433627 361584 350965 307569 357648 291490 160118 192643 437381 491103
5726 491103 269736 208003 360108 395146 348325 276055 379118 441778 314856 253691 308988
5715 308988 417720 288646 244120 311666 113245 80820 355337 200801 142016 270225
5705 270225 194102 258448 139925 316637 352378 220158 206186 298509 145865 64169 175444
5694 175444 171158 325240 192195 274600 88596 44043 115999 140788 81469 92366 203482
5683 203482 312995 252332 133088 163542 215849 197227 118400 117616 28748 169904 144257
5672 144257 231120 197560 104542 244965 210279 253038 152899 51603 141630 165096 -121553
5661 -121553 -25346 127795 123479 161108 144166 109552 174415 235153 198140 91107 214573
$$ packed form
5737C23297J51945m1615p2043j0619m3396N0079o6158j31372L2525K44738N3722
5726D91103k21367o1733J52105L5038m6821p2270J03063O2660j26922o1165N5297
5715C08988J08732j29074m4526O7546j98421l2425K74517j54536n8785J28209
5705B70225p6123O4346j18523J76712L5741j32220j3972R2323j52644q1696J11275
5694A75444m286J54082j33045Q2405j86004m4553P1956K4789n9319J0897J11116
5683B03482J09513o0663j19244L0454N2307j8622p8827p84q8868J41156k5647
5672A44257Q6863l3560r3018J40423l4686M2759j00139j01296R0027K3466k86649
5661a21553R6207J53141m316L7629j6942l4614O4863O0738l7013j07033J23466
$$ plain form
5650 214573 14168 74943 157954 63701 -49612 14204 4069 -60235 -185583 -193254 -18970
5639 -18970 70779 88749 176823 277225 -18127 50894 23174 -153285 -167455 32109 53407
5628 53407 23058 -71274 53778 6253 -107313 -93874 -44207 -64622 -51464 -71649 -38340
$$ packed form
5650B14573k00405O0775Q3011r4253j13313O3816j0135o4304j25348p671J74284
5639a8970Q9749J7970Q8074J00402k95352O9021k7720j76459j4170J99564K1298
5628E3407l0349r4332J25052m7525j13566J3439M9667k0415J3158k0185L3309
$$ [...]
##END NTUPLES=NMR SPECTRUM
##END=
