##TITLE=1H_78_2025-BAy
 200.13MHz,CDCl3,
 8 sc
 
 4.7.2025
##JCAMPDX= 6.0         $$ Bruker NMR JCAMP-DX V2.0
##DATA TYPE= NMR FID
##DATA CLASS= NTUPLES
##ORIGIN= UXNMR, Bruker Analytische Messtechnik GmbH
##OWNER= pz
$$ XWIN-NMR		Version 3.5
$$ Fri Jul  4 16:31:30 2025 Russian Standard Time (UT+4h)  she@DPX200
##.OBSERVE FREQUENCY= 200.1313
##.OBSERVE NUCLEUS= ^1H
##.DELAY= (6, 6)
##.ACQUISITION MODE= SIMULTANEOUS
##.ACQUISITION SCHEME= undefined
##.AVERAGES= 8
##.DIGITISER RES= 18
##SPECTROMETER/DATA SYSTEM= spect
##.PULSE SEQUENCE= zg30
##.SOLVENT NAME= CDCl3
##.SHIFT REFERENCE= (INTERNAL, CDCl3, 0, 14.3821)
##AUDIT TRAIL= $$ (NUMBER, WHEN, WHO, WHERE, WHAT)
$$ ##TITLE= Audit trail, XWIN-NMR		Version 3.5
$$ ##JCAMPDX= 5.01
$$ ##ORIGIN= Bruker BioSpin GmbH
$$ ##OWNER= she
$$ F:/spectra/data/she/nmr/H-C/1/audita.txt
$$ ##AUDIT TRAIL=  $$ (NUMBER, WHEN, WHO, WHERE, WHAT)
(   1,<2025-07-04 16:30:02.46 +0400>,<she>,<DPX200>,
      <created by zg, POWCHK disabled, PULCHK disabled
       configuration hash MD5:
       00 E9 B6 7A A2 85 ED C7 34 08 36 98 17 FE 4E 26
       data hash MD5: 16K
       CF EC 04 63 1C 56 04 98 80 0A B0 26 28 03 CF 1F>)
$$ ##END=
$$ 
$$ hash MD5
$$ 75 AA AE 7A 93 A4 75 18 E6 B3 7F 0D ED 75 9C 45
##$RELAX= 
##$RELAX= 
##$RELAX= 
##$RELAX= 
##$RELAX= 
##$RELAX= 
$$ Bruker specific parameters
$$ --------------------------
##$DU= <F:/spectra>
##$EXPNO= 1
##$NAME= <H-C>
##$PROCNO= 1
##$TYPE= <nmr>
##$USER= <she>
##$AMP= (0..31)
100 100 100 100 100 100 100 100 100 100 100 100 100 100 100 100 100 100 
100 100 100 100 100 100 100 100 100 100 100 100 100 100 
##$AQSEQ= 0
##$AQ_mod= 1
##$AUNM= <au_zg>
##$AUTOPOS= <>
##$BF1= 200.13
##$BF2= 200.13
##$BF3= 200.13
##$BF4= 200.13
##$BF5= 200.13
##$BF6= 200.13
##$BF7= 200.13
##$BF8= 200.13
##$BYTORDA= 1
##$CFDGTYP= 0
##$CFRGTYP= 5
##$CHEMSTR= <none>
##$CNST= (0..31)
1 1 145 1 1 1 1 1 1 1 1 1 1 1 1 1 1 1 1 1 1 1 1 1 1 1 1 1 1 1 1 1 
##$CPDPRG= <>
##$CPDPRG1= <>
##$CPDPRG2= <>
##$CPDPRG3= <>
##$CPDPRG4= <mlev>
##$CPDPRG5= <mlev>
##$CPDPRG6= <mlev>
##$CPDPRG7= <mlev>
##$CPDPRG8= <mlev>
##$CPDPRGB= <>
##$CPDPRGT= <>
##$D= (0..31)
0 0.7 0 0 0 0 0 0 0 0 0 0.03 0 0 0 0 0 0 0 0 0 0 0 0 0 0 0 0 0 0 0 0 
##$DATE= 1751632201
##$DBL= (0..7)
120 120 120 120 120 120 120 120 
##$DBP= (0..7)
150 150 150 150 150 150 150 150 
##$DBP07= 0
##$DBPNAM0= <>
##$DBPNAM1= <>
##$DBPNAM2= <>
##$DBPNAM3= <>
##$DBPNAM4= <>
##$DBPNAM5= <>
##$DBPNAM6= <>
##$DBPNAM7= <>
##$DBPOAL= (0..7)
0.5 0.5 0.5 0.5 0.5 0.5 0.5 0.5 
##$DBPOFFS= (0..7)
0 0 0 0 0 0 0 0 
##$DE= 6
##$DECBNUC= <off>
##$DECIM= 32
##$DECNUC= <off>
##$DECSTAT= 4
##$DIGMOD= 1
##$DIGTYP= 9
##$DL= (0..7)
0 120 120 120 120 120 120 120 
##$DP= (0..7)
150 150 150 150 150 150 150 150 
##$DP07= 0
##$DPNAME0= <>
##$DPNAME1= <>
##$DPNAME2= <>
##$DPNAME3= <>
##$DPNAME4= <>
##$DPNAME5= <>
##$DPNAME6= <>
##$DPNAME7= <>
##$DPOAL= (0..7)
0.5 0.5 0.5 0.5 0.5 0.5 0.5 0.5 
##$DPOFFS= (0..7)
0 0 0 0 0 0 0 0 
##$DQDMODE= 0
##$DR= 18
##$DS= 0
##$DSLIST= <SSSSSSSSSSSSSSS>
$$ [...]
##$SUBNAM0= <"">
##$SUBNAM1= <"">
##$SUBNAM2= <"">
##$SUBNAM3= <"">
##$SUBNAM4= <"">
##$SUBNAM5= <"">
##$SUBNAM6= <"">
##$SUBNAM7= <"">
##$SUBNAM8= <"">
##$SUBNAM9= <"">
##$SW= 18.0517328524113
##$SWIBOX= (0..15)
0 0 2 0 0 0 0 0 0 0 0 0 0 0 0 0 
##$SW_h= 3612.71676300578
##$TD= 16384
##$TD0= 1
##$TE= 0
##$TE2= 300
##$TE3= 300
##$TEG= 300
##$TL= (0..7)
0 120 120 120 120 120 120 120 
##$TP= (0..7)
150 150 150 150 150 150 150 150 
##$TP07= 0
##$TPNAME0= <>
##$TPNAME1= <>
##$TPNAME2= <>
##$TPNAME3= <>
##$TPNAME4= <>
##$TPNAME5= <>
##$TPNAME6= <>
##$TPNAME7= <>
##$TPOAL= (0..7)
0.5 0.5 0.5 0.5 0.5 0.5 0.5 0.5 
##$TPOFFS= (0..7)
0 0 0 0 0 0 0 0 
##$TUNHIN= 0
##$TUNHOUT= 0
##$TUNXOUT= 0
##$USERA1= <user>
##$USERA2= <user>
##$USERA3= <user>
##$USERA4= <user>
##$USERA5= <user>
##$V9= 5
##$VALIST= <valist>
##$VCLIST= <CCCCCCCCCCCCCCC>
##$VD= 0
##$VDLIST= <DDDDDDDDDDDDDDD>
##$VPLIST= <PPPPPPPPPPPPPPP>
##$VTLIST= <TTTTTTTTTTTTTTT>
##$WBST= 1024
##$WBSW= 4
##$XGAIN= (0..3)
0 0 0 0 
##$XL= 0
##$YL= 0
##$YMAX_a= 659395
##$YMIN_a= -1017586
##$ZGOPTNS= <>
##$ZL1= 120
##$ZL2= 120
##$ZL3= 120
##$ZL4= 120
##$ABSF1= 10
##$ABSF2= 0
##$ABSG= 5
##$ABSL= 3
##$ALPHA= 0
##$AQORDER= 0
##$ASSFAC= 0
##$ASSFACI= 0
##$ASSFACX= 0
##$ASSWID= 0
##$AUNMP= <proc_1d>
##$AZFE= 0.1
##$AZFW= 0.1
##$BCFW= 1
##$BC_mod= 2
##$BYTORDP= 1
##$COROFFS= 0
##$CY= -3
##$DATMOD= 1
##$DC= 2
##$DFILT= <>
##$DTYPP= 0
##$F1P= 0
##$F2P= 0
##$FCOR= 0.5
##$FTSIZE= 0
##$FT_mod= 4
##$GAMMA= 1
##$GB= 0.15
##$INTBC= 1
##$INTSCL= 1
##$ISEN= 128
##$LB= 0.25
##$LEV0= 0
##$LPBIN= 0
##$MAXI= 10000
##$MC2= 0
##$MEAN= 0
##$ME_mod= 0
##$MI= 1.114404
##$NCOEF= 0
##$NC_proc= 0
##$NLEV= 6
##$NOISF1= 3.799351
##$NOISF2= 2.8
##$NSP= 1
##$NTH_PI= 0
##$NZP= 0
##$OFFSET= 14.38212
##$PC= 1
##$PHC0= -1205.684
##$PHC1= 16.39223
##$PH_mod= 1
##$PKNL= yes
##$PPARMOD= 0
##$PSCAL= 0
##$PSIGN= 0
##$REVERSE= no
##$SF= 200.129724274929
##$SI= 16384
##$SIGF1= 3
##$SIGF2= 2
##$SINO= 400
##$SIOLD= 16384
##$SREGLST= <1H.CDCl3>
##$SSB= 0
##$STSI= 0
##$STSR= 0
##$SW_p= 3205.1282051282
##$SYMM= 0
##$S_DEV= 0
##$TDeff= 0
##$TDoff= 0
##$TI= <>
##$TILT= no
##$TM1= 0
##$TM2= 0
##$TOPLEV= 0
##$USERP1= <user>
##$USERP2= <user>
##$USERP3= <user>
##$USERP4= <user>
##$USERP5= <user>
##$WDW= 1
##$XDIM= 8192
##$YMAX_p= 0
##$YMIN_p= 0
$$ End of Bruker specific parameters
$$ ---------------------------------
##NTUPLES= NMR FID
##VAR_NAME=  TIME,          FID/REAL,        FID/IMAG
##SYMBOL=    X,             R,               I
##VAR_TYPE=  INDEPENDENT,   DEPENDENT,       DEPENDENT
##VAR_FORM=  AFFN,          ASDF,            ASDF
##VAR_DIM=   8192,          8192,            8192
##UNITS=     SECONDS,       ARBITRARY UNITS, ARBITRARY UNITS
##FACTOR=    0.0002768,     1,               1
##FIRST=     0,             0,               0
##LAST=      2.2672688,     0,               0
##MIN=       0,             -1017586,        0
##MAX=       2.2672688,     659395,          0
$$ Real data points
##PAGE= N=1
##DATA TABLE= (X++(R..R)), XYDATA
0@%%%%%%Qq%qJ6j6K1k9L2m0N6p2Q1r7J20j42J67j93K28k69L10l59M14m72N41o17
32c28O96p85Q89j002J124j256J403j564J740j933K140k368K619k891L186l511
48a841L870m265M696n173N705o297O965p720Q576r566J0723j2095J3754j5799
62h467J8402k1836K6576l3556M4843o5976J18223m76868o18927J226357M9054
73B57825o58562N29132N06894o68920k01739N92972j49536n63045N98771M15603
83F59395q77930j96623P61794k45762n79050L86478M33365j88164q1765J40977
93B12715l27587m19797N05163M62321n53086j89001N23322j24707l91797K41674
103f0780K57298j58839m0501K06517j52570l52057K61332K30292m43394J125N23360
$$ y = [0, 0, 0, 0, 0, 0, 0, 8, 0, 0, -8, 8, -8, 13, -16, 16, -24, 32, -40, 41, -56, 64, -78, 89, -104, 124, -145, 165, -194, 220, -252, 289, -328, 368, -417, 472, -530, 594, -662, 741, -823, 917, -1016, 1124, -1244, 1375, -1516, 1670, -1841, 2029, -2236, 2460, -2713, 2992, -3305, 3660, -4060, 4516, -5050, 5673, -6422, 7332, -8467, 9935, -11901, 14675, -18881, 25962, -40014, 78209, -398659, -1017586, 208771, 257825, -400737, 128395, 635289, -33631, -235370, 357602, 208066, -354979, 243792, 659395, -218535, -415158, 346636, 100874, -478176, -91698, 341667, 153503, 71738, 212715, -114872, -534669, -29506, 432815, -120271, -309272, 214050, 89343, -302454, -60780, 196518, 37679, -2822, 203695, 51125, -300932, -39600, 190692, -252702, -251577, 271783]
114B71783p0450k83720O2867M172n6777J19295J29456j14302k01995J08374R7316
125F6019k06404N2913K29016p8981q1190J3983k0204O5233l5584r2517N6948m374
137c5142J1750Q7476j00428p5689J05048P2975J3428o2359j1055P9205j22059
148c6850p7175J73746r322p9427P9065n3528o1093J01542M8767n2824r9956K4859
160d2196J34610j02787j00932J37802l3448q7577J25631J7285q5698K2753M5928
171C1371k3689r2960O6141J59433j58989j23082J96712j2878j08886J33761L047
182F9981j32009M6623J01042m3791j23022O5759J27587j53546m9424J96043q3343
193B1900j23956J39550q976j02088P3832N9960o6303q8002O5746J15298j06571
$$ y = [271783, 201333, -82387, -19520, -15348, -72125, 47170, 176626, 62324, -139671, -31297, 66019, -140385, -87472, 141544, 62563, -18627, -4644, -24848, 40385, 4801, -87716, -30768, -35142, -23392, 64084, -36344, -112033, -6985, 65990, 79418, 17059, 6004, 85209, -36850, -114025, 59721, 50399, -29028, 50037, -3491, -64584, 36958, 85725, 32901, -67055, -42196, 92414, -10373, -111305, 26497, -6951, -94528, 31103, 48388, -37310, -14557, 31371, 7682, -85278, -19137, 140296, -18693, -141775, 54937, 42059, -66827, 66934, 69981, -62028, -15405, 85637, 41846, -81176, -15417, 112170, -41376, -90800, 105243, 21900, -102056, 37494, 28518, -73570, 262, 60222, -6081, -94083, -28337, 86961, -19610]
204a9610m0725J37356p1702p3202J23578j6392p8364M3416L4977j0070n1038J7750
216d026P8433q9030m3435J19183m9867o5554Q4699k6439n7863L3219K0198J1263
228A0781l7101j1038O7125m8984k9336Q8247m5002m3578O6359j8646r150K4540
240A4217k4480L1361o98l3284N1990k0363l9569N1328k4798k1107L6596k5393
252d200J4476Q164m8678M4490P164n2998M5252j0193m2846M5278j1014j7641K0344
265b402k3910L0502J4606m7139M3980R203m8389M4716n161l8258L7000j0865o000
278b117K1631l0839K6323J5726m9231L3466L463m7792L9061p210l4548L4371j3816
291a1512l385K4104l0746K2665J7468m0791L3822K73m2348M3076o425l0934L6328
$$ y = [-19610, -60335, 77021, 5319, -67883, 55695, 39303, -39061, 4355, 39332, 29262, -21776, -4026, 74407, -14623, -58058, 61125, 11258, -54296, 30403, 3964, -53899, -20680, -482, 10781, -26320, -37358, 29767, -19217, -48553, 39694, -5308, -48886, 17473, -1173, -10323, 14217, -10263, 21098, 20400, -12884, 39106, 18743, -20826, 30502, 5704, -15403, 21193, -4200, 10276, 18440, -30238, 14252, 21416, -31582, 13670, 3477, -39369, 5909, -5105, -22746, -2402, -26312, 4190, 18796, -28343, 15637, 24840, -23549, 21167, 16006, -22252, 14748, 3883, -2117, 19514, -11325, 14998, 30724, -18507, 14959, 18422, -29370, 9691, 2481, -32067, 2304, -11512, -14897, 9207, -21539, 1126, 18594, -22197, 11625, 11898, -30450, 12626, 6201, -24733, 11595]
304A1595j5827j653L0523k9443J4268J2799l7538L2070l473m0648M1417r408k6456
317b1774M0493j7147o986K7262k7285J0290Q092l4394L1146o348l7474M3958r037
330G96k6074L9856j5747r037K6298k2878R586L888k9974L3676n786l4040M4375
343A4939q578k4401M0633j4522j4367K1595k0345Q854J439k8265L2915q138k9560
356b7801M7403j1455k6659M0151j6354j4588K4114j8640M654N69k2353L2934r133
369B842k4755M2866j9145k3740M3675j9637j5678K3460k1605M827Q192j7603K5753
382I452j0196j9335M1208j8644j7939L8142k6207j0795K7525k1049O430J0065
394H657k1382K0429m909j3673L5549j9653j6559L0227k5942j137K8171k8529O952
$$ y = [11595, -4232, -5885, 24638, -4805, 9463, 22262, -15276, 16794, 13321, -27327, 14090, 4682, -21774, 18719, 1572, -5414, 21848, -5437, 4853, 12945, -21449, 9697, 3349, -34125, 9833, 796, -25278, 14578, -1169, -10206, 16092, -6786, 2800, 6688, -23286, 10390, 4604, -29436, 14939, 6361, -18040, 22593, 8071, -6296, 15299, -5046, 3808, 5247, -23018, 9897, 1759, -27801, 19602, 8147, -18512, 21639, 5285, -9303, 14811, -3829, 825, 1394, -20959, 11975, 2842, -21913, 20953, 1808, -21932, 21743, 2106, -13572, 9888, -11717, -6890, 1302, -16301, 9452, -744, -20079, 21129, 2485, -15454, 22688, -3519, -14314, 13211, -7838, -1408, 8657, -12725, 7704, 2795, -10878, 24671, 5018, -11541, 18686, -7256, -8393, 19778, -8751, -1799]
407a799J6103k4081J7648P22j8622K1285j3314m469K3393k9289N611K0085l8686
420b5413J9073K8116l1265J3971O174k6028J3816N29N307J1211k9737J6901J4582
433A7237m4588K5999K3763m4218J9597K2559k6842L87m042O74O498j6029L3465
446A4460J0895n5603K1694K1583m2090K7049L1048k6104m238j497K637q8j9479
459a9733L3251J0565m5671L1078J6010n6380J3641K6101j5263J4922O571o552
471H540j2300k6371K8628J8852k7694L1913Q918m8983J3833J0466j6521K2031
483A1312K022l293P668k6396K975P135k4389K6111J5461k1194J5231j5656k6174
496b9187K3545l107P445K9774k5473j2063N186k0220J5905J2371n406K2514j6540
$$ y = [-1799, 14304, -9777, 7871, 8593, -10029, 11256, -2058, -6527, 16866, -12423, -6812, 13273, -25413, -6340, 21776, -9489, 4482, 10656, -15372, -1556, -1027, 4280, 15491, -14246, 2655, 17237, -27351, -1352, 22411, -21807, -2210, 20349, -6493, -6106, -10148, -9474, -2976, -19005, 14460, 25355, -30248, -8554, 13029, -29061, -2012, 29036, 2932, -1306, -2803, -166, -254, -19733, 13518, 24083, -21588, 9490, 25500, -30880, -17239, 8862, -6401, 8521, 15092, 8540, -3760, -30131, -1503, 17349, -10345, 21568, 30486, -18497, -4664, 5802, -10719, 11312, 13334, 10041, 17709, -8687, -5712, 1423, -22966, 3145, 18606, -2588, 12643, -3013, -29187, -5642, -8749, -1304, 28470, 2997, -9066, -3880, -24100, -8195, 4176, -1230, 21284, 4744]
509D744j8609K2141k2191m244L7254j4185o389J5763j6639n160n625P62L3048
522B0670r501p143K1174m0361j5511M1621j0255n253K1982j4400r981m982J720
535a0220K0354j6451L341K8770l5611q771L2273k8539o271L5431n380l117r22
548D887j0449K098j3758J6247L2007l2559n501K3367l5192J505L7102j3791n123
561H40O991n892%j6480R159K1921k7423J0431L0666m1003r259K7807j6853J064
575h031K0707J791q980k4377P502K0546k5243J8413L2840m3338q208K9764k0894
588g508n838K0257N970p29j6124P792P311l7178J4094L8303k8390p1K2822k8411
602g700j1978J2061P921J0727j2545N694J1036l7763K064L3942k0809K200K3774
$$ y = [4744, -13865, 8276, -13915, -18159, 19095, 4910, -1479, 14284, -2355, -7515, -13140, -12378, 20670, 11169, 4026, 25200, -15161, -30672, 10949, 694, -4559, 17423, 3023, -6958, -11940, -10220, 10134, -6317, -2976, 25794, -9817, -18588, 13685, -14854, -21125, 14306, 8926, 5809, 4887, -5562, -3464, -17222, -975, 31032, -1527, -7028, 16339, -18853, -17348, 19754, 5963, 840, 7831, 1939, 1939, -14541, -5382, 16539, -10884, -453, 30213, -10790, -20049, 7758, -9095, -8031, 12676, 14467, 5487, -18890, -11388, 9158, -16085, 2328, 35168, -8170, -16378, 13386, -7508, -13346, 6911, 12881, 12152, -3972, 3820, 11131, -26047, -11953, 26350, -2040, -2111, 20711, -7700, -19678, -7617, 304, 11031, -1514, 4180, 15216, -22547, -20483, 13459, -7350, -5150, 18624]
615A8624j5427q505l499p62J2338j3700J0491K7676l2489j0153K3853k0238j72
628a1963K3083l731J000r120o591J1584j8066M341L3224k0341r375J7896j6767
641d826m815Q576k448J4607o863p688J8781k1086j1288L0363r666r011J7993p652
655D977n577m638l179J8384j0202o952K5686k0208j6383K6844j0506j0307J6901
668D840l170n4m828n717J7076j1112q133K6401j3802j2761K2981j1370r494J3059
682C916l312M861l856q259J7136j2358j1492K5762j1795j3062K1464r497q803
695i295J0629l551M454n018o042J7809j1021r931K3963j3245j0993K2790r206
708A343o810J1525n731L050j067n374J4596j1008q848K1398j2839q637K0137j1194
$$ y = [18624, 3197, -5308, -8807, -9569, 2769, -10931, -440, 27236, -5253, -15406, 8447, -11791, -11963, 11120, 7389, 8389, -731, -7322, 4262, -13804, -9463, 23761, 3420, -5955, 11941, -4826, -9641, -1065, -3513, 11094, 4231, -3457, 15324, -5762, -17050, 13313, 3647, -5364, 12629, 4977, -600, -5238, -8417, 9967, -235, -7187, 18499, -1709, -18092, 8752, -1754, -12061, 4840, 1670, 1616, -3212, -8929, 8147, -2965, -11098, 15303, 1501, -11260, 11721, 351, -9143, 3916, 604, 5465, 1609, -6650, 10486, -1872, -13364, 12398, 603, -12459, 9005, -492, -9295, 1334, -2217, 2237, -2781, -8823, 8986, -2035, -11966, 11997, -1248, -12241, 10549, 1343, -5467, 6058, 327, 3377, 2310, -3064, 11532, 524, -8324, 13074, 235, -8402, 11735, 541]
722E41n984R757p090M634k524q134J5071j0260j0182K2587j0764j0201J8768q468
736b249m092R145n184O061m026o465J7917j0766r194K2689j1479j0454J9153p926
750C130n392O955o792N821m188p308J7362j0202j1167K0395q781q316J4905p711
764a289j892M565p269J0125l353j0664J7436o824j1684J9209o270r194J1353o285
778b036J044M151q888J0281l473j1148J8555n152j1012J6051p006n872J1270q128
792a363K130M052j1578J0838K09j1437J4107m415j0003J3238o625k685Q807j1634
806f359M547N787j2257J0933R76j2677J3176k000p488J1755q215j765R456j0889
820e020N054O009j2790R292J776j0322J1551m596o243J1540r883j226J0879j2334
$$ y = [541, -5443, 4314, -2776, 1858, -666, -8800, 6271, -3989, -14171, 8416, -2348, -12549, 6219, -2249, -6341, 2804, -2380, 3681, -345, -6810, 11107, 341, -8853, 13836, 2357, -8097, 11056, 3130, -2262, 4693, -2099, 3722, -466, -7774, 9588, -614, -11781, 8614, -167, -8483, 6422, -1289, -3181, 1384, -5885, 4240, 887, -9777, 7659, 835, -10849, 8360, 2090, -7104, 4249, -2036, -992, 3159, -5729, 4552, 1079, -10069, 8486, 3334, -7678, 8373, 1367, -4505, 6765, -1363, 767, 4819, -6759, 4079, 4288, -7149, 6958, 2543, -7460, 5778, -847, -3532, 5275, -6359, -1812, 3975, -8282, 2651, 3627, -9050, 4126, 2126, -5362, 6393, -1822, -3587, 5869, -5020, 34, 6043, -6747, 2545, 4321, -6001, 5550, 954, -5289, 6251, -3632, -4858, 6021, -6313]
834f313L743O479j0948P921J279q970J0821n254m197J2744j0249j051J1219j0991
848c767M154O009j0688Q707m56q610J2057p173n853J3309j0018k549J0740r684
862c822K877M289q417Q955l185p328J4062q069n542J5144r720l576J1146p772
876i58K125L217p751R189m367p805J3069q405n757J4467r299m285J1001p900J976
891a483K150o299R902m054p559J3312q555l899J4548r683k488J0469q288J954
905B7K153p329J0040l359p145J1645q343l795J3695j1042m22J1352j0176K651
919d8K998r030Q989j117o144R711o858k251R744j2027L020J0727j1676M629L220
934C887j1435Q657J317p263Q761l103j313N871j1969N218Q193j2744Q510M293
$$ y = [-6313, -2570, 3909, -7039, 882, 2161, -6809, 4012, -1242, -5439, 7305, -2944, -3995, 7224, -3767, 387, 6396, -4292, 4415, 3959, -4651, 7406, 233, -5620, 7689, -2329, -4878, 5862, -3822, -945, 3344, -5073, 3882, 697, -6631, 7431, -638, -6180, 8964, -756, -4332, 6814, -958, 1167, 4384, -3367, 5822, 1455, -6350, 6719, -1686, -7443, 7024, -2275, -6560, 4441, -3459, -1483, 667, -5632, 4270, 216, -7343, 5969, -2586, -6485, 8063, -1620, -4108, 6361, -1927, 27, 2180, -5149, 4891, 1532, -5613, 6032, -2311, -6106, 7589, -3453, -3875, 7477, -2699, -48, 2950, -6080, 2909, 1792, -4352, 5359, -1499, -3750, 5994, -6033, -3013, 7714, -3962, 667, 3887, -7548, 1109, 2426, -4837, 3924, 821, -492, 5379, -6590, -1372, 6821, -5923, 2587, 6880]
948F880j4345Q492J856j0532Q407J321O81J257j1053P373M120j3436J3113M950
962I084j5895J1812K669j5487N553N138J278j07p486Q390k256j6342J5643L808
976E802j6063J6361M213k0141L743O700q67k83k303J2168m028j7591J5049L78
990C138j6934K0061Q017j9037L324L212o118k656O01J4851k110j5391J4003m208
1004G53j9244J8892P494j2983R240L328q282n332l214J2508J659q206J4822m183
1018G252j9518J2010J343j0581J4029M804n619k663q111N015J154o141J5664J473
1032A0111j2719R090p243j1513J3453K449r3N245r403K59l95r682J0045M124m826
1047a098R853q474j0059Q388n029K002J1146o762K738K502j2992L743L305j692
$$ y = [6880, -7465, 1027, 2883, -7649, 758, 2079, 2760, 4017, -7036, 337, 4457, -8979, 4134, 9084, -6811, 5001, 7670, -7817, -2264, 2874, 4152, 4045, -3441, 4949, 2693, -13649, 1994, 5802, -10261, 6100, 10313, -9828, -6085, 615, -252, -535, -2838, 9330, 5302, -12289, 2760, 3138, -13796, 6265, 14282, -4755, -1431, 1781, -4337, -6993, -6392, 8459, 6349, -9042, 4961, 753, -18491, 401, 7895, -5088, 4152, 7480, -802, -6134, -9348, 3160, 4819, -3387, 11435, 7252, -12266, -256, 1087, -9494, 4535, 9339, 3720, 1057, -7054, -2039, -885, -7026, 8638, 10111, -2608, 6482, -761, -12274, 1179, 3628, 3535, 8780, -623, -364, -759, -10441, -396, 3728, -1098, 8755, 281, -9778, -1390, -6419, -4417, 6729, -33, 2705, 5207, -7785, -4042, -737, -2429]
1061b429J0819m075n369O437j0538n49J0455p336N961O560j2919R99J396n838
1075f426Q048j351n12O866j0931j53O527j0756P249R944j1854L721K851q734L764
1090a747P5J434O355p899L172M218j3842P851Q366j3335O558O426j0518K286j41
1105g41p62L793o157O022L653j4601Q742O107j5024Q245O968r476L522M97j300
1120e12K203o219O463L996j2689Q865N257j4904O895N609r049M509Q71j298K508
1135B505p246N119M297j1760Q926N360j2839O477L209q512N485m29o93M359o743
1150b485K972L584j0569O605M463r771P677N92p573O374l316j719P818o609J726
1165b31M975r253L889K636o894P836r98n500P734n697l529Q754o051O00O362p196
$$ y = [-2429, 8390, 4315, -1054, 5383, -5155, -5704, 4751, -2585, 3376, 9936, -2983, -1984, -588, -6426, 1622, 271, -241, 6625, -4306, -4459, 2068, -8688, -1439, 8505, -3349, 372, 3223, -5511, -1747, -1672, -238, 6117, -1782, 1390, 5608, -8234, -383, 7983, -5352, 1206, 7632, -2886, -600, -741, -1503, 2290, -3867, 2155, 5808, -8793, -51, 6056, -8968, -723, 6245, -3231, 291, 788, -512, 1691, -4528, 1935, 5931, -6758, 2107, 7364, -7540, -645, 4964, -4085, 424, 1295, -3, 2505, -4741, 378, 4675, -7085, 1841, 7201, -5638, 839, 4048, -4464, 1021, 592, -101, 4258, -2485, 487, 4071, -6498, 107, 4570, -5201, 2476, 3068, -4505, 1869, -1447, -3166, 4652, -1957, -231, 4744, -4509, -620, 2016, -4878, 2958, 1960, -3540, 4194, -1503, -5032, 3722, -2329, -1729, 4633, -2563]
1181b563K930J621o710P682j584n123R751n791m035Q306n846q7N582o457L750
1196A426Q28o561P438k600n537R313m497l404P603n836j52N004n941M259R79o838
1212d516P140j789n348Q436m233l052O990o231J304M915p528M603K265p664O904
1227B196j039m867P385l985j300N860p580K525N182q102M681K616p517N058o38
1242D75m284O941m801n08O478q274K616N872q257L960L665o077M501j857k267
1257a817O135n865K10P501q861J332O036q217K861L139m721L967k716j766O424
1272C642p017N02P877q325J132O119p293L036J749m035N389l269k233P250p022
1287b498p67Q248p058N26N478o257L398L59l878N999m119k417P839o614j330P164
$$ y = [-2563, 367, 1988, -4722, 2960, 1376, -3747, 6004, 213, -3822, 4484, -1362, -1449, 4133, -2324, 1426, 2254, -4307, 3131, 531, -5006, 4307, -190, -3594, 4009, -1827, -1979, 3025, -2916, 1343, 2322, -4516, 2624, 835, -4513, 3923, -310, -3362, 3628, -2603, -1299, 3616, -3912, 691, 2956, -4708, 2196, 1157, -3710, 3675, -310, -1610, 4250, -3330, -805, 4377, -3725, 956, 3572, -3945, 1113, 475, -3809, 3132, -1669, -2177, 4301, -3973, -1357, 4515, -3742, 218, 3883, -2194, 2307, 450, -1817, 4318, -1547, -1337, 6164, -2697, -1365, 4671, -3546, -685, 2454, -2267, 1700, -1016, -2782, 3642, -3375, -2873, 5004, -3321, -2189, 3930, -3363, -327, 1422, -2613, 2776, -493, -2726, 4524, -2498, -3265, 4983, -2075, -1549, 3929, -2328, 1070, 1429, -2449, 3550, -569, -2986, 4853, -1761, -3091, 4073]
1303D073o539J309L491n572M119o55m761P543l449l617P788m564j923O322n119
1318a554J845K158n269N648o89o166P848k412m940P119l767k124M540m828K308
1333b83J751n976O688o99o402P881j882m655O636l273q26M284n130L484J157o584
1349c829O625l77o228O632j901l955N527m017J83M028n989L654K047o360N887
1364A927j21n358O328k863k182N484n102N89M805o679L028K516n933M431j37m222
1380c489N460l495j606O513o280R55O130o799K373L205n513L410J54k863N216
1395C371m379r68O395p279Q54O242o473J720K852m894L500m82k958N714m166q31
1411a782O325o652NO051o184K453K664n287M186j531k997N258l663l86N881n950
$$ y = [4073, -2466, -1157, 2334, -3238, 881, 226, -4535, 3008, -441, -4058, 3730, -834, -2757, 3565, -1554, 291, 2449, -2820, 2828, 2139, -4027, 3821, 1409, -3531, 3588, -179, -2303, 2237, -2591, -283, 1468, -4508, 2180, 1481, -4921, 2960, 1078, -3577, 3059, -214, -1040, 3244, -1886, 1598, 2755, -3829, 2796, 2419, -3809, 2823, 922, -3033, 2494, -1523, -1340, 2688, -3301, 353, 2400, -3960, 1927, 1806, -3552, 2776, -87, -2269, 3215, -1887, -1298, 3507, -3172, -144, 2372, -3561, 870, 733, -3489, 1971, -1524, -3130, 3383, -2897, -1942, 4188, -2611, -238, 2967, -2546, 864, 1018, -1845, 3371, -1008, -1976, 4419, -2860, -2006, 4236, -2237, -517, 2335, -2559, 941, 459, -2499, 3215, -951, -1782, 4543, -2109, -2104, 3947, -2237, 216, 2880, -2407, 1779, 248, -2749, 2509, -1154, -1540, 4341, -1609]
1427a609L19M362n931L337K037n197N571j147m625M637k591j065N108m627N28
1442h93L009n449L387P19n263O856j28n289M683k063j773M358l667K214K753n520
1458b066L918m84o412P378M44n618N359k397k354L390l990K278K611m290M921
1473B688j347o612O868R1n375O423j413k064K480m108J551J638l639O087j439
1488A829o553P213j764n719O246l08j836L378l390L69Q94l284N807j221n351Q358
1504D668k600o620O186q89k127L985k367O17o13l312N278k168m840R359k073o940
1520d456O340j558l499M530j642J047J08k752M641l669m612R560k136n720O716
1535B898j963l746L056j181J039O67j541M836m052m695Q049k420n068P402j708
$$ y = [-1609, -1290, 3072, -2859, 478, 2515, -2682, 2889, 1742, -2883, 1754, -837, -1902, 3206, -1421, -893, 2116, -3333, 54, 773, -4490, 2366, 2238, -3051, 1632, -431, -2204, 2154, -1513, 701, 3454, -2066, 1852, 1368, -5044, 2334, 2778, -2840, 2519, 122, -2232, 1158, -2832, -554, 2057, -2233, 2688, 1341, -5271, 1597, 1688, -3687, 2736, 1323, -741, 1739, -2369, -818, 820, -2819, 3268, 1829, -4724, 2489, 725, -4994, 1252, 944, -892, 2486, -904, -535, 359, -2925, 2882, 1661, -3690, 4668, 2068, -4552, 1634, 745, -1382, 2603, 236, 853, 240, -3072, 2206, 38, -4802, 4557, 2484, -4456, 1884, 326, -3173, 1357, -285, 762, 870, -1882, 2759, -910, -5522, 4038, 1902, -3818, 2898, 935, -2811, 245, -936, 103, 770, -771, 4065, 13, -4682, 3367, 947, -4121, 3281, 1573]
1550A573l237K872k534J58R84k117N284k417m385O783l285m679O730j552q66L285
1566B597l436N41P16l340N238j404l517O485l043m460M948k407O8L742l901K375
1582A202K41m478M252j031l099O526j545l519L588l334k44L198l518L411Q48n167
1598b669M281j467m449N796p25k812L832k589l99J914l802L955J337m812M618
1613B009q77m989N194l63k547L473j873L73J005m548L929Q36m885N547p7n386
1629c179M386k89k519K780j252J114Q28m888M746J34n854N792N68n748M828m27
1645A020k919K411j511J873K29m520M852N29n793N172Q32n062L793n6j942K084
1661I92k321J829Q38n265M876J031n778N405L42m131L005q12o52K246k718K023
$$ y = [1573, -1664, 1208, -1326, -1168, -184, -2301, 2983, 566, -3819, 2964, -321, -5000, 1730, 178, -688, 2597, -839, -298, 418, -2922, 2316, 912, -2605, 3880, 837, -3623, 1325, -1082, -1014, 2728, -1173, 1202, 1443, -3035, 1217, 186, -2913, 3613, 2068, -1451, 2137, -1197, -1441, 1757, -1761, 1650, 2498, -2669, 1612, 145, -4304, 1492, 767, -2045, 1787, -802, -1201, 713, -3089, 866, 2203, -2609, 2009, 1132, -3857, 1337, 974, -1573, 1900, 27, 400, 1405, -3143, 786, 1622, -3263, 2284, 2207, -3179, 1207, 918, -1601, 1179, -73, 1041, 1869, -3019, 1727, 1861, -3993, 1799, 2367, -3381, 1447, 1020, -1899, 512, -999, 874, 1103, -3417, 1435, 1964, -3829, 1343, 2175, -2887, 906, 850, -1092, 992, -1329, 500, 1338, -3927, 949, 1980, -3798, 1607, 1949, -2182, 823, 11, -641, 1605, -1113, 910]
1677I10J521n414L817J376n302M035Q24l462K963j654n98K453l916K243K482n184
1693b906L061J530m227L114N68k498L415k439p6L027m450J586L085m553K318J109
1709A664l721K702m89j949L662k257n74L415m559Q01L142l878K809Q76l091L210
1725A763j565j917M605l067r84L768l889M06J723k741K347N89l082M064j571k741
1741b292M490k507j412L816k944P46J418l528L098j58k892M333j023l173L911
1756A883k043j246K840k587J139J163l299L473m16l403M197n83l117L806j918
1771a11j214K246k739K119J186m254L866M94m399L988n81k190K436j241j27J740
1787A219l386K489J602m605L802J195m118K940j77j897K218j957P88J533m099
$$ y = [910, 2431, -2983, 834, 2210, -3092, 943, 1767, -1695, 1268, -386, -984, 1469, -2447, -204, 2278, -2906, 155, 1685, -2542, 572, 1140, -1358, 2057, -382, -458, 2569, -1881, -295, 2790, -1763, 555, 1664, -2057, 645, 156, -1793, 1869, -388, -962, 2453, -2106, -1305, 1837, -2041, 768, 1644, -1447, 1763, 198, -1719, 2886, -181, -1165, 2603, -1286, -880, 843, -1898, 449, 1038, -2044, 2020, 449, -2292, 2198, -309, -1721, 2095, -849, -103, 1315, -2213, 885, 727, -2165, 2168, 1145, -2028, 1883, -160, -1406, 1434, -1153, -14, 1149, -2150, 1323, 907, -2496, 1701, 1118, -1999, 1807, -111, -1325, 921, -1818, 301, 1487, -2767, 1099, 1593, -2806, 1182, 601, -1589, 847, -394, -521, 1219, -2167, 322, 1924, -2681, 1121, 2316, -1802, 1138, 961, -936, 1282, -675, 113, 1646, -2453]
1802b453K795J699m460L502J033l915K986l20j641J999k161N91K036l855K305
1817A41K042m600K817Q41l306K829q77j581K797k651P50K613l926K340J595l382
1833a558K869k52k462K907j573j575L749k596l17K786l428J643J054k815K513
1848I45j171k058M455k661j925M616k717j023L227k564R41N12j616K643j318k014
1864a728M380k522k369M632k625j018K581k154R87O35k327L134j732k155M584
1879B303k471j937M049k555p63K780k603J411O93k559L085j207j849L664k467
1894d26r76L809l198L41K744l740J790J234k994K643k93k198K739k207m8K734
1910A954l768J381K034l787K153J757l454K041Q97j952J847j918L32K343l788
$$ y = [-2453, 342, 2041, -2419, 1083, 2116, -1799, 1187, 867, -774, 1225, -936, -345, 1691, -2164, 141, 2183, -2417, 400, 1241, -2065, 764, -113, -1694, 1103, -1548, -798, 1815, -2111, 229, 1824, -1558, 1311, 1059, -1403, 1504, -69, -1644, 2105, -491, -808, 1978, -1450, 193, 1247, -1568, 945, -226, -2284, 2171, -490, -2415, 2201, -516, -1539, 1688, -876, 65, 577, -1039, 1604, 286, -1728, 2652, 130, -2239, 2393, -232, -1250, 1331, -823, 164, 799, -1528, 1606, -126, -2281, 2303, -168, -2105, 1944, -611, -1374, 1406, -1197, 214, 907, -1652, 1433, 226, -1623, 2041, -426, -1402, 2407, -791, -450, 2294, -1446, 344, 1578, -1416, 1227, 934, -1264, 1475, -732, -780, 1954, -1814, -433, 1601, -2186, -33, 1724, -1730, 311, 1208, -744, 1103, -815, -483, 1860, -1928]
1925a928K168K008m643K323K156m310K175P96j747J807k013N67J593l222K115
1940a55J910l894K703J617l996K336M48j921K227j508Q9J616k791J396J188l347
1956b082K926O63l501L058o60k622K988j211m31K295k382J576N39k885L185l65
1972A091l113L934j104k913L642j450j504K435j529R67J00k347L223j080l111
1987b759M722j415k775L790j405j600K062j202P13K02j546K805j587k524M309
2002A790j641k344M178j943j013J805j574N40O64j630K967j066k996M498k039
2017A96k088L324j347p04K094k817J114N48k262L067m92k314L107j305j754L046
2033A413j937K35K531l144J275J173l669K539N34k478K605r68j176K104k482P79
$$ y = [-1928, 240, 2248, -2395, -72, 2084, -2226, -51, 745, -1002, 805, -1208, -641, 952, -2270, -155, 1755, -2139, 564, 2181, -1815, 521, 969, -952, 1275, -233, -144, 1472, -1319, 77, 1265, -2082, 844, 1507, -1994, 1064, 404, -2218, 770, -441, -872, 1423, -959, 617, 1156, -1729, 1456, 1091, -2022, 1912, 808, -2105, 1537, 87, -1417, 1018, -511, 456, 556, -1791, 1432, 352, -2759, 1963, 548, -2227, 1563, 158, -1442, 620, -582, 131, 333, -1213, 1592, 5, -2519, 1790, 149, -2195, 1983, 40, -973, 832, -742, -202, 462, -1168, 1799, 733, -2263, 2235, 196, -1892, 1432, 85, -619, 1475, -1342, -228, 320, -1942, 1125, 633, -1681, 1426, 121, -1633, 1413, -524, -289, 2242, -902, 373, 1546, -2123, 416, 950, -1528, 1077, 109, -1067, 1037, -1445, -666]
2049f66K243l272J972J272l553K168P35k372K501p21m55J580k367M68J942l511
2065b036K367J626m034K499L68k724K376r59j17K235k766J223J589l928K431J646
2081A796l566K692O23l156J846j72o73J780k077J318R88l853K615J020l820L481
2097H42M02k456J927k86j112J709k140J548R07l213K409J043l727K623M70k334
2113a388K295q17p41J652k102J198J239l395K657Q52l290K324M21k150J896n26
2129A25n65J658k491J379J436l358K084J061l361K268M40j773K020j205m48J802
2145A072k301J632J388l324K044P04k787K178j73j666K614j898m6J927l059J367
2161c28J495k642J886J203k992J856m85j071K449j619M71J452l003R35J582l217
$$ y = [-666, 1577, -1695, 277, 1549, -2004, 164, 899, -1473, 1028, 307, -148, 1432, -935, -467, 1475, -2036, 331, 1957, -2077, 422, 790, -1934, 442, -517, -634, 1601, -1165, 58, 1647, -2281, 150, 1796, -1770, 922, 1545, -1611, 235, 63, -610, 1170, -907, 411, 1399, -2454, 161, 1181, -2639, 842, 1244, -1212, 715, 429, -683, 1026, -1114, 434, 1341, -1872, 537, 1580, -2147, 476, 946, -1388, 907, 90, -651, 1001, -1101, 97, 1336, -2059, 598, 1450, -1840, 484, 905, -1245, 651, 125, -440, 1218, -1273, 106, 1542, -1816, 268, 1329, -2032, 236, 676, -1097, 923, -282, -730, 1072, -1229, 403, 1791, -1533, 511, 1215, -1572, 606, 433, -1233, 1381, -517, -563, 1364, -1695, -328, 1167, -1475, 411, 1614, -1378, 478, -7, -1078, 1371, -248, 223, 1675, -1328, -393, 1189, -2028]
2177b028K461J112l035J717k66j443K312j642J61K411k833J186R81l148K377R75
2193A298k061J984o46j639J836j657P38K085k663J097J190l662J988R58k294K470
2209A022l39j479J576j769N38J460k321K091J078l489J416N14k121K205J93r62
2225c87J652k214J54J851k983J947J858l045J361O47k207J859l25n03J821j840
2241c54L95J291l183J357J909k417J299O66k106J557r84k12K282j986K10K232
2257A956l381Q27J902k731J615P99j755J655j631m76K473k282J28K961l281N78
2273f43J520k062J518l55o67J991j506j060K898k161l9K370k622K45J349j871
2289a095J183k27p67K345j706q70K490k194l27K461k182R07Q89j747J491n09j397
$$ y = [-2028, 433, 1545, -1490, 227, -39, -1482, 830, -812, -651, 1760, -1073, 113, 1094, -2054, 323, 1298, -763, 1221, 575, -1064, 772, -885, -147, 1938, -725, 372, 1562, -2100, -112, 846, -1448, 1022, 683, -796, 780, -989, -451, 1009, -1312, 779, 1857, -1632, -216, 298, -1823, 382, 575, -387, 1265, -949, -795, 1056, -1927, 20, 1878, -1167, 194, 841, -1366, 493, 168, -335, 1486, -354, 41, 1332, -1851, -494, 1415, -1002, 297, 963, -1143, 414, -570, -782, 1500, -486, -276, 1956, -1425, -598, 1304, -1427, 188, 987, -768, 887, -744, -1220, 1253, -1029, -901, 2060, -1221, -643, 877, -1185, 333, -22, -689, 1302, -204, -1264, 1634, -527, -566, 1804, -818, -573, 776, -1095, 88, -139, -906, 1439, -267, -1137, 1353, -841, -1168, 1293, -889, 18, 907, -840, 651, 142, -1255]
2306a255K318j161r88K587j901m02J928k141J021L89j512J935o47j480K770j361
2322A00j248K404j443m99J774k166J011N55j569J658j93j645K016p52j139K135
2338I99j497m0J492k092J144P34k228J825J25j432J957j001m68J907j970K66J522
2355A243k587J310R17k231J664J92j493J897j266k99J953k146O60J282k465J375
2371FJ121k282J444l6j027J465j044o03J891j594j68J853j897Q07R64j851J694
2388G43m27j024K194j641o42K298k011l98J687j581P55N50j447J576n58j230J953
2405G97q63r36J876j385k40J891j720N91M80j189J638o57j320K458j543r17K227
2422A188j658j07R05j192R75j23q98J980r59j177K210j368q36K156j601L47P89
$$ y = [-1255, 1063, -98, -1086, 1501, -400, -802, 1126, -1015, 6, 395, -1117, 818, 171, -1309, 1461, 100, -1148, 1256, -187, -686, 1088, -1078, -67, 488, -1081, 577, 384, -1261, 755, 3, -1136, 999, -498, -538, 954, -1138, 6, 740, -1488, 337, 462, -970, 987, -14, -482, 1425, -545, -279, 1243, -1344, -34, 883, -1348, 316, 508, -985, 912, -354, -653, 1300, -846, -186, 1096, -1369, 6, 1127, -1155, 289, 253, -774, 691, -353, -956, 935, -659, -827, 1026, -871, -64, 900, -951, 743, 316, -708, 1486, -155, -797, 1501, -510, -908, 779, -802, -47, 503, -944, 632, 74, -1156, 797, -66, -1002, 874, -511, -751, 1140, -580, 11, 491, -698, 940, 283, -1037, 1421, -122, -1039, 1188, -470, -577, 328, -864, 111, -12, -910, 1070, 111, -1066, 1144, -224, -1060, 1096, -505, -158, 631]
2439F31j514J258K22j772K155o29j289K022j185q19J606j084K87Q23j583J214
2455C43j9j305J972n82j505K244j051q29J472j646Q69Q39j741J479M6j926K160
2472H20n68j328K136r96l94J222j284K79Q02j551J625m41j481K028o34j594K224
2489H65r71m43J478j441N94J07j164J488l43j221K187p18j530J957r18p05J499
2506G21o88J29K84j544J501k70j865K901p84j634K148r74j053J434l80L82K9j130
2524g93J755n50k102K676n01j844K293k60j428Q98m19N70k78j068K097o98k240
2541a892K747j31k113J935M41j208J15m69J095n64r08K407q45k090K254Ok376
2558a596K025p0o36K56k20J254j084j419K606j3k570K528P3k296J076M35l12k64
$$ y = [631, -883, 375, 597, -1175, 980, 351, -938, 1084, -101, -920, 686, -398, -111, 712, -871, 343, 324, -981, 991, 409, -1096, 1148, 97, -732, 740, -906, -37, 802, -939, 540, 586, -1340, 820, 252, -1076, 1060, 64, -330, 892, -392, -113, 689, -862, 763, 322, -1159, 869, 235, -1359, 865, -106, -549, 929, -512, 82, 189, -975, 513, 170, -1051, 1136, 418, -1112, 845, -73, -778, 721, 33, 162, 446, -1098, 403, 133, -1732, 1169, 385, -1249, 899, -75, -1128, 306, -74, 308, 337, -793, 962, 412, -1690, 986, 485, -1359, 934, 674, -754, 144, -275, 295, 17, -1051, 1046, 348, -1892, 855, 724, -1389, 546, 987, -221, -106, -575, 520, -44, -952, 1455, 610, -1480, 774, 780, -1596, 429, 359, -277, -21, -241, 1013, -71, -1490, 1116, 1103, -1467, 1061, 1134, -1162, -86, 349, 37, -227]
2576b27k61J523n98k147K696k33k335K037O48j987P42Nj22L45r97J711J16k500
2594a584K259M14k566J496P85j222J63M46J76k29j187J790J86k362J963Q13k584
2611a243J361O29j367P27m75J100j14j752J880k7k716K071R23k168J111Q46r94
2628b08o7n32J093N2j297J977M50k597J242J081k277R57Q78n42q0q79Q05Q5j584
2647a443J887P64k366J164N92j829Q83O01k24M88o19N83J62k079J384J354j997
2664f95J178Q95k239L93K53j47M63m20Q28M87k410J243P30j942J178J647j588
2681a46O7j15l9J70p02J254P20k015Q16R01k111Q32P33n79O76k10l57M44j609
2700a270J284J293j877R96Q75j945M28M06n88N89j92J73Q02j768N02J228j683
$$ y = [-227, -488, 1035, 437, -1710, 986, 753, -1582, 455, 1103, -884, -142, -137, -259, 86, -911, 800, 916, -1584, 675, 1089, -1477, 19, 804, -418, -255, 191, 367, 138, -1049, 741, 927, -1435, 528, 1341, -1243, 118, 747, -620, 107, -368, 732, 618, -1134, 746, 719, -1997, 74, 997, -1171, -60, 786, -208, -275, -807, 286, 338, -959, 1018, 1468, -1129, 113, 1194, -1083, -126, 752, 210, 130, -749, 56, 141, -1443, 444, 1208, -1158, 6, 598, -1231, -348, 253, 29, 517, -102, 481, 643, -1436, -52, 1302, -695, 483, 1378, -861, -468, -215, -362, 101, -319, 509, 996, -1414, -171, 559, -1383, -205, 1442, -146, -79, -194, -233, -63, -765, 489, 1209, -806, 10, 911, -1200, -368, 365, -214, 462, 252, -105, 339, -1270, 14, 1307, -570, 426, 1301, -644, -216, 190, -398, 191, -1, 172, 974, -794, -292, 936, -747]
2717g47P14R33j303M6P69j100P93k54R6R25j266K06Q69j656Q57N54p69O20k84
2736Cm62P14p93j17J369j084K60Q19j203J52J039q36O03k18l88O37q81O8P68j201
2756g51O87R34j367L21K91q60Q57O0m76P92r71J15R57j061L64J054j489M58P33
2775F48j275Q20k33l75J128r84J30Q10j326K30J198j522O14Q36j245Q05m17k26
2793c84O64o59K47J051j584J42J214j350K94R17q96M47j46k43R06r25N0J394j569
2812d30K21R82j363N62J94o60R89l16r11J242o07l45J152j033J28N29r64N29N06
2831D05j331J235k83m07Q92o09o4R43j178K41N79q12O04j15q55J079j18p52R56
2850D10n56j32Q08q03L50K35q48J030j98r39J154j04j180J334n77k12O15n72J7
$$ y = [-747, -33, 900, -403, -357, 412, -688, 105, -149, -53, 872, -394, -188, 681, -975, -118, 436, -333, 287, 3, -459, 255, -538, -655, 714, -370, -110, 709, -494, -342, 697, -139, 464, 246, -142, 495, -386, -318, 450, -751, -64, 870, -497, -176, 115, -745, 112, 172, -304, 488, -483, -368, 589, -472, -108, 946, -543, -85, 648, -627, 193, -40, -415, 713, -271, -141, 669, -657, -427, 771, -751, -137, 699, -546, 259, -158, -384, 280, -379, -132, 919, -665, -523, 691, -659, -365, 552, -344, 103, -43, -286, 620, -305, -255, 1139, -430, -209, 773, -590, -28, 166, -494, 495, 179, -732, 510, -97, -442, 710, -323, -195, 334, -630, -101, 405, -926, 309, 26, -381, 511, -98, -162, 781, -397, -156, 423, -389, 215, 100, -755, 324, 206, -546, 410, -146, -278, 530, -273, 77, 312, -536, 494, 296, -643, 511, 407, -773, 561, -16, -228, 387, -185, -168]
2869a68O20q85Q68K45j310J130l94p63J102j44n06P41p11J40L40o00K20M71j029
2888f33R93n77l23P83m36k54Q78j023Q4Q42n58K80J69o44R74o30m18J219r74j01
2908c49P53o04J21N00p01M08K72r12J062q64m06J417q72n58J236q30J19P19o34
2927a23L49K0l59M89l54m43J037q69j79R53n46l05L62o02P16j6p46R68m22n67
2947f37J225o71p9R23r62N26o8n67K00L79r47R92j43j003J194l91l35P10o32M43
2967A57J14r11J147j93r14P44l7o27P84k57j05K96o30M48L61j469J293J28r37
2986f08J239l28n88L69j6J40N1n51N36R2j301J220J22j057Q63J37p38N75l32J13
3006f2K67n70M74R8q76P92J50j194J204l9m76L50Q7k28L57o35K21L02j078J222
$$ y = [-168, 452, -433, 435, 680, -630, 500, 106, -657, 445, 301, -205, 536, -175, -35, 305, -295, -75, 396, -633, 360, -217, -540, 243, -193, -447, 431, -592, -508, 334, -224, 56, 225, -419, 555, -75, -493, 726, -248, -349, 404, -200, -79, 421, -280, 128, 400, -512, 550, -314, -720, 697, -175, -733, 503, -327, -208, 511, -123, 226, 246, -113, 376, 22, -421, 616, -253, -432, 521, -25, -330, 32, -570, 146, 130, -616, 352, -70, -637, 588, -83, -162, 761, -201, 325, 257, -310, -110, 269, -678, 314, 171, -832, 362, -29, -364, 346, -286, 157, 271, -640, 507, 314, -600, 144, 107, -520, 264, 7, -98, 198, -432, 16, 377, -1092, 201, 329, -608, 631, 303, -285, 84, 68, 208, 259, -292, 244, 336, -965, 255, 377, -680, 183, 320, -418, 157, -175, -62, 205, -365, 109, 207, -669, 123, 273, -921, 283, 244, -232, 118, 205, -23, 334, -301, -80, 222, -856, 366]
3026C66j35r56R04R9o34O25l07K4K56p96P06K21p36O50nr64R30R7q02N95j96m8
3048a06K12n28P99j84q97Q68L7r97J108j68n17N30n3l35M24n07N78J73q18P52
3068C71J12j293Q31L25m53M77j98QN5n52L68M72j244J383k59r36P30N2m97J67
3088h1j29L35K14o84N75K92j446J148N94j162M23n0k54N7r6O80L05j392Q12L67
3108E08j424O06M63n57J90O74l93o2m32M64K23q26Q43M79j375N72O04p31J47K76
3128B49k17J03n46O54K06j115Q84O01j202O8Q58p72j86J46L80qm14O05L21j279
3148f64P79M67j095M22N22m81N7p3j2M19p99P14L37j353P67N17r57L34N46m72
3168b5k38R3Q5K00m53O07J71j020P03M05j030K60O39m83L71m89L3L80j074Q36
$$ y = [366, 231, -725, 179, 278, -356, 269, -38, -14, 242, -554, 152, 373, -363, 287, 282, -682, 248, 345, -457, 138, -58, -106, 106, -422, 377, 193, -704, 164, 201, -796, 312, 144, -373, 157, 104, -231, 193, -314, 264, 437, -381, 371, 483, -810, 21, 346, -107, 370, 172, 180, 235, -317, 51, 523, -721, 662, 403, -533, 197, 249, -248, -81, -210, 125, 339, -345, 230, 522, -924, 224, 818, -344, 79, 29, -225, -168, -264, 416, 721, -671, 141, 508, -916, -310, 153, -404, -214, 460, 67, 5, -427, 37, 260, -566, 277, 756, -619, -47, 557, -174, -27, 249, 32, 135, -411, 243, 449, -666, 218, 819, -383, -315, 543, -229, -415, -269, 111, 103, -311, 294, 615, -664, 115, 582, -513, -91, 431, -50, 7, -66, -78, 341, -458, 256, 593, -760, 7, 524, -433, -99, 447, -25, -263, -170, -85, 115, -338, 269, 440, -580, 123, 528, -502, -242, 397, -86, 285, -204, -171, 209, -865, -29]
3188b9O24j029M09O49j057J24M74m57L82o4J14K25q44J23R30j246Q84N56o91l39
3208b62M07q8r4R8p0M18p93n3R49j123J84R50m12j4p9p2Q3m91M27N36r17J33N34
3231B51r66M43R28q39L00J58l0j2o06L83N12q30K94O62r90O5N01k31n0J99j73
3252c1L99m68l7M63n84J50O41m84J40Km68Q7K13j23N24p74K22N98p16J52N21n69
3274a42j3J65k30L59k40r4M28l71P6O07m97p0L02l20j18L31l83L22K0k56K53j08
3296B1k74O62o12L86K20n34K31N1m76M97M5k96K99m71O5O63o54j50N17m22M32
3317B00j06l80N07j05j78M13l14j3K72l96M0M43o17Q0M34n58M74m5n35O53l51
3338h2K8K67m76L42J88n10L13l4k92M83k29j46K25J9m02N85o89N78J9m61J27K75
$$ y = [-29, 595, -434, -25, 624, -433, -309, 165, -292, 90, 26, 140, 365, -479, -356, 574, -672, 212, 768, 77, -262, 145, 57, -37, 61, -9, 409, -384, -437, 512, -611, -427, 523, 111, 97, 18, -54, 29, -462, -35, 501, -416, -283, 251, -715, -272, 656, -183, 117, 275, 245, 233, -373, 10, 522, -308, -14, 648, -342, -277, 224, -7, -57, 142, -31, 368, -100, -137, 326, -258, -108, 533, 49, 189, 191, -277, -190, 23, -100, 424, -350, -128, 470, -246, -94, 427, -142, -155, 10, -220, 139, -101, -195, 233, -138, -62, 545, 48, -22, 280, -40, -158, 173, -210, 112, 132, -124, 129, 21, -253, 409, -203, 183, 403, -131, 100, 151, -325, 172, 217, -79, 220, -251, -186, 477, -177, -327, 190, -232, 200, 94, -286, 221, 116, -62, 351, 37, 24, 296, -100, -60, 383, -234, -154, 280, -278, 196, 151, -384, 269, -82, -54, 213, -263, 79, 267, -243, 70, 36, -256, 227, -2, -148, 77, 96, -306, 279, -410, 168, 187, -274, -147, 128]
3360A28l37J68K40k63K80j02p8n5M8kJ96m17M11J1n11O81n13k29P24o33QM74o75
3383d46K12L05l92K67k36J25M10j67j84L44l20j7K93j98nL31l97L36k39j12M45
3404C55k49m48N38k17n6N07n19J06J05m85K80L0RL36m19j94O00j65m16L38k46
3425b10M4N40o06K80M3l32J79j75L73L95o94M5K50l54K35J53m31L08J27k68L48
3446B50m71L3L06l17L9O48r08M71L6k92L54m2l10L23m11K38l6q2%K90m00R7K79
3469I5l80M46k25k10L85m9j78K10r5j40K30l74J96K93l93L84J2n77P76j88l86
3490a68K41n4j55L36j78J28k35k46M78p2j88L87k44l90O31m67Q6J28k60L01K04
3511B63j08j48J0l9M55o30K7M09j68J57J98n18L29j93q3L74l69j18K92j99k10
$$ y = [128, -209, -41, 199, -64, 216, 114, 36, -19, 29, 27, 223, -194, 217, 228, -283, 398, -115, -344, 380, -253, -245, 229, -446, -234, 71, -321, -54, -290, -165, 245, 78, -106, 238, -82, -99, 194, -4, -9, 322, -75, 261, 22, -90, 355, 106, -342, 196, -21, -77, 430, -89, 17, 122, -363, -83, -53, -44, 292, -127, -321, 279, 114, -302, 36, -210, -166, 374, -232, 48, 91, -241, -62, -237, 136, 531, -163, -118, 132, -222, 13, 166, -265, 43, 170, -98, 250, -221, -188, 118, -199, -160, 488, -420, 51, 87, -205, 149, 107, -203, 120, -291, -53, -89, -171, -171, 119, -281, -184, 95, -285, 161, -64, -274, 111, 62, -116, 94, -1, -141, 89, -285, -89, 204, -189, 195, 207, -370, 406, 218, -168, 73, 19, -136, 200, 22, 150, -85, -331, 147, 75, -113, 274, 30, -360, 271, -196, -110, 18, -242, 59, 263, 155, 7, 17, -22, 433, -197, -170, 239, 71, 228, 426, -92, 237, 44, -39, 335, -34, -152, 140, -59, -269]
3532b69L78l42L83n2k86L33L3m09K94L18p01P42n27N4K82l12J57k14K64k38K2
3553i0j15J56J28N2l8j84j03K47k03K4Q7l9K07k6j0K60o04j27O20l75l3N75l94
3576A5Ln4K4j6j19K1M20m97o2M05j52j0K09k91K03j3l30O46l52l34M35kl92O25
3600C82k92k56J59r6P9J05j14J54k6m19K19Q6k06N72ql34m4p5n0K42m25N22k2
3623A53l36N24m36k54L25J7J54O9l87R6rm19N41J3J17J55m16k6m5k7K78K18m48
3646a43PM84o17L73j08j42J43K62j44j49o7K9J45m45O16j91l03L03j26l94L89
3667g8K24j57M17k35k47J54k15Q6M93m26K36k75j37J90j61j51M46p5j00J32k26
3688a05L26k83o1j9L76m62K03J06m43M62k30K95l7k53k2K77l30J98n7j33M26j74
$$ y = [-269, 109, -233, 150, 98, -188, 145, 178, -231, 63, 381, -320, 422, -105, -51, 231, -81, 76, -138, 126, -112, -90, -205, -49, 79, 131, 93, -91, -194, 53, -150, -126, -39, -78, 129, 103, 93, 353, -251, -378, 242, -133, -166, 409, 15, 18, -36, -12, -28, -147, -126, 294, -203, -265, 140, -12, -22, 187, -104, 99, 86, -244, 402, 50, -284, 151, 149, -243, 382, 90, -166, -7, -103, -24, 81, -33, 121, 95, -324, -105, -19, -225, 347, 339, 5, -39, -114, -164, 78, -347, 175, 153, -183, 341, -95, -349, -24, -7, 147, 216, -171, -75, -84, -503, 38, 51, 168, 323, -93, -119, -164, -191, 87, 305, -143, -136, 348, -269, 104, -4, -146, -3, 259, 115, -34, -101, -72, 73, -372, 244, 53, -250, 53, -73, -467, -78, 146, -11, 406, 171, -76, 78, -137, -51, 442, 16, 252, -23, -160, 30, -131, -282, 164, 89, -11, 121, -105, 221, -62, -123, -142, 234, -228, -25, 81, -362, 100, -130, 165, 128, -125, -147, 130, -200, -2, -59, -192, 234, 60]
3710F0m04M70l97J42N29l73J49q3M6k04lj74K09p9L49k25J3j6J5m9j03N5k3J76
3734H0k43J04N7r4N8J45m30J33Q1J19j77M21k99L4Q3pj20l66N96M1l62J42K07
3757B03j84j50K68l06K14O2l57M95o5p8J58j64P8Q2k93l8M93m68K46j70j61L60
3779B25m90K73K21k80K24O0m78LN21m11J83J83m16K05M5R5q7l07K02K69m73Q6
3801a47J30J3K54k14O5j10po3M36l91J3J15j47K87o9k18K33j21m20N23k51P9L30
3824C20l01j52j92L90J83k74j26N12l89K2M36l11k1k32J70J83k32l9J20R6m35
3845b72O41k25k49L63j40j68K16R0k11J27r5q5J71j36K4N0l00L38J4l96K47j5
3867a1M1J50m2j88j56L41j0l01k35L75n9k53L17J07j61K9q9R1m3J60n8M2kL00
$$ y = [60, -344, 126, -271, -129, 400, 27, 176, 93, 139, -65, -68, -242, -33, -112, 237, 12, 25, 9, 24, -25, -128, -73, -96, 80, -163, -59, -2, -96, -38, 107, -323, -190, -109, 10, -167, 254, -45, -11, 72, 65, -55, -421, 175, 216, -146, -4, 203, 19, -131, 137, -169, 45, 107, -250, 245, 180, 102, 260, 96, 174, 256, -37, -75, 418, -50, 196, 26, -135, 225, -265, 8, 229, -51, 173, 233, -245, -242, 279, -132, 51, 234, -182, 23, 68, 163, 76, -231, -29, 240, -233, -147, -17, -4, 250, 36, 101, -9, -16, -79, 357, -34, -21, 94, -53, 234, 165, -53, 180, 59, -361, 162, -89, -10, 320, 19, -133, -325, 65, 248, -26, -152, 360, -29, -7, 429, 118, 97, -135, 35, 218, -14, -53, 67, 163, -272, 369, 144, -105, 258, 118, -50, 166, 256, 45, 172, 77, -8, 163, 27, 51, 101, -199, 139, 153, -243, 4, -11, 30, 180, 138, -50, -206, 135, 125, -176, -411, -36, -95, -348, -31, 76, -85, -56, -145, -54, -97, 63, 5, 47, 45, 345]
3891C45k52l70L21J00k22j48L57j78K02l17K11J51j68m1Q6m66N16L2l56L82l26
3912a41M4L4j46K56l18K05O7k09J9L01j18L17j83l90K15J24k75O2J50J94l7j45
3934B6j82M29m09j49M43l26L54j73j13M1k08j05N10k67J63J05m1q1J76l07J06
3955hK65k73n5J85j16nP1r8L31k37Jj02j08J35k0r5L73k66Q4K05l09j11K89l95
3979b59M13m8k95J76L4J12R8n52J36J60j03K4R0K5n1K01l12Q8Rj87M14k72j9M06
4003B88k63J34Q6l74K99q2j9j1j02j05K06r5N5K0J20mjr8p4o9J97J20n69J53M99
4028C11l33j95M39k64k7J36mm6J61l15L33k04j09M62l39o5J93j56m1J63l68K33
4050c5L10k85j7m23L00Q7k3J4L1L5j48K86k32Q3J53l48L39k34m35O64l24J6K43
$$ y = [345, 93, -277, 44, 144, -78, -226, 131, -47, 155, -162, 49, 200, 32, -9, 77, -389, 127, 159, -197, 185, -141, -97, -63, -209, 47, -271, -66, 1, -208, -189, 112, -6, 311, 128, -262, -47, 77, -198, -136, 14, 208, 171, 26, -156, 273, -136, -285, 158, -168, 186, 13, -100, -59, -267, -372, 138, -129, 34, 139, 98, 17, 193, -114, -8, 257, -16, -71, 114, -2, -7, 64, -34, 297, 60, 61, -41, -149, -14, -34, -129, 244, -22, 62, 267, -42, -153, 136, -259, 154, 106, -189, -13, 21, 133, 231, -321, -185, -25, -128, -104, -14, 11, -40, 161, -151, -63, -54, -241, 173, -99, -118, 288, 25, 159, 245, -129, 170, 88, 69, 58, -44, -149, 57, -38, 17, 37, 157, 153, 152, 54, -20, -89, 108, 228, -341, -188, 311, -22, -217, 222, -42, -69, 67, 63, 17, 178, -137, 196, -8, -117, 345, 6, -59, 134, -22, -63, 100, -268, -35, 275, -10, -27, -450, -150, -63, -86, -72, -41, -6, -154, 132, -100, -17, 136, -212, 127, -107, -542, 122, -202, -186, 57]
4073E7l3k17K45k52J58qn5J65j99P5J38j04J02L4j07r8L15k21P9Rm23N88P4n60
4097b38L88k8k16L40l85L2J96l00K92j34qJ11k58j8L09o8l45J44J43K20k24j73
4119b20L48k20jL41k91j51L34j01j97P0j75O4J22J07J10j44j61Q5Q5m56O60M3
4141B52l78j08L4K03p7K33j28P3k85J97Mm70M87R7l30K75M1J99l82k09N43m76
4163b05J72O08k88n49M22o0k48K80J08k39O7q4K49k85l7L09j57k44K7O3L8N4j42
4186a41J74J72m38L72p9k79M65J79n96L58q3j8j83K9K00j88L49j55P6n38M29K01
4208C06l37J55Lk33M5m0M65l34q8R3L0m49L82m0m8K75k22M6J24p7Kk8q5k8J3p6
4234a46J45J40j19j01K23k26NK5K8J75m08L42k84K85K00n37l4L42k25J11Q5l77
$$ y = [57, 24, -193, 52, -200, -42, -50, -105, 60, -139, -64, 74, -30, 72, 106, -1, -99, 216, -5, 74, 83, -340, 248, 322, -238, 150, 122, -94, 246, -139, -107, 89, -211, 81, -53, -61, 50, -208, -226, 83, 15, -330, -186, -43, 177, -47, -220, 128, -92, -93, 248, -43, -194, 140, 39, -158, -88, -263, -199, -77, 30, 140, -4, -165, -80, 5, -451, 209, 252, -126, -234, -200, 3, -74, 159, 31, 104, -181, 16, 20, -450, 37, 134, -196, 79, 120, 319, -63, -272, 271, -205, -33, 575, 287, -262, 160, 100, -148, 132, 240, 1, 68, -16, 233, -52, -89, 220, 63, -181, -154, -91, -53, 1, -141, 33, 205, -233, 139, 60, -219, 246, 425, -171, 187, 104, 86, -97, -68, 132, -56, 293, 138, 214, -324, 105, 306, -31, 124, 127, -106, -61, -101, 364, 30, -58, 35, 65, -384, -2, -42, -90, 185, -37, 9, 133, 56, 58, 30, -55, -83, -70, -146, -1, 139, 20, -81, 142, -84, -79, -54, -26, 149, -259, 83, -201, 84, 284, -253, -287, 55, -170, -59, 26, -351]
4256c51O56j98l55L36J12j28m3K61l48P8j49K21l94L27J40j32L2J5j07k23L52
4277A02L1p8Qk23J32j98K73l00L75m00M25l0k96q5K36j88K60j61J8J96l15K27
4299IK02k68L0L64n16J28J09j97K70j77J65L2o60N63N6l29L43J0l57K47j45L27
4321B06k22J63k64J37k61L35J85n04Q4J70K24k80j35j8N77m71L5L30o59L41K13
4342A86l68K58Q3n4n3L85l00l06J93k65N08o45N33J79o50M78O1q4j61K21j05K78
4364C72k85k09J45rK3J40m57M55Q0m43M02k25k22K97J19k28K89l17l8R0R4n5J76
4387A94m29L22N0k74M12k95J83o2k66M6K66j22j12o3J87K11k81P4N3j41J71p5
4409D9k23J69K32l50M06l44M4P3J42n1J80n98L04L63n47Q3J00r1r5K67l19K97
$$ y = [-351, 305, 107, -248, 88, 200, 72, 29, 290, -58, 20, -129, 92, -302, 25, 165, 33, 65, 80, -27, -250, 102, 133, 55, 63, -160, -28, -226, 47, -253, 122, -278, 147, 117, -179, -264, -28, -216, 44, -117, -99, 97, -218, 9, 211, -57, -27, 337, -179, -51, 58, -139, 131, -46, 119, 151, -509, 54, 110, -219, 124, 134, -223, 24, -121, 206, -16, 147, -117, 20, -241, 94, 279, -225, -141, 29, 253, -27, -162, -180, 397, -74, -39, 291, -368, -27, 186, -182, 76, 159, 105, 52, 437, 137, -169, 24, -241, 267, -378, 155, 334, -316, 162, 223, 139, -22, 199, 94, 372, 87, -122, 23, 14, 37, 177, -280, 175, 255, -188, 214, -11, -233, 64, 183, -45, 244, -73, -111, -21, 73, 18, 194, -235, 87, 137, -137, 275, -20, 163, 101, -165, -119, 147, 25, -87, -150, 37, 248, -33, 41, 94, -47, 124, 49, -174, -5, 227, -123, 283, -61, -17, 56, 198, 147, 327, -271, 33, 396, -151, -68, 32, -59, -154, 113, -206, 91]
4431I1r7j81K69l27N22P3m56k3L04k21K0l8k5J90k84Q5L21k64o1J07j71Q6J15
4454C5m6J5P1j92L10m34j6L87q0j6k4j79J67j18R5J41j68N9J36j71K10J49m03
4477g2J11M4j61j06L47j20L89l94j63ko5k86N76J7j50M15n34J96J26j26j93J30
4499b1k95N68l14jO2j42J76L30n35K83o9j87J87Ol45M86m67k94P99l18P8J31K1
4522A39n5J46j10kj91R9K49m31o2K28j52kK93l12R5M6MK6k0K08m43OM9K96j02
4547Bro5J05j67L0k5J05k2j91K88l00J47J28j04p2R0O0R7P1m01KK01k80N21K1
4572B32j91O4m21J31O02n40j5L25k44K47j61o6j23J93j62M07l46p9L52m73K63
4593eJ19j65K62M5m74L26l67J21L60j90R8j04M8j02m9k1K74l27L6L66k76k6R5
$$ y = [91, -6, -187, 82, -245, 277, 350, -106, -129, 175, -46, -26, -64, -89, 101, -183, -98, 223, -41, -102, 5, -166, -80, 35, -11, 4, 75, -117, 193, -241, -257, 130, 50, 34, 10, -169, -2, -120, -25, 116, -52, 7, 143, -28, 182, 331, -72, 39, 83, -78, -184, 163, 43, 432, 38, -125, -127, -192, -478, 98, 115, -35, 380, -154, 42, 168, 42, -151, -21, -316, 252, -62, -63, -1, -143, 33, 363, -172, 111, 42, -145, 42, 48, -297, 189, -278, -572, 227, -91, -13, 118, 139, 84, 230, 120, 118, -73, 26, 275, -156, -218, 10, -142, -144, 149, -163, -68, -22, -18, 8, -12, 196, -247, -241, -192, 104, 2, -7, -72, 33, -134, -104, -129, -24, -46, -237, 51, -249, -102, 26, -78, -150, -60, 0, 97, 168, -233, -231, -30, -310, 211, 232, 41, 105, -316, -185, 417, -123, -138, 187, -57, 190, 29, -37, -160, 33, -129, 278, -68, -147, 205, -268, -5, 114, -51, 211, 256, -218, 108, -259, -138, 222, 32, 130, 26, 74, -28, -77, -98, 176, -151, -115, 251, -25, -51, 44]
4616D4Ok46J39l1M6O9k13K32m1jJ69P2k22L50m01J07rN1O6p8l18L02Pl64M36k59
4642h7k68L45R9j79J25l67M07j04l4K76j65n2n2j53J85K05l36J18N3k60Q0J03
4664f1j64L93P9l29m1K26l52K65j23L14N0l28K00p9k59L47k9p7l0OL7J10k32J34
4688E7J12m96L34K81n41N37k87k59K91J26k53R5o6J63m5j94K42j23k45J91L58
4709B78m20J54o2OJ91j82o2j69K48m8J56j79J10r9j07J82K61k82L89n34R4N69
4731D94p40K42K20k87K43l63J56K9L9L2k2r9j10L54J07J7k76k92N9qm1L87P9l88
4755a68K87m10L07np0K40j74m0J14k95J89j8J6J11K57l29k00J92N1k0Rk61K06
4778a1J22k22M48j88J42l07o4j77O34m19Q2K6j68J47j95K11Q6k23QL3No3k5Q5
$$ y = [44, 50, -196, -57, -88, -42, 27, -186, 46, 5, 4, 173, 245, 23, 373, -28, 79, 70, 121, 187, 109, -209, 93, 100, -264, 172, -87, -355, -10, 89, -90, 35, -332, 75, -29, -63, 213, 48, -4, -56, -209, -24, 181, -155, -37, 16, -244, -164, -61, -225, 168, 247, -82, -123, 103, -249, 16, -107, 207, 257, -71, 129, 50, -209, 138, 109, 32, 2, 8, 45, 155, -77, 57, 169, -327, 7, 288, -253, 284, -3, -262, 29, 155, -98, -3, -69, 94, 49, -145, 97, -26, -271, -80, 278, -142, 12, -50, -44, 147, -35, -97, -266, -18, -66, 90, -89, 21, -78, -185, -3, 258, -24, 365, -169, -75, 494, -246, -4, 216, -71, 172, -191, -35, -6, 33, 65, 43, -56, -166, 188, 295, 312, 36, -256, -197, -205, -246, 141, 220, -168, 119, -291, 16, 11, -59, 181, 7, -33, 81, -214, -25, -43, -27, 84, 341, 12, -188, 4, 55, 35, 44, -217, -11, 111, -111, 337, 149, 291, -16, -80, -257, 377, -42, 40, 66, -102, 45, -150, 61, 147, -76, -68, -35, -30, -93, -118, -33]
4802c3J4o7R1J31j2k84M15l88J24N33p10m5K44K1k70L93l67J37J47j81J32j15
4824i0J03K97p19L66J64k31r7K48j59J37j94J18K62l95P2L93l26J17Q9l50O2J48
4846A5j72L8o5L15j59J60k35J69j46M5l4q2L94j28J62l40j02K77k36k84K25K44
4868F1l2n5J29j01k1J61l46K77p7j22L22j66l3J53n2j81J06O7O8r9j06K17k42
4891g2r2J8J23J69k46j62K50P1j33j21M19k09J38j59p3P8l6J6N1j15J95J03m69
4914b56J77J73j35J42n7j87L25j54r7n2RON9j72J58L18l08J13l7k27M37l12l4
4937a11K83k37J10N0k47K43J36k17j19J03K4N7p1j61P15o11l23O01k72p7J20l02
4959c06L61p6j8L84m83J93J57k24J3K36o34K71M20m48L21j69j53M62k39q5L0j3
$$ y = [-33, -19, -86, 5, 136, 124, -160, 255, -133, -9, 524, -186, -231, 13, 34, -236, 157, -210, -73, 74, -107, 25, -90, 13, 310, -409, -43, 121, -110, -207, 41, -118, 19, -175, -57, 205, -190, -118, 275, -51, 66, 155, -195, -133, 15, -157, -119, -184, 131, -28, 132, -103, 66, -80, -35, -69, -151, 243, 115, 277, -63, -165, 112, -124, -408, -183, 61, 29, -26, 103, 2, -19, 142, -204, 73, -4, -126, 196, 30, -3, 150, 98, -83, 23, 90, 158, 59, -47, 170, -72, -164, -146, -23, 146, -100, -262, -12, 59, -74, -195, 224, 15, 153, -6, -79, -1, -37, -21, 30, -85, 110, 213, -256, -79, 94, -41, 101, 44, -143, 182, 28, -69, -121, -112, -106, -47, -219, -61, 257, -51, 62, 25, -202, 235, -77, -111, 172, -65, 45, 95, -152, 91, 227, 10, -109, -6, 18, 75, 4, -157, 558, -53, -376, 225, -47, -124, -4, -306, 55, -21, -39, 345, -138, 55, 212, -12, 1, 237, -397, -126, 294, -154, 167, -2, -155, 307, 68, -17, 13, 0]
4981@j81K51R1j69K28m94M85k38m16N67j02j8K01k02j9L3M8L29r9n37J39Q5p6
5004i4K08J60n63N43n41J82J74l60K32K23l43M91l38M6J76j63l92M49l38M64j19
5025I7j61M41m86L0p8J53j90O3j8N7J52o9K35mk77M1Rk65K02L61l45K49L9l08
5049g2L3J68m5j50o5J56j57j90J50K30J71k10K11l62K38k29J54J3j53K38m0J03
5071A92n0j60j33M10l96J40l6m2m0J60K58j05j8p0j23m6r3J56J57O1J47m44J72
5094I7N6n58O36j69j04J81j13L3O4k15L26k14K95n00K99l93K01J94j71K21j13
5115E3J58p5l7k85L52l45J73J54j56J40p5k44L11j01j2J71l59K84l87J38K83J86
5137C27n04M7J46q9J10k01M19L7j72k77L73n78M71j63k56L59k3n2N3kk95M58r8
$$ y = [0, -181, 70, 161, -8, 220, -274, 211, -27, -443, 124, 22, 4, 205, 3, -16, 17, 65, 394, 295, -242, -103, -18, -94, 114, 274, -289, 254, -287, -105, 69, -291, -59, 164, -179, 312, -26, 20, 196, 33, -359, 90, -248, 216, 97, -64, 377, -109, -79, -157, -4, -194, -131, -149, -92, 60, -9, 226, 222, -55, -14, -5, -270, -68, 293, -52, 197, 236, -72, -39, 129, 84, -66, -131, 25, -132, -322, -172, 58, 229, 19, 230, -132, 106, -123, 31, 44, -109, 129, 89, 192, 142, -18, -151, 259, -137, 3, -33, -75, -115, 45, 303, 198, 180, 110, -13, -59, -152, 4, 161, 222, 369, -75, 97, 153, -405, 231, 62, -42, 139, 26, 59, 123, -92, 234, 20, 315, -185, 114, -279, -78, 116, -55, 166, 53, 211, 136, 99, -186, 166, -179, -6, 148, -8, 132, 57, -187, 124, 23, 11, 182, -177, 107, -280, -142, 141, 327, -177, -130, 16, -73, 37, -164, 255, 292, 120, -157, 216, -362, 109, -54, -310, 49, 26, -26, 27, 25, -270, 188, 90]
5160I0o3K26k39k25K10m13L42K7J03N4m8j06K66n10L92O8J6j11m8n2q0M62n06
5183a45J91ok74N13n33K59m6P5K3J71j17l64K60k04K87p5L2k91L40l1P6j08K18
5206B51j24l64J15N05l41J12k59M6J98j41J09m01L49n9K11m38K45K08k77m6J4
5227h7L4KN8On1J01j85M50l88J61j37k5J25j77k45M46k76J57oj0k69M42k09J24
5251D1Jk35oL3J39J02j42L4L74l59N2q7PL27k61R0j7Pm18N10l96J75K24m7p2n2
5277B4q2P4k79j31O42j97k70M37k78o6O1P7j32K6n4M13j63j93J50n7J46j11q0
5300d3j20M06k00q0j41K07R8j72k08L57jl91L98l15J74J1R0M2k6M3j38J74j03
5323F2Q6j5k93K89k7k15K06o9j69MK75q7K28l85l3J76J18j3o8k11K67k63L4L5
$$ y = [90, 27, 253, 14, -211, -1, -414, -72, -45, 58, 112, 64, -42, 224, -286, 106, 174, 190, 79, 31, -21, -101, 361, -145, 46, 40, -234, 279, -254, 5, -41, 34, 57, 228, 111, -253, 7, -197, 90, 15, 47, -244, 96, 65, 141, 33, 251, 127, -237, -122, 383, 42, 154, -105, -59, 139, -2, 107, -294, 55, -4, 207, -231, 14, 222, -55, -101, -87, -53, -51, 7, 13, -38, 63, -122, 328, -60, 101, -36, -61, 64, -113, -358, 88, -188, -31, -37, -47, -316, 126, -83, 41, 42, -193, -199, -166, -27, 75, -67, -33, 341, -18, 34, -53, -46, 281, 20, 110, 93, 100, -318, 192, -204, -29, 195, 148, 76, 24, -58, 16, -263, -394, 248, 51, -219, 218, -60, -126, -65, 12, -120, -94, -148, 265, 102, -91, 59, 2, 148, 37, -43, -163, 243, 43, -37, -178, 29, 127, -45, -253, 104, 103, -288, 110, -205, -31, -20, 70, 112, 86, 129, -9, 165, 62, 148, 133, -160, 129, 102, -113, 93, 24, -145, -141, 134, 47, 275, -110, -143, 33, 151, 138, 70, -141, 126, -137, -103, -68]
5347f8o1J60j93r5J17K42o6L38n03J12Rr0K3L33m84K81K12j21n0j16lk1j19N3
5371a10L2j95M50l2j90Rp0o8K60M0l21L18o6P9j80j48k42M03k03J80k65K54J02
5394C7J27k17J33q6N8p0j88K72J6k21j8L09l46L33m13K55K7Q7l94N03m12K13J89
5417A94l35J69o5j95J27J50j83K84j78J44J1k10J37r8K6m7L19m05J87J41k83J73
5439F3l80M28K96m97J53L03o21J53J51N4n7J21l39L40l43K23K22l74o1L94m05
5460a76K28J84l23L11l19k41O32n66J8M23k17L63k47j70L06j74j14N07k15j87
5480B3K28m30K91j02j27J20J8K46j9l17l07N82l84L69j79k67K25J39l13o4N13
5501B45j40j57K44l47K91k78J35k0M3j66J76O2l35M13j27j03k02K50K18k5j72
$$ y = [-68, -129, 31, -162, -257, -140, 102, 36, 374, -129, -17, -8, -98, -75, 258, -226, 55, 267, 146, 96, -20, -23, -44, -163, -110, -78, -273, 177, 145, -45, -36, -106, -174, 86, 126, -195, 123, 57, 136, -44, -192, -434, -31, -234, -54, -319, -65, 37, 164, -53, 80, -6, 52, -18, -206, 66, 82, -139, -157, 152, -194, 139, -274, -19, 8, 95, -299, 204, -208, 5, 194, -141, 28, -37, -232, -105, 45, -138, 146, -32, 112, 123, -87, 50, -48, -22, -69, 250, -155, 32, 173, -110, 63, -317, 111, 407, -90, 63, 366, -255, -102, 49, 103, 46, 167, -172, 168, -175, 48, 270, -104, -165, 229, -176, 52, 236, -87, 224, -95, -336, 296, -270, -252, 171, -46, 317, 70, -100, 206, 32, -82, 425, 210, 23, 251, -179, 112, 10, -117, 3, 21, 267, 248, -69, -376, 206, -178, 191, 12, -255, -30, 109, -204, -268, 245, 105, -52, 192, -155, 136, -142, -7, -27, 16, -150, 26, 88, -247, 166, 39, -64, -266, -16, 202, 177, 5]
5522EJ89l2n9J71l3m60J67j39M94n43j06N96k70k34L47J20k46k32K56J6l0k3L3
5545a3J20m04M17k68lK13j78n8K25m2j58J83k16J44J15l22O84o18J91Kr5M3j95
5568b33J49J76J11k27J7o3j72J97P3r9K34n80K37L55l56J37N0m1J41k96J0L00
5590A20l04O0K03JJ40j05k40J1M4k37L90k33N6J27l37J26J37k20L48j0j85K13
5612A05j14j68P9K67l82N11l51j40K93k56J10N28l73m8o6r4n8Q9k23M67p2j55
5634e1J53m87K38L09j84J7L24m61J91K65p81M68J88j96K95l77J91l58K24J2J4
5655fj38Q7K3k02M54m9l18M55j97k45mL3q6Nj25M07L4l91M42j35k77M77k47j0
5679a3M48n04j87M86q27Q57k77l18L54p6m2K42k91r3M09N9k58j07J20n3j3J14
$$ y = [5, 194, 162, 103, 274, 241, -219, -52, -191, 303, -240, -346, 250, -20, -254, 93, 213, -33, -265, -9, 7, -23, -46, -13, 107, -297, 120, -148, -151, 62, -116, -174, 51, 9, -149, 34, -182, -38, 77, -245, 439, -179, 12, 14, -81, -38, -233, -84, 92, 203, -24, -7, -70, -242, -45, 28, -71, 163, -417, -180, 175, -181, -44, 6, -35, 106, -190, -180, 120, -184, -124, 79, 80, 220, 115, -125, -114, -70, -307, 83, -150, -94, 33, -304, -178, -41, -261, 87, 77, -108, 105, -9, -177, -98, 169, -213, 298, -53, -193, 100, -156, -46, 482, 109, 61, -5, -99, -157, -68, -291, 176, 104, -51, 102, -385, -147, 162, -22, -5, 319, -142, 49, 314, -467, 1, 189, -7, 288, -89, 102, -256, -32, -20, -6, -144, -57, -34, -236, 218, 169, -149, 306, 109, -136, -140, -107, -193, -188, -313, 94, 128, -263, 179, 44, -233, 244, -3, -13, 435, -69, -256, 230, -597, 260, -17, -335, 19, -57, -99, 143, -148, -241, 168, 227, -31, -138, -18, -71, -84, 30]
5701C0p6q6n3J83K08k88k3q6J59J09k28M02p2l20L05l35nL79j56l7J9j47K55k7
5725A10l51L20Nj48K2k05K35kl14L91J12k92J06j38j1L90J00n97L79p8j27K86
5747A93k34R0O1k70L20k54m3K06P3m55K39J70k03J67j4P1O2k37J04R8j57J46l39
5770b06O4J81j16J80K23m43K08o0j39J79J92m00O29k20m49M49k03J79R9n18J89
5791A8m9m59O82k99m1M05l38m41M72J36j55J41M0O5l74J92j66L16j27K55L1n19
5813b15K15j9Q9j71N9j87L24k76J83R4j67M6L50l63J11J51k33k17R9K12k68R8
5835h5l18N69n8K6j10P0J16m33j23N52n92M53kM6J27l83p4J19M03n00L34j42k12
5858b17K71N8j09P6k64J95J27k71L32k81M3n0k43J73K22k46K52J24k76m0L91l26
$$ y = [30, -46, -132, -185, -2, 206, -82, -105, -191, -32, 77, -151, 251, 179, -141, 164, -171, -176, 203, 47, 10, 29, -118, 137, 110, -241, 79, 84, -64, -42, -247, -12, -14, -328, 63, 175, -117, -11, -149, -160, 230, 330, -267, 112, 34, -93, 193, -41, 49, 110, -160, 160, -94, -137, 69, 142, -313, -74, 96, -107, 60, 46, 117, 179, -58, 46, 144, -13, 133, -206, -142, 39, -77, 103, 326, -117, 91, 31, -108, 71, 263, -137, 492, 272, -177, 272, 69, 248, 347, -171, 18, -31, -490, 192, -107, -148, 257, -81, -522, -50, 86, -69, 72, 112, 177, -197, -5, -171, 145, 18, 273, 304, -215, 0, -19, 70, -101, -42, -229, 95, -181, 2, 96, -71, -25, 325, -38, 73, 224, -9, -226, -127, 85, -183, -85, -403, 166, 108, 134, 24, 94, 210, -223, -346, 206, -386, 67, 65, 111, 238, -145, -219, -100, 303, -197, 137, -5, -217, 54, 112, 3, 79, -185, 10, 137, -134, 198, -83, -40, -90, -333, -160, 62, -184, 68, 192, -84, -124, 267, -59]
5880e9K76k51k68K23r9N0J81j51j4K77k46l4m0j16K02L1j53K04k25M37j35j92
5902a02p2M85j96NK6l54J69J14m65N28p9j85K99k36Q4J50n55L34K78m48L09j14
5924b5j12L00l07k3L10k03k48L61m54M44l5q4K23l92J78K80m65M8L19m1j11M1
5946DQ4J77k32k63K68L23l17p3J18j33N0kj99m2K75j51K56j2k55J48r1J9M5j01
5970a04J7m9L33o5l36L37k2l07L92N7k38QQ4k9o1J21p5K70m08L8L62l71L96l54
5994dj00J15L35q2k6k83o8K7K3l2L0k27L23O7j45J29j51K21K54m87R1j73lK40
6018G4K08l83L08q6j74J52j42J16Q2k55J46nq9p7K88j78r9P1j3P1j71J1J31j6
6042c0J25j37k06L55Jl60K18K27l90L6L52m23N92l99P0j1k9o1k20J79J42r2j4
$$ y = [-59, 217, -34, -302, -79, -178, -128, 53, -98, -112, 165, -81, -115, -155, -271, -69, -38, -191, 13, -212, 225, 90, -102, -174, 311, 115, 120, 146, -208, -39, 75, -390, 138, 59, -126, 173, -63, 21, 171, -384, -50, 228, -220, 89, -25, -137, 163, -144, -167, 143, -60, -308, 53, -401, 43, 8, -76, 147, -245, -67, 213, -252, -204, 115, 74, -37, 4, 88, 265, 33, -230, 38, 361, 44, -29, 89, -44, 6, 4, -195, -237, 38, -113, 143, 131, -124, 24, -67, -48, -3, -104, -87, -136, 197, 132, -204, 133, 111, -196, 196, 253, 15, 23, 107, 78, 17, 138, 63, 333, -75, -37, 325, -46, 350, -4, -104, 11, 346, 264, 238, -45, -113, -86, -63, -95, -65, -292, 31, 98, -47, 82, -69, 152, 406, -81, 10, -163, -166, 74, 282, -101, 207, 121, -53, 99, -43, 73, 155, -100, 46, 41, -48, -125, 163, -15, -114, -43, -56, 15, -156, -145, -14, -30, 95, -42, -248, 107, 108, -252, -34, 193, -197, -161, 191, -232, 360, -39, 31, 20, -9, -70, -290, -111, 31, -61, -75]
6065g5K42r4o2j87P3K97m2l7j45j29k5J65P6k64M25l18l7L52k13j00L13q5j97
6088f7N5m46M76Q6j44K42j50j6K13j15j15K58n93L56lO8p1q1Op9J01k08M72j26
6112A19k75K16k84K71J06j26j78J00j92K84L8J30L12n41P3P9j23J67j59j93K95
6133A19l2l15M48j36j27J52o6J33k26O4K69j35j76J45k24j61M80k97j22P23m86
6154C0m8K5k02J45K40j10j41K42j23J62m68L21J42k75J03P0l48O7K23r6p5R8j22
6177a40J57j02Q8m2j45M78l25q8J62j0r9K48M4k10Q1j64K14MP0k04L49l49n0k23
6201b56K74P1j34k9K00J40m51J3o7K01j54kK99j89j45L69k37j12M09k14M3K10
6223B39k77K2J49j35J38k12j15L43m46K58K54k60P9J96n63O56m25n3L3p4K68l9
$$ y = [-75, 167, 73, 11, -176, -103, 194, 152, 115, -30, -159, -184, -19, 57, -207, 218, -100, -137, 215, 2, -98, 215, 130, -67, -12, -458, 18, 104, -40, 202, 52, 36, 249, 134, 19, 277, -316, 40, 37, 105, 34, -47, -41, -120, -19, -227, 245, 119, -156, 60, -224, 47, 153, 27, -151, -51, -243, 41, 79, 209, 521, -20, 53, 132, 9, 176, 17, -176, 119, 87, -228, 220, 84, -43, 109, 43, 176, -50, 14, 283, 148, -28, 117, -107, -268, 212, -85, -207, 516, 30, -18, 7, -195, -50, 190, 80, -61, 181, 58, 220, -248, 73, 215, -60, 43, 113, -235, -168, 55, -41, -116, -18, -140, 17, -85, 3, -39, -184, 294, -31, -119, 43, 33, -66, 182, 226, 16, 97, -67, 147, 151, 221, 17, 366, 17, -33, -256, 18, 89, -45, -74, 126, 266, -185, -172, -239, -38, -192, -194, 105, -84, -229, 140, -97, -209, 200, -14, 29, 239, -38, -16, 133, -2, 136, -76, -191, 152, -294, -36, 218, -42, 37, 233, -330, 326, -99, -152, -119, -193, 75, 36]
6245C6L4k54L46k95K4L96m16N9R4k00J06K9J21q5M4r2M7o6K35M0j68k88L43k78
6269a88J10K6k81K58J38k77K58k51M65k27l3J75k17j40L2J0j18K92N7L8Lk96K49
6292H3Q4k05J2J54O8k23J43m6k97J69n8K74k24p4K57Lpo3j61M23l70o0M83m82
6316a17K33Q1k23j13P5j57K15q3nJ14j22k3L10m5m4q3K86k38J1k50J10K98j54
6339G6R9m10L02M4k86J25R2l3j11K01k11Q1K8k68M19j56k03M13l62J52q4j87J64
6362a15L73l52K94m0l14N18k96p3L8j6J93j09k71J34N5k52L31m1k23L13n0k05
6384a08M2J66k5j06J47p1j24M7J70O6l35M84m16q5L54m74K12P7K7J00k45K45J20
6407B68j36m35M30j1j71L21k50j6K47m06J51l9J14m9J3K59k51j34Q3L29l06j00
$$ y = [36, 70, -184, 162, -133, -109, 287, -129, -70, 24, -176, -70, -41, 80, -5, 39, -53, -6, -72, 163, 203, 35, -253, 90, -188, -78, -52, -333, -75, 63, -214, 44, -207, 258, 31, -2, 173, -44, -184, -152, -142, -260, 32, 89, 127, 130, -166, 83, 167, -38, -26, 128, 196, -27, 116, 70, -227, -58, -116, 158, -66, -140, 117, 120, 113, 50, -111, 312, -58, -118, 365, -117, 116, 197, -26, -139, -64, -221, -6, -89, -94, 20, -102, -125, 185, 140, 96, 13, 299, 61, 72, -178, -68, 230, 76, 175, -235, 67, 111, -175, -50, 42, 9, -102, 99, -112, -31, -3, -271, 148, -8, -211, 202, -160, -8, -92, -279, -115, 258, -94, 200, 160, -154, 364, 68, -5, 33, 17, 210, 101, -170, -36, 19, -233, 98, 57, -166, 147, 97, -108, -66, 100, 75, -31, 116, 45, -79, -32, 138, 204, -131, 353, -63, -148, 206, -268, -56, 21, 48, 148, -97, 148, 268, 132, -303, 127, 116, -55, 266, 16, 0, 247, -159, -8, -47, 67, 18, 31, 290, 39, -95, -12, 317, 11, -89]
6429h9J84j31j22L23l35L13j12j29M8Q9r3K82k93r6m3N5j94J77J74R4L2j41R4
6452H7N4n16N63l82l7L32p8Q2k68Q6P9o7%J37j40R1j3j00p1K12Q4j9k9j14J97
6477A70r7l70O49n07Q3L04k82Q7K26j89k52J64j62J32j58L33Q0j75M07l77n4M78
6499D90n76N0L3mk58J77L44n56K82J3lO9q0m4L31l07p7M55m91K79p8k25M13k66
6523b9l9K71K2k44L9j72M8K20j91J91p7J42j03l5J1L2k28J16K26n06K02Q5p8K57
6547A60k39j37J74O3n2L6j32j02L20m99L12j5j42M49j00k35J24j35L54J19k85
6568C8J93l03n5Q3J68k19L14Q0l80j20L86L0k07O3JJ35k47L57l87L31j67N4r6
6591E2R3j72k65K36q9q5N22l52j5K52j31j69L03k36L10j26K8q1k89N15m60j52
$$ y = [-89, 95, -36, -158, 165, -170, 143, 31, -98, -50, 39, -54, 228, -65, -161, -204, -149, -343, -166, 8, 102, 134, -7, 87, 141, -375, 188, -194, -231, 101, 23, 105, -163, -77, 2, -65, -65, 72, -68, 23, 10, -90, -161, 51, 135, 116, 87, -27, 170, 73, -297, 352, -155, -72, 232, -50, 37, 263, 74, -178, -14, -176, -44, -202, 131, 211, 36, 443, 66, 12, 490, -86, -36, -3, -7, -265, -88, 256, -300, -18, -5, -8, 61, -19, -63, 268, -39, -116, 339, -152, 127, 49, -176, 237, -29, -68, 203, 225, -19, 20, -152, -104, 116, -75, 116, 39, 181, 78, 43, 54, 86, -142, -26, 200, -306, -104, -19, -97, 160, -79, -216, -42, 21, -31, 5, -127, -229, 91, -408, -96, -111, -253, 196, 96, -139, -15, -150, 204, 323, 38, 231, -72, -127, -44, 124, -95, 219, 299, -81, -201, 185, 215, 8, 71, 72, 207, -40, 317, -70, 261, 94, 148, 52, 145, -27, -292, -56, -145, -230, 292, -60, -75, 177, 46, -123, 180, -56, 254, 128, 156, 75, -214, 301, -159, -311]
6613c11J21K28K2j71J86l50L11K2k06J31Q4N6j70j63N6J55n8J31l46L58j80k48
6635c42M34J35P5k04K37k23k40OJ49J43k33j2K77m1j65P4j76M7L73l81J48J2M6
6658A39n7m3p6J69k59J28J15j75J71m0m2k56J80p7J25q8J08J91k55L6M7k43mK13
6682Gj6O4j11k48O61o20J65K28j54J36j62J37k76K04k08L83l45j10M71k59L82
6703C29j72m5k29J85K37l84J36j20J18Mk07J63q6O3n1N8o8J97j85J10J24k07K10
6726A80J25j80r3m1P7J10m13K10K3j07j4J94k01J64M29l78o8o9rL25l62J60M3
6749A05J29k92R0j40R0P2j19L16m60K68J11j27Q7k99Q3j19K28J48J38l34j10J78
6771D3K2K6k73K04k47M12k40J7J05l4j7j6m2R1j59o3L57m14J37M4n2ko5J71K18
$$ y = [-311, -190, 38, 60, -111, 75, -275, 36, 58, -148, -17, 67, 123, -47, -210, -154, 1, -57, 74, -272, 86, -94, -342, 92, 227, 302, 98, 335, 112, -128, -122, 27, 170, -63, -75, 202, 161, -4, 70, -106, -59, 314, -67, 81, 93, 139, 82, 39, -37, 132, -127, 1, 116, -59, 112, 72, 30, -226, -46, -123, 2, -86, 22, 213, -42, -6, 41, -202, -206, 7, -9, 55, -56, -304, 357, -263, -98, 130, -24, 112, -50, 87, -189, 15, -193, 190, -155, -265, 206, -53, 329, 157, 112, -117, 68, 305, -79, 57, -63, 55, 59, -148, 15, -71, -8, -59, -1, -69, 128, -57, 53, 177, -30, 180, 305, 125, 32, -9, 68, 178, -235, -25, -2, -109, -123, 71, -130, 34, 463, 85, 17, -52, -61, 264, -98, 62, 105, 234, -58, 32, -108, -18, 54, -65, 251, -209, 59, 170, 43, 130, -169, -86, -205, 23, 171, 309, -25, -135, 43, 65, 91, -182, 22, -225, 187, -53, -36, 69, 35, 18, 2, -40, 51, -108, -171, 186, -228, -91, -47, -99, -101, -166, 5, 223]
6796B23l91p4K83Mq1J55k73K66j74O2K6J66k16Q4r7r9M57l99l6J77lj86J68J07
6820A49M3k19R6j30J15n5J29k57L47N0m02O8K89l60M1M10k75O7k64j3J46P1k37
6843a91J20p4l6M02j77L2j79j2L32j04j91N39l56lj03j7O1r2r3L56k89J33L4l25
6867b33K41m6j72J14K95l33L47j73j57J31O8k34J54J4n9L87m81JL53k00M2K21
6889B80m76M44M7m91M36l74r8J03QJ55m3QJ46j61j33J05J68l18L52k63j20J39
6911h6k3J06j16J93k7k02K37L65o39LK67k85J27L23k52q4L76l00o5M0k41N71n49
6934b61L93k87J33j34M27m83K56P7k03K84k71j92K28J34l22K41j21J73k11r4P8
6955a55P8m9J45Mj53r4J32j7J61j83K14J53n46M4K99O9m15L25j07n8k3J46K29
$$ y = [223, -168, -242, 41, 45, -36, 119, -154, 112, -62, 0, 26, 192, -24, 60, -37, -136, 321, -78, -114, 63, 60, -126, 42, 149, 192, -27, 69, -61, 54, -1, 128, -129, 218, 268, -134, -66, 223, -137, -96, 314, 39, 106, -158, -171, -25, 46, -191, -71, -145, -181, 221, 44, 76, -103, -115, 217, 113, -78, 461, 105, 102, -1, -18, 43, -49, -142, 214, -75, 58, 92, -233, 8, -38, -210, -96, 199, -134, 213, 40, -117, 14, 82, -152, 2, 16, -43, 344, -137, -136, 217, 17, 59, 280, -196, 248, 295, -196, 240, -134, -232, -129, -121, 34, -9, -1, 145, -16, -149, -44, 124, -194, 158, -105, -225, -86, -109, -3, -119, 74, 47, -155, 82, 447, -192, -189, 78, -207, -80, 243, -9, -93, 283, -17, -82, -42, -283, 288, -261, 132, -155, -22, -156, 271, -212, 44, 121, -82, 202, -69, -261, -33, 101, -221, 20, -101, 72, -139, -233, -155, -77, -126, 19, 23, -130, -224, -92, -109, 52, -131, 83, 236, -310, -266, 33, 102, -313, 12, -95, -153, -176, -30, 199]
6978A99l95P2K19k98K20q0P0j30J53j01j01M35l1j3K8k79K30l32J14J78p34O37
7000F1q3j7k12M84m59L11j91l3K34rj29j27P2R3K25k28J85N8k51J94j70Q1p7k52
7024b40L51k02P2K42k59k33N00m92J93K81j18j20rJ69J2j18l91N16j85j15L24
7045A78k56K68j1k81j37J24J60r8J44Q8k32N9J16k36R1O7K56l15L18m92m2K6K79
7068G4r7L7J88l27J39j55K66J85k07j61q6P7L87j79j19j47m2K74M6k04j36J08
7090g9K60k41j21O9K45j68rO7k22K15K98j73m6N0j34K00K51l31l7o6o4J21N7l57
7114b15M26j86k0K93k47j14j8k29J58L87l81J17K52p6P5k72k62L21Q4N4n9l06
7136b18J97R6O6J31j87k09J51O8K40l03j6Pl48j0J90K69k76J14R4j01j1M40l61
$$ y = [199, -196, -124, 95, -203, 17, -63, 7, -123, 30, -71, -172, 263, 232, 219, 247, -32, 198, -134, -20, 158, -576, 61, -22, -39, -251, 233, -226, 85, -106, -139, 95, 86, -43, -170, -98, -5, 220, -8, 177, 235, -16, 178, 8, 89, 12, -240, 111, -91, -19, 223, -36, -269, 231, -261, -68, 213, 95, -25, -34, 135, 147, 29, -362, 154, -31, -146, 178, -78, 190, 179, -102, -239, -115, 45, -53, 91, 179, -53, 6, 122, -114, -23, 44, 300, -15, 303, -189, -231, -205, 74, -23, 14, 202, -125, 14, -141, 125, 310, 103, -58, -144, -67, 320, 141, 22, -125, -167, 107, 153, -51, -187, -79, 181, -60, -181, -112, 133, -35, -44, 23, -199, 16, 314, 141, 95, 145, 11, 211, 462, 131, 94, 28, -36, 85, 142, -215, 211, 25, 5, 298, 51, -63, -81, -310, -152, 235, -146, -29, 223, 147, 222, -50, -312, 9, 93, 147, 88, -218, -21, 75, 141, 272, 85, -124, 27, 95, 335, 32, 16, 23, -325, -335, -145, 124, -152, -38, 56, -45, -56, 384, 23]
7159B3K9J06J2r2j36K43j25k14K95j60m4J5N0K13k32m00M02l9j29L43p3l18J54
7182g7Q4k44K48p2J40k1l5m4l2j51K72L05n44J97m8j45L33k9k14M66n86M46j83
7205F6l19L41p8k13J3L65l16M7LR9J7j72K18J05l37k11M29k82R9J34P6q2l65R4
7229b69M56n38L90Q6j14J86J28m58P4J83Q9k40NL80j1o12o9P05n46K41j8n1o9
7252g2q0L46j33p6K06J40m37L76j94l03J53n6J78J86l03J69j86j66K39J5l3K24
7274A93j28m42J86M55l88K13J55j81J28k70o7K62l21L78p8n2MO3j01j7m0J82J07
7297B41k49RJ86k55R2jj00O1N0o3R9k62J66L25n97J94M58j73l13K01k96M08q4
7320I7q1j51J38l90M70K3Q0L1k03J79q2o9K53k31j09J49j25K33Q4k16j31K46k11
$$ y = [23, 52, 158, 170, 78, -58, 185, 60, -154, 141, -19, -63, -48, 2, 215, -17, -417, -15, -54, -183, 160, 87, -231, -77, 7, -237, 11, -61, 79, 58, 23, -21, -53, -204, 68, 373, -171, 26, -22, -167, 166, 137, -77, 389, -197, 249, 66, -253, 88, 10, -203, -190, 175, -141, -94, -91, 8, 25, -147, 71, 176, -161, -372, 57, -225, -126, 8, 84, 2, -363, -269, 187, -351, 39, 125, 11, 197, 325, -133, -59, 124, 213, -27, -22, 358, 347, -265, -334, 371, -175, 66, 48, -3, -72, -152, 194, 61, -15, 191, 331, -106, 270, 76, -227, -74, -130, 48, 234, -69, 100, -86, -252, -13, 2, -31, 193, 65, -377, -191, 264, -124, 89, 244, 63, 191, -79, -146, 116, -205, 173, 95, 43, 47, 110, 9, -8, -48, 134, 241, -8, 1, 187, -68, 24, 23, -77, -16, 34, -29, 70, -192, -26, 299, -298, -104, 354, 181, -132, 69, -227, 181, 97, 16, -135, 3, -387, 83, 106, 186, 217, 14, 193, 111, 42, 295, 64, -45, 104, -21, 212, 296, 80, -51, 195, -16]
7343a6m4J71M3m7k00J22L6q3P4J26j38n9L7mJ4K14n07K02j28o7L37j9m1K26k87
7368c8rO9k82K22K48k93N8j53M2K40j08J80j07k27J4L0j46J54K55m22M81j93k50
7391b35J60j23L21Ml69L56l1J74k84M8o5L3j46N0M17k73j26K75k97K29j41n8K31
7414A50m15K15j7n2m3L69j12j11n1lJ79k3m95M12l51K89J93j6m22N56l52J43J26
7437A69l03J77R9j77J62N9m90O91m94J44q3NlK25m43L82K85m96J46k2j34K32J6
7460A47m14L57k68K01J43j49k5j34p2J20Jk13N13j53k3j21rk94P77l92J42k13
7482g9K8l2m1j17J69L4q0L58k23m1j7K80J97p10J19J26J01Q4j56j67KL01j21j27
7506a12J44l88L51J64k62K76k34J5K71l57j7J83j61R1K64l7j72o2k23M49l2m65
$$ y = [-16, -60, 111, 154, 107, -93, 29, 65, -18, 56, 182, 44, -15, 22, 18, 32, 246, -261, -59, -187, -254, 83, 64, 23, 249, -38, -47, 22, -260, -38, 210, -83, -25, -178, -136, 104, -4, 176, 69, -158, -144, -114, -260, -106, 149, -273, 208, 15, -235, -75, -198, 123, 127, -242, 114, 83, 257, -27, 21, -44, -11, -157, -107, 310, 37, -89, 186, -111, 118, -23, -81, 150, -265, -50, -67, -119, -162, 207, 95, -16, -67, -70, 109, 86, -409, 3, -348, -59, 134, 118, -304, 252, -100, 43, 169, -134, 43, 142, -35, 127, 186, -304, 387, -107, 37, -46, -41, -44, 181, -262, 120, 405, -91, 55, 33, -101, 131, 147, -267, 90, -178, 23, 166, 17, -8, -142, -214, -94, -93, -306, 207, 54, 31, -90, -99, -393, 384, -8, 134, -79, -51, -83, -124, -241, -72, -38, -118, 240, 17, -24, -41, 239, 436, -274, -155, -29, 72, 156, 0, -167, -165, 136, 15, -112, 32, -356, -5, 159, -103, 173, -61, -46, 225, -132, -149, 34, -127, -36, 228, 191, 19, -43, -266, 183, 151, -314]
7528c14M54J1P6j15J5j42L00n06K97m26K88j03K05j71J84l0j79M01m34r4J75J69
7550F1j68J63k73N22m86J41M36m49m9J71l41K80j5m00N24j52j06L36j42K5m1j67
7572a30O8L90l95l2M04l86K94j71k28M4q8n4M65jj93J28k41O6j28nR7k6K7K48
7596A53k55K94k9j42l2K21k25j2K22m97K17J72q5J33m38J49K77n6J5J57m42J71
7618c2J51j9j36m2k1L93o07K61J96j33M2o4j01J51j29K35l60K13j99J27L6k61
7640b99M39j61P6j7j52l14M0K68J6K25k20L44j17j99J33q5l2K19j69P0q8KM39
7663D18l22l02N18m93J32j8J90k14J88l11K89j69l5L72j94k00J39J24k30L99j36
7684A45l25L35J6k29J41j67K04r6k12n8O1PO6J36K0l9k2J26J9j52J27Rl68M76
$$ y = [-314, 140, 151, 227, 112, 127, -15, 285, -221, 76, -350, -62, -165, 40, -131, 53, 23, -156, 245, -189, -283, -108, 61, -107, 56, -217, 305, -181, -40, 396, -53, -102, 69, -272, 8, -7, -407, 117, -35, -141, 195, 53, 78, 37, -130, -62, 328, -67, -99, 305, -81, 213, 42, -186, -142, -230, -284, 181, 180, -13, 115, -126, -60, -188, -193, -96, -122, -95, 153, -102, 192, 163, 21, -11, 210, -15, -27, 195, -302, -85, 87, 2, 135, -303, -154, 123, 67, 82, 239, -203, -32, 119, 100, -36, -78, -99, 294, -313, -52, 144, 11, 53, -11, -112, 39, -90, 145, -215, -2, -201, -74, -38, -299, 140, -21, 55, 38, -114, -428, -388, -120, -104, 121, -99, 245, 128, -71, 62, -23, -55, 164, -5, 65, -23, -21, 418, 96, -206, 312, -181, -49, -67, 123, -91, 97, -214, 75, -94, -129, 243, 49, -151, -12, 112, -118, 281, 145, -180, 155, 171, -58, 83, -84, 120, 24, -188, -246, -185, -178, -112, 24, 44, 5, -17, 109, 128, -24, 103, 112, -256, 220]
7708B20j09k46J58j3L7q3q2K18kj56K00K8l10Q3L67o88J79L55k44kq2M96j85j24
7732A5J10l61K6L64l52J91J55j78K65k20k50M16j60l7K7J9QJ12j08P2o0Rj13J67
7756A17l8Q2j88q2K98r7j67p8R2J97j29P6R5j54m13K58K18l90J89L43n86L16k42
7779b83J72K86n15K82M15p16L13J31k20J46J84l64K33K55l74J40j09k5L26m04
7799a27K62n3l47J64M3Q1J06l06L87N8l34L25k14l11L76j43j46L66m44L13K21
7820B77m55J05L83m32J79k2PJ89p2k39L5j55K30LJ38j8p7j44K73k90q5L3L45j02
7844A06J17k55j26L69l21Q2J86l97Q7M21l81K47l24O2K85m04L7R4J62k78J59j7
7866h9J62J32l72M9n0J96K5j22l47M46k38J13K39j77J82p7k7J56m2l79K53p9o
$$ y = [220, 111, -135, 23, 10, 47, -36, -118, 100, 98, -58, 142, 170, -140, -57, 310, -378, -199, 156, -88, -90, -172, 324, 139, 15, 125, -236, -210, 154, -198, -7, 148, -30, 235, 15, -235, 181, 21, -16, 11, 30, 38, 150, 42, 114, 54, 63, -50, 117, 79, 161, -27, -109, 189, 92, -75, -153, -61, 136, 7, 83, 178, 24, -389, -131, 87, -303, -114, 229, -357, -41, -283, -111, 175, -340, -58, 357, -359, -46, 85, -135, 11, 195, -169, 64, 319, -55, 85, -24, -49, 277, -127, 135, 82, -265, -101, -58, 23, 129, -177, 210, 268, -66, 259, 45, -266, 110, -33, -179, 187, -257, 56, 277, -178, -73, 310, -122, 57, 35, 42, 231, 159, -80, -45, -200, 30, 33, 171, 153, 76, -68, 205, -85, -170, -137, 208, 106, 223, -32, -158, 211, -110, -28, 158, -239, -152, 269, -112, 135, -189, -127, 158, -246, -209, -115, 47, -231, -72, -89, 73, 205, -167, -118, -168, 28, 53, -69, -416, 30, -208, -95, 144, -33, 149, 72, 45, 201, 159, -220, 33, -46, -52]
7889e2J77o9L5J45m55Q6L63l42L9M2J25P4k98J49J26j88J25K32l25q0J1j62M46
7912B04l7l06P0l6p3J46q4m4J90K2O8j36k09K23J73p45N89r0l2K9j2k6K59k48
7936a05K71N5l55M46j91m81M42r5j41L32m58K74k0pP2n5r4J32j60K18K1j90k57
7959c46M29l86K10K94j72K13l2j38j63J19J7j64j35j4J67r7R0K7l4Q8J02k03L5
7982i3J13j28N3j30J39Q3l09R5M53k46j09J69j13J51j69k32M86m23J26K62m32
8003b54L75J55l28P7J59q5J04l38P5M66m43k34L43j5j36K63q7l80L14J91p3r5
8025E4j81K60l7n6j8M2q1J35j81K95j93J09N3j23K3j30q5OL65m30L3N2m4K13j83
8050a02J31R1j56n7P2J58j12M16n30K12R9m84J86K24k34J34J73k44K08j25k01
$$ y = [-52, 125, 56, 91, 236, -219, -133, 230, -112, -73, -31, 94, 168, -130, 19, 145, -43, 82, 314, -11, -91, -80, -242, 204, 167, -139, -69, -105, -178, -32, -116, -160, 30, 52, 120, -16, -225, -2, 171, -574, 15, -75, -107, -78, -90, -116, 143, -105, 166, 221, -134, 312, 121, -360, 82, -13, -154, 178, -280, -6, -26, -33, 39, -16, -110, 22, -138, 80, 101, -89, -346, 83, -303, -93, 201, 29, 242, 210, 72, -91, 28, 45, -119, -254, -268, -101, -198, -108, -81, -115, -27, 75, -128, -93, 20, -108, -55, -185, -46, 37, -272, -177, 276, 30, -79, 90, -23, 128, -41, -273, 213, -210, -84, 178, -254, 121, 276, -52, 25, 184, 99, 203, -135, -60, 406, -37, -271, 72, 57, -79, 184, 97, -283, 31, 222, 149, 54, -127, 133, 96, 40, 22, 64, -17, 118, -63, 232, 39, 148, 201, 78, 101, -29, -114, -108, 257, -173, -140, -88, -132, 81, -102, 29, 120, -36, -93, -21, 137, 25, 441, -89, 123, 222, -262, -76, 148, -86, 48, 221, -23, 185, 60, -141]
8071a41L60j45q8Q2j54K43K45m28m0J44nJ29k06j37K68r2k93N32l24j15J35K00
8093A70l67J72j32M80l87j43M29l62K63k42j17K23k00K1p6Q9J91K30l65k2K15
8114G0l57K07K98q0m1j08k84J74K30l2o8J10j80J40j34J37Km35M38rk36K45l68
8137b81P0K04K2j01Q7j23O5O7m4j11K4O1m6L2oQ8j9N3n4j21r1L30J47j61j28j8
8163e4K98k29k19N8L8j16L61M8l23L4k26M76j19J00ll05m8K97j41L0l1j61J51
8186h4J48K00k76q6K1
$$ y = [-141, 219, 74, -14, 68, -86, 157, 402, -26, -66, 78, 73, 202, -4, -141, 127, 35, -258, 274, -50, -165, -30, 170, -197, -25, -157, 323, -64, -207, 222, -140, 123, -119, -236, -13, -213, -192, -268, -179, 12, 242, -123, -145, 70, -287, -80, 218, 138, 97, -11, -295, -121, 109, 77, 9, 119, -61, 79, -55, 82, 84, -351, 87, 78, -158, 87, -281, -211, -7, 15, -86, 1, -122, -57, 10, -34, -145, -121, -60, -106, -74, -80, 8, -11, 42, -12, -133, -224, 106, 253, 92, -36, -54, 244, 15, -204, -146, -108, -224, 137, 185, -138, -104, -330, 146, 27, 127, 124, -181, -229, 68, -73, -43, -74, -235, -84, 64, 264, -12, -98, -77]
8191g7
$$ Imaginary data points
##PAGE= N=2
##DATA TABLE= (X++(I..I)), XYDATA
0@%%%%%%Qj6J6j6K4l2M0n6P2q8J12j44J76k08K48k97L54m19M91n78O76p85R08
29D86j043J196j367J553j761J993k250K533k839L176l547L956m401M886n418N997
45C150o631P323q076Q901r809J0807j1904J3117j4466J5970j7661J9574k1756
58a1461K4275k7219L0717l4949M0195m6905N5827o8344Q7318j19825J90421o03841
70d83791L76439O77157r92649L03111M21224n37848k68150P52642m3555o08359
80d03779M03764O52951p50920l78956P70131K9093n76494M08240M18838l76464
90A96404k79201J87020j53657l57638L63734N20054m78347l47665M72981k6713
100I6972m27481K88146L27868k64746j93565J98866j0989k95162J50594L06545
$$ y = [0, 0, 0, 0, 0, 0, 0, 8, -8, 8, -8, 16, -16, 24, -32, 40, -48, 64, -80, 96, -112, 136, -161, 193, -226, 265, -313, 363, -422, 486, -557, 639, -728, 825, -936, 1057, -1193, 1340, -1499, 1677, -1870, 2086, -2315, 2571, -2847, 3150, -3481, 3842, -4234, 4667, -5142, 5665, -6239, 6878, -7588, 8382, -9279, 10295, -11461, 12814, -14405, 16312, -18637, 21558, -25347, 30480, -37864, 49454, -70371, 120050, -483791, -107352, 569805, -422844, -119733, 301491, -236357, -504507, 248135, 204580, -403779, -15, 652936, -97984, -476940, 293191, 322284, -254210, 154030, 572868, 196404, -82797, 104223, -49434, -407072, -43338, 476716, -1631, -349296, 123685, 96972, -330509, -42363, 285505, 20759, -172806, 26060, 15071, -280091, -129497, 177048]
110A77048k99975n0339N10224j06812m51084J13193J72334o7181L3287P4446q2868
121B2273j42757Q4531J32098j52366K6745K67314j05959k07105M7407L8235L9991
132E0407k8406j31895N7672Q1293k2726L0572q8733q1103J50656Q0543p1763q6703
144f0186k3374R7874m3695j05117J57918O1227j11450N9796r845q6407J09939
155D6680O6888q8597r1915J6832J37401m3646j40003J11658L4337j05744J05824
166D9715L8612j36782N183P0046j7154p2627J9367J33790r6238j50920J82360
177B5352N0986j57218J02078N7281j55670K3019J21113l1285j03621L6107J27642
188I5784r6306q6805J86912l0828j79848J33023O4483j34039L9055O7456o8345
$$ y = [177048, -122927, -173266, 336958, 230146, -220938, -107745, 64589, -2592, 30695, 105141, 22273, -120484, -35953, 96145, -56221, -29476, 237838, 131879, -75226, -27819, 10416, 50407, 22001, -109894, -52222, 29071, 6345, 36917, -51816, -132919, 17737, 98280, 26517, -60186, -83560, 14314, -29381, -134498, 23420, 84647, -26803, 32993, 23148, -63259, 46680, 113568, 24971, -66944, -50112, 87289, 43643, -96360, 15298, 49635, -56109, 49715, 88327, -48455, -43272, 26774, 9620, -63007, -43640, 90150, -6088, -157008, 25352, 76338, -80880, 21198, 78479, -77191, -54172, 66941, 35656, -67965, -31858, 95784, -522, -87327, 99585, 68757, -111091, 21932, 86415, -47624, -8569, 58887, -9458]
199i458o0765N2721R6108q5980q1763J36737k3458j25845J12459L7253j00204
210e2195L7031M4949k3054k2267J0716O3759n6043o6460J25775O4j10798P0399
222B1876J8578o9902M0739K3800k0183k0061j6189N2921k7330o5396Q1195l069
234A6979p7341N7848N640l5328L9824j6718m190J8718l3919L6983P968o2379M4966
247i49J7450l5086L9587j0994j2776L4271l5787J4323K7780n9325K8297K6001
259C2792o0947K8141J6503l3899K5742j3741m241K9439m1798J4974K8371o1412
271d0076K5215L1712m8841K5610J3053k1406L3504j4673m399L0093m1874J3970
283A888L0958n5173J9956K7418m1586K6624N139k7287L0271j6390o989K5454m2140
$$ y = [-9458, -70223, -17502, 78606, -7374, -89137, 47600, 24142, -101703, 10756, 48009, -52195, -15164, 29785, 6731, -15536, -4820, 58939, 2896, -63564, 62211, 62275, -48523, 21876, 40454, -29448, 11291, 35091, 14908, -5153, -21342, 31579, 4249, -61147, 20048, 16979, -60362, -2514, 3126, -32202, 7622, -9096, -13286, 5432, -28487, 8496, 16464, -45915, -949, 16501, -18585, 21002, 10008, -2768, 31503, -4284, 10039, 37819, -21506, 6791, 32792, -28155, -14, 16489, -17410, 8332, -5409, -9650, 19789, -22009, -7035, 21336, -40076, -14861, 16851, -31990, -6380, 6673, -14733, 18771, 4098, -301, 29792, -12082, 1888, 32846, -22327, -2371, 25047, -16539, 10085, 15224, -12063, 18208, 1818, -5171, 20283, -21857]
296b1857J1073K7748m9561K1781K2026l9921L2209O960k6917L2308j4039r727
308g917K5176l6780J1187K5976m2887K5293J7479l8837L6572N398l2143K7867
320A6384j3650q888K4471l2778J0889K1072l9387L0511J4547m3623L2790N653
332A7991l1517K3889j3651j0286K0503k7201J4098J7576l7899L2499J5679m2245
344b0564L1235N838l2019K3228j0314q359J9206k3845J6133J4370l7324L4706
356A2291J1826m5701L0179M185l1570K6845p646j2647J7275j6829J9465J0540
368A8213l5958L2015N041m0448L5696j469l4652K8380q159j1921K0668j5604J1836
381C638P202l0045K9375K015l5708L3149p305k9063L5211q336j2204K0772j8621
$$ y = [-21857, -10784, 16964, -32597, -10816, 11210, -28711, 3498, 10458, -16459, 15849, 1810, -7917, 17259, -19521, -8334, 17642, -25245, 48, 17527, -21310, 15262, 20660, -11483, 16384, 2734, -6154, 18317, -14461, -3572, 17500, -21887, 8624, 23171, -20452, 12338, 17991, -13526, 10363, -3288, -13574, 6929, -20272, -6174, 11402, -26497, 6002, 21681, -20564, 10671, 16509, -15510, 7718, -2596, -10955, 8251, -15594, 539, 14909, -22415, 12291, 24117, -21584, 8595, 12780, -18790, 8055, 409, -12238, 5037, -11792, 7673, 18213, -17745, 14270, 19311, -21137, 14559, 13090, -21562, 6818, -1341, -13262, 7406, -8198, 3638, 10840, -19205, 10170, 12185, -23523, 9626, 2321, -26742, 8469, 133, -12071, 8701, -9920]
394i920Q224J2961k3718K3440k484l1529L0867p335j9356L4879j6056j1211K7809
407A6571k1081L560J6900k4251J3693K809j7900K4403j5489j3607L0331k4993
419i054j54L8973l2205p558K1666k5643P159J4893p573J0886j9028j057K8231
432A9536l4310P339M1242m0879q84L6464k9986r123J1041m695J0790r247J0003
445G291J5995n2517L588M5407l6234N710M0333l2896j5673J2560r84P178r729
458i971J6510K0406m4690Q469L4371m9320J762M5918j8315k361R915j8551q095
471a3952j2256K1120L0888l1375N476K0530m7168M547L4701j7686J2645J1570
483A9040j7455N126j4967m898K3481j4733J1623K3996k9843r29K359k6695K4749
$$ y = [-9920, -1696, 11265, -12453, 10987, 8503, -23026, 7841, 506, -18850, 16029, -27, -11238, 16571, -4510, -950, 15950, -8301, 5392, 8201, -9699, 14704, -785, -14392, 15939, -9054, -9208, 29765, -2440, -9998, 11668, -13975, -6816, 8077, 504, 11390, -7638, -8695, 19536, -14774, -7435, 33807, -7072, -7956, 28508, -1478, -10601, 440, -4255, 6535, -2712, 7291, 23286, -29231, -25643, 19764, -16470, -10760, 29573, -3323, -18996, -6436, -7420, -242, -9971, 6539, 26945, -17745, -9276, 25095, -24225, -22463, 23455, 5140, 2779, 12694, -5857, -13952, -26208, -5088, 25800, -5575, -99, 20431, -26737, -22190, 12511, -5175, 7470, 19040, 1585, 6711, -8256, -13154, 10327, -4406, 7217, 31213, 1370, 441, 2800, -23895, 854]
496H54J4676j1058K0313k2335k6956J9202o294P752K2924j4673O127o064k7700
509b3232K2142r85j5387L6356p292k5797J7830j0463j0557J1033J124K4239k707
522A6304k6210J6521j8550k0992M9359L297k4540J9524r556j7435P366K930J6087
535A4105o882j3262K4843k2300k4098L9015j1087j9977L7910l140k1513L160r181
548a2407L348J633N609K7556k6251k4418L1983j6350j0927M3208j0300k1836J2564
561C412n406j910l384K494K4422j8073r119L2603l0080k2563M0230o114j2318
574e806K2515n679j5420j4166M521K8024j5284l391L2247l5560k3784M0844q502
587E59j6046K5310L757r131j1397o93J5382k2042L525M4418k3795k1951K8060
$$ y = [854, 15530, 4472, 24785, 2450, -24506, -5304, -11598, -3846, 19078, 4405, 10532, 4468, -23232, -1090, -2075, -17462, 18894, 11602, -14195, 3635, -6828, -17385, -6352, -5228, 19011, 16304, -9906, 6615, -11935, -32927, 16432, 19729, -4811, 14713, 5157, -12278, -4912, -1982, 14105, 7223, -6039, 18804, -3496, -27594, 11421, 334, -19643, 18267, 15127, -6386, -3226, -12407, -9059, -7426, -1817, 25739, -512, -24930, 7053, -9297, -20224, 22984, 12684, -9152, 3412, -1994, -3904, -7288, -4794, 19628, 1555, -7564, 25039, -5041, -27604, 12626, 6512, -5806, 16709, 11030, -4390, -18556, -14035, 13989, -1295, -4686, 27561, -7999, -31783, 9061, 559, -15487, 9823, 13580, 4449, -6948, -7641, 7741, -14301, -10776, 33642, 9847, -12104, 15956]
600A5956j9563j7413K4920Q136J894j0070q207J2443k3377o129M1721j1984j6358
613h031K4854j4495j7435P907N99J1914m179l594K3289k4839k2825L2097o375
626a113j0950K6223m877j1620k290q465J2888l163m965K9429j3425k5099K1252
639C825o576j1744J7322p55M189l77j5444J3990o365j7432L0702R72k1625J7066
653G748j996j3173M884j200J3995o27j6207J9474p069k5212K7032K190k0731J7243
667F351J084j0234J221o431J1771n82j6068K1578k472k3431K1679l87j7671J6354
681B762J579l939K276r386J1705j78j7756K2289J22k2745J9952N04j7237J3041
695B989R90l790J478q487J2353p73j7502J9972j830k0390K0896j62j6553J3743
$$ y = [15956, -3607, -21020, 3900, 12036, 13930, 3860, -4347, 8096, -15281, -21410, 20311, 8327, -8031, 16823, 2328, -15107, -7200, -6601, 5313, 1134, -2460, 20829, -4010, -26835, 5262, -1113, -12063, 14160, 9283, -2337, -4627, -13092, -204, -3367, -8332, 21097, 7672, -17427, 3825, -2751, -14495, 2827, 2072, 6261, 5884, -9560, 4430, -1935, -19367, 11335, 12307, -9318, 7748, 5752, -7421, -2537, -3737, 10258, 9631, -6576, 12898, 5829, -19383, 7649, 9839, -10892, 6351, 7435, -2799, -1578, -8009, 3762, 3180, -12888, 8690, 6218, -17213, 4466, 4079, -13592, 2762, 4341, 402, 2678, -6708, 4997, 4819, -12937, 9352, 9474, -13271, 6681, 7185, -10052, 2989, 3979, 189, 1667, -6820, 5533, 4760, -12742, 7230, 5400, -14990, 5906, 5744, -10809, 2934]
709B934j889m450M696o920R380j052j4737J9226j538j7314J9726k063j4718J3609
723D890k669k731M519r646J0011K97j5827J8616o61j9529J7450o42j3189J1477
737B366k819k136L184r209J2835n83j6359J9644j50j8596J8636l1j3390J0503
751C895l197m73L695r378J2026n52j7312J7213P68j6838J4456r76j0425Q837m841
766c102K974M353j3175J1948L065j7137J5825K450j6446J1676%o399P809p169
780c328L179M280j3472J2839L953j7737J3318J401j3514J2706k490n573Q961r324
794d801M957P836j3815Q611M408j4764J1338J225j0411J0383n886l350J1584j0841
808c526K813Q270j4619P559O031j3213R274q49q993J1382n470k691J1261j1367
$$ y = [2934, 1045, -3405, 1291, -5629, 3751, 2699, -12038, 7188, 5650, -11664, 8062, 5999, -8719, 4890, 2221, -510, 4009, -5637, 4374, 4671, -11156, 7460, 6799, -12730, 4720, 4078, -9111, 2366, -453, -2589, 595, -8614, 4221, 3638, -12721, 6923, 6773, -11823, 6813, 6782, -6608, 3895, 698, 225, 3920, -5458, 6568, 6016, -11296, 5917, 6685, -10153, 4303, 3327, -7098, 1739, -3102, -128, 4225, -8950, 2998, 6063, -11074, 4751, 7201, -9245, 2431, 2431, -3968, 3841, -3328, -149, 4131, -9341, 3498, 7451, -10286, 3032, 4433, -9081, 3625, 1135, -4438, 4523, -4801, 156, 7992, -5823, 2788, 7196, -7568, 3770, 4995, -5416, 4967, -919, -4269, 7315, -3526, -713, 7557, -7062, 497, 6528, -6685, 2589, 1740, -7253, 4129, -1341, -4032, 7229, -4138]
822d138K445R427j2427O460L364j1503J0517k196p921J3042p472m447J1806r854
836b897P61Q022j2155O304J916j0426J1514l650q604J3795o293l935J1019r355
850c984K538O496j0731Q202J543j1390J2918k756r596J3005m649n079Q714q156
864b925L140L857j1125R714L48j2355J3971k321j0895J3594l445m584P679o630
878a977L694L231j0796J0761m9j1954J4168k551j1307J2408l848n053O991o687
892b969M205K277j1605J0547q6j1015J4247l603r719J2512m393m747P677o957
906c629M728L387j1196R162k80r515J3165m152q429J3350o735m763Q418p856M230
921a15N327j0106P968n35q602J0854n780m062J3687r734l316R167j0540L836P579
$$ y = [-4138, -1693, 7734, -4693, 1767, 5131, -6372, 4145, 1949, -5972, 7070, -402, -4849, 6957, -2897, -2136, 5886, -6269, 35, 1951, -8475, 3039, -611, -9215, 4580, -1713, -5648, 5371, -3984, -1446, 5050, -5681, 2521, 4064, -7326, 5592, 2836, -6760, 6245, 1596, -3483, 5231, -2925, 215, 4072, -7053, 2661, 3009, -9346, 4625, 2304, -8591, 5003, 1558, -3026, 4653, -1977, 1717, 4948, -5848, 4913, 4864, -7090, 7078, 4527, -6780, 5628, 1780, -3273, 3718, -2969, 1236, 3513, -8092, 2455, 2369, -8646, 5601, 1998, -7721, 4791, 398, -4349, 3328, -3629, 1099, 4486, -6710, 2452, 2172, -7343, 5822, 1670, -6759, 6591, -144, -4907, 3511, -4345, -115, 5212, -4894, 3074, 2539, -6063, 4791, -989, -5051, 8636, -1098, -4414, 4753, -5787, -1951, 5628]
936E628j0417N775J823o472O768o913n44J2561j0957N20J0368j4229K856R211
950E978j1589N434N988o077J195p180J721J0156j1747N046J1089j7035M029J0660
964G668j5539L452J1775l665o16n403K981M458j3912R314J2645j7931O223J0422
978A1872k1554J056J3743l524r48j468M810K84j7362J0442J1311j7504J2230J4042
992A7430k3252j117J0730o128o4L210Q621k36j7867O712O624j8847J3244J5097
1006A4157j8379J955P379j1575k832K673R889N266j2127O470K463k0251R769J2196
1020G053j2498Q849P880j2915l104k487L419P369o213Q194M598j7072L973L182
1034B28j1755J3734Q585q414K995o530m130O463n995O656R145r721L000k369j3166
$$ y = [5628, -4789, 986, 2809, -3663, 3105, -3808, -4352, 8209, -2748, -2228, 8140, -6089, -3233, 5978, -5611, -177, 5811, -266, 929, -6251, -4530, 5626, -6121, -1075, 10014, -7021, -2992, 7668, -7871, -4419, 7356, 3691, 3075, -2328, 653, 5111, -8801, 513, 13158, -4773, 1450, 11872, -9682, -8626, 5117, 1593, 645, -823, 3987, 4271, -13091, -2649, 8662, -8842, 3388, 17430, -5822, -6939, 3791, -2337, -2401, 809, 9430, 9194, -8673, -1961, 4663, -14184, -940, 14157, -4222, -2267, 5112, -6463, -9295, -6622, 3267, 8533, -3594, 2876, 5339, -14912, -5143, 7053, -5445, 3404, 11284, -1631, -4735, -7222, -3803, 3566, -2647, 5547, 10145, -6927, -2954, 228, -11527, 2207, 10792, 2378, 5373, -1157, -5287, 1176, -4819, 1837, 10982, 1261, 4261, 1892, -11274]
1049a1274J0284K947m204J0711n953n837N380j0305J142J0766l860N111p48j0770
1063f610O326k737m301J3884l925k706Q713j2097l174Q732m862N174L014n925
1077d94N193o356n124J0485n680J98J2449j2237l264Q295q423J714N353k829N430
1092D710n219l559Q207j0411K113J3584j1791j161J1198j0566j263N810k532M047
1106C167l417q0O502j2000J617J2254j3800J522J2490j0839q75N506m309K705
1120D43k579J598O860j0820K342J0563j3823J217J1876r551N38N340m935K421
1134A490l772N5P716r797K410J0209j2754Q37R096r346K672M696m453M041l771
1149f71k058P522q484J492R187r692J805N809r195L926K102n436P368k739m191
$$ y = [-11274, -990, 1957, -2247, 8464, 2511, -3326, 2054, -8251, -7109, 3657, -203, 4908, 4160, -6610, -284, -3021, -7322, 6562, 2637, -69, 8644, -3453, -6627, 2105, -2757, 2417, 5431, -494, 4699, -1657, -6781, 3704, -1976, -1778, 10671, -1566, -4830, 3465, -4958, -3244, 2109, -720, 4710, -509, -4068, 4139, -6272, -4159, 9425, -2366, -3527, 7671, -2895, -4158, 1652, -880, 3167, -250, -330, 6172, -5828, -4211, 8043, -5757, -4235, 8255, -2584, -3459, 2047, -2262, 443, -2136, -538, 6322, -4498, -2156, 8407, -5416, -4199, 7677, -1874, -1336, 4004, -931, 1490, -2282, -2227, 5489, -4308, -1898, 8311, -4443, -3606, 5490, -3856, -1184, 3512, -941, 3100, -671, -2729, 4793, -3691, -2199, 6988, -2704, -899, 4910, -4285, -359, 1743, -3693, 3675, 936, -3255]
1164c255P190o794n37P787o933L392L781q724N528j14o986Q790j849n065Q100
1179D311n459j831N517o476L841L390p750O831n09p969Q707j299m914P531m154
1194b33j176M724o654M207K857q409P484P01q383P455j319m962P161m018o63M876
1210C648p206L913L155q000O720K8o770P270k305l632P072o058k9N920p676K756
1226a194M391p510N090O98n609O858l678k117P470o030k5O805p882K084M057o119
1242b711N233n96n155P088m869k924Q763o430j318P246o739J290L119n116M832
1257A713j156l548P837n468l659Q968o062j284O924n706J107J920m845N710k145
1272C06m602Q790m807l985Q730n312j777N781m667K619P06n262O840k752m994
$$ y = [-3255, 3935, -2859, -3396, 4391, -2542, 850, 4631, -4093, 1435, 1321, -5665, 3125, 1276, -3789, 4311, -1148, -2979, 2538, -3938, -97, 3293, -4457, 2374, 1865, -6104, 2603, 1304, -3610, 3921, -233, -1409, 3315, -3339, 868, 3725, -4684, 2800, 3501, -4882, 2573, 1254, -3708, 3453, -565, -1228, 3648, -3558, 355, 3510, -4490, 2230, 2258, -4512, 2758, 453, -3179, 3893, -2165, -2194, 3726, -3950, -1194, 3197, -4313, 777, 1475, -4134, 2724, -954, -3071, 4399, -1631, -1656, 5149, -2733, -649, 3408, -2711, 2522, 1926, -3229, 3859, -1010, -3934, 4829, -1601, -2919, 4327, -2412, -1122, 1997, -3119, 1713, 557, -2991, 4846, -622, -4281, 4687, -1375, -2659, 4265, -1441, -334, 1586, -3259, 2451, 306, -4296, 4494, -313, -4298, 4432, -880, -2657, 3124, -1543, 1076, 1782, -3480, 3360, 608, -4386]
1287d386R174l932m386P398m658o98M112n264L531P35n910P317j842n601Q207
1302C797l062l796O402m767N43L263o446M821J341p106P014o91n837O724k550
1317c50k265N035m893K048L751p386N279K543p588O095L60n578N511k389j377
1332a204M433n921K799L232p925N154K297p817N637K66m436N376k785l15M664
1347C455o538L304M260q191M659K531o746N178l58l826N320l817n62N068o433
1362b696K095M051p098M063J586n369N453j173l496O523m210j670N946n796J452
1377c39L526n907L605O67m909O255k914l564P271m928k060O223n121O96L475m623
1393b647L912m29m055O565l582l512Q045m447k912O201n037R56K797m344L797
$$ y = [-4386, 4788, 856, -3530, 3868, -790, -1488, 2624, -2640, 891, 1626, -4284, 3033, 1191, -4410, 3797, 735, -3061, 3341, -1426, -883, 2380, -4066, 755, 2096, -5010, 2004, 1313, -4524, 2200, -350, -2615, 2420, -2473, -425, 3326, -4060, 1219, 3762, -3826, 2269, 2629, -2949, 2562, 173, -1204, 3229, -2692, 107, 3339, -4586, 568, 2865, -4952, 685, 951, -3485, 1891, -894, -1209, 3455, -3083, 221, 4481, -3710, 949, 3480, -3266, 1912, 1554, -2272, 3048, -769, -1331, 3737, -2696, -601, 3450, -3648, 415, 2001, -3368, 2085, 912, -2584, 3939, -271, -1941, 4005, -1791, -339, 3187, -2720, 885, 1552, -3357, 2898, -16, -3580, 3691, -1237, -3297, 2926, -2195, -1499, 1976, -2647, 1265, 836, -3219, 3346, -236, -3748, 4297, -150, -3062, 3139, -1898, -942, 1855, -2489, 1308]
1408A308n45m187O656l800l573P912m430j278N354n165J320K487n268M552j38
1423A205l812O188l669l415O449l810q23N136n086J686K519o112M131J172l839
1438b080N596k541l053N013m469l7M642n475L117L308p668L007J656m265M882
1453A633j478j523M435n163P38L671o121M758M156p403L321J101m929L711r36
1468b9p50L965m508J291K055p243M859M253o800L870K028n218K643j435p62M208
1484B427l617K507J797p731M691L096p632M982K923n270K795j531j823K892k469
1499a963K869K335p153N303J829q742N483L176n184M079p40k449J788k586K803
1514H48J129n776O401J375r198N039K521n883M250O92j881J536k839K280M83n330
$$ y = [1308, 763, -3424, 3232, -568, -4141, 3771, -659, -1937, 3417, -1748, -428, 2059, -3209, 1343, 1205, -2607, 3581, -88, -3503, 2946, -864, -1687, 3449, -1637, 49, 2568, -3544, 587, 1759, -2080, 3516, 975, -2078, 2935, -1534, -1571, 3071, -2404, 713, 4021, -3647, -640, 1016, -3249, 1633, 155, -1368, 3067, -2096, -1358, 2313, -3808, 950, 5106, -2297, 1024, 2125, -2804, 907, -29, -779, 3186, -1322, -31, 2024, -5219, -360, 3893, -2907, 963, 2991, -2227, 416, -1019, -1781, 2427, -1190, 1317, 3114, -4617, 74, 3170, -4462, 520, 3443, -1827, 968, -563, -2386, 506, -1963, 906, 3241, -3912, 1391, 3220, -5522, -39, 3137, -2047, 2032, 1292, -1157, 631, -1955, 848, 1977, -3799, 2602, 3977, -5221, -182, 2339, -3544, 706, 1398, -483, 1053, -1786, 494, 977, -4353]
1530d353P229J767q679N299J440o161L960O78j607K302k567K166p67n451O650
1545A906J456p522O239J362o226L362p03j535K920k207K539K21o111M954Q32o655
1561e168N927J687m649L397j969j490K968k573K895J560m994M263P23o684N080
1576I73Q93l019M300k479j439K696m497J514L009m775M579O77n999L741k97k013
1592b136M226k082j32L239n368J378K626m691M285J733n030L310o93k666L093
1607A092k307Q23L580n407J687K452n663L840K465m603L040K29k560K361l075
1622b046J346L885n691L033K585o517K931K596m617K869O97j592K053l341J268
1637e41L748n959L019L556o339K712K507m523J798M27q64K048l908K171L021o066
$$ y = [-4353, 2876, 4643, -4036, 1263, 2703, -3458, 502, 1180, -427, 1875, -692, 1474, 707, -4744, 1906, 3362, -4160, 2079, 3441, -2785, 577, -126, -1661, 1259, -948, 1591, 1812, -4299, 655, 1487, -5168, 759, 2446, -2203, 1194, -775, -2265, 703, -1870, 1025, 2585, -2409, 1854, 2577, -4107, 973, 1866, -1153, 3147, 668, -771, 1925, -2572, -1058, 1951, -2824, 1755, 2432, -3567, 174, -123, -2136, 2090, 8, -124, 3115, -2253, -875, 1751, -2940, 1345, 3078, -1952, 1358, 665, -2001, 1092, -1215, -392, 3188, -2219, -532, 1920, -3743, 97, 2562, -2041, 999, 1228, -1332, 1029, -2046, -700, 3185, -2506, 527, 3112, -3405, -474, 2122, -2495, 374, 1071, -521, 1532, -1809, -541, 3207, -2752, 267, 3823, -2516, 196, 2703, -1820, -22, 405, -459, 1589, -2319, -148, 2873, -3193]
1653c193K792L718o272K667K446l927K151l18j76K082m367J829L987o038K226
1668c93L964o066K101J933k640J914j259n31L361m674J500L919n487K073L798
1683C513m912J301Q10k250K751j626q01M054m499k59M108m422J499K720l644K173
1699E16k26k416L466k059p58M573l769k15L601m065J028K120l306L165q05k902
1715b052L597k444j953M841k979k19L152l862J472J126l026L822m90l274M200
1730A911k142j780L826k296L77K505l662K440K26m298L921R2l476L819q65j915
1746a317K344j810M73K660l853K699J042n143L837J91l541L292o14j063K659l082
1762a226J091J888m327L064J882m549K485O45l003K756j197l47K944l786J327
$$ y = [-3193, -401, 3317, -2955, -288, 2158, -1769, 382, 64, -112, 1970, -2397, -568, 3419, -2619, -393, 3571, -2495, -394, 1539, -1101, 813, -446, -977, 2384, -2290, -790, 3129, -2358, -285, 3513, -1399, -98, 712, -1538, 1213, -413, -1214, 2840, -1659, -1918, 2190, -2232, -733, 1987, -1657, 516, 290, -2126, 1340, -719, -1477, 3096, -673, -888, 2713, -1352, -324, 1796, -1510, 1655, 850, -2052, 1545, -899, -2852, 1989, -990, -1209, 1943, -1919, -447, 679, -2347, 1475, 985, -2289, 1911, -231, -2011, 1815, -481, -104, 2401, -1261, 1179, 1405, -2893, 1028, 1120, -2356, 1463, 598, -1317, 1027, -783, -310, 2350, -1503, 1196, 2238, -2905, 932, 1123, -2418, 874, 260, -803, 1856, -1226, -135, 1753, -2574, 490, 2372, -2177, 308, 953, -2050, 706, -491, -838, 2106, -1680, -353]
1777c53K823m979K472J816m095K482M27j927K498k414M32L252m256J793L181n037
1793a885J604K303l537K041k52j216K283k485J63L746m613J004L775m795J205
1808f59J871l101K046m27j066L116k601p8L860m438P92L371l901J371J136k635
1824a343K133n73j378L125k626m03L563l688O81J949l693K299O96k982L722r05
1840E77k284L280j597q92K710k789Q74J428l170K904k13l592M460r52l059L594
1856A279r68j259J972k053J659M06k829L304j52m241M807o72l793L846j188q57
1872g39J749k028J363O02l198L663l02m008M297q62k673L507j695n97K426k395
1888h90J187P59l152L189j6l683M120j460j686L252k312m05L115l123Q21J715
$$ y = [-353, 2470, -2509, -37, 1779, -2316, 166, 593, -1334, 1164, -1250, -818, 2434, -1822, -29, 3152, -1885, -281, 2022, -1515, 526, 274, -942, 1341, -1144, -981, 2765, -1848, -844, 2931, -1864, -659, 1212, -1889, 157, -270, -1336, 1780, -821, -899, 2961, -1477, -685, 2686, -1215, 156, 1292, -1343, 790, 217, -1161, 1964, -662, -1065, 2498, -1190, -509, 1440, -2253, 46, 742, -2240, 1482, 577, -1707, 1573, -24, -916, 1794, -995, -121, 1307, -1863, 1041, 828, -2764, 1696, 744, -2315, 1279, 311, -948, 1024, -1029, 630, 1036, -1793, 1511, 1359, -2882, 1925, 1253, -2540, 1306, 118, -739, 1010, -1018, 345, 947, -2251, 1412, 1110, -2898, 1399, 537, -2136, 1371, -324, -921, 1505, -890, 297, 1056, -2096, 1093, 1077, -2606, 1514, 54, -1632, 1620, -692, -1097, 2018, -1105, -284, 1431]
1904A431k953K041J30k180L502k140j359L784l541L7L829l853M35K354k654J269
1920A32o5j240K679k128k69L838m209L78L784l935K74K675k725J136p8j403K485
1937A329k243M3L000l629O37L130m164R30K309k758J753J67j325K217k152j7K920
1954B147l153Q69K449m027J555J830l564K296J40j847K403j328p70J935k765J923
1970I3J399l782K964J161m188K734Q73l003K899n99p51J202k001J114J347l894
1986b432L400Q41m338L465M51l477K786p2q52J377j997J338N07l483L343J083
2002A940m210L118M72l408K213p4q36J648j829J160R25l452K835J135l596L330
2018A371k00k291K184j156j131K184j962Q44J611l322K272N38l045K824k22j636
$$ y = [1431, -1522, 519, 649, -1531, 1971, -169, -1528, 2256, -1285, -1248, 2581, -1272, -837, 1517, -1137, 132, 67, -1173, 1506, -622, -891, 2947, -1262, -884, 2900, -1035, -761, 1914, -811, 325, 247, -1156, 1329, -914, -871, 2129, -1500, -863, 2267, -1897, -967, 1342, -1416, 337, 504, -821, 1396, -756, -773, 2147, -1006, -137, 2312, -1715, -160, 1670, -1894, 402, 542, -1305, 1098, -230, -1000, 935, -1830, 93, 1492, -2290, 674, 1835, -2353, 381, 1254, -1749, 1150, 551, -200, 1002, -999, 115, 1462, -2432, 968, 1809, -2529, 936, 1387, -2090, 696, 624, -228, 1149, -848, 490, 997, -2486, 857, 1940, -2270, 848, 1320, -2088, 125, 51, -785, 863, -966, 194, 1119, -2333, 502, 1637, -1959, 1371, 1171, -1120, 1064, -92, -1223, 961, -1001, -157, 1454, -1868, 404, 942, -2103, 721, 499, -1137]
2034a137K615k036m84K342k583J124K168k907J355O96k496K092o31j276L095k414
2050d77n81K887l453K47K896k650J282J142k395J556j005n01K909k357J56K993
2066B649l817L82K533l170J355J184j809J577j459l82K191k653N74L024l303M97
2082f27K572l135Q08J267j430J557j080m34K166k899M48L030l698J101K561l211
2098a004O17J247j601J263p26l24K509l249Q10K504l357P44K791l308J035P26
2114F77j763J907j646J44K093k535L31K849l450J002K020k931J286Q20j684J920
2130A040j260n52K417k840L05K737l329J012J852k703J534k4j323J818r89l18
2146f23K620k997L66K504l492J323J887k527J603p2j752K202j637m28K757k464
$$ y = [-1137, 1478, -558, -1042, 1300, -1283, -159, 2009, -898, 457, 1153, -1343, 749, 118, -1158, 1937, -477, -1058, 1829, -1624, -1377, 1519, -1131, 151, 1293, -1102, 454, -551, -1052, 1857, -500, -344, 2649, -1168, -786, 1747, -1423, -68, 1116, -693, 884, -575, -957, 1234, -1419, -845, 2179, -1124, -627, 1945, -1190, -382, 885, -545, 1012, -68, -502, 1664, -1235, -787, 2243, -1455, -354, 2207, -1004, -387, 860, -741, 522, -204, -528, 1981, -1268, -458, 2046, -1311, -567, 2224, -1084, -49, 677, -1086, 821, -825, -681, 1412, -1123, -792, 2057, -1393, -391, 1629, -1302, -16, 804, -880, 1040, -220, -772, 1645, -1195, -890, 1847, -1482, -470, 1382, -1321, 213, 189, -1134, 684, -305, -623, 1997, -1000, -634, 1870, -1622, -299, 1588, -939, 664, 592, -1160, 1042, -595, -1023, 1734, -730]
2162g30m04K550k890L35K011k048J700L32j695J877j734n16K894k168J39K291
2178A944k983O39J366k226J964J07j469K315k161r88K763k455M37K605k808Q97
$$ y = [-730, -1134, 1416, -1474, -1139, 872, -1176, 524, 856, -839, 1038, -696, -1212, 1682, -486, -347, 1944, -1039, -400, 966, -1260, 704, 811, -658, 1657, -504, -1492, 1271, -1184, -747, 1858, -950, -53]
$$ [...]
8191a05
##END NTUPLES=NMR FID
##END=
