##TITLE=1H_78-2022
 CDCl3
 8 sc, 
 23.09.2022
##JCAMPDX= 6.0         $$ Bruker NMR JCAMP-DX V2.0
##DATA TYPE= NMR SPECTRUM
##DATA CLASS= NTUPLES
##ORIGIN= UXNMR, Bruker Analytische Messtechnik GmbH
##OWNER= root
$$ XWIN-NMR		Version 3.5
$$ Fri Sep 23 13:09:20 2022 Russian Standard Time (UT+4h)  she@DPX200
##.OBSERVE FREQUENCY= 200.1313499994
##.OBSERVE NUCLEUS= ^1H
##.ACQUISITION MODE= SIMULTANEOUS
##.ACQUISITION SCHEME= undefined
##.AVERAGES= 8
##.DIGITISER RES= 18
##SPECTROMETER/DATA SYSTEM= spect
##.PULSE SEQUENCE= zg30
##.SOLVENT NAME= CDCl3
##.SHIFT REFERENCE= (INTERNAL, CDCl3, 0, 15.7458)
##AUDIT TRAIL= $$ (NUMBER, WHEN, WHO, WHERE, WHAT)
$$ ##TITLE= Audit trail, XWIN-NMR		Version 3.5
$$ ##JCAMPDX= 5.01
$$ ##ORIGIN= Bruker BioSpin GmbH
$$ ##OWNER= she
$$ F:/spectra/data/she/nmr/H-F/1/pdata/1/auditp.txt
$$ ##AUDIT TRAIL=  $$ (NUMBER, WHEN, WHO, WHERE, WHAT)
(   1,<2022-09-23 13:07:55.93 +0400>,<she>,<DPX200>,
      <created by zg, POWCHK disabled, PULCHK disabled
       configuration hash MD5:
       00 E9 B6 7A A2 85 ED C7 34 08 36 98 17 FE 4E 26
       data hash MD5: 16K
       A8 D9 F6 8A 52 A8 71 82 C8 91 C5 FA 17 A0 69 AA>)
(   2,<2022-09-23 13:08:02.37 +0400>,<she>,<DPX200>,
      <Start of raw data processing
       efp BC_mod = 2 LB = 0.24 FT_mod = 6 PKNL = 1 PHC0 = -18035.98 PHC1 = 12.40069 SI = 16K 
       data hash MD5: 16K
       BC 3F 95 CB 50 62 40 FF E6 44 18 DB CD E7 05 68>)
(   3,<2022-09-23 13:08:19.01 +0400>,<she>,<DPX200>,
      <pk PHC0 = 3.680211 PHC1 = -6 
       data hash MD5: 16K
       90 A1 BC 10 8B C9 CB E9 9E 17 1C 4D 1A DF AB 9C>)
(   4,<2022-09-23 13:08:22.21 +0400>,<she>,<DPX200>,
      <abs ABSG = 5 
       data hash MD5: 16K
       D3 8B C5 63 08 81 5C E8 31 CF 08 4C 4E 7B 9C 03>)
(   5,<2022-09-23 13:08:51.29 +0400>,<she>,<DPX200>,
      <abs ABSG = 5 
       data hash MD5: 16K
       5A 4B 71 71 7C 2C 24 5C 66 B0 71 03 FE 41 B4 59>)
$$ ##END=
$$ 
$$ hash MD5
$$ E4 BE F4 99 F7 6D 86 9E 47 3E E9 07 3E 79 65 89
##$RELAX= 
##$RELAX= 
##$RELAX= 
##$RELAX= 
##$RELAX= 
##$RELAX= 
$$ Bruker specific parameters
$$ --------------------------
##$DU= <F:/spectra>
##$EXPNO= 1
##$NAME= <H-F>
##$PROCNO= 1
##$TYPE= <nmr>
##$USER= <she>
##$AMP= (0..31)
100 100 100 100 100 100 100 100 100 100 100 100 100 100 100 100 100 100 
100 100 100 100 100 100 100 100 100 100 100 100 100 100 
##$AQSEQ= 0
##$AQ_mod= 1
##$AUNM= <au_zg>
##$AUTOPOS= <>
##$BF1= 200.13
##$BF2= 200.13
##$BF3= 200.13
##$BF4= 200.13
##$BF5= 200.13
##$BF6= 200.13
##$BF7= 200.13
##$BF8= 200.13
##$BYTORDA= 1
##$CFDGTYP= 0
##$CFRGTYP= 5
##$CHEMSTR= <none>
##$CNST= (0..31)
1 1 145 1 1 1 1 1 1 1 1 1 1 1 1 1 1 1 1 1 1 1 1 1 1 1 1 1 1 1 1 1 
##$CPDPRG= <>
##$CPDPRG1= <>
##$CPDPRG2= <>
##$CPDPRG3= <>
##$CPDPRG4= <mlev>
##$CPDPRG5= <mlev>
##$CPDPRG6= <mlev>
##$CPDPRG7= <mlev>
##$CPDPRG8= <mlev>
##$CPDPRGB= <>
##$CPDPRGT= <>
##$D= (0..31)
0 1.2 0 0 0 0 0 0 0 0.06 0 0.03 0 0 0 0 0.0002 0 0 0 0 0 0 0 0 0 0 0 0 
0 0 0 
##$DATE= 1663924075
##$DBL= (0..7)
$$ [...]
##$SUBNAM3= <"">
##$SUBNAM4= <"">
##$SUBNAM5= <"">
##$SUBNAM6= <"">
##$SUBNAM7= <"">
##$SUBNAM8= <"">
##$SUBNAM9= <"">
##$SW= 18.0517283424941
##$SWIBOX= (0..15)
0 0 2 0 0 0 0 0 0 0 0 0 0 0 0 0 
##$SW_h= 3612.71676300578
##$TD= 16384
##$TD0= 1
##$TE= 0
##$TE2= 300
##$TE3= 300
##$TEG= 300
##$TL= (0..7)
0 120 120 120 120 120 120 120 
##$TP= (0..7)
150 150 150 150 150 150 150 150 
##$TP07= 0
##$TPNAME0= <>
##$TPNAME1= <>
##$TPNAME2= <>
##$TPNAME3= <>
##$TPNAME4= <>
##$TPNAME5= <>
##$TPNAME6= <>
##$TPNAME7= <>
##$TPOAL= (0..7)
0.5 0.5 0.5 0.5 0.5 0.5 0.5 0.5 
##$TPOFFS= (0..7)
0 0 0 0 0 0 0 0 
##$TUNHIN= 0
##$TUNHOUT= 0
##$TUNXOUT= 0
##$USERA1= <user>
##$USERA2= <user>
##$USERA3= <user>
##$USERA4= <user>
##$USERA5= <user>
##$V9= 5
##$VALIST= <valist>
##$VCLIST= <CCCCCCCCCCCCCCC>
##$VD= 0
##$VDLIST= <DDDDDDDDDDDDDDD>
##$VPLIST= <PPPPPPPPPPPPPPP>
##$VTLIST= <TTTTTTTTTTTTTTT>
##$WBST= 1024
##$WBSW= 4
##$XGAIN= (0..3)
0 0 0 0 
##$XL= 0
##$YL= 0
##$YMAX_a= 457282
##$YMIN_a= -331281
##$ZGOPTNS= <>
##$ZL1= 120
##$ZL2= 120
##$ZL3= 120
##$ZL4= 120
##$ABSF1= 15.74579
##$ABSF2= -2.30606
##$ABSG= 5
##$ABSL= 3
##$ALPHA= 0
##$AQORDER= 0
##$ASSFAC= 0
##$ASSFACI= 0
##$ASSFACX= 0
##$ASSWID= 0
##$AUNMP= <proc_1d>
##$AZFE= 0.1
##$AZFW= 0.1
##$BCFW= 0
##$BC_mod= 2
##$BYTORDP= 0
##$COROFFS= 0
##$CY= -3
##$DATMOD= 1
##$DC= 0
##$DFILT= <>
##$DTYPP= 0
##$F1P= 0
##$F2P= 0
##$FCOR= 1
##$FTSIZE= 16384
##$FT_mod= 6
##$GAMMA= 0
##$GB= 0
##$INTBC= 1
##$INTSCL= 3.70164e-10
##$ISEN= 128
##$LB= 0.24
##$LEV0= 0
##$LPBIN= 0
##$MAXI= 10000
##$MC2= 0
##$MEAN= 0
##$ME_mod= 0
##$MI= 1.114404
##$NCOEF= 0
##$NC_proc= -6
##$NLEV= 6
##$NOISF1= 3.799351
##$NOISF2= 2.8
##$NSP= 0
##$NTH_PI= 0
##$NZP= 0
##$OFFSET= 15.74579
##$PC= 1
##$PHC0= -18032.3
##$PHC1= 6.40069
##$PH_mod= 1
##$PKNL= yes
##$PPARMOD= 0
##$PSCAL= 0
##$PSIGN= 0
##$REVERSE= no
##$SF= 200.130005152729
##$SI= 16384
##$SIGF1= 3
##$SIGF2= 2
##$SINO= 5.538805
##$SIOLD= 16384
##$SREGLST= <1H.CDCl3>
##$SSB= 0
##$STSI= 16384
##$STSR= 0
##$SW_p= 3612.71676300578
##$SYMM= 0
##$S_DEV= 0
##$TDeff= 16384
##$TDoff= 0
##$TI= <>
##$TILT= no
##$TM1= 0
##$TM2= 0
##$TOPLEV= 0
##$USERP1= <user>
##$USERP2= <user>
##$USERP3= <user>
##$USERP4= <user>
##$USERP5= <user>
##$WDW= 1
##$XDIM= 16384
##$YMAX_p= 385242666
##$YMIN_p= -660996
$$ End of Bruker specific parameters
$$ ---------------------------------
##NTUPLES= NMR SPECTRUM
##VAR_NAME=  FREQUENCY,     SPECTRUM/REAL,   SPECTRUM/IMAG
##SYMBOL=    X,             R,               I
##VAR_TYPE=  INDEPENDENT,   DEPENDENT,       DEPENDENT
##VAR_FORM=  AFFN,          ASDF,            ASDF
##VAR_DIM=   16384,         16384,           16384
##UNITS=     HZ,            ARBITRARY UNITS, ARBITRARY UNITS
##FACTOR=    0.220516191357247, 1,           1
##FIRST=     3151.20493935103, 0,            0
##LAST=      -461.511823654754, 0,           0
##MIN=       -461.511823654754, -660996,     0
##MAX=       3151.20493935103, 385242666,    0
$$ Real data points
##PAGE= N=1
##DATA TABLE= (X++(R..R)), XYDATA
$$ [...]
7506h0226R772k5550k6937N4089q8296O766O7396P9594R4690J18251k0341n5155
7494A34053j03622p0228K8836j7359O6112j71607M8807j71412k7803P8160J39169
7483f6894q0052l8101o4358K26730q1339j36409M5403K3406O271j93236L8665
7472c19914J81038q790J55643l7014Q1054N6388j11121o5758q0278O365m0132
7461a82519L1375J98226Q7164j78482j38325J787N4364o6639M7101n324m2895
7450a94167K1113J58168k44192O9584K5707j063J75678q3234J08303L6001j16436
7439d4538k4411N2209j992p2239j38515N1059J39766o159q3594j01223J8952K24207
7427A3522Q0397j76795K1873j71926j0501J70932O3687j2779M4520r1974j47511
$$ plain form
7506 -80226 -70454 -96004 -122941 -68852 -157148 -150382 -82986 -3392 91298 209549 189208 134053
7494 134053 30431 -39797 -10961 -28320 37792 -133815 -85008 -256420 -284223 -206063 -66894
7483 -66894 -146946 -185047 -249405 -22675 -104014 -240423 -195020 -171614 -165343 -358579 -319914
7472 -319914 -138876 -147666 7977 -29037 52017 108405 -2716 -68474 -148752 -142387 -182519
7461 -182519 -151144 47082 134246 -44236 -182561 -180774 -126410 -193049 -145948 -151272 -194167
7450 -194167 -173054 -14886 -259078 -189494 -163787 -164850 10828 -72406 35897 71898 -44538
7439 -44538 -68949 -16740 -18732 -90971 -229486 -178427 -38661 -44820 -128414 -229637 -210685 13522
7427 13522 93919 -82876 -61003 -232929 -243430 -72498 -8811 -21590 22930 -69044 -216555
7416b16555n5115j23152K53434L7239m6483J0388L5889n6923j9781J82002J9315
7405B0258l9621J5797l183N0941j3881k46749P8159o7199J34254M1644k5016L9931
7393a4665k2624L0665l4579m9725j8748O4399P8410q2436j93377j1933R6402Q9138
7381f9073j3601n589m8474N1246J0776j46085P3703L5989M2403O5498j26611j11520
7369b41338J02058k379k37677N8077J35400P7313o3322Q4690M0204j37668O2414
7358a22228p1555j3812O0216k269O8435P428p4053K7527L7773m0971K3095J8824
7346h1590r017J44834R9971j41179l02742N3138M2983P7682O1173m8484M4541
7335e8690k8081J4008j85016M3032j6758K3829P9740j07626M5599j53638J58776
$$ plain form
7416 -216555 -271670 -394822 -141388 -104149 -150632 -140244 -104355 -161278 -181059 943 20258
7405 20258 -19363 -3566 -6749 44192 30311 -216438 -138279 -205478 -71224 -29580 -54596 -14665
7393 -14665 -37289 -6624 -41203 -90928 -109676 -45277 33133 -49303 -242680 -254613 -158211 -69073
7381 -69073 -82674 -88263 -136737 -85491 -74715 -220800 -147097 -111108 -68705 -3207 -129818 -241338
7369 -241338 -139280 -141659 -379336 -321259 -185859 -108546 -171868 -87178 -46974 -184642 -122228
7358 -122228 -193783 -207595 -147379 -149648 -81213 -73785 -147838 -120311 -82538 -123509 -100414 -81590
7346 -81590 -90607 54227 154198 13019 -289723 -236585 -193602 -115920 -54747 -103231 -58690
7335 -58690 -86771 -72763 -257779 -214747 -231505 -207676 -127936 -235562 -189963 -343601 -184825
7324a84825J27135o5673J58554p0938k886n1465P5188m3024M1196o6565J16986
7313C3683N3843j67561N1116J614j09413m6392Q566l1981J36646P5071K2137J2910
7301D0239k76295n812K19635K2072q6169j2797L2209Q3043q5393n7546R1766j36248
7289a71296M7245N3709M6805M3322o5310K1190l1511m8323O9622J37657j13864
7278a0754m312J8855o420j32885j20570L8963R8084r0819j1753L3730l1045j378
7266b20304J24847J7173O700o6809m1583k8983n3289R7553j14751Q2430J86419
7255a0597j60619n4391N0570J78363J8873k12395K9665j56136N7284M9068L9439
7244a70876N2246J70917n5521j29232l258l2437J6903j3393o466J02706L0542
$$ plain form
7324 -184825 -57690 -123363 35191 -35747 -38633 -90098 -14910 -57934 -16738 -83303 33683
7313 33683 87526 -80035 -28919 -27305 -136718 -183110 -174544 -206525 -69879 5192 27329 40239
7301 40239 -236056 -241868 -22233 -161 -86330 -99127 -66918 16125 -69268 -126814 -35048 -171296
7289 -171296 -124051 -70342 -23537 19785 -45525 -24335 -55846 -104169 -34547 103110 -10754
7278 -10754 -15066 3789 -2631 -135516 -256086 -217123 -119039 -209858 -221611 -187881 -218926 -220304
7266 -220304 -95457 -78284 -71584 -138393 -179976 -208959 -262248 -164695 -279446 -197016 -10597
7255 -10597 -171216 -225607 -175037 3326 22199 -190196 -160531 -316667 -259383 -210315 -170876
7244 -170876 -118630 52287 -3234 -132466 -135724 -168161 -151258 -164651 -171117 -68411 -37869
7233c7869p1349J01856J51971o6608j57060j8941R4597j52184K7585M0717j00169
7222a87454M5165O5312q0400j27293K7353P4283o6478J2169j60889J33209J93485
7211g1538l905q0839m1425Q4608J22981M4125l9605p6292p4690N9871k00281Q3785
7199a93205N6185r4351K1721n616K36436k6873M7774q9228l5727j2497L5907q1849
7187a41323Q6893J4414K3851l228q9896R0552q3496J0789M6208j6741J06709p6797
7175c2065k8054K3561L6634j01446j44771Q9656K3248J25189M082j04986Q4233
7164b4719Q3795q7201R506j14149Q330k15877K50853K65684j23739r7021o8911
7153a13449J31558J15595n6609k5565j4540j34501K4915l9004o4599L05895o5258
$$ plain form
7233 -37869 -109218 -7362 144609 78001 -79059 -98000 -3403 -155587 -128002 -87285 -187454
7222 -187454 -142289 -76977 -157377 -284670 -257317 -183034 -249512 -237343 -398232 -265023 -71538
7211 -71538 -75443 -156282 -197707 -113099 9882 54007 14402 -61890 -136580 -76709 -276990 -193205
7199 -193205 -137020 -231371 -209650 -215266 21170 -5703 42071 -47157 -82884 -95381 -59474 -141323
7187 -141323 -54430 -40016 -16165 -19393 -109289 -18737 -102233 -91444 -45236 -61977 44732 -32065
7175 -32065 -60119 -36558 76 -101370 -246141 -156485 -133237 -8048 -3966 -108952 -24719
7164 -24719 59076 -28125 -18619 -132768 -124438 -340315 -89462 176222 52483 -44538 -113449
7153 -113449 18109 133704 77095 51530 36990 -97511 -72596 -111600 -176199 129696 64438
7142F4438q8086k273j2226j18017R8897K0767n7953k9654K1777j8846m3374L9512
7130a25038K07191j63512p1605J32753p2640K930k6194j0968n6218K9511N4139
7119i9651j713J31742k2073n3457J74686j26668L8942o9646o1063j4776n1423
7108a55100Q5613r2408L5090P7239n3691l3702Q5976j04119J48812Q8631k69631
7097a87290J6404Q6517j2829k5681O8462m5003l067J07064r7064M5686j3263n1205
7085a11269K896J63608O210k54710Q3757J34404n1461k3486k7231m5543o2571
7074a85396J01547J60909L7545p3029l3040j7186L7482J6691k00300K6565J84148
7063E5936m8131k20817L6544j5122K23959J398O9672O384j9246j44358K6972P0874
$$ plain form
7142 64438 -23648 -25921 -38147 -156164 -57267 -36500 -94453 -124107 -102330 -121176 -164550 -125038
7130 -125038 82153 -81359 -152964 -20211 -92851 -89921 -116115 -127083 -183301 -153790 -99651
7119 -99651 -101364 30378 8305 -45152 129534 2866 41808 -27838 -88901 -103677 -155100
7108 -155100 -69487 -161895 -126805 -49566 -103257 -136959 -50983 -155102 -6290 82341 -187290
7097 -187290 -170886 -84369 -97198 -122879 -54417 -99420 -102487 4577 -92487 -46801 -60064 -111269
7085 -111269 -108373 55235 61445 -193265 -109508 24896 -26565 -50051 -77282 -122825 -185396
7074 -185396 -83849 77060 114605 41576 8536 -8650 28832 45523 -154777 -128212 55936
7063 55936 7805 -213012 -176468 -191590 32369 33767 103439 109823 90577 -53781 -26809 44065
7051D4065j87795l9855J61951Q6219j17546m745r1219k8863R0925M6866m7526
7040h7523K9806J789j04175O1626K101O801N661M6186P6862l5225q3206m4138
7028a23435j2788Q8276Q9240j74813k8838Q3073J9657K1416n895K0537m4635p3980
7016a42185J10382J35585j2987q6953j17199j51896J22737n6307J54952M6968
7006C097j37776j34069m4904J88171j25497N7799Q6894j44636J7389j7696R0060
6995a61168Q0502L8905M4074l7714K4970J09214j93694j27783m6522J96944l7016
6984a09288j23894J17854j22453O7925J03843J23633k46618l705K36081l6575
6974F803k04184R2741J04332K1341j37866m3391N2010J60059K1900j61695K9385
$$ plain form
7051 44065 -143730 -183585 -21634 64585 -52961 -57706 -148925 -177788 -86863 -39997 -87523
7040 -87523 -57717 -55928 -160103 -98477 -96376 -89575 -83914 -37728 39134 3909 -79297 -123435
7028 -123435 -136223 -47947 41293 -133520 -162358 -79285 -59628 -38212 -44107 -23570 -68205 -142185
7016 -142185 -31803 103782 90795 3842 -113357 -265253 -142516 -198823 -43871 3097
7006 3097 -134679 -268748 -313652 -125481 -250978 -193179 -106285 -250921 -233532 -251228 -161168
6995 -161168 -80666 -41761 2313 -35401 -10431 98783 -94911 -222694 -269216 -72272 -109288
6984 -109288 -233182 -115328 -237781 -169856 -66013 57620 -188998 -192703 43378 6803
6974 6803 -197381 -104640 -308 21033 -116833 -160224 -108214 51845 73745 -87950 -58565
6963e8565N7786k8331j51789P8605J59332N1596J5452M5250J144l3995j34835
6952A650j7214L2442M2675M0522k2216K9447J10208r3506k38090Q7377j21726
6941a48431R5233j8466n2743J7034n5413M0092P4511M4723p7547J27571K9374
6930G5938o8661j40895j64591j8318K80979J23668J712K0592j18295Q4216j61856
6919h5511J02883J58210k15926m9635O3119Q1181j27667O4272P0183r7130n7314
6908i3335P3165K1901o0862q7885L3669J77529j54337q0935K22997j7859l5131
6897a083k272o3843J26379J409P457j0995o9870n7546l2594J25119m5996n1773
6885g5608M5744m9046J7008J08974J1232j13127K9988j60578m7779J73840r592
$$ plain form
6963 -58565 -779 -29110 -180899 -102294 57038 108634 124086 169336 170480 136485 1650
6952 1650 -15564 16878 59553 100075 77859 107306 217514 124008 -114082 -26705 -148431
6941 -148431 -53198 -71664 -124407 -107373 -162786 -122694 -48183 -3460 -81007 46564 75938
6930 75938 7277 -133618 -298209 -316527 -35548 88120 89832 110424 -7871 76345 -85511
6919 -85511 17372 175582 -40344 -89979 -26860 54321 -73346 -9074 61109 -36021 -93335
6908 -93335 -20170 1731 -59131 -147016 -113347 64182 -90155 -171090 51907 34048 -1083
6897 -1083 -3355 -67198 59181 60590 68047 57052 -12818 -70364 -102958 22161 -23835 -75608
6885 -75608 -29864 -78910 -61902 47072 58304 -54823 -24835 -185413 -233192 -59352 -68944
6874f8944J84474j56163k8532N9986j0583L2045M6499r4455J67373O5531j88337
6863H894r1443q7311J26056o301P548o0776q6629O1667n8236J40184J3154j14657
6851a47850Q2189J00385j15660J7285M3110j0268p8888r9875J66351Q6294j38199
6840i5126j90423m813J78114J46584p0919j9989P9099q1273J17690j18502r5800
6829a55358O9764J69999M1135j31921N5651j37651m8727O1216J53584L3229k01284
6818i0363n9384O9644O3032R908l3709O1935K9916m1414n3149j23600j0033O9941
6806a07276J9253o2481j01822m0454J73502M2017J83229M0661o9578L2582l2953
6795G6680O7359o7716k4254J8523n9948m3756O806J8361J13557n9457K23107k78162
$$ plain form
6874 -68944 115530 -40633 -69165 -9179 -19762 12283 58782 -35673 131700 197231 8894
6863 8894 -82549 -169860 -43804 -50105 -42557 -103333 -189962 -128295 -186531 -46347 -33193 -147850
6851 -147850 -65661 34724 -80936 -63651 -20541 -30809 -109697 -209572 -43221 43073 -95126
6840 -95126 -285549 -290362 -112248 34336 -36583 -56572 22527 -58746 58944 -59558 -155358
6829 -155358 -85594 84405 125540 -6381 49270 -88381 -137108 -75892 77692 110921 -90363
6818 -90363 -149747 -80103 -17071 -7163 -40872 21063 50979 9565 -43584 -167184 -177217 -107276
6806 -107276 -88023 -150504 -252326 -292780 -119278 -77261 105968 146629 77051 109633 76680
6795 76680 144039 76323 52069 70592 10644 -33112 -26306 -7945 105612 46155 269262 -8900
6783h900r6520K8052J49519J34564J7858L9310j70288j10440N4794R6731K3771
6772A58451j1365k08195J3692J32085J23692p0682N0035N1191l29970N4385k3745
6761f0426r2175O7584J6097r1248k0089K14702L5193j03246J00537m8096L2833
6750E1666J21188q0575j11007q5902R4025J55305j02029n268p4584J5461P0465
6739D8745J04212j4708n492j18777r9279J15572j71615P5987J55986k4945m6051
6728A9635l640J10491K2161p6129J04150Q3652j62944n5266q4464o553J32944
6717H4037j62935l1343N4714Q5753L982Q4562J03803k2551j24462o8030k589M1464
6705D6405j0388q0063J24019k0057K8992K302l7719P6710j9530j60192q9089J16098
$$ plain form
6783 -8900 -105420 -77368 72151 206715 224573 263883 93595 -16845 37949 134680 158451
6772 158451 147086 -61109 -47417 84668 208360 137678 187713 238904 -91066 -36681 -60426
6761 -60426 -152601 -85017 -68920 -160168 -180257 34445 69638 -33608 66929 18833 51666
6750 51666 172854 92279 -18728 -104630 -10605 144700 42671 37403 -37181 -21720 48745
6739 48745 152957 138249 132757 13980 -85299 30273 -141342 -65355 90631 65686 19635
6728 19635 15995 126486 148647 72518 176668 260320 97376 42110 -42354 -48907 84037
6717 84037 -78898 -110241 -55527 30226 34208 118770 222573 200022 75560 7530 4941 46405
6705 46405 36017 -44046 79973 59916 88908 91210 53491 130201 110671 -49521 -138610 -22512
6693b2512J30818M8456O7949L8223j28290m7626j23473J68259q9477j7638J82284
6682B06973M8146k34680k11771K25628J19424J62366j34442j95476N4702L435
6672D4305J00579O7727M2837p6161O5478q1393J21082j10311l4814N1336n1908
6661A38757N6811M6175N1503l5070k08571N3005Q4041j24895J92338J97273l6644
6650D14723j19348n5693j30457K26912O6279p6650K575M2592J18423r3515j05912
6639B89929J17451J66182o9873M9258P3756J20048Q6988J42192j64293q0674K1825
6628G52789m9058J32627l0918j74253k04926m6081n1997p3968Q5214J00505j34176
6617C05758m4780J70123K8445l6265J17378R7394r5664q7991P7912J2428P7705
$$ plain form
6693 -22512 108306 156762 224711 262934 134644 87018 -36455 131804 42327 24689 206973
6682 206973 255119 20439 -191332 34296 153720 316086 181644 -13832 40870 44305
6672 44305 144884 212611 255448 179287 244765 163372 284454 174143 139329 190665 138757
6661 138757 195568 241743 293246 258176 49605 102610 186651 61756 254094 451367 414723
6650 414723 295375 239682 109225 336137 402416 325766 328341 370933 489356 395841 289929
6639 289929 407380 573562 503689 552947 626703 746751 833739 975931 811638 730964 752789
6628 752789 703731 836358 805440 631187 426261 380180 328183 254215 339429 439934 305758
6617 305758 260978 431101 459546 423281 540659 638053 542389 454398 532310 544738 622443
6606F22443l178q9051R1031M0728P069J29479p2229J30577J08552R8449j87049
6595H76821j01035L1704j48682P2144q3197k19596j24010L244N0592K8514K2664
6584D09163O1883l1259o4349j29501o6792j2085N1696J16456P9886J9687m2725
6573C92060j08074K5701Q4351r9635K27946J0020j9069j66622o0104M8585j71109
6562A64050j6876J71557j6079J38714K7381k3178j2504l159M1800m4700L7220
6551D64226p9783J11588j11678J3014r4257p8306J04785l5468N874P505J14987
6540D22487j880k5690J7470q4657L4292J5592M204P6193o1103J8413J64667j02313
6528D77675m42m1328p8568J22739N7879o1707q5899K3301j2112J20195Q6801m9889
$$ plain form
6606 622443 619265 530214 621245 661973 669042 798521 726292 856869 965421 1063870 876821
6595 876821 775786 807490 658808 730952 647755 428159 304149 307393 357985 386499 409163
6584 409163 471046 439787 375438 245937 179145 167060 218756 335212 415098 434785 392060
6573 392060 283986 309687 394038 294403 522349 532369 513300 346678 286574 335159 164050
6562 164050 147174 318731 302652 441366 468747 445569 433065 429906 471706 427006 464226
6551 464226 384443 496031 384353 397367 303110 224804 329589 294121 299995 307500 422487
6540 422487 420607 394917 412387 327730 362022 377614 381818 458011 396908 415321 579988 477675
6528 477675 477233 435905 357337 480076 537955 476248 390349 413650 401538 521733 608534 558645
6516E58645r3803P3274O026m8822j61459R4159J8605n6196j382Q6815J9345q8355
6504D06852J24914k2907M9915o3887k8174Q5362J40615M4942q2815n0886Q0784
6493F84715J40105m7808o4928j59175J58965J37077j57230j9404J34637J5018
6483H21972L5997k17631r5740K07322O289N4848p5117L4242j11287P4419P0262
6472H05576j79312M3362K04471k4431q7076J0872m1608J24930J12115N0394j3767
6461A005526m0809Q8412n0497K1744Q4205o180J13536l4953Q8861M8707K3585
6450A342137L8766p3890n292K08460k564j01796n9210R371j022Q5961J55284j68222
6438A427983j28763K5082J14426p3921P1902j11537J78395N5824j952K501J9385
$$ plain form
6516 558645 464842 538116 544142 495320 333861 428020 446625 390429 389047 475862 495207 406852
6504 406852 531766 508859 558774 494887 466713 552075 692690 737632 654817 603931 684715
6493 684715 824820 777012 712084 552909 711874 848951 691721 672317 806954 821972
6483 821972 857969 640338 544598 751920 758209 813057 737940 772182 660895 735314 805576
6472 805576 626264 669626 874097 849666 762590 773462 731854 856784 968899 1019293 1005526
6461 1005526 964717 1053129 1002632 1024376 1108581 1102401 1215937 1180984 1269845 1318552 1342137
6450 1342137 1380903 1307013 1301721 1510181 1507617 1405821 1346611 1355982 1354960 1440921 1596205 1427983
6438 1427983 1299220 1324302 1438728 1364807 1436709 1325172 1503567 1559391 1557439 1559940 1579325
6427A579325l5163N9855J9821L0180N985N0146j05737R4803J46506O5056J03014
6416B013791o2234j8864R4583J18592p2132L650j7947J6235J0380j5008P2243
6405B143289M0982J31978K44434j5814n8745o7544n5544J33218m4749l0069J3033
6394B434469J49870J04662j50948K05888K12825P7098J81070j38795j35561L4785
6384B975363J10800M0036J85161R0467J35768q4764J76689K21423m264J17778
6374C964457J1889J38644K77608L15056L119Q1419K34045J50674J02867n8457
6364E221321P5337K05839r1973L09738J71809K21146R5017J42144P8455J45848
6354F574681J35783K31465J11827K69774L19987Q7611L14739K87897K78173L50852
$$ plain form
6427 1579325 1544162 1604017 1623838 1654018 1660003 1710149 1604412 1699215 1845721 1910777 2013791
6416 2013791 1951557 1932693 2027276 2145868 2073736 2077386 2059439 2075674 2086054 2071046 2143289
6405 2143289 2184271 2316249 2560683 2544869 2486124 2418580 2363036 2496254 2451505 2421436 2434469
6394 2434469 2584339 2689001 2538053 2743941 2956766 3033864 3214934 3076139 2940578 2975363
6384 2975363 3086163 3126199 3311360 3401827 3537595 3452831 3629520 3850943 3846679 3964457
6374 3964457 3976346 4114990 4392598 4707654 4710773 4792192 5026237 5176911 5279778 5221321
6364 5221321 5296658 5502497 5410524 5720262 5892071 6113217 6208234 6350378 6428833 6574681
6354 6574681 6710464 6941929 7053756 7323530 7643517 7731128 8045867 8333764 8611937 8962789
6344H962789L25207K10747K38290M24960M01257L78263K92973M32147L52801M93288
6334A2512722N33944N19867L97499L74344M37352Q30380P31910M90421N22140
6325A7350579O87564P14289Q77980J055293R32938J051571J300414J262239J379338
6316B6612205J563743J646830J930923J879975K132743K623286L161898L372357
6308D4923960M002710M798661N622331O741773P608835Q732622J0751360J2216680
6300A05398932J3423024J2876956J0122619M962533k729334r712899j3781011
6293A20560820j3959425j2603158j0512119q380538o430564n015682l829229l069699
6285E6760406k406039j673652j184597o19845J6474M12677O08823J287815J649673
$$ plain form
6344 8962789 9287996 9498743 9737033 10161993 10563250 10941513 11234486 11666633 12019434 12512722
6334 12512722 13046666 13566533 13964032 14338376 14775728 15606108 16338018 16828439 17350579
6325 17350579 18038143 18752432 19630412 20685705 21618643 22670214 23970628 25232867 26612205
6316 26612205 28175948 29822778 31753701 33633676 35766419 38389705 41551603 44923960
6308 44923960 48926670 53725331 59347662 66089435 73698270 82430892 93182252 105398932
6300 105398932 118821956 131698912 141821531 146784064 144054730 134341831 120560820
6293 120560820 106601395 93998237 83486118 75105580 68675016 63659334 59830105 56760406
6285 56760406 54354367 52680715 51496118 50876273 50892747 51305424 51914247 53202062 54851735
6276E4851735K361456K936216L767219M714093N787488O868921Q525424J0103888
6268I9916440J1653266J2415659J1229011P661044J226569o289469j2774877j5430905
6260A09606738j4871614j3065636j0601296q765959o936019n688904m771882l972851
6252D0932577l612809l025023k628569k340762j906181j719789j451080j371076
6244B2877288j308825j091430j019550j047624p37660q98945q43037q64220o31294
6235A4434703o32786n71178o11935o34744j76384l67737m08914m06124l04967
6226A0319934l57926l32429o39553k85765j47591j96051m39467l7079j54072m29197
6216G300804k65966k78697j02260k03803k35847j80352j48889j69845j67033j86683
$$ plain form
6276 54851735 57213191 60149407 63916626 68630719 74418207 81287128 89812552 99916440
6268 99916440 111569706 123985365 135214376 142875420 144101989 137812520 125037643 109606738
6260 109606738 94735124 81669488 71068192 62302233 55366214 49677310 44905428 40932577
6252 40932577 37319768 34294745 31666176 29325414 27419233 25699444 24248364 22877288
6244 22877288 21568463 20477033 19457483 18409859 17672199 16773254 15930217 15065997 14434703
6235 14434703 13801917 13230739 12618804 11984060 11807676 11439939 11031025 10624901 10319934
6226 10319934 9962008 9629579 8990026 8704261 8556670 8360619 7921152 7884073 7730001 7300804
6216 7300804 7034838 6756141 6653881 6450078 6214231 6033879 5884990 5715145 5548112 5361429
6206E361429j09234l33055K8510l0106j60502j02401k74939M6962r3541k5236
6196D307887j79721k47673n5150l33016j02468j94424O551j53813J05988J09308
6186C263469j57860j76708K9698k84953j9744J66165j86303l6493n8948k97461
6176B240862r2416J20301O3983M8456p9112j22961k9259j94485J8574r5980j37934
6165A740029J9018K0815j93784q5320m16n7588M8323j20461M2365Q620n9469j596
6153A360536j70320R6613k8323j00496m7342j17920J77080O4073n5660k80400
6143H97841O8089M3434j9794j22743M9318j28271O5584N5290J26221j72453j17117
6132G45399l3986p7763n5471L6083P2772J11643l8436R208L9474j01503k7984
$$ plain form
6206 5361429 5252195 4919140 4947650 4917544 4757042 4654641 4379702 4426664 4333123 4307887
6196 4307887 4128166 3880493 3825343 3492327 3389859 3195435 3201986 3048173 3154161 3263469
6186 3263469 3105609 2928901 2958599 2673646 2653902 2820067 2633764 2597271 2538323 2240862
6176 2240862 2148446 2268747 2332730 2381186 2302074 2179113 2149854 1955369 1973943 1877963 1740029
6165 1740029 1759047 1779862 1586078 1500758 1500342 1442754 1491077 1370616 1412981 1421601 1362132 1360536
6153 1360536 1190216 1286829 1258506 1158010 1110668 992748 1169828 1233901 1178241 897841
6143 897841 965930 1009364 989570 866827 916145 787874 853458 908748 1034969 862516 745399
6132 745399 711413 633650 578179 614262 687034 798677 760241 769449 808923 707420 679436
6121F79436J0650j50151o5367k8706O5319N0429j45645n5508O2484k7975M8005
6110D42971K7389q7478L7560J37192N9921o5983p4847K27690P8295j32171J9535
6099F70074j37724m5888M5378M0598r7615J0466K1971j03275j9099N3849l4431
6088D04304m1708n9581l5819j33848P4578J85421L8785M0253j51180R092r1559
6077B38738K3962k619K20005K3543q2979N6795j35128p0348J22358q515q7889
6066B97923J17435O1280J7859m5680p5748J7672J52232L1871j44689M8469P4519
6055E53143j56247k6343n6356J38r0982P898k7918p9571J80052J5223j12994q5213
6043A20830o9418J30008O1165m7468J19161J6423p415j5722k41025O4908J19608
$$ plain form
6121 679436 690086 539935 474568 445862 511181 561610 415965 360457 422941 394966 442971
6110 442971 470360 382882 420442 557634 617555 551572 476725 704415 782710 650539 670074
6099 670074 532350 486462 531840 572438 474823 485289 507260 403985 384886 438735 404304
6088 404304 362596 303015 267196 133348 207926 393347 432132 472385 321205 330297 238738
6077 238738 262700 260081 480086 503629 420650 477445 342317 271969 394327 385812 297923
6066 297923 415358 476638 494497 448817 373069 390741 542973 574844 430155 478624 553143
6055 553143 396896 370553 314197 314335 223353 231251 203333 123762 303814 319037 206043 120830
6043 120830 51412 181420 242585 195117 314278 330701 323286 307564 66539 131447 251055
6032B51055r1418m186J73393j71746q6181J00672j17651j15124K42080K8715j14261
6021I5348J25941O4552k07099J18447j26557m7122R4323P5820K6128n900J30554
6010C44435j68219k01500J17253M3572J95283L74l7739n5443O1523m1231n1497
5999B06811j37081J45637q0899j41143N8985J11678K3879O9817J12270j03011
5989B66943o7340m753L5000J27954J4749p0694R364k8404j79436m4667N4758j18473
5977d999J19800N4424P6524K6369J52711O2221k8291j15382n4683p0016j12700
5966A05978O4565K85984R6646L3156k8377J06246J33034J44357j9807j14229J44665
5955I52218k05473j94573J0734k5701j66397r4345L1831j2168r944j61582J64119
$$ plain form
6032 251055 159637 155451 328844 157098 70917 171589 53938 -61186 180894 209609 95348
6021 95348 221289 285841 78742 197189 70632 23510 117833 193653 219781 213881 344435
6010 344435 176216 -25284 91969 135541 330824 331198 293459 238016 299539 258308 206811
5999 206811 69730 215367 134468 -6675 52310 163988 187867 257684 369954 266943
5989 266943 199603 194850 229850 357804 372553 301859 311223 282819 103383 58716 113474 -4999
5977 -4999 114801 169225 245749 272118 424829 487050 458759 343377 288694 218678 105978
5966 105978 170543 456527 553173 586329 557952 664198 797232 941589 921782 807553 952218
5955 952218 746745 552172 562906 537205 370808 276463 308294 296126 286182 124600 288719
5944B88719j3532J30814J18796j8339j26980L539r9915k1101P9388M1301N4859
5933D37549J3873O1792L1187N0374J888k7251J40207J0832K7371j09283Q5180
5922G23719r4608k51803q2984q8950J22529J29211k33089m0656J411J47204j83828
5911A48156o186O5714q7888m9011J23334K3430K5871m7981j46221J38289k5171
5900A62336p9457j21996r8J41023J57923q1954K8570n3789l2044R3866l2230j33141
5888D9009m3472L9981J56807n9895P5386K7299K1093n7280j864r1417J63685J05406
5876C84738n7040j43070o2242J17334n513J9735J5857n4715j69149M2633Q0198
5865A68766p2346j8507N4353j85041p7667N2571N2027j1789J00579Q6233o7707
$$ plain form
5944 288719 275187 406001 524797 506458 379478 383017 283102 262001 341389 382690 437549
5933 437549 451422 513214 544401 594775 596663 569412 709619 720451 747822 638539 723719
5922 723719 629111 377308 294324 205374 327903 457114 224025 183369 184780 331984 148156
5911 148156 141970 207684 119796 70785 194119 217549 243420 195439 49218 187507 162336
5900 162336 82879 -39117 -39215 101808 259731 177777 206347 152558 120514 214380 182150 49009
5888 49009 5537 45518 202325 142430 217816 245115 266208 208928 207064 115647 279332 384738
5876 384738 327698 184628 122386 239720 234207 253942 269799 215084 45935 88568 168766
5865 168766 96420 77913 132266 -52775 -130442 -77871 -25844 -37633 62946 149179 81472
5854H1472Q2969O2716j00469j40968m0326K0073l0507J42477J586k20911K3316
5843a18572J60508O733Q3962j96239j38344J23667O4892p6383J8873O9874o9766
5832g0795O8280j56092J53040O4645J26004p7832j7752o3586K1754p4396L1297
5821D567k365p2070k0291M8875o9551k0332O3815J38289j11199n0116Q8944J0936
5809I502j10154o5909Q5891j3882R7110r6548P2662J14656j54161o8562O2842
5798f6553K30148m3104r4974J0726K4722j8711L1712m7944j43811J89096j42803
5787g1496p6809K3717O9401K06709j8850l6541n5226j18148J44573J4364l4142
5776D7552j32153p8411n9344J25969J58854K33056j36288m7200J06836q7690M8611
$$ plain form
5854 81472 164441 227157 126688 -14280 -54606 -34533 -65040 77437 79023 -141888 -118572
5843 -118572 41936 48669 132631 -63608 -201952 -78285 -13393 -89776 -70903 -1029 -70795
5832 -70795 -2515 -158607 -5567 59078 185082 107250 89498 25912 47666 -26730 4567
5821 4567 2202 -69868 -90159 -41284 -110835 -131167 -67352 70937 -40262 -90378 -1434 9502
5809 9502 -100652 -166561 -80670 -94552 2558 -93990 -21328 93328 -60833 -129395 -66553
5798 -66553 163595 120491 25517 36243 60965 42254 73966 26022 -117789 71307 -71496
5787 -71496 -148305 -124588 -55187 151522 132672 96131 40905 -77243 67330 81694 47552
5776 47552 -84601 -163012 -222356 -96387 62467 295523 159235 112035 218871 131181 179792
5765A79792j49680K6468n8871j01321J60609j9285l1652j34895J86110O605k60948
5754a97068O8946J36609k8682J5172p0159j62293R2541P3250l8357M075J8484
5743h7482J26932r4296K75q4932o0400Q6123J0536J79297j20057j18946K25460
5732F2510j31132m359J25044k10584J55125M5027j65712J55494N5511K9638j6803
5721I9759o0532q3519j0424P1911J23513J4403P1527j04186j18248R4983q4289
5710A4898m6800O8398M1955J16067J4549j56769p543m9065J34205j64587j0101
5699d4793l1102J67824j3550l8944o11j48164j1807N8778J10115R7843K1030m1299
5687A25320J47174j76348l1964L338r9501K606j5749k4104L9486J7751L832R8973
$$ plain form
5765 179792 30112 56580 -2291 -103612 56997 37712 6060 -128835 57275 63880 -197068
5754 -197068 -128122 8487 -20195 -5023 -75182 -237475 -144934 -71684 -110041 -105966 -87482
5743 -87482 39450 -54846 -54571 -139503 -199903 -113780 -103244 76053 -44004 -162950 62510
5732 62510 -68622 -72981 52063 -158521 -3396 41631 -124081 31413 86924 116562 99759
5721 99759 39227 -44292 -54716 17195 140708 155111 226638 122452 4204 99187 14898
5710 14898 -31902 36496 78451 194518 209067 52298 44755 -4310 129895 -34692 -44793
5699 -44793 -75895 91929 78379 39435 38824 -109340 -121147 -62369 47746 145589 166619 125320
5687 125320 272494 96146 64182 67520 -31981 -29375 -45124 -69228 -29742 -11991 -8159 90814
5675I0814p5690p867O8069k2571l4781k9709J1638J65196j52822p1638K6803j93350
5663b25908J38700J46905N7205j54781M5823M2607N7320p2808j05690J16862P465
5652E3700j28209j53368Q5534K4030m8415N0967N5172r682j04533j1906J98573
5641A1863k5766N5650r6101N0553M8727j20936J25083J5038J7414m6088k0320
5630A5117J5121Q9226k03399o3280Q2031M1598l4469N0414m5186l6402J33521
5619D4292P4072n0793O447r2701j0212L7471M7193J52257R493k257j29380J15267
5607B01149q9343O0703J08196p7065j82339M3467q108L9758K4962J0614l1670
5596A00324j61239p9114K1405K23748O8210n5342k5362n4488J34656K6045L1144
$$ plain form
5675 90814 15124 7257 75326 52755 17974 -11735 -97 165099 12277 -59361 -32558 -225908
5663 -225908 -87208 59697 116902 -37879 7944 50551 107871 35063 -70627 46235 53700
5652 53700 -74509 -227877 -142343 -118313 -166728 -115761 -60589 -70271 -174804 -186710 11863
5641 11863 -13903 41747 -54354 -3801 44926 -76010 49073 64111 81525 35437 15117
5630 15117 30238 119464 -83935 -147215 -65184 -23586 -58055 -7641 -52827 -89229 44292
5619 44292 118364 67571 74018 -18683 -28895 8576 55769 208026 217519 215262 85882 201149
5607 201149 111806 172509 280705 203640 21301 64768 56660 96418 121380 131994 100324
5596 100324 -60915 -140029 -118624 105124 173334 117992 92630 38142 172798 198843 229987
5585B29987j17530j56335J44436L505q6925j5555J02947K20971o6658O8203j14121
5574B12925r04L3817K8175J8192j68721P388O3677n4325Q2127K18546p0747j17136
5562B53014j6923o483M2690J28329j07619Q8556L8003p8510O561K2313o4187Q1669
5550C87413j49872J68509R1219j6494J4068m4746j12811Q372n6662Q8700P6208
5539D53904J03217J95405j28207n4914J12612N4128j01731Q4934J47451J60942
5529A027741J6122J9624k8590j0844K38577m4288R8635K33019J57970J71164L4683
5518A913813K4867L389j37317j3980K14267k3532q2501p3326j9632K565N7326
5507A865939N5820M7788j9244J43996J04539J31685K3049J13089J30195m6149
$$ plain form
5585 229987 112457 -43878 100558 104063 17138 1583 104530 325501 258843 327046 212925
5574 212925 212021 245838 274013 292205 123484 130872 194549 140224 222351 440897 370150 253014
5562 253014 236091 229608 272298 400627 293008 381564 419567 341057 347618 369931 305744 387413
5550 387413 237541 406050 497269 480775 494843 450097 337286 345658 288996 377696 453904
5539 453904 557121 752526 624319 569405 682017 736145 634414 719348 866799 1027741
5529 1027741 1043863 1063487 1034897 1024053 1262630 1218342 1316977 1549996 1707966 1879130 1913813
5518 1913813 1938680 1942069 1804752 1790772 2005039 1981507 1899006 1825680 1806048 1808613 1865939
5507 1865939 1921759 1969547 1950303 2094299 2198838 2330523 2353572 2466661 2596856 2550707
5497B550707K9856J82390J50113l1397L11483L04576J61449P0186J74009P3511
5487C976883j82682k81342k16330l84015j86701j48466k28265M8403j46513k3389
5477B227583j05732J26283P8356k26789q5233j83182j761Q4202m6553j49013j01098
5466A617063K5844K1623Q2249R3227O5090q9756J30789j5205k27464k81005j66668
5455A255787P9836r3797j18573j15864R1494k2631j90181j18184q5541J08481
5445G90827j75601P1498J39245j41463j66600K3421J22026j63137j22204K2718
5435D00730m4427M6256j6813J124N8098K2009K87j05508l1813q6333J6538P1605
5423C31753P376L1712q3006q4055O9653k3866m6059l6072J90175P7618j02963
$$ plain form
5497 2550707 2580563 2762953 2913066 2881669 3193152 3497728 3659177 3729363 3903372 3976883
5487 3976883 3794201 3512859 3296529 2912514 2725813 2577347 2349082 2397485 2250972 2227583
5477 2227583 2121851 2248134 2326490 2099701 2014468 1831286 1829525 1913727 1867174 1718161 1617063
5466 1617063 1642907 1664530 1746779 1840006 1905096 1815340 1946129 1930924 1703460 1422455 1255787
5455 1255787 1335623 1241826 1123253 1007389 1098883 1076252 886071 767887 682346 790827
5445 790827 615226 686724 825969 684506 517906 541327 663353 500216 378012 400730
5435 400730 356303 402559 385746 386870 444968 466977 467264 361756 329943 243610 260148 331753
5423 331753 339129 370841 287835 203780 273433 249567 203508 167436 357611 435229 332266
5412C32266m2763q541n9652r9021k6460O4912m9774J5590R1525L8282n3368m2194
5400A60802r7451K9841R1557k2792l7328Q230K6450J09426r2897l9468l2209k9767
5388G4394J93792o2251l4876J112m0289k1096M9192o5471j58720M320J17361P3212
5376A30680N5145o1037k9476P3807o0691J021N9205P5304o0783m5656j034n0996
5364H5489M4334o1404J31353q625n2476m9426m8040k5812R5504K28168k5639j05689
5352B07737P0636J176j37223p5810P6271k8028J3199P4236j6758j90967o7003
5341g2534K20048J61703N835j24427l3285Q3119q6139j7640k8568j20430L0978
5330A8660L5185M2464k7142L1074j42703J78857N8590j36739n362P5636J6967
$$ plain form
5412 332266 289503 280962 221310 122289 95829 160741 110967 126557 218082 256364 202996 160802
5400 160802 63351 93192 184749 161957 124629 132859 159309 268735 175838 136370 104161 74394
5388 74394 268186 205935 171059 172171 131882 110786 159978 94507 -64213 -59893 57468 130680
5376 130680 185825 124788 95312 169119 108428 109449 168654 243958 183175 137519 136485 85489
5364 85489 129823 68419 199772 191147 138671 89245 41205 15393 110897 339065 313426 207737
5352 207737 278373 279549 142326 66516 142787 114759 127958 202194 185436 -5531 -72534
5341 -72534 147514 309217 315052 190625 157340 240459 154320 136680 108112 -12318 18660
5330 18660 53845 96309 69167 100241 -42462 136395 194985 58246 52884 128520 145487
5319A45487m7329N969K599j552j87367O7082M8905K46271J44673m2691k27265
5308A54782K038k4297N1733l9030j77125K9850P042K0673N241j02688L9627J55841
5296A23687j68978j9249R827R0502J61381j4827m4308J13998j73501O0714Q580
5285A47826j43852q8743q8029J20553L31697m3443m6773m8430m9378r5613l4800
5274c8985M3899Q5306J5878n822O5016k6232Q6814N4646j43383k79k03531o34
5262f7307O6374n1366J80016l918K8499l8025m5626o5486Q0388L8699J5169m7774
5250H9643J5275N4610J97851L5599k80119r1802J05050k7848n4933L9659J29352
5239B12337j07333J08277p7993n9700q0648J6280m7085O1681L7974L9741Q5451
$$ plain form
5319 145487 98158 104127 106726 105174 -82193 -15111 33794 280065 424738 382047 154782
5308 154782 156820 132523 184256 145226 -31899 -2049 4993 25666 30907 -71781 -32154 123687
5296 123687 -45291 -64540 -54713 35789 197170 182343 138035 252033 78532 139246 147826
5285 147826 3974 -84769 -172798 -52245 279452 236009 189236 140806 91428 -4185 -38985
5274 -38985 4914 90220 106098 100276 165292 139060 225874 280520 137137 136858 -66673 -67307
5262 -67307 -933 -52299 127717 123799 152298 114273 68647 3161 83549 122248 137417 89643
5250 89643 104918 159528 357379 392978 112859 21057 126107 98259 43326 82985 212337
5239 212337 105004 213281 135288 75588 -5060 11220 -35865 25816 63790 103531 188982
5228A88982j48915N2911J8862j58860J5524O7800l6191J14396J070m3185l3171
5217C9223J09553k9170R888J16777K9922k862k14632j3341K46565j00771j64199
5206B6953Q6739R9010j13800m6736m7141M2652M2790J34387n2058j21036n35J05917
5194A57142J0705r9760r842N683K9879j55090K0294m0634J3852L8827J92771J20365
5182B84192j20004r1600m0169N9354q6796L7075L9167J36368j41830q5219P917
5171a545J06926M6203M7068n5977k6142R3083R3355k14671o8272J46857p0803
5160I6082K6465J12156k7574j63761j2415j30176j06084K68816L3393j0993k508
5149H3401j30668N6814j8167O4762j8745J12006j9503k02853J3728R5356j6300
$$ plain form
5228 188982 40067 92978 111840 -47020 -31496 36304 113 114509 115579 72394 39223
5217 39223 148776 119606 129494 246271 276193 273331 58699 45358 291923 191152 26953
5206 26953 113692 212702 98902 52166 5025 47677 90467 224854 172796 51760 51225 157142
5194 157142 167847 68087 58245 63928 93807 -61283 -40989 -81623 -67771 -28944 163827 284192
5182 284192 164188 72588 32419 91773 4977 42052 81219 217587 75757 -9462 -1545
5171 -1545 105381 151584 198652 142675 116533 209616 302971 88300 20028 166885 96082
5160 96082 122547 234703 207129 43368 30953 -99223 -205307 63509 96902 85909 83401
5149 83401 -47267 9547 -8620 56142 37397 149403 129900 -72953 -59225 36131 19831
5138A9831M4541K977N9148R3624L2780n4966o3790j38563l0038Q2833M2747n8884
5126C2240K19969p3239K5750L9176m3154j703K5952l7659j82623o2552K2639J1437
5114b3767P541J00871J9956j52825J42989L7902j46203K2867m3685q444J5723
5103b7075K82P4876K27296j83424J3125K0334k8507n1884J68P6898j03282n9660
5091d0853P6308P5772r2104j78642R3972k469J69371J40407j09642l1326K2406
5080A23200j10601J4225O2046j39412L5387j193J27610m395K2067Q1165j03313
5069A06786L8754j04622o2808O1661j5114P3745O3062l0993r6801J09742j9523
5058A23889L5152k747q2801P3705j69666O2094J6148p6279J14606M2873J5813
$$ plain form
5138 19831 64372 67349 126497 220121 252901 197935 134145 -4418 -34456 48377 91124 32240
5126 32240 252209 178970 204720 243896 200742 199039 224991 187332 4709 -57843 -35204 -23767
5114 -23767 -16226 84645 104601 -48224 94765 132667 -13536 9331 -34354 -42798 -27075
5103 -27075 -26793 48083 275379 91955 105080 125414 96907 45023 45191 122089 18807 -40853
5091 -40853 35455 111227 19123 -159519 -65547 -68016 101355 241762 132120 100794 123200
5080 123200 12599 26824 88870 -50542 -15155 -16348 111262 106867 128934 210099 106786
5069 106786 145540 40918 -21890 39771 24657 98402 161464 130471 33670 143412 123889
5058 123889 159041 156294 73493 147198 -22468 39626 55774 -20505 94101 136974 152787
5047A52787l6188j41138k7509K9487J10241L9481N3518P4542j42022j14730R4503
5036I2972R5588j51951R5840J84826l4895j49088q423M2370K6348P251p1603n2110
5024G7125l0579j9892p2994J0025J02615j59193M2793J41496L2447J01933P991
5013B33767j05229p5101J5207K8710Q1818j43587O1470K8242j75275j147P1923
5002B0798J37713l4892m6438N2533n061r0969l2953P8930Q3554J38546m4846p5182
4990A81733r0206q2124L539L8498K0030j08819Q4431l8794j87693J17259K29536
4979A67390J2626o4355l553j88367L8667N4878P4985r8827O5332n4280K7436N8211
4967I0143L7882J53636p4211N0984j05586Q6831j16891P8993O6840n7287n4352
$$ plain form
5047 152787 116599 -24539 -52048 -22561 87680 127161 180679 255221 113199 -1531 92972
5036 92972 188560 36609 132449 317275 282380 133292 124869 167239 193587 200838 129235 77125
5024 77125 46546 26654 -46340 -36315 66300 -92893 -50100 91396 123843 225776 233767
5013 233767 128538 53437 68644 97354 179172 35585 97055 125297 -49978 -51125 20798
5002 20798 158511 123619 77181 129714 124653 33684 731 79661 163215 301761 256915 181733
4990 181733 91527 9403 12942 51440 71470 -37349 47082 8288 -179405 -62146 167390
4979 167390 180016 115661 112108 -76259 -37592 17286 92271 -6556 58776 4496 31932 90143
4967 90143 128025 281661 207450 258434 152848 239679 122788 201781 268621 211334 156982
4956A56982M7486k7650j06344N2810K4738j41377j46385j6140J69052k798J7319
4945B7693O2783O5315J6787N8590k5531o867M4341j58599l9163M6216O1735k2198
4933A31102m1465m3760R804M0736o1932j03112J7899J7135l365J3785J15544P5138
4921A67509N1340j2912j35920l2907R8073K6091P4696j99177K3478R6811l0100
4910A26982p2907J7892M2309j32761q3065J1971J18492J25164O2915m4440j79436
4899f884M0010k3602J38540N9441l8202L7781o8620j32781l8462M05O6560J11818
4887A46004p5747N100o7705J39660o499J06128K110j65466m0447Q6207M3468P508
4875A80321Q8136J4015j23996j35055J40911j2660p9468K0416K6917m5915l244
$$ plain form
4956 156982 204468 176818 70474 123284 148022 6645 -139740 -155880 13172 10374 27693
4945 27693 90476 155791 172578 231168 205637 198770 243111 84512 45349 91565 153300 131102
4933 131102 89637 45877 55681 96417 34485 -68627 -50728 -33593 -36958 -23173 92371 167509
4921 167509 218849 205937 70017 37110 135183 161274 235970 36793 60271 157082 126982
4910 126982 54075 71967 114276 -18485 -101550 -89579 28913 154077 216992 172552 -6884
4899 -6884 33126 9524 148064 207505 169303 207084 138464 5683 -32779 -32374 34186 146004
4887 146004 70257 75357 7652 147312 140813 246941 249051 83585 43138 129345 172813 180321
4875 180321 268457 282472 158476 23421 164332 151672 72204 92620 119537 73622 70378
4864G0378J42729l7547j37363r2108K29936M237L557R4578j18986l5227q8033
4853C6151K9116P8806j8489j1753m7821o5234K2247o3619J13864J20747M6046
4842B40061M9585j3477m0080k13673J04393L8400q7083J91333j78623p0504k4692
4831d360J90872J23954j04215l5581k0763l6267M759L5055K5298P578j59695P9113
4819A05748J33104M2459r3652k5669K0380L0986J1589j09306m7971J22081J20678
4808C10427L3234j4188j42639j12524L2282m894J11815J9065r337M2185p1345
4797A94081k2721L478O54J51418o9747m7242l8990Q4787L1503j59861J84842J8750
4785C30952k22291j1996J54947q9812K3134j18537l3161R2668n2444M0880q2944
$$ plain form
4864 70378 213107 175560 38197 -53911 176025 180262 183819 278397 159411 124184 36151
4853 36151 65267 144073 125584 113831 66010 776 23023 -40596 73268 194015 240061
4842 240061 289646 276169 236089 22416 126809 165209 78126 269459 90836 20332 -4360
4831 -4360 186512 310466 206251 170670 149907 113640 118399 153454 178752 186330 26635 105748
4819 105748 238852 281311 187659 161990 182370 213356 224945 115639 67668 189749 310427
4808 310427 343661 329473 186834 74310 106592 101698 213513 232578 223241 265426 194081
4797 194081 171360 174838 175492 326910 257163 209921 170931 255718 287221 127360 312202 330952
4785 330952 108661 96665 251612 161800 184934 66397 33236 125904 73460 114340 31396
4774C1396J81392q9533O9733O0341J40162J05979j68993O8770P844o1588J31728
4763D77231k5031M6361l2935j93208N5808j3395j1190n4326j8774J10694p998
4752C33237j76674p7036O2056M3565J1710Q2179k9719M7960j11621j394J13152
4741B97415K6783k3748J02073j85j10630r0998N7163P8377p1067j39656J31691
4730B57218Q1358M4268K5282j489N8976j80656J1941m1723P530J41457p6239j01869
4718B26054P1884l7004P9979l8504j06620J30393L8974N3975K1453P562k00498
4707B47648p2581N6437r8464J21460K0771m1207j09265J443N5252P9859p7625
4696A83728j79510J58880J28977J6864M2811j22464l1276J57369j57417r2084
$$ plain form
4774 31396 212788 123255 192988 253329 393491 499470 330477 399247 407091 345503 477231
4763 477231 452200 498561 465626 272418 328226 314831 303641 249315 230541 341235 333237
4752 333237 156563 79527 141583 185148 196858 279037 249318 297278 185657 184263 297415
4741 297415 324198 300450 402523 402338 291708 200710 257873 336250 265183 125527 257218
4730 257218 338576 382844 408126 406637 465613 284957 296898 255175 262705 404162 327923 226054
4718 226054 297938 260934 340913 302409 195789 326182 365156 419131 440584 448146 247648
4707 247648 175067 231504 133040 254500 275271 234064 124799 126242 181494 261353 183728
4696 183728 4218 163098 292075 308939 351750 229286 198010 355379 197962 105878
4686A05878J32298P7865j05389J44289p3185q133P1585Q2983J30669p8681q7471
4675C92708j1899j48074M4709J54235K16310j91423j66685J01696R3723L55959
4665H41259L8173k58877j6309P2011j89926j38727O8697q862L0988J15732P1866
4654F26025p4520n0613J6056N2359J6743j46788o4991P7298K05407p5127P4246
4643F56095m3254K9314M4171j31743J40085k8897k6072j3101j01461K323m7848
4632D79612K47240n823o1660R3282m1252j10233K8736J9096J10979l7204J56641
4621H79414j48236m3847L0166k2740K9609j439M7013Q9601J27970N8079o688k0842
4609A018060j74855O9737R3900J40783K36598j82764p4822N3706J44710n6276
$$ plain form
4686 105878 238176 316041 210652 354941 281756 273623 345208 428191 558860 480179 392708
4675 392708 380809 232735 277444 431679 647989 456566 289881 391577 485300 841259
4665 841259 879432 620555 604246 676257 486331 347604 416301 407439 438427 554159 626025
4654 626025 551505 500892 516948 569307 586050 439262 374271 451569 656976 581849 656095
4643 656095 612841 642155 686326 554583 694668 665771 639699 626598 525137 527460 479612
4632 479612 726852 721029 659369 752651 711399 601166 629902 648998 759977 722773 879414
4621 879414 731178 687331 717497 694757 724366 722927 769940 859541 987511 1045590 1038902 1018060
4609 1018060 843205 912942 1006842 1147625 1384223 1201459 1126637 1180343 1325053 1268777
4599A268777k0503M6211M7565M9345K50641Q8526J40639J58093J66115L16715
4589B512124L08782L1450K462m2017J9519M501j50813j65097k27685k74905k38678
4578A779643L705p6040j80534n690K0145R2125j93727j54731o6538j23754K7095
4567A121699K2295J13041l2173k3759O9723M7684R2438J3164l3283m5978k9156
4556A315695L2241j28395J10118L4868J458j5845r611N0757P6458j07929j52385
4545A207430j9901l9636M7680R4525m7649J0905o12O6140J61409j33594r0673
4534A256024M3542J31798j78430j6713O6158j1022K7282p1796J70544L6865k4927
4523A429325J69134K29133j84827j07768K52610R401N3208j06995l0241O4316
$$ plain form
4599 1268777 1248274 1294485 1342050 1391395 1642036 1730562 1871201 2029294 2195409 2512124
4589 2512124 2820906 2852356 2854818 2812801 2832320 2836821 2686008 2520911 2293226 2018321 1779643
4578 1779643 1783348 1707308 1526774 1521084 1541229 1633354 1439627 1284896 1218358 1094604 1121699
4567 1121699 1143994 1257035 1224862 1201103 1270826 1318510 1410948 1424112 1390829 1344851 1315695
4556 1315695 1347936 1219541 1329659 1364527 1365985 1350140 1340529 1391286 1467744 1359815 1207430
4545 1207430 1187529 1147893 1195573 1290098 1242449 1253354 1252742 1318882 1480291 1346697 1256024
4534 1256024 1299566 1431364 1252934 1236221 1302379 1291357 1318639 1246843 1417387 1454252 1429325
4523 1429325 1598459 1827592 1642765 1534997 1787607 1797008 1850216 1743221 1712980 1777296
4513A777296m8242Q8022L4884J76835l6978j05719J03471j13154K9163k9168K2263
4502A898673J4412j48409K03707J52898J9761l0898l9583Q684m8588K16661K0351
4491B267669K13315P2734j06697p1332J96071p0524P391N4606N8621K0346M9585
4480B691785J2005R8330n5093p4781j1507O3748K40446k6768p754R3207K35345
4469C258963R3919j62066J1759K9562O4338J96714k05835K2536O2944J9959K28369
4458C621162J48941n5780J95895O8908K2907K89661O2494n9726Q5885J02238M61
4447D483046J50685J3916k265L5297n004Q4504J30297J06381j95569N1232J9545
4436D872065O0048J30724J86543P3063p5377L7362J52835J14760j763j68529J62877
$$ plain form
4513 1777296 1729054 1817076 1851960 2028795 1991817 1886098 1989569 1876415 1905578 1876410 1898673
4502 1898673 1913085 1764676 1968383 2121281 2141042 2110144 2070561 2079245 2030657 2247318 2267669
4491 2267669 2480984 2553718 2447021 2375689 2571760 2501236 2508627 2563233 2621854 2642200 2691785
4480 2691785 2703790 2802120 2747027 2672246 2660739 2724487 2964933 2938165 2930411 3023618 3258963
4469 3258963 3352882 3190816 3202575 3232137 3296475 3493189 3287354 3309890 3372834 3392793 3621162
4458 3621162 3770103 3714323 3910218 3979126 4002033 4291694 4354188 4294462 4380347 4482585 4483046
4447 4483046 4633731 4647647 4645382 4680679 4675675 4760179 4890476 4996857 4801288 4852520 4872065
4436 4872065 4932113 5062837 5249380 5322443 5247066 5284428 5437263 5552023 5550260 5381731 5544608
4425E544608J35508Q1247M3926o0992J36234P6714m7779Q0656J00538J88911K23552
4414F503123Q5696K974M11632R1403M6369O5798J60569J64879K40445q3514Q9175
4403G778549J20211N1360J85690K17382R1811J77333J58935q0315j13761K58844
4393H846039L44264N8136N726J26490J75232L34273Q7890L3588K28244J87936
4383A0427818J26365Q4519K59627J16194K22992K56879N18013J09011J81532K65736
4373A2568686L24078K17492L36009K14836K04339K84272K75002K10187K26461
4364A4861362M18294K72061J31303M43622L58102K12755K23213M54378L93506
4355A7768596N20466L42298O71050N65948M64117O27165P60534N40792N30470
$$ plain form
4425 5544608 5680116 5761363 5805289 5744297 5880531 5957245 5909466 5990122 6090660 6279571 6503123
4414 6503123 6588819 6591793 7003425 7094828 7141197 7206995 7367564 7532443 7772888 7689374 7778549
4403 7778549 7898760 7950120 8135810 8353192 8445003 8622336 8781271 8700956 8587195 8846039
4393 8846039 9190303 9248439 9254165 9380655 9555887 9890160 9978050 10011638 10239882 10427818
4383 10427818 10554183 10638702 10898329 11014523 11237515 11494394 12012407 12121418 12302950 12568686
4373 12568686 12892764 13110256 13446265 13661101 13865440 14149712 14424714 14634901 14861362
4364 14861362 15279656 15551717 15683020 16126642 16484744 16697499 16920712 17375090 17768596
4355 17768596 18289062 18631360 19302410 19868358 20332475 20959640 21720174 22260966 22791436
4346B2791436M78239P08396N98507N46075P61505O94073P99159P04418Q20064
4337B8901872Q87805J015997J108164R85614J307646J285213J228056J488044
4329C8208411J477881J882315J804117J841104K007335K360167K366705K649564
4321E4597599L138721L213655L743704M289247M833848N318128O091587O866919
4313I2093408P688328Q598366J0047736J1529639J3606098J6512096J9731719
4306A79807390K3792555K8067891L1836406L3860470L3070929K8032807J9421036
4299C77889484P353182o199738j9332859k9627734l5372549l7601455l5806123
4292B21302208l1420105k6062390k0868532j6706819j3299078j0759266r213923
$$ plain form
4346 22791436 23269675 23978071 24576578 25122653 25884158 26578231 27377390 28081808 28901872
4337 28901872 29789677 30805674 31913838 32899452 34207098 35492311 36720367 38208411
4329 38208411 39686292 41568607 43372724 45213828 47221163 49581330 51948035 54597599
4321 54597599 57736320 60949975 64693679 68982926 73816774 79134902 85226489 92093408
4313 92093408 99781736 108380102 118427838 129957477 143563575 160075671 179807390
4306 179807390 203599945 231667836 263504242 297364712 330435641 358468448 377889484
4299 377889484 385242666 379042928 359710069 330082335 294709786 257108331 221302208
4292 221302208 189882103 163819713 142951181 126244362 112945284 102186018 92972095
4285I2972095q214916p095611o186694n383035m717773m453430l874819l276131
4277D9769686l080142k723283k558133k157557k226228j935038j689435j547359
4269C1852511j541922j482561j244583j116873q42637j077871r93765r28650q29110
4260B1794539o16282q32912o39690o26885o31481p23539n45565m51750l70728
4251A6355707m04060n73074l70549n20575n01352l36988j72489j90002m64229
4242A2822389p2907k37660m67092k83257k20457k77484j99868j97339l33441l11686
4232A0221198l32135l47075k10571l64222l45302k68260k06625k30543k38441
4223G678024l39558j56518j66014k92248l12618l6893r7263k22275k21200j07516
$$ plain form
4285 92972095 84757179 77661568 71474874 66091839 61374066 56920636 53045817 49769686
4277 49769686 46689544 43966261 41408128 39250571 37024343 35089305 33399870 31852511
4269 31852511 30310589 28828028 27583445 26466572 25623935 24546064 23552299 22623649 21794539
4260 21794539 21178257 20345345 19705655 19078770 18447289 17723750 17178185 16726435 16355707
4251 16355707 15951647 15378573 15008024 14487449 13986097 13649109 13476620 13286618 12822389
4242 12822389 12749482 12511822 12044730 11761473 11541016 11263532 11063664 10866325 10532884 10221198
4232 10221198 9889063 9541988 9331417 8967195 8621893 8353633 8147008 7916465 7678024
4223 7678024 7338466 7181948 7015934 6723686 6411068 6374175 6276912 6054637 5833437 5725921
4213E725921k66025k47617n2913k29336k66637j72973l903k6995j33494k38594
4203D087434q5983J5381j29382j78141o9062K1983o2277l70492j7363k2195k8608
4192C161295j00442J03416j94887j92021m6253m1783j08225J05561j53945q2915
4182B449801m1210M9465N8698j47100K1657J01949m9454j03928n625J05480k62684
4171B177049j42148p6266j2813j17598J27985p8088r1328n311p3952L2675j86997
4160A553208j79107Q6079j01636q7514J3368n7927O0214k26301n124J05142j54337
4149A006065j19610J58372P4434m3139j36901O4315k1529j2320p5796L7534R1929
4138A023354J18870n3540O1907j57161j41574q317Q7123k2193m1081P2917k6053
$$ plain form
4213 5725921 5459896 5212279 5159366 4930030 4663393 4490420 4486517 4459522 4326028 4087434
4203 4087434 4001451 4016832 3887450 3709309 3640247 3662230 3599953 3229461 3212098 3189903 3161295
4192 3161295 3060853 3164269 2969382 2777361 2731108 2689325 2581100 2686661 2532716 2449801
4182 2449801 2408591 2458056 2516754 2369654 2391311 2493260 2443806 2339878 2334253 2439733 2177049
4171 2177049 2034901 1958635 1945822 1828224 1956209 1878121 1786793 1781482 1707530 1740205 1553208
4160 1553208 1374101 1460180 1358544 1271030 1284398 1226471 1286685 1060384 1055260 1160402 1006065
4149 1006065 886455 1044827 1119261 1076122 939221 1003536 982007 969687 893891 931425 1023354
4138 1023354 1142224 1088684 1150591 993430 851856 843539 930662 908469 867388 940305 914252
4127I14252J63815m176l5661j15476k5235O6j00458O703p3864J3108M2483j03760
4115F81797o3976n5804N1242m1820J58942J26754k08225J12536j5247r1863j16279
4104E38057p5999K59492J43153j0394L4591m9972j2152r7684j51698k6156J3679
4093E64917p8518R4136J51622m8739j45969Q6852M8788q7567O5618q7944m3931
4082E19265q7089K5249P6641N5704Q4358j43606j6592j622o8314K4813J61483
4071F30290k2451k1173k9238N8927j62309P6765o6477n5104J95052j39402O4800
4060E29680J6920n8624q6039M4187R3718k1432K4515k7407L2326p5752p0939L4539
4048D35692j52550k4575L1127K2503O5264P3949M6721P166j25901J3025K75803
$$ plain form
4127 914252 1078067 1073891 1038230 922754 897519 897585 797127 803830 729966 743074 785557 681797
4115 681797 617821 562017 613259 571439 730381 857135 648910 761446 746199 654336 538057
4104 538057 462058 721550 864703 854309 888900 838928 826776 729092 577394 551238 564917
4093 564917 486399 580535 732157 683418 537449 624301 673089 585522 651140 563196 519265
4082 519265 432176 457425 534066 589770 674128 530522 513930 512308 443994 468807 630290
4071 630290 607839 586666 557428 616355 454046 530811 464334 409230 604282 464880 529680
4060 529680 546600 487976 401937 446124 539842 518410 542925 515518 547844 472092 401153 435692
4048 435692 283142 258567 289694 312197 377461 451410 498131 505297 379396 392421 668224
4037F68224m0867O3728j4990j30797j31809K3796l1639J23934n7802L8702R5067
4026F05547n9286J93617J7466P1683m3653R3662q622J15381R5399P7120J72001
4015A330315n8845K14802K23918J47656K67558M3372j4913p243k0325j03668k48410
4004A774217l84836m1161J0141n2051l08947j29651k09062P9395n5821r8416p6548
3993E07260j02868J81207j15022J13150r8212n5164J20529j43661m1027k8860
3983C37332m369J08028l3446k02070k0127o8375P6974J51937k9128q5323L7338
3972B68771j0493j0157J17432J21130j67861k7416Q5994o9935m9396j2782P6671
3961C21958M7854j1804r1839p5376k1520O6776L8944N3988j37147j28614O8019
$$ plain form
4037 668224 627357 691085 676095 545298 413489 437285 405646 529580 471778 510480 605547
4026 605547 546261 739878 757344 829027 785374 879036 870414 985795 1081194 1158314 1330315
4015 1330315 1271470 1486272 1710190 1857846 2125404 2168776 2153863 2146620 2126295 2022627 1774217
4004 1774217 1389381 1348220 1358361 1306310 997363 867712 658650 738045 682224 583808 507260
3993 507260 404392 585599 470577 583727 485515 430351 550880 407219 366192 337332
3983 337332 332963 440991 407545 205475 185348 116973 193947 345884 316756 231433 268771
3972 268771 258278 248121 365553 486683 318822 291406 377400 307465 258069 245287 321958
3961 321958 369812 358008 266169 190793 169273 236049 274993 328981 191834 63220 131239
3950A31239J36098l5046J24063l4089N3350K0455o3261Q9021j34309o5779N9995
3939B81737j25643k8861r1722O5998L2285J40675n7290k5541J1121j79180l1626
3928h047O0481N3237n7481n7861q6695Q9452N3104M2510p0161Q1368k0528M830
3916H4209k4327o9042J38090N6210o5092j12991q5499q6033J16610J57304M9936
3905A59375J6196j43113o9509j43738K459N5370J47199O3889j4917J49073r5290
3894A26994M0132j00953m8581j39784K11993R0098k39028J01001J38956M5593
3884B26421p6421J13166O7964j74778n3494P0185n3233j21411J0003J14595j1065
3873A11932j46571R870M5618J2124P1875k7243K5710k8516P4984m5073j04048
$$ plain form
3950 131239 267337 232291 356354 322265 375615 396070 332809 421830 287521 221742 281737
3939 281737 156094 127233 35511 101509 133794 274469 217179 191638 202759 23579 -8047
3928 -8047 52434 105671 48190 -9671 -96366 -6914 46190 88700 18539 99907 79379 84209
3916 84209 59882 -9160 128930 185140 120048 7057 -78442 -164475 -47865 109439 159375
3905 159375 175571 32458 -37051 -180789 -178330 -122960 24239 88128 73211 222284 126994
3894 126994 167126 66173 17592 -122192 89801 179899 -59129 41872 180828 226421
3884 226421 150000 263166 331130 156352 102858 173043 119810 -1601 8402 122997 111932
3873 111932 -34639 -24769 20849 32973 104848 77605 103315 74799 149783 104710 662
3862F62p9866J38217J9656R7412r2520n8787Q2674O1790n9750p5544j26763k3911
3850a16730N7893J31403R3782k8528j57365L0266J30190K7617J53501j67242n0774
3839A04013L0367N4218K3008L8333O794L5977m1541L4628j15683J23878K8857
3828C22849L1067M3857N3903M4863N6455k52127q3058J12834L1715J22853K1797
3817E07008j14673r3585K99783J7351j64348N7831J14982J72297K1057k8937K5082
3806H13848J84629K46106M5024j21014K14491J75828K48908K6506p3537N4447
3796A815236k31491J41264J31724k9838j89686Q4388J09335J18352j7732O610
3786A938162K51444K09280N7909j50668J23503l5733J9857p822J76483l4871l9994
$$ plain form
3862 662 -79204 59013 78669 176081 83561 24774 107448 169238 109488 33944 -92819 -116730
3850 -116730 -58837 72566 166348 137820 -19545 10721 140911 168528 322029 154787 104013
3839 104013 134380 188598 211606 249939 256733 292710 251169 285797 170114 293992 322849
3828 322849 353916 397773 451676 496539 552994 300867 217809 330643 362358 485211 507008
3817 507008 392335 298750 598533 615884 451536 509367 624349 796646 817703 788766 813848
3806 813848 998477 1244583 1289607 1168593 1383084 1558912 1807820 1834326 1760789 1815236
3796 1815236 1583745 1725009 1856733 1826895 1637209 1721597 1830932 1949284 1931552 1938162
3786 1938162 2189606 2398886 2456795 2306127 2429630 2393897 2413754 2405932 2582415 2547544 2507550
3775B507550J42481K14935J87892K05576O8541L09431K57494R1561r9715k81801
3765C603945m55478l85277j31514j93897o1028m0022R7132j38180m28j28278Q2442
3754B249417r7526J31575J36502j67740l17931j70031j97655J1546j66495M822
3744A416484j24547N6450J74645J9752L5279j5916j3371j31922o2504k38226O116
3733A122240J2978j49335o1415j38963n6324l39919j01691K60792l0975j02310
3723D15078O5932j48784M8892K3063o0195J15635k3455j80202o2539k1391Q4288
3712B56322J34183j07634q8845J52678p6658k6843K0772o2889J06139n5726n3606
3701A97893m9805N0617J45843j3289j80066m8504j3523m6714q8092N1532J14022
$$ plain form
3775 2507550 2650031 2864966 3052858 3258434 3326975 3636406 3893900 3985461 3885746 3603945
3765 3603945 3148467 2763190 2631676 2437779 2376751 2336729 2433861 2295681 2295253 2166975 2249417
3754 2249417 2151891 2283466 2419968 2252228 1934297 1764266 1566611 1578157 1411662 1416484
3744 1416484 1291937 1348387 1523032 1542784 1578063 1562147 1548776 1416854 1354350 1116124 1122240
3733 1122240 1135218 985883 924468 785505 729181 389262 287571 548363 517388 415078
3723 415078 481010 332226 381118 404181 343986 459621 436166 255964 193425 172034 256322
3712 256322 390505 282871 194026 346704 270046 243203 263975 201086 307225 251499 197893
3701 197893 148088 198705 344548 331259 151193 102689 89166 42452 -45640 5892 119914
3690A19914J6205L7820n4619q0291j7476r2857R932J19142O88p8071N431P3531
3678E9349j5884r6799J11663k5781P6525J14923J3896j52284J03971k7530n5066
3667A06983j12331p2364o6201O2493J37007O9590j36319J03223q1644p7716m099
3656g1378j12690K9198P7932J7905Q1134R5135m5632j74991N8048J2017n0755
3645h4077Q774J16433p0864J19422R9849n1576n8816j50858P8568O0142l3223
3634C3774j55080Q081K7852j36357k9480J34379k1987J13537L6606j1670n8237
3623e8582K6969J43457j08258p8782j18538J06571R0407O4880M0962n4387q2763
3612b8064J10113o1139j20926J30639R9952k8558p0473r4911o1321N7883J2356
$$ plain form
3690 119914 136119 173939 119320 39029 21553 -71304 -61372 57770 58458 -19613 -14182 59349
3678 59349 43465 -53334 58329 32548 109073 223996 237892 85608 189579 162049 106983
3667 106983 -5348 -77712 -143913 -81420 55587 125177 -11142 92081 10437 -67279 -71378
3656 -71378 -184068 -154870 -76938 -59033 22101 117236 71604 -103387 -45339 -33322 -84077
3645 -84077 -75303 41130 -29734 89688 189537 137961 79145 -71713 6855 66997 33774
3634 33774 -121306 -113225 -85373 -221730 -251210 -116831 -138818 -25281 11325 -345 -58582
3623 -58582 -31613 111844 3586 -75196 -193734 -87163 3244 68124 109086 54699 -28064
3612 -28064 82049 20910 -100016 30623 130575 102017 31544 -63367 -124688 -66805 -54449
3601e4449J13605k16176n7802J92302K35804n7629j09164m7150P930j37527k2214
3590a52470K0347n6012r164K37041m9439r8326K4156J43382p4333q5549J12822
3579A2455Q8447j60816o4844L9109J78827J46020m5380j36459j16168o7921J54657
3568B7927J51279q6330j09781J0817j3824j07921n3068J08572o8812O7449K3176
3557e0516j21749Kj3695M5170n0548m9453J38053J79623j79755k08788M3090K857
3545b65709O8848N3666J03175K2177L7644j77005r7113P6339J5435O2206R7497
3534b840K7707j19150R8288m4842j07309Q0306J36271j04510q2869O1411J82678
3523A25141j69316m5962k5540J6864l0576L4185m070k3986o1555n1784O0808O8547
$$ plain form
3601 -54449 59156 -157020 -214822 -22520 213284 155655 46491 -659 7271 -130256 -152470
3590 -152470 -132123 -188135 -197299 39742 -9697 -108023 -83867 59515 -14818 -100367 12455
3579 12455 100902 -59914 -124758 -85649 93178 239198 193818 57359 -58809 -126730 27927
3568 27927 179206 92876 -16905 -6088 -19912 -127833 -180901 -72329 -141141 -73692 -50516
3557 -50516 -172265 -172263 -185958 -140788 -191336 -240789 -102736 76887 -102868 -311656 -268566 -265709
3545 -265709 -196861 -143195 -40020 -17843 19801 -157204 -254317 -177978 -162543 -100337 -2840
3534 -2840 24867 -94283 4005 -40837 -148146 -67840 68431 -36079 -118948 -57537 125141
3523 125141 -44175 -90137 -115677 -98813 -129389 -95204 -99274 -123260 -184815 -236599 -175791 -107244
3511a07244L2700L9610o9563j4427n4589K1669Q0775J45523j27903P0447p5699
3500e8701o1417O645o5636M9222N2797k4569o5607L2470J986M5213p0320J65400
3488G483p6920K7972j35504J74736J66888k27068r5518Q6736O7690j78346r0268
3477b72119J61452J36658r6620r8275J10436R0441j36779r8828M9871R8230k9027
3466h4560K4268K588L9342l4069N1361P4780m0409p8328m8911l8030J2527P2067
3454d7374m0856k2784l8307o9361n3944J52110q0572j4966J27770J07823j28513
3443a08974k0812O7719J7904J9810k64487M7885K38557J2924j83784j11503J08322
3432a76439J63570q562n7472r432L3073q4119N2280J88978M2601j58691o0677
$$ plain form
3511 -107244 -74544 -34934 -104497 -118924 -173513 -151844 -71069 74454 -53449 16998 -58701
3500 -58701 -120118 -113473 -179109 -129887 -77090 -101659 -167266 -134796 -132810 -87597 -157917 7483
3488 7483 -69437 -41465 -176969 -2233 164655 -62413 -157931 -71195 -3505 -181851 -272119
3477 -272119 -110667 25991 -70629 -168904 -58468 31973 -104806 -203634 -153763 -55533 -84560
3466 -84560 -60292 -57704 -18362 -52431 -1070 73710 33301 -45027 -93938 -131968 -119441 -47374
3454 -47374 -88230 -111014 -149321 -218682 -272626 -120516 -201088 -216054 -88284 19539 -108974
3443 -108974 -129786 -62067 -44163 -24353 -288840 -240955 -2398 10526 -173258 -284761 -176439
3432 -176439 -12869 -21431 -78903 -88335 -55262 -139381 -87101 101877 144478 -14213 -74890
3421g4890j7527n8433J13312n1090J31297M1926j25937M0853j04692m0230J39684
3410e727j12480j65069J27528K14283m9196j33133J81905j04198R8824K5748j24425
3399d5940L1098k1980p1697p3270J14589q2415N1306J6993n7260R3587N6937l712
3387H236J6927r7094J4067r0290P8863L0044p6702R0545n1494n7404J54335M4731
3375F4764q5150o4594p3698J88280l3180q0243l1555P3441p002j4552m6736R4153
3363a6072N2892k02962j09044N4960K3131R9238O3715k0542n8036o3692J21351
3352e5061j4426j46354K25851O7599j12830L01113k0120o9997K3767j67197k6846
3341E499J6339m7023O4164P0750Q9548m9682j71130R0896k6880j5522J28289l429
$$ plain form
3421 -74890 -92417 -150850 -37538 -88628 42669 84595 -41342 -489 -105181 -145411 -5727
3410 -5727 -118207 -283276 -155748 58535 9339 -123794 58111 -46087 52737 78485 -45940
3399 -45940 -14842 -36822 -108519 -181789 -67200 -149615 -98309 -81316 -138576 -44989 11948 8236
3387 8236 25163 -71931 -57864 -148154 -69291 -39247 -115949 -25404 -76898 -134302 20033 64764
3375 64764 -20386 -84980 -158678 29602 -3578 -83821 -115376 -41935 -48937 -63489 -110225 -16072
3363 -16072 36820 -166142 -275186 -220226 -197095 -97857 -34142 -54684 -112720 -176412 -55061
3352 -55061 -69487 -215841 10010 77609 -35221 265892 245772 175775 199542 32345 5499
3341 5499 21838 -25185 38979 109729 199277 149595 -21535 69361 42481 26959 155248 151819
3329A51819r7591j16068J68497j13716M6484k7623j57258J56826K4582m2017n7281
3318f3346k80604o2026L99946P2397j48228n7034q532n4904K1873J23161Q5101
3307B7804m8740k4547K7528K5120k5083l648l0076R5374J23047j00543O9989j58155
3295b1930j7282P5496l2920l1972J67178N1094j17076j02054k6020M2853J326
3284a1307K8315M3147k7497K7657k4881r4199q184K2269p413L7666O1839M1555
3272H8967Q2218K122j67361l7788J11990K35430k45329Q2471O3148p6756K17971
3261C57083j74303q9493j37201O8993N0938Q9939J96417p700o5030r731L7356
3250C17268J2053j49588l7098J43610J54984N7263J02494j51072O7279R8628o1243
$$ plain form
3329 151819 54228 -61840 106657 -7059 39425 11802 -145456 11370 35952 -6065 -63346
3318 -63346 -343950 -405976 -6030 66367 -81861 -138895 -147427 -202331 -180458 -57297 27804
3307 27804 -20936 -45483 -17955 7165 -17918 -21566 -51642 43732 166779 66236 136225 -21930
3295 -21930 -39212 36284 3364 -28608 138570 189664 72588 -29466 -55486 -12633 -11307
3284 -11307 17008 60155 32658 60315 35434 -58765 -66949 -44680 -52093 -14427 47412 88967
3272 88967 171185 173307 5946 -31842 80148 315578 70249 152720 215868 139112 357083
3261 357083 182780 93287 -43914 25079 76017 165956 362373 354673 289643 279912 317268
3250 317268 329321 179733 142635 286245 441229 498492 600986 449914 517193 615821 554578
3239E54578O875l7991Q7608K0709J29429n2719n583k7910j00214j04401m0370
3228D30011j02333j67634o9081O6399j2848j8946j4189J1348K02821L3536j16862
3217B42222k12133J09713p7742M9961o2921j4762J25332J5136k08900K9825J0552
3206F283k9217R5014R4652j56516L3892j5891m1138O1771j4629J10470j23661
3195B1030n7925L1821m192J776M8514j39830m8983J13798M4622j532o9571Q6818
3183B6346j7214J57476p0784j36578k1646M3690k7245K43389M1211k70740r7366
3172a29461J45264N1520j18995k9456Q8500O8021k21701j2978J20133j9124j43037
3161b01314K9919Q5969J03319j01637P1161k8603K2111p7654J4130J28788m5975
$$ plain form
3239 554578 561453 523462 611070 631779 761208 708489 702906 674996 574782 470381 430011
3228 430011 327678 160044 90963 157362 144514 125568 111379 122727 325548 359084 242222
3217 242222 30089 139802 62060 112021 49100 34338 159670 174806 -34094 -4269 6283
3206 6283 -22934 72080 166732 10216 44108 28217 -12921 48850 34221 144691 21030
3195 21030 -36895 -5074 -9266 -7490 41024 -98806 -147789 -33991 10631 9099 -60472 26346
3183 26346 9132 166608 95824 -40754 -62400 -18710 -45955 197434 238645 -32095 -129461
3172 -129461 15803 67323 -51672 -81128 7372 75393 -146308 -159286 -39153 -58277 -201314
3161 -201314 -171395 -85426 17893 -83744 -12583 -41186 -19075 -96729 -82599 46189 214
3150B14j01264P7788R2575N0362p0597J6936q3230O5783J7235j76344K9797K16048
3138A35303o238j4906r7742o0229P646R424J6271j60288N2128R3011p8540j60073
3126b64233J26674L6732o254R856r0547N6768j33305J70489J6541Q6216J57918
3115A66855j48513r5680k7521l9134J07455P8702Q123P5048K3105j37166j36917
3104a25643j0040j4164j23297Q4813J1013P33J59419r5312p0043J82187p4277
3093g4611Q238M9855j38883n6101O1294L4354j16287O2984J08444j9870j64196
3082b44779J44203p1631q8616J1202l7665K72216J59341j64570j6195j9486J10098
3071E4118m4515j75468N8461p7681J3827l246n2914Q2735J78085j02285k46002
$$ plain form
3150 214 -101050 -23262 69313 119675 49078 66014 -17216 48567 65802 -110542 -80745 135303
3138 135303 129065 114159 16417 -43812 -36166 -26742 -10471 -170759 -118631 -25620 -104160 -264233
3126 -264233 -137559 -100827 -107081 -97225 -187772 -131004 -264309 -93820 -77279 8937 166855
3115 166855 18342 -77338 -104859 -143993 -36538 42164 50287 125335 148440 11274 -125643
3104 -125643 -135683 -149847 -273144 -188331 -177318 -176585 -17166 -112478 -182521 -334 -74611
3093 -74611 -66373 -16518 -155401 -211502 -150208 -115854 -232141 -169157 -60713 -80583 -244779
3082 -244779 -100576 -172207 -260823 -249621 -287286 -15070 144271 -20299 -36494 -55980 54118
3071 54118 9603 -165865 -107404 -185085 -171258 -174504 -227418 -144683 33402 -68883 -314885
3060c14885K7034k2400P0695J06112r5257J03116l7463j2701N4164m6180j9800
3049a87565J13422J5069n1773O1721O8664l1723j59937P0371N4595j02953K2448
3038a27661l8020q2142K17945M9361q4698J5831j2685n2747K2199k05061L3968
3027b63710R0783l0991O8610R5100j11130m1501l6076J96207r4115J34630j5378
3016g571k0608J21275Q698q5699j11101J8600m0449J35699o2150n8450J93063
3005I1307k5154j27923j00235M3850p1279j06276K16937Q0044j29938N6581L8363
2994c3723O6244P713o1450J01670K0890n9506j00306P9805p946j3936L7015j23298
2982h6828N4091p1116N376K08803l9103N161j02274J07487j02685j28933P960
$$ plain form
3060 -314885 -287851 -310251 -239556 -133444 -228701 -125585 -163048 -175749 -121585 -167765 -187565
3049 -187565 -74143 -59074 -110847 -49126 19538 -12185 -172122 -101751 -47156 -150109 -127661
3038 -127661 -165681 -247823 -29878 19483 -65215 -49384 -62069 -114816 -92617 -297678 -263710
3027 -263710 -172927 -203918 -135308 -40208 -151338 -192839 -228915 -32708 -126823 7807 -7571
3016 -7571 -28179 93096 101794 16095 -95006 -76406 -116855 18844 -43306 -101756 91307
3005 91307 66153 -61770 -162005 -118155 -189434 -295710 -78773 1271 -128667 -72086 -33723
2994 -33723 32521 40234 -21216 80454 101344 41838 -58468 21337 13391 -545 36470 -86828
2982 -86828 -32737 -103853 -98477 110326 71223 76384 -25890 81597 -21088 -150021 -142061
2971a42061R4557p1925J4870R7139r9005k2435m4232j13688P6377P5827n7895
2960a92471L0294P4561J24487L1985l320j67493n5646J25907K019N9683j86254
2949a56248r4712J5661O8928J05481k7497n868Q4534L2992K2219J08174J07814
2938B61478j65580k32089l6893k1696J9083k719J10309J91742j07892N3564O2428
2927A31735j19888p9000l99P0624J36581O2341J64j51936p3160j17224j4766m1455
2915a96383j9830J75610Q0121o7167K5682j1925k2298m2881J02239L4084r476
2904D7776R5924k986j43138m4742K8237m6242n5958M0846L4343j89031P3146R4716
2892f7109J75482p1318J907j29629j36783K13609J54326M5380k0494Q495j21132
$$ plain form
2971 -142061 -47504 -119429 -104559 -7420 -106425 -128860 -173092 -286780 -210403 -134576 -192471
2960 -192471 -162177 -87616 36871 68856 65536 -101957 -157603 -31696 -29677 30006 -156248
2949 -156248 -250960 -235299 -166371 -60890 -88387 -94255 -9721 23271 45490 153664 261478
2938 261478 95898 -136191 -173084 -194780 -175697 -178416 -68107 123635 15743 69307 131735
2927 131735 11847 -67153 -67552 3072 139653 201994 202158 50222 -22938 -140162 -154928 -196383
2915 -196383 -216213 -40603 39518 -27649 -1967 -13892 -36190 -79071 23168 57252 47776
2904 47776 143700 140714 -2424 -47166 -18929 -65171 -121129 -80283 -45940 -234971 -161825 -67109
2892 -67109 108373 37055 38962 -90667 -227450 -13841 140485 185865 165371 173866 52734
2881E2734m5664J2681L8715K3009j87339Q4692O3643n8370N0412J635L8034n9559
2869A4623o441P3011O6432k621j38036q2869p6373Q0414L2338m4897j80427M892
2857b59954J72500m2090J48899n4308J8003o3668j9389J70699l7641o5037M8425
2846A6439K21P9613j414q0882K18656j67922k5690m445L6613J94004k5524j76539
2834F3130l3622j35308M7471j2325j5564j34726K4721J85714O7302j844j0464
2823D4485L0142j02821j22942J96688M8408j35158L5392J31269j07121j05337
2813h6995M1168J1300r8305J2255N6557L6470J70545r8o208j65663j4680O0359
2801A6705L4481j07782p7577N7064J30954r9921L471q0249p3665m2058K49519
$$ plain form
2881 52734 7070 19751 58466 81475 -105864 -21172 42471 -15899 34513 36148 74182 14623
2869 14623 8182 81193 147625 145004 6968 -75901 -152274 -71860 -39522 -84419 -264846 -259954
2857 -259954 -87454 -129544 19355 -34953 -16950 -80618 -100007 70692 33051 -31986 16439
2846 16439 16660 96273 94859 13977 232633 64711 39021 34576 71189 265193 239669 63130
2834 63130 29508 -105800 -58329 -70654 -86218 -220944 -196223 -10509 56793 54949 44485
2823 44485 74627 -28194 -151136 45552 93960 -41198 -5806 125463 18342 -86995
2813 -86995 -45827 -34527 -132832 -120577 -64020 -27550 142995 142897 136689 -28974 -43654 16705
2801 16705 51186 -56596 -134173 -77109 53845 -46076 -42605 -122854 -196519 -238577 10942
2790A0942N7328q1257j32345K5044J23798j77371n5858L9803R7804J07531q107
2779G312j23845N0194L1915K5604k5661J30829J42753k11970k29516J70584l9523
2768g1324m5807J34745j11764j97385J73967o5210p8658O0136N7146J06983n334
2757d2505J87109j57045o8204o86j7828l4002J22674m121l8540q3110n8170J56376
2745c8052N8461q9843p7910l8849Q7679Q4543r1407r8848R1738m708R9735M8721
2733C1260j84891Q4795j7391Q287j0625l8889M6339m0977r5368J12951J15627
2722A1118M496n8593M9413m6039o03L2369j0443Q6886k6813j67557J06454j06920
2710a26232r7759J36252J09701K3358j23756K3206j6347k9243P9536j13251m0448
$$ plain form
2790 10942 68270 -12987 -145332 -120288 3510 -173861 -229719 -189916 -92112 15419 7312
2779 7312 -116533 -66339 -34424 -8820 -34481 96348 239101 27131 -202385 -31801 -71324
2768 -71324 -117131 17614 -94150 -291535 -117568 -182778 -261436 -201300 -144154 -37171 -42505
2757 -42505 144604 -12441 -80645 -81331 -99159 -133161 -10487 -14608 -53148 -136258 -194428 -38052
2745 -38052 20409 -69434 -147344 -186193 -98514 -13971 -105378 -204226 -112488 -117196 -17461 31260
2733 31260 -153631 -68836 -86227 -77940 -88565 -127454 -81115 -122092 -217460 -104509 11118
2722 11118 15614 -42979 6434 -39605 -40208 -7839 -18282 68604 41791 -125766 -19312 -126232
2710 -126232 -223991 -87739 21962 45320 -78436 -55230 -71577 -100820 -21284 -134535 -174983
2699a74983l7073K0949l3796j3031J10385j9311J5062k7784j8912Q8885N7862
2688c1747j04999J95872m0909Q1799j9314p5433O8874j14169j15251J4988J14910
2677b5379j4001j05615L8504j2825l1837q6560p0495p545K91017J10143k81782
2666a96375j24197J71572K39708j74724J8603J9139L3240k5791n0199K3224j243
2655f7043J5760r805K1592m8354p2594J8880k2116J70431j311O344L5451o3981
2643a6746k04933N0824Q0390P129M4232o8745O749M5719m051J2574K6995L7286
2631A7423p4985m4324J70892j52780O4396J76721L0634k44274L3535Q5256l4207
2620B8287j49583l8923J01379q9653r5727L9964J57992J04766J1117P404j97753
$$ plain form
2699 -174983 -212056 -191107 -224903 -237934 -127549 -146860 -131798 -159582 -178494 -89609 -31747
2688 -31747 -136746 59126 18217 100016 80702 5269 74143 -40026 -155277 -140289 -25379
2677 -25379 -39380 -144995 -106491 -119316 -151153 -237713 -308208 -315753 -24736 85407 -196375
2666 -196375 -320572 -149000 90708 -84016 -65413 -46274 -13034 -38825 -89024 -65800 -67043
2655 -67043 -51283 -61088 -39496 -87850 -160444 -141564 -163680 6751 5440 11784 47235 -16746
2643 -16746 -221679 -170855 -90465 -83336 -39104 -107849 -101100 -55381 -59432 -46858 -19863 17423
2631 17423 -57562 -101886 69006 -83774 -19378 157343 187977 -56297 -22762 62494 28287
2620 28287 -121296 -160219 -58840 -148493 -244220 -204256 -46264 58502 69619 77023 -120730
2609a20730K8112k9452j2361J23280J2703n8473K5205L095J4541k8827j48904
2598a91811J58822k04J00772J03069k08523N1384J2931k5709j27440j65886j4948
2587c07543J39158J17709J2684R9235j59073j30771L5359nj11972J46637J14262
2576d4320j4812l542M1924R2502K005n9557r2396m7547k5678J05402K43756R1509
2564B89246j3290j28183q3906j22649m4019P121M1595j08539n3895J11067Q5064
2553b0388n1866N4263O6062n6766k05226J41488J00974j18538P1566r6876q7992
2542b03299J62140M8364j53064j30844K45024p9097k7398K22724j09540p5743
2532a00733J88045J7373j29926r1493Q0780M8588k1700l834N0945l9711k3908
$$ plain form
2609 -120730 -92618 -122070 -134431 -11151 1552 -56921 -31716 -28621 -14080 -42907 -191811
2598 -191811 -32989 -33193 67579 170648 -37875 13509 26440 731 -126709 -292595 -307543
2587 -307543 -168385 -50676 -37992 61243 -97830 -228601 -193242 -193247 -305219 -158582 -44320
2576 -44320 -59132 -62674 -20750 71752 73757 14200 -78196 -125743 -151421 -46019 197737 289246
2564 289246 275956 147773 63867 -58782 -102801 -95680 -54085 -162624 -216519 -105452 -20388
2553 -20388 -72254 -17991 48071 -8695 -213921 -72433 28541 -89997 -18431 -115307 -203299
2542 -203299 -41159 7205 -145859 -276703 -31679 -110776 -138174 84550 -24990 -100733
2532 -100733 87312 104685 -25241 -116734 -35954 12634 -9066 -12900 38045 -1666 -25574
2521b5574n2591k2608o0720L7930q7130n9248L2525R1912J29209k8322J09775
2510F5158j3811R9711j42214J04739r8855n9036k8845j81886R642K30236j60259
2499a75420M0527l3587J41924q4972M6818J89367j15595j86471J66832J44737
2489A34160j40086j36264j9236K05744m3003N0094J11842q9985j42596o113q027
2478h3470K71615j7735j71450k6487P5194j33741j46232J37486l5180p7512j27138
2467c34650J50231N8537Q9186J54970j18979p0587J38426K3193p3563L9340n356
2456E0748m0205o8154Q4958j22503l6934J053O5316J09306R8911k19081m4740
2445a21325Q6348J3107q5141j10818J48039n4310J21219M3871r5427j18483l8673
$$ plain form
2521 -25574 -78165 -100773 -161493 -123563 -210693 -269941 -237416 -145504 -16295 -44617 65158
2510 65158 51347 151058 8844 113583 14728 -44308 -73153 -255039 -245397 -15161 -175420
2499 -175420 -134893 -168480 -26556 -111528 -64710 124657 9062 -177409 -10577 134160
2489 134160 -5926 -142190 -161426 44318 1315 51409 163251 73266 -69330 -75443 -83470
2478 -83470 188145 170410 -1040 -27527 47667 -86074 -232306 -94820 -130000 -207512 -334650
2467 -334650 -184419 -125882 -36696 118274 -705 -71292 67134 90327 16764 56104 50748
2456 50748 10543 -57611 27347 -95156 -132090 -131037 -65721 43585 142496 -76585 -121325
2445 -121325 -34977 -21870 -107011 -217829 -69790 -124100 -2881 40990 -54437 -172920 -211593
2434b11593J75850K7094o8036j34011l0799k9733Q9768J15530o4162J34486l9322
2423c4928j24179k5996J56442L3808O350j51369R4707J31817N169q9437l4675
2412c2291Q3155Q9731J50708j93965j20280o6944Q1010P334n5747n8286K5792
2401h9783Q074P5959P8538k8004R307n9707p3842l3426P2518Q6557o6978k7178
2389d7965M8390K3119j07088Q5308J27401j36109n7641k4708Q5275O6605N1886
2378A14473l0957k6771m0812J66067p0682j03688J31102m0564J14982Q3819j14259
2367A82710k03005M4180N4196J22112R7957l808n269Q786l5973m580j03469K9964
2355A83801j52150Q4519j81244k7409l1119J52478K30249O2909k23979k554l9428
$$ plain form
2434 -211593 -35743 -8649 -76685 -210696 -241495 -271228 -181460 -65930 -130092 4394 -34928
2423 -34928 -159107 -185103 -28661 5147 11497 -139872 -45165 86652 91821 2384 -32291
2412 -32291 50864 140595 291303 97338 -22942 -89886 -8876 -1542 -57289 -115575 -89783
2401 -89783 -81709 -5750 72788 44784 54091 -5616 -79458 -112884 -40366 46191 -20787 -47965
2389 -47965 425 23544 -83544 1764 129165 -6944 -64585 -89293 -4018 62587 114473
2378 114473 83516 56745 15933 182000 111318 7630 138732 98168 213150 296969 182710
2367 182710 -20295 23885 78081 200193 298150 294342 289073 297859 261886 257306 153837 183801
2355 183801 31651 116170 -65074 -92483 -123602 28876 259125 322034 98055 95501 56073
2344E6073M2257l3399j25112L6779j4126k0414j24665K49563O3742l2840j21981
2333b4123K25839k6772j75677L8124k6892K9007R4003j19304O1277j5032k7832
2322C2618j05960K230P1635M633J3999J71280R139r634l2290j4785P4110l7017
2310A79958k18380J02928K03719m4693j57974J5948O537L1190k0541L9263k2518
2299A15437n0985N6176l8207R2771M661N7499P709j66809o813P2920N229Q3638
2287B33226R3647j83288o2319J38656N6365N249M056R314M4783J04233j66223
2276B77699j65208J58257l4980K8911o9751r3542L9893n3600j1321J44302J12308
2265C32968q4569m6599p8340R437m9782J11206J47951j40877j8749p3181K1158
$$ plain form
2344 56073 98330 64931 -60181 -23402 -37528 -57942 -182607 66956 130698 97858 -24123
2333 -24123 201716 174944 -733 37391 10499 39506 133509 14205 75482 60450 32618
2322 32618 -73342 -71112 523 5156 19155 190435 199574 189940 157650 142865 216975 179958
2310 179958 -38422 64506 268225 223532 65558 81506 88043 119233 98692 137955 115437
2299 115437 64452 120628 82421 175192 179853 237352 245061 78252 71439 144359 149588 233226
2287 233226 326873 143585 81266 219922 276287 281536 285592 294906 339689 443922 277699
2276 277699 112491 270748 235768 264679 194928 101386 141279 87679 76358 220660 332968
2265 332968 248399 201800 123460 132897 83115 194321 342272 201395 182646 109465 130623
2254A30623R418J9814N6297J07829j63452j21474J52627M185J14275J8530K6900
2243C55572q6741P3110M0044n4619J9680K7632k8960q1882j41272N9547O9700
2232B51811J4210p35R192k11457J31972J47484J39763k4168j15612q0131J60332
2221D22661K1958j24283j97510N3017J32837L9223l7862L5638J33928M2781J54043
2210F76431k86302j5220N4826J8696l7560K42564r2349M0163O4174j07616J00764
2199F58571j4723l2542m3267J94411k9844k6737j03049O7267J5423j82706P7767
2188E80571l2694k9284M3430P8103P1253n4073l6105J63495O3288j43102J21412
2177H26294j7584J7066K4775J70870K3642J809L9672q8112J9564r0010K00648
$$ plain form
2254 130623 140041 159855 216152 323981 160529 39055 191682 195867 310142 328672 355572
2243 355572 268831 341941 381985 327366 347046 374678 345718 263836 122564 182111 251811
2232 251811 266021 265286 274478 63021 194993 342477 482240 458072 342460 262329 422661
2221 422661 444619 320336 122826 175843 308680 347903 310041 345679 479607 522388 676431
2210 676431 390129 374909 429735 448431 410871 653435 561086 601249 665423 557807 658571
2199 658571 643848 611306 568039 762450 732606 705869 602820 670087 685510 502804 580571
2188 580571 547877 518593 562023 640126 711379 657306 621201 784696 847984 704882 826294
2177 826294 808710 825776 850551 1021421 1045063 1046872 1086544 998432 1017996 927986 1128634
2166A128634J78454p915N2738J01679k5109j4484J4768J52847R455L2434J8151
2155A641652q8592J27960J62709q3423N4201J356J11158N0758p3414P904J27012
2144B039281Q4251J55916J16435k2169J68756P5514J24861R9484J0494O4120J92365
2133C109308K46801L8375j03735J45747K41090J87995K58477J68401J21539K25003
2123D639001L82576J49130K93669J25238K77419L55449M72136K97570N22886L05259
2113G820333O07432O12187N66532J077769P91981R09187Q62718O99028J011238
2104A4958405J278995J561676K248760K656368L217177L695316N000536O696491
2096D1313724P864646P671734N792985J746373n430158j0733253r757885p347125
$$ plain form
2166 1128634 1307088 1299173 1351911 1453590 1428481 1413997 1428765 1581612 1591067 1623501 1641652
2155 1641652 1553060 1681020 1843729 1760306 1814507 1815863 1927021 1977779 1904365 1912269 2039281
2144 2039281 2123532 2279448 2395883 2373714 2542470 2617984 2742845 2842329 2852823 2916943 3109308
2133 3109308 3356109 3394484 3290749 3436496 3677586 3865581 4124058 4292459 4413998 4639001
2123 4639001 5021577 5170707 5464376 5589614 5867033 6222482 6694618 6992188 7515074 7820333
2113 7820333 8427765 9039952 9606484 10684253 11476234 12385421 13248139 13947167 14958405
2104 14958405 16237400 17799076 20047836 22704204 25921381 29616697 34617233 41313724
2096 41313724 49178370 56850104 62643089 64389462 58959304 48226051 38468166 31121041
2088C1121041n356042m060628l045560k353342j652529j400931j250042r46274
2080A1055693o25198n76992n26149o53825n91241p27435m51352n68209m79449
2071E855843l13024l92413n89067l25821m9754l62210k3940k63197k04807j36041
2061C195569j75944q1811k15661j18832o8628k5501l2235k46720p5866p6421j19307
2050A958643j19031j30582j56518P7103R6856m6579o8734j29719r942N1446N7011
2039A579954j25820o0499L3337j00102O4345j10778j31221j05179Q7279K5078
2029A156394P9190r9762j45883r0606J26210L5889j53114j61121j29665M512J31062
2018G53106O5634k4634j16589n2404N728l4050m9540k5540K4945k8789J11257
$$ plain form
2088 31121041 25764999 21704371 18658811 16305469 14652940 13252009 12001967 11055693
2080 11055693 10430495 9853503 9327354 8673529 8082288 7354853 6903501 6335292 5855843
2071 5855843 5542819 5150406 4561339 4235518 4185764 3823554 3799614 3536417 3331610 3195569
2061 3195569 3019625 2937814 2722153 2603321 2534693 2509192 2476957 2230237 2154371 2077950 1958643
2050 1958643 1839612 1709030 1552512 1629615 1726471 1679892 1611158 1481439 1471497 1522943 1579954
2039 1579954 1454134 1393635 1426972 1326870 1391215 1280437 1149216 1044037 1131316 1156394
2029 1156394 1235584 1135822 989939 899333 1025543 1061432 908318 747197 617532 622044 753106
2018 753106 818740 794106 677517 625113 630841 596791 547251 521711 546656 517867 629124
2007F29124l8902K1089J19858j19653j23682M9554r5198o8351P5799r3699n5906
1996C00033l5612O6145n3990K094l3467j17683J29738N5958j01491j02268J6676
1985A26133N2944J92423M8512j50242o5341j15641N745J01371L8906O394r1974
1974A49230Q6015j04303J41809j2856l7863N624M3015j24676r1078J27606m557
1963A77966j51363m1779J85944l8258n6808n1380R4508M2656q7010m9217M2442
1952F7701l2616R348o6417j32388K9658K8966K932J43780N1468r5071N3251n041
1940E5571n3255p7589M3067J84996K242j23015j7737J28100O330L3282n7734J22956
1928B47214r3321m9287N2656l6276m4175k10976l5134m8390J09155J22902m1097
$$ plain form
2007 629124 590222 611311 731169 611516 487834 537388 442190 373839 449638 355939 300033
1996 300033 264421 330566 276576 278670 245203 127520 257258 313216 211725 109457 126133
1985 126133 179077 371500 420012 269770 204429 88788 94533 195904 234810 241204 149230
1974 149230 235245 130942 272751 259895 222032 227656 270671 145995 54917 182523 177966
1963 177966 26603 -15176 170768 132510 75702 24322 118830 161486 74476 25259 67701
1952 67701 35085 44433 -21984 -154372 -124714 -95748 -92816 50964 102432 7361 60612 55571
1940 55571 2316 -75273 -32206 152790 155032 32017 14280 142380 148710 181992 124258 247214
1928 247214 153893 104606 157262 120986 76811 -134165 -169299 -217689 -108534 14368 -26729
1917b6729J45467l7178n7999O941j00472l0374m7834N3509j43300J7903J27465
1906i2601j5626J35417j67639M1200Q7813J16814j67581o2545L16581q0429j37222
1895b5818P3868J4387j74848K2156J25269P0801K0719p1295j54669P1809j2146
1884c9767J72955k3430k74835p2271J67350r897n2266J37392O5986j12466J8004
1873b3245Q9803j04273R2709L4249K5056N4594j13573J1846j7803m5603k3596
1862a9836J01901m672k50970k8607J19120J01135M5948k6925J41411j521j19059
1851E7925J9781R2775j52009n9863J8107M9304K5639L4141p477l306L1383n2930
1839E3470o5919J7232K7636J0096K5791J8921K0802j39909j3685J8533K0815l7423
$$ plain form
1917 -26729 118738 81560 23561 30502 -69970 -100344 -148178 -94669 -237969 -220066 -92601
1906 -92601 -108227 27190 -140449 -99249 -11436 105378 -62203 -124748 191833 111404 -25818
1895 -25818 48050 62437 -112411 -90255 35014 105815 126534 55239 -99430 -27621 -39767
1884 -39767 133188 109758 -165077 -237348 -69998 -79895 -132161 5231 71217 -41249 -23245
1873 -23245 66558 -37715 54994 89243 114299 168893 55320 67166 49363 3760 -19836
1862 -19836 82065 77393 -173577 -202184 -83064 18071 64019 37094 178505 176984 57925
1851 57925 77706 170481 18472 -41391 -23284 26020 51659 85800 78323 75017 106400 53470
1839 53470 -12449 4783 32419 42515 68306 87227 108029 -31880 -45565 -27032 -6217 -43640
1827d3640K28282J45076r3970q867n3724o3586J75579j05257k51314J08799K8676
1816F6054L7294p1423J64464p5869j39885m6782R3027j26554L4537J8066J7611
1805b9460R8573j35772K13282j79076k10313K1093K29398K3181J2356k17606k5270
1794a99614l1533J50357l8184q4123M3721J44908P3459l0405j24791K1099M3758
1783c1348J06042q9700j19818q7658j1008J73855N1617p3032o1358M520o1590
1772a99478K35795k8536q6666r058l6819J07519m6442N0620J14360n7416n0387
1761f508P5549j2943j38887K08755k31173r0848j6665j02555K8413J31990J292
1750a53580p2049J2692J58748p6563l7352R7113O3539j40188j5271Q6124k5162
$$ plain form
1827 -43640 184642 329718 235748 226881 173157 109571 285150 179893 -71421 37378 66054
1816 66054 103348 31925 196389 120520 -19365 -66147 26880 -99674 -65137 -47071 -29460
1805 -29460 69113 -66659 146623 -32453 -242766 -221673 7725 30906 43262 -174344 -199614
1794 -199614 -231147 -80790 -118974 -203097 -159376 -14468 58991 28586 -96205 -75106 -31348
1783 -31348 74694 -15006 -134824 -222482 -233490 -59635 -8018 -81050 -142408 -137888 -199478
1772 -199478 36317 7781 -78885 -87943 -124762 -17243 -63685 -13065 101295 43879 -6508
1761 -6508 69041 56098 -82789 125966 -105207 -196055 -212720 -315275 -286862 -154872 -153580
1750 -153580 -225629 -212937 -54189 -130752 -168104 -70991 -7452 -147640 -162911 -76787 -101949
1739a01949p3877n1265J58198J58332j5522j40427l088J33617K9688n0087L3933
1728G7553j92053N1383R7158o1789m5367m1424n772N6867j21870L289M7403L13299
1716A78677j324k35049J29023o7269q9101j11919J63651M0275j24534P947o0081
1705a69704J38372M2070n9026O8657n9752q7856J04024k7644K4483K14466k4341
1694A63749j75240j7504j3752r0899m9154n0129j0857J35155K0261j11945J21307
1683g9008Q6209N0854k04146r6036P8521N2557o581J48109p9988m1495O3883n3427
1671h0548J22613j24058j24280J1299N9939O3331l2444J62118K5889k47200L3852
1660a29489K3864n3240k1581O9884m1162K4269L6202j6717R2311o2120r3502Q4933
$$ plain form
1739 -101949 -175826 -227091 -68893 89439 73917 -66510 -69598 64019 93707 43620 77553
1728 77553 -114500 -63117 34041 -27748 -73115 -114539 -120311 -63444 -185314 -182025 -134622 178677
1716 178677 177353 -57696 71327 4058 -85043 -196962 -33311 6964 -117570 -109623 -169704
1705 -169704 -31332 10738 -48288 20369 -39383 -127239 -23215 -50859 -26376 188090 163749
1694 163749 -11491 -28995 -42747 -133646 -182800 -232929 -243786 -108631 -88370 -200315 -79008
1683 -79008 7201 58055 -146091 -242127 -163606 -111049 -117630 30479 -49509 -91004 -27121 -80548
1671 -80548 42065 -81993 -206273 -194974 -135035 -71704 -104148 57970 83859 -163341 -129489
1660 -129489 -105625 -158865 -180446 -110562 -151724 -127455 -91253 -107970 -15659 -77779 -171281 -86348
1648h6348P9435j33720P9071j00130j4488J09244O287J2225O0892r0628l8779
1637a16939R2919J2684m0786K8294k2700K474j9572q3649j01175m9272J5428L4564
1625b47730J48221O258Q3076p8614Q3762m4101j88850M667J14975M6192J7145
1614e4999j38860Q4445P3971m5509j16035p4632J47265j56282k7498K46435j06866
1603a68565K1597k1781o4078k0432J70211M2467m0235L3313j40015P3076N4711
1592e9731j9J792j25436J8278j0301M7709l3578K6926Q4256L3690l8346k1481
1580g6241R9529j8623r4494K0792O5658p7278j3903L4563m5609Q2451N6247k2700
1568A0392Q6560k04581M0656N5795Q4503j55380k8799R4551J24839K9748J0969
$$ plain form
1648 -86348 -6913 -140633 -61562 -161692 -176180 -66936 -60649 -48424 12468 -78160 -116939
1637 -116939 -24020 -11336 -52122 -23828 -46528 -44054 -63626 -147275 -248450 -297722 -282294 -247730
1625 -247730 -99509 -93251 -10175 -88789 -5027 -49128 -237978 -233311 -118336 -72144 -54999
1614 -54999 -193859 -109414 -35443 -80952 -196987 -271619 -124354 -280636 -308134 -61699 -168565
1603 -168565 -146968 -168749 -232827 -253259 -83048 -40581 -80816 -47503 -187518 -114442 -59731
1592 -59731 -59750 -57958 -183394 -165116 -175417 -127708 -161286 -134360 -50104 -16414 -54760 -76241
1580 -76241 23288 4665 -89829 -69037 -3379 -80657 -94560 -59997 -105606 -23155 33092 10392
1568 10392 96952 -107629 -66973 -11178 73325 -82055 -110854 -16303 108536 138284 149253
1557A49253l6962p1689j48299k6608J69632Q36j6795O7464p837j15889O240m0249
1545g0903k2825R0642j04030K40508m5005j58459P6341J67137j28493j12153J12166
1534D4926l4876K8405p6970K2139j16125J81764J44434m2742q3661m9326n4416
1523c6448k722j02803p8049J24067Q1482K8778J7490L774l1396r518o3128m2207
1511a10680J47353p3655K03212k3804j29912j28642R9641J95075j98598M6385
1501B6375L3702m1736l1285P8291K1794j63504l0716n7707j28020M5825K0867
1490b26114J51710O7190J37626j07361k68249N1222L1337l2939J18467J83738
1480A06627J3679m6962r7962K9791j90281J8467q2027k6715J81641O810o5776
$$ plain form
1557 149253 112291 40602 -107697 -134305 35327 36163 19368 86832 78995 -36894 -30654 -70903
1545 -70903 -93728 -3086 -107116 133392 88387 -70072 6269 173406 44913 -67240 44926
1534 44926 10050 38455 -38515 -16376 -132501 49263 193697 150955 67294 17968 -36448
1523 -36448 -39170 -141973 -220022 -95955 -14473 14305 31795 35569 4173 -5345 -68473 -110680
1511 -110680 36673 -36982 166230 142426 12514 -116128 -16487 178588 -20010 26375
1501 26375 60077 18341 -12944 65347 87141 -76363 -107079 -164786 -292806 -246981 -226114
1490 -226114 -74404 -7214 130412 23051 -245198 -193976 -162639 -195578 -77111 106627
1480 106627 120306 73344 -24618 5173 -185108 -166641 -248668 -275383 -93742 -86932 -152708
1469a52708r5628O8079O7821R5444j13395k053j09015J05037P6274k7832Q2193
1458e783j19772K0043q0036q8037K23690N4371N2193M8451j16881R8076p6720
1447I595m2180n8140k1628O1885L3986K4295j20503N2142r9401j60854J86890
1436a33913q377J0572Q9604K8169l0868J70264o7561m3301P7057o9521L5174P5801
1424A33100n1644j78116P6619P1868P3324n0134q625r9510J27186p5668K7431
1413D5831p7608o4177p9837o830J38739k5614l2957k9279l549K2782O8127J89758
1401A45386j01671k4405J26040j1877o9532p7n132j90973J02981l9787l1913J15474
1389A4514j41460q7771Q4708n847K8076J8802J64824L1590j2901j57320R1147
$$ plain form
1469 -152708 -248336 -180257 -112436 -16992 -130387 -132440 -241455 -136418 -60144 -87976 -5783
1458 -5783 -125555 -105512 -185548 -273585 -49895 4476 56669 105120 -11761 86315 9595
1447 9595 -32585 -90725 -112353 -50468 -16482 7813 -112690 -60548 -159949 -320803 -133913
1436 -133913 -142290 -131718 -42114 -13945 -44813 125451 57890 14589 91646 22125 57299 133100
1424 133100 81456 -96660 -20041 51827 125151 75017 66392 -33118 94068 18400 45831
1413 45831 -31777 -95954 -175791 -182621 -43882 -69496 -102453 -131732 -135281 -112499 -44372 145386
1401 145386 43715 19310 145350 133473 63941 63864 58732 -132241 -29260 -69047 -100960 14514
1389 14514 -126946 -214717 -130009 -135856 -107780 -88978 75846 107436 94535 -62785 28362
1378B8362J26268j5195o3342l1198j0268J03559p1798r9561p6149R7232j2899
1367b4989J21050q6550j80666N1434m1410p0695J89245L6536p2614K36293q0830
1356G6804j47234j26533J44989j6568r2490l1567M6133J64780J44077j26532j25228
1345h9369j24721L7710J46627l6692n0183Q1392m5010o7859J85106j28412j32364
1334b23775J73937R0157l6441k4109K6802j58911p1101J7502J3578R7631O1900
1323c2830n0313L4781j1123j135r5791R8921J02584l0536L530J662l7409j1979
1311b9638Q1172r3210r7302N1742K16494l5067k07472L6054k5632J6620J16369
1300C0130m9271o6752J30768J7337q7896r7976J20864n4587O3914P0083j03112
$$ plain form
1378 28362 154630 139435 76093 44895 34627 138186 66388 -33173 -109322 -12090 -24989
1367 -24989 96061 9511 -171155 -119721 -161131 -231826 -42581 -6045 -78659 157634 76804
1356 76804 -70430 -196963 -51974 -68542 -161032 -192599 -146466 18314 162391 35859 -89369
1345 -89369 -214090 -176380 -29753 -66445 -116628 -35236 -80246 -148105 37001 -91411 -223775
1334 -223775 -49838 40319 3878 -20231 6571 -152340 -223441 -205939 -192361 -94730 -32830
1323 -32830 -83143 -48362 -59485 -60620 -156411 -57490 45094 14558 18088 19750 -17659 -29638
1311 -29638 51534 -41676 -138978 -87236 129258 94191 -113281 -77227 -102859 -86239 30130
1300 30130 -19141 -85893 44875 62212 -25684 -123660 -2796 -57383 6531 76614 -26498
1289b6498j3312M535j8517P7319m3745p9722P5047r0645J00623K1952J854n1638
1277d2747M7733R0450J04026k43090q8010l9260L384O0618l7766M7879N0233K3434
1265b3116N4793j00366j1156m9227K26110M1302n1249j95392l1231O9718r5046
1254a64860L3481O0270j5671m3533J10097j17288J20318J4580m4699l1387Q3545
1243D853p6783J59977O8691q5420j5565j34272j76487o305K32726O7779k0262
1232A8932M7814P0272p2813m5281O8901q1019l2202L8077q0305k5868r4811k3403
1220b11706n441J07750J34786R8588r5070R7970j79826Q7526q7250m3075P8822
1209a6926M5462L5643k053J77762j46466o0397J30458j96578r1412J14524o8961
$$ plain form
1289 -26498 -39810 -35275 -53792 23527 -20218 -99940 -24893 -115538 -14915 7037 8891 -42747
1277 -42747 4986 95436 199462 -43628 -131638 -170898 -167514 -106896 -144662 -96783 -46550 -23116
1265 -23116 31677 -68689 -79845 -129072 97038 138340 87091 -108301 -139532 -69814 -164860
1254 -164860 -131379 -71109 -86780 -130313 -20216 -137504 -17186 -2606 -47305 -78692 4853
1243 4853 -71930 88047 156738 71318 55753 -78519 -255006 -261311 -28585 39194 18932
1232 18932 66746 137018 64205 18924 87825 6806 -25396 12681 -67624 -93492 -188303 -211706
1220 -211706 -217147 -109397 25389 123977 28907 126877 -52949 34577 -52673 -95748 -16926
1209 -16926 28536 64179 62126 239888 93422 33025 163483 -33095 -124507 -9983 -78944
1198g8944M9861l6379M3110k6912Q5559K6815K1103k03944j01597Q9111J2156
1187a20061J2039J95777Q6992m507j53670L3229j60111J25290O409o0961n8833
1176i8407q8209R2130J54480j51743p2724J40228J21928m5299M0034J01241J6316
1165B09975m5369O139m1646k02675M9860O8672J537l7603J21621m3625m6473n7283
1153a6870M9780n6281r85J68531p2556n0026J5820o2087q0653m6588j35665R5197
1141a92383P4218N4385o584j574K01499k4604M703l5277m3899n7822n9854P1532
1129a5660j6535r9881R3368J08632l8783r1419J59322k5795Q3278n4040j52932
1118e0445k1170k6460J25938k4871r4545j2973p4238K26087o2594K1828O0197
$$ plain form
1198 -78944 -29083 -65462 -22352 -49264 36295 63110 84213 -119731 -221328 -132217 -120061
1187 -120061 -108022 87755 174747 170240 16570 49799 -110312 14978 21387 -39574 -98407
1176 -98407 -186616 -94486 59994 -91749 -164473 -24245 97683 52384 92418 193659 209975
1165 209975 164606 170745 129099 -73576 -23716 44956 46493 8890 130511 86886 40413 -16870
1153 -16870 32910 -23371 -24356 144175 71619 21593 37413 -24674 -105327 -151915 -287580 -192383
1141 -192383 -118165 -63780 -70364 -71938 129561 104957 109660 74383 30484 -27338 -87192 -15660
1129 -15660 -32195 -132076 -38708 69924 31141 -60278 99044 73249 156527 102487 -50445
1118 -50445 -71615 -98075 27863 2992 -91553 -104526 -178764 47323 -15271 6557 66754
1107F6754J55448J2403j46141j2071j56656M9785J27025j9292r1364J1867K0546
1096A8304O0304J46905j5754r2226k7402Q7824R7726K138k11791p6245K37004
1085B26787q8357r2053J9189J05937M1967j66351p2748O1406N9248p0570K7337
1074E1792n38n6476O7061m2242k3291j50932K507J12348J249k8055J7278r747
1062e9046l238O1953m3957K3832O0264o2888j74844k1948R5394K3374P2575M8732
$$ plain form
1107 66754 222202 234605 88464 76393 -80263 -30478 96547 77255 -14109 -2242 18304
1096 18304 78608 225513 209759 117533 90131 177955 275681 277819 66028 -10217 226787
1085 226787 138430 46377 65566 171503 213470 47119 -25629 35777 95025 24455 51792
1074 51792 51254 -5222 61839 19597 -3694 -154626 -152119 -39771 -38522 -66577 -49299 -59046
1062 -59046 -62284 -331 -44288 -20456 39808 -23080 -197924 -219872 -124478 -101104 -28529 20203
$$ [...]
##END NTUPLES=NMR SPECTRUM
##END=
