##TITLE=1H_77-2024
 CDCl3
 8 sc, 
 12.9.2024
##JCAMPDX= 6.0         $$ Bruker NMR JCAMP-DX V2.0
##DATA TYPE= NMR FID
##DATA CLASS= NTUPLES
##ORIGIN= UXNMR, Bruker Analytische Messtechnik GmbH
##OWNER= root
$$ XWIN-NMR		Version 3.5
$$ Thu Sep 12 14:09:10 2024 Russian Standard Time (UT+4h)  she@DPX200
##.OBSERVE FREQUENCY= 200.1318
##.OBSERVE NUCLEUS= ^1H
##.DELAY= (6, 6)
##.ACQUISITION MODE= SIMULTANEOUS
##.ACQUISITION SCHEME= undefined
##.AVERAGES= 8
##.DIGITISER RES= 18
##SPECTROMETER/DATA SYSTEM= spect
##.PULSE SEQUENCE= zg30
##.SOLVENT NAME= CDCl3
##.SHIFT REFERENCE= (INTERNAL, CDCl3, 0, 15.7039)
##AUDIT TRAIL= $$ (NUMBER, WHEN, WHO, WHERE, WHAT)
$$ ##TITLE= Audit trail, XWIN-NMR		Version 3.5
$$ ##JCAMPDX= 5.01
$$ ##ORIGIN= Bruker BioSpin GmbH
$$ ##OWNER= she
$$ F:/spectra/data/she/nmr/H-F/1/audita.txt
$$ ##AUDIT TRAIL=  $$ (NUMBER, WHEN, WHO, WHERE, WHAT)
(   1,<2024-09-12 14:08:07.48 +0400>,<she>,<DPX200>,
      <created by zg, POWCHK disabled, PULCHK disabled
       configuration hash MD5:
       00 E9 B6 7A A2 85 ED C7 34 08 36 98 17 FE 4E 26
       data hash MD5: 16K
       2A 9E 3A 7B 25 57 13 EF 1D 73 B3 19 87 C8 26 8D>)
$$ ##END=
$$ 
$$ hash MD5
$$ 7D D3 F1 DF 2F 8C 4E 1E B4 69 0E B7 7D AD 52 95
##$RELAX= 
##$RELAX= 
##$RELAX= 
##$RELAX= 
##$RELAX= 
##$RELAX= 
$$ Bruker specific parameters
$$ --------------------------
##$DU= <F:/spectra>
##$EXPNO= 1
##$NAME= <H-F>
##$PROCNO= 1
##$TYPE= <nmr>
##$USER= <she>
##$AMP= (0..31)
100 100 100 100 100 100 100 100 100 100 100 100 100 100 100 100 100 100 
100 100 100 100 100 100 100 100 100 100 100 100 100 100 
##$AQSEQ= 0
##$AQ_mod= 1
##$AUNM= <au_zg>
##$AUTOPOS= <>
##$BF1= 200.13
##$BF2= 200.13
##$BF3= 200.13
##$BF4= 200.13
##$BF5= 200.13
##$BF6= 200.13
##$BF7= 200.13
##$BF8= 200.13
##$BYTORDA= 1
##$CFDGTYP= 0
##$CFRGTYP= 5
##$CHEMSTR= <none>
##$CNST= (0..31)
1 1 145 1 1 1 1 1 1 1 1 1 1 1 1 1 1 1 1 1 1 1 1 1 1 1 1 1 1 1 1 1 
##$CPDPRG= <>
##$CPDPRG1= <>
##$CPDPRG2= <>
##$CPDPRG3= <>
##$CPDPRG4= <mlev>
##$CPDPRG5= <mlev>
##$CPDPRG6= <mlev>
##$CPDPRG7= <mlev>
##$CPDPRG8= <mlev>
##$CPDPRGB= <>
##$CPDPRGT= <>
##$D= (0..31)
0 1.2 0 0 0 0 0 0 0 0.06 0 0.03 0 0 0 0 0.0002 0 0 0 0 0 0 0 0 0 0 0 0 
0 0 0 
##$DATE= 1726135686
##$DBL= (0..7)
120 120 120 120 120 120 120 120 
##$DBP= (0..7)
150 150 150 150 150 150 150 150 
##$DBP07= 0
##$DBPNAM0= <>
##$DBPNAM1= <>
##$DBPNAM2= <>
##$DBPNAM3= <>
##$DBPNAM4= <>
##$DBPNAM5= <>
##$DBPNAM6= <>
##$DBPNAM7= <>
##$DBPOAL= (0..7)
0.5 0.5 0.5 0.5 0.5 0.5 0.5 0.5 
##$DBPOFFS= (0..7)
0 0 0 0 0 0 0 0 
##$DE= 6
##$DECBNUC= <off>
##$DECIM= 24
##$DECNUC= <off>
##$DECSTAT= 4
##$DIGMOD= 1
##$DIGTYP= 9
##$DL= (0..7)
0 120 120 120 120 120 120 120 
##$DP= (0..7)
150 150 150 150 150 150 150 150 
##$DP07= 0
##$DPNAME0= <>
##$DPNAME1= <>
##$DPNAME2= <>
##$DPNAME3= <>
##$DPNAME4= <>
##$DPNAME5= <>
##$DPNAME6= <>
##$DPNAME7= <>
##$DPOAL= (0..7)
0.5 0.5 0.5 0.5 0.5 0.5 0.5 0.5 
##$DPOFFS= (0..7)
0 0 0 0 0 0 0 0 
##$DQDMODE= 0
##$DR= 18
##$DS= 0
##$DSLIST= <SSSSSSSSSSSSSSS>
$$ [...]
##$SUBNAM2= <"">
##$SUBNAM3= <"">
##$SUBNAM4= <"">
##$SUBNAM5= <"">
##$SUBNAM6= <"">
##$SUBNAM7= <"">
##$SUBNAM8= <"">
##$SUBNAM9= <"">
##$SW= 24.0689170037331
##$SWIBOX= (0..15)
0 0 2 0 0 0 0 0 0 0 0 0 0 0 0 0 
##$SW_h= 4816.95568400771
##$TD= 16384
##$TD0= 1
##$TE= 0
##$TE2= 300
##$TE3= 300
##$TEG= 300
##$TL= (0..7)
0 120 120 120 120 120 120 120 
##$TP= (0..7)
150 150 150 150 150 150 150 150 
##$TP07= 0
##$TPNAME0= <>
##$TPNAME1= <>
##$TPNAME2= <>
##$TPNAME3= <>
##$TPNAME4= <>
##$TPNAME5= <>
##$TPNAME6= <>
##$TPNAME7= <>
##$TPOAL= (0..7)
0.5 0.5 0.5 0.5 0.5 0.5 0.5 0.5 
##$TPOFFS= (0..7)
0 0 0 0 0 0 0 0 
##$TUNHIN= 0
##$TUNHOUT= 0
##$TUNXOUT= 0
##$USERA1= <user>
##$USERA2= <user>
##$USERA3= <user>
##$USERA4= <user>
##$USERA5= <user>
##$V9= 5
##$VALIST= <valist>
##$VCLIST= <CCCCCCCCCCCCCCC>
##$VD= 0
##$VDLIST= <DDDDDDDDDDDDDDD>
##$VPLIST= <PPPPPPPPPPPPPPP>
##$VTLIST= <TTTTTTTTTTTTTTT>
##$WBST= 1024
##$WBSW= 4
##$XGAIN= (0..3)
0 0 0 0 
##$XL= 0
##$YL= 0
##$YMAX_a= 109565
##$YMIN_a= -94687
##$ZGOPTNS= <>
##$ZL1= 120
##$ZL2= 120
##$ZL3= 120
##$ZL4= 120
##$ABSF1= 10
##$ABSF2= 0
##$ABSG= 5
##$ABSL= 3
##$ALPHA= 0
##$AQORDER= 0
##$ASSFAC= 0
##$ASSFACI= 0
##$ASSFACX= 0
##$ASSWID= 0
##$AUNMP= <proc_1d>
##$AZFE= 0.1
##$AZFW= 0.1
##$BCFW= 1
##$BC_mod= 2
##$BYTORDP= 1
##$COROFFS= 0
##$CY= 11.3945322036743
##$DATMOD= 1
##$DC= 2
##$DFILT= <>
##$DTYPP= 0
##$F1P= 15.6554695791079
##$F2P= 12.8336369535428
##$FCOR= 0.5
##$FTSIZE= 0
##$FT_mod= 4
##$GAMMA= 1
##$GB= 0.15
##$INTBC= 1
##$INTSCL= 1
##$ISEN= 128
##$LB= 0.24
##$LEV0= 0
##$LPBIN= 0
##$MAXI= 10000
##$MC2= 0
##$MEAN= 0
##$ME_mod= 0
##$MI= 1.114404
##$NCOEF= 0
##$NC_proc= 0
##$NLEV= 6
##$NOISF1= 3.799351
##$NOISF2= 2.8
##$NSP= 1
##$NTH_PI= 0
##$NZP= 0
##$OFFSET= 15.70392
##$PC= 1
##$PHC0= -26006.64
##$PHC1= 17.38748
##$PH_mod= 1
##$PKNL= yes
##$PPARMOD= 0
##$PSCAL= 0
##$PSIGN= 0
##$REVERSE= no
##$SF= 200.130013532006
##$SI= 16384
##$SIGF1= 3
##$SIGF2= 2
##$SINO= 400
##$SIOLD= 16384
##$SREGLST= <1H.CDCl3>
##$SSB= 0
##$STSI= 0
##$STSR= 0
##$SW_p= 3612.71676300578
##$SYMM= 0
##$S_DEV= 0
##$TDeff= 0
##$TDoff= 0
##$TI= <>
##$TILT= no
##$TM1= 0
##$TM2= 0
##$TOPLEV= 0
##$USERP1= <user>
##$USERP2= <user>
##$USERP3= <user>
##$USERP4= <user>
##$USERP5= <user>
##$WDW= 1
##$XDIM= 8192
##$YMAX_p= 0
##$YMIN_p= 0
$$ End of Bruker specific parameters
$$ ---------------------------------
##NTUPLES= NMR FID
##VAR_NAME=  TIME,          FID/REAL,        FID/IMAG
##SYMBOL=    X,             R,               I
##VAR_TYPE=  INDEPENDENT,   DEPENDENT,       DEPENDENT
##VAR_FORM=  AFFN,          ASDF,            ASDF
##VAR_DIM=   8192,          8192,            8192
##UNITS=     SECONDS,       ARBITRARY UNITS, ARBITRARY UNITS
##FACTOR=    0.0002076,     1,               1
##FIRST=     0,             0,               0
##LAST=      1.7004516,     0,               0
##MIN=       0,             -94687,          0
##MAX=       1.7004516,     109565,          0
$$ Real data points
##PAGE= N=1
##DATA TABLE= (X++(R..R)), XYDATA
$$ plain form
0 0 0 0 0 0 0 0 0 0 0 0 0 4 -8 8 -8 8 -8 16 -16 16 -24 24 -32 34 -40 48 -54 62 -70 79 -90 101 -114 128
34 128 -144 160 -177 200 -221 245 -271 299 -333 368 -405 450 -498 553 -614 682 -761 852 -960
53 -960 1087 -1242 1430 -1664 1952 -2275 2385 -2571 109228 -38365 -51021 109565 -24267
66 -24267 -26459 95130 -555 -68078 31593 24859 -37144 29573 42886 -56853 10657 58142
78 58142 -38730 -1131 24373 -43566 3601 3940 -41020 -19156 -24223 8796 21256 -22965 15510
91 15510 -1915 -27611 46017 7389 -32835 33164 10179 -13339 28886 6936 -26176 18317
103 18317 46234 -14005 -10389 29844 -45389 -13835 62339 -49263 -28306 55146 -52029 -17688
115 -17688 48075 -63072 -24511 50907 -22169 -14849 25244 -18686 -15468 43913 23481 -24897
$$ packed form
0@%%%%%%%%%%%Mj2J6j6J6j6K4l2L2m0M8n6O6p4Q8j02J16j32J49j69J91k15K42
34A28k72L04l37L77m21M66n16N70o32P01p73Q55r48J051j167J296j443J613j812
53i60K047k329K672l094L616m227M660m956J11799j47593j2656J60586j33832
66b4267k192J21589r5685o7523R9671o734o2003O6717J3313r9739O7510M7485
78E8142r6872L7599K5504o7939M7167L39m4960K1864n067L3019J2460m4221L8475
91A5510j7425k5696P3628l8628m0224O5999k2985k3518M2225k1950l3112M4493
103A8317K7917o0239L616M0233p5233L1554P6174j11602K0957Q3452j07175L4341
115a7688O5763j11147L8561P5418p3076P320M0093m3930L218N9381k0432m8378
$$ plain form
127 -24897 21253 20018 -30337 25651 11454 -43015 29329 20471 -17886 25274 -13586 -20576 25699
140 25699 -7023 -5197 -4600 -34879 -3772 -4382 -16627 3452 -6633 6300 21057 4086 -749
153 -749 -7576 4459 11210 1079 11147 -16191 -11816 29887 -8422 3748 33145 -23376 12013
166 12013 33308 -39533 -7832 8972 -32891 8289 12826 -29553 -12481 9504 366 -4141 15040
179 15040 1524 -20989 21658 6850 -32575 15477 4498 -13115 35301 226 -19292 17958
191 17958 -2254 6522 17267 -11678 78 272 -6706 3278 -13559 -6661 3635 -1858 6491 -11397
205 -11397 -11932 4022 -4904 14115 5927 -15649 10239 -1453 -5253 14628 -13625 170 18130
218 18130 -8194 9196 660 -16253 18871 9020 -2259 9548 -11954 -8964 2476 -4170 -4679
$$ packed form
127b4897M6150j235n0355N5988j4197n4469P2344q858l8357M3160l8860o990M6275
140B5699l2722J826N97l0279L1107o10j2245K0079j0085J2933J4757j6971m835
153g49o827J2035O751j0131J0068k7338M375M1703l8309J2170K9397n6521L5389
166A2013K1295p2841L1701J6804m1863M1180M537m2379J7072K1985r138m507J9181
179A5040j3516k2513M2647j4808l9425M8052j0979j7613M8416l5075j9518L7250
191A7958k0212Q776J0745k8945J1756J94o978R984j6837O898J0296n493Q349j7888
205a1397n35J5954q926J9019q188k1576K5888j1692l800J9881k8253J3795J7960
218A8130k6324J7390q536j6913L5124r851j1279J1807k1502K990J1440o646n09
$$ plain form
231 -4679 -9481 5175 3868 -8631 12042 -7896 -12974 27337 -894 -10062 12983 -19306 -7649
244 -7649 16224 -7487 895 6522 2092 8790 -800 3426 -2369 -6934 16953 -3176 -14829 3479
258 3479 -14331 -3484 14281 -5361 1857 3039 -534 7099 -7732 -287 2196 -10150 14095
271 14095 -692 -19648 8524 -3211 -2957 19746 -3087 -3708 6713 -2173 1391 -4936 -2001 2069
285 2069 -6230 8667 -3861 -17058 10070 -178 -829 16946 -8147 -4162 7178 -7499 3334
298 3334 -2061 -6425 7234 -4448 1062 1673 -12369 9345 7693 -1422 10122 -7862 -5887 6153
312 6153 -6792 2022 -1044 -6831 7989 -3973 -2054 4009 -7593 10263 8615 -4591 6348
325 6348 -9697 -6900 9116 -7921 1376 4607 -9389 7560 2132 -6592 5690 -429 5238 5194
$$ packed form
231d679m802J4656j307j2499K0673j9938n078M0311k8231r168K3045l2289J1657
244g649K3873k3711Q382N627m430O698r590M226n795m565K3887k0129j1653J8308
258C479j7810J0847J7765j9642P218J182l573P633j4831P445K483j2346K4245
271A4095j4787j8956K8172j1735K54K2703k2833o21J0421q886L564o327K935M070
285B069q299J4897j2528j3197K7128j0248o51J7775k5093L985J1340j4677J0833
298C334n395m364J3659j1682N510O11j4042K1714j652r115J1544j7984J975J2040
312F153j2945Q814l066n787J4820j1962J919O063j1602J7856j648j3206J0939
325F348j6045K797J6016j7037R297L231j3996J6949n428q724J2282o119N667m4
$$ plain form
339 5194 -5767 -349 -9662 -2888 9617 -8213 2405 6180 -10900 9093 3954 -9019 8826
352 8826 1066 -623 4338 -8900 -2902 -3512 -1843 10632 -4840 -287 7413 -8484 5734 5370
366 5370 -8323 6426 910 -3427 1160 -9367 -507 61 -1335 11858 -4834 -3622 9949 -8200
380 -8200 2195 7842 -10230 3686 2313 -8164 534 -5656 511 5315 396 8696 -3507 -4041
394 -4041 8580 -6143 1237 6837 -9993 3024 1164 -9048 3737 -2925 997 9288 -2694
407 -2694 3253 -1310 -7638 6475 -3065 -2690 4825 -8571 506 1250 -6962 6093 772 1725 10115
422 10115 -4124 704 1207 -7100 6143 -626 -3862 4511 -6924 710 4094 -5516 7931 2292
436 2292 -2985 7372 -7245 -5657 2261 -7114 2209 1265 -4685 3097 -3984 2171 5822 -3099 8782
$$ packed form
339E194j0961N418r313O774J2505j7830J0618L775j7080J9993n139j2973J7845
352H826p760j689M961j3238N998o10J669J2475j5472M553P700j5897J4218l64
366E370j3693J4749n516m337M587j0527Q860N68j396J3193j6692J212J3571j8149
380h200J0395N647j8072J3916j373j0477Q698o190O167M804m919Q300j2203n34
394d041J2621j4723P380N600j6830J3017j860j0212J2785o662L922Q291j1982
407b694N947m563o328J4113r540L75P515j3396R077P44q212J3055n321R53Q390
422A0115j4239M828N03q307J3243o769l236Q373j1435P634L384r610J3447n639
436B292n277J0357j4617J588P918r375R323r44n950P782p081O155L651q921J1881
$$ plain form
451 8782 2963 -5369 6451 -6167 -5326 6960 -3604 2884 4121 -4397 3617 -1951 380 5867
465 5867 -5719 2803 592 -11687 2141 -4194 -7765 7076 -1584 -1099 3368 -3437 2522 -503
479 -503 1863 7046 -4602 4129 2908 -9850 6792 1743 -5624 10695 -705 -3747 5387 -4733
493 -4733 -183 2099 -2112 2851 -4914 -3631 -1471 -9503 1641 751 -4577 6717 -2253 -1818 6087
508 6087 -3456 5012 5060 -3454 6548 -3040 -5358 5603 -4589 2844 8834 -3091 4336 2090 -4536
523 -4536 2947 -2992 -2404 -1314 -6988 -1181 -6828 -5197 4074 -3567 5299 7018 -6344 5495 247
538 247 -6572 8411 -2989 -3295 7927 -4513 739 6126 -1964 6327 5839 1702 1430 -4704 -1421
553 -1421 -5348 -4509 3234 -7802 -2248 4594 -9589 2285 3926 -8378 7551 1914 -6762 4331
$$ packed form
451H782n819q332J1820j2618Q41J2286j0564O488J237q518Q014n568K331N487
465E867j1586Q522k211j2279J3828o335l571J4841q660M85M467o805N959l025
479e03K366N183j1648Q731j221j2758J6642n049p367J6319j1400l042R134j0120
493d733M550K282m211M963p765J283K160q032J1144q90n328J1294q970M35P905
508F087r543Q468M8q514J0002r588k318J0961j0192P433N990j1925P427k246o626
523d536P483n939N88J090n674N807n647J631R271p641Q866J719j3362J1839n248
538B47o819J4983j1400l06J1222j2440N252N387q090Q291m88m137k72o134L283
553a421l927Q39P743j1036N554O842j4183J1874J641j2304J5929n637q676J1093
$$ plain form
567 4331 -4716 -2526 6919 122 4780 3964 -1011 4757 211 1057 2563 -1109 4319 -1694 -3023 864
583 864 -9020 1410 3756 -9397 3714 -2749 -11656 6411 -2334 -6472 8820 -1037 -793 6229
597 6229 -3293 -1414 1693 2383 3157 -52 3420 -1009 -328 9254 -1176 1651 7116 -7021 993
612 993 -394 -13875 1473 -2238 -7476 7470 -4149 -5986 6832 -2444 75 5036 -3543 -2372
626 -2372 -557 -250 -3282 -1186 7746 722 5016 12067 -6026 1320 8803 -7883 3077 2878 -12078
641 -12078 1246 -1014 -7376 3123 -2327 18 5233 -2544 -1028 -3677 -4957 1114 -976 327
655 327 -1090 -1527 4450 -838 4623 6942 -4936 8055 6079 -9649 5427 -254 -9960 10629
669 10629 1496 -8320 4826 -2472 -5889 2923 -316 -4312 -2107 3749 -2878 -5647 5049 -3986
$$ packed form
567D331r047K190R445o797M658q16m975N768m546Q46J506l672N428o013j329L887
583H64r884J0430K346j3153J3111o463q907J8067q745m138J5292r857K44P022
597F229r522J879L107O90P74l209L472m429O81R582j0430K827N465j4137Q014
612I93j387j3481J5348l711n238J4946j1619j837J2818r276K519M961q579J171
626b372J815L07l032K096Q932p024M294P051j8093P346P483j6686J0960j99j4956
641a2078J3324k260o362J0499n450K345N215p777J516k649j280O071k090J303
655C27j417m37N977n288N461K319j1878J2991j976j5728J5076n681r706K0589
669A0629r133r816J3146p298l417Q812l239l996K205N856o627k769J0696r035
$$ plain form
683 -3986 -2588 11101 -3913 -4231 6078 -6014 2670 7563 -2955 5317 3129 -657 5752 -4119
697 -4119 -2697 3377 -4079 926 -898 -7290 -1213 897 2237 639 -225 2699 -5468 -36 3132
712 3132 -11704 1083 6441 -8176 6840 4617 -9036 8910 7403 -2501 6148 -460 -5158 -309
726 -309 -345 -2689 -4291 2915 2366 -2569 5581 -2193 -5979 7259 -1632 -3635 2823 -9178 -2761 3561
742 3561 -4755 3402 2675 -1235 7600 965 -1822 1969 -2866 2936 2716 -2296 -720 -3410 715 2538
758 2538 -1035 3230 -2148 -979 5462 -6375 -2097 2719 -6910 4996 3578 -9105 2133 202
772 202 -3563 6454 796 -2401 2186 1214 1531 -1749 799 1620 -2447 5893 -516 -8479 3476 -1816
788 -1816 -2217 7748 -3469 -2194 4176 -2873 2171 -64 -4573 2607 -1336 -914 794 -6047 851
$$ packed form
683c986J398J3689j5014l18J0309j2092Q684M893j0518Q272k188l786O409r871
697d119J422O074p456N005j824o392O077K110J340j598q64K924q167N432L168
712C132j4836J2787N358j4617J5016k223j3653J7946j507r904Q649o608m698M849
726c09l6k344j602P206n49m935Q150p774l786J3238q891k003O458j2001O417O322
742C561q316Q157p27l910Q835o635k787L791m835N802k20n012J576k690M125J823
758B538l573M265n378J169O441j1837M278M816r629J1906j418j2683J1238j931
772B02l765J0017n658l197M587r72L17l280K548Q21m067Q340o409p963J1955n292
788a816m01R965j1217J275O370p049N044k235m509P180l943M22J708o841O898
$$ plain form
803 851 3833 1773 4786 -1078 99 1704 -2302 2545 -2889 -4713 4904 -2269 -1849 3369 -5388 2597
819 2597 7211 -2017 1935 -1563 -4653 1802 -1674 -1188 -707 -2661 3825 118 -499 2818 -2812 3934
835 3934 4984 -3622 788 -3419 -4380 4314 -1789 -976 2287 -2957 3658 1754 -3535 2249 -963 837
851 837 3848 -3878 -2546 -1556 -1472 4675 -864 -484 1982 -2749 4250 1362 -4858 3978 40 -1296
867 -1296 3863 -5344 -3549 1581 -516 3340 -380 -1787 1662 -1921 3090 1586 -4888 3142 578
882 578 -2749 2174 -4643 -2273 3601 319 3651 -713 -2983 3617 -1190 781 2940 -5504 890
897 890 2074 -4120 180 -2253 -653 3983 652 2343 -1838 -3731 4478 -1321 -1256 2790 -5558 35
913 35 2927 -4043 878 285 -153 5218 235 -202 -943 -3474 3167 38 -2367 1220 -3831 458 2827
$$ packed form
803H51K982k060L013n864J177J605m006M847n434j824R617p173M20N218q757P985
819B597M614r228L952l498l090O455l476M86M81j954O486l707o17L317n630O746
835C934J050q606M410m207r61Q694o103Q13L263n244O615j904n289N784l212J800
851H37L011p726J332R90Q4O147n539L80K466m731O999k888o220Q836l938j336
867a296N159r207J795N130k097L856l720j407L449l583N011j504o474Q030k564
882E78l327M923o817K370N874l282L332m364k270O600m807J971K159q444O394
897H90J184o194M300k433J600M636l331J691m181j893Q209n799O5M046q348N593
913C5K892o970M921n93m38N371m983m37p41k531O641l129k405L587n051M289K369
$$ plain form
930 2827 -3508 1916 689 -101 5231 -2106 -2617 633 -3874 2669 1566 -3820 1129 -1083 236 3272
946 3272 -1800 1648 1607 -457 3598 -3110 -3394 1195 -2425 2659 1565 -4462 1931 -141 -172 4398
962 4398 -2799 466 3063 -2574 1335 -2350 -4491 2608 -240 845 1496 -3348 1346 1126 466 3035
978 3035 -2479 390 1886 -3575 979 -1692 -3729 5149 106 -557 2740 -3408 879 3141 -1031
993 -1031 1478 -1695 -1779 1370 -3104 221 -691 -2336 4752 211 -1482 1927 -3052 1379 3291 -2700
1009 -2700 926 -2044 -2429 2661 -2476 -156 2564 -1496 4274 1466 -3005 1403 -1346 467 2438
1024 2438 -2794 -483 -1451 -1814 3050 -1837 188 3066 -1973 2632 387 -4520 1607 -976 -304 2825
1040 2825 -3809 -85 1052 -1585 3931 415 -834 3483 -926 690 247 -3326 1400 -5 -100 1569
$$ packed form
930B827o335N424j227p90N332p337n11L250m507O543j103n386M949k212J319L036
946C272n072L448m1k064M055o708k84M589l620N084j094o027O393k072l1M570
962D398p197L265K597n637L909l685k141P099k848J085O51m844M694k20o60K569
978C035n514K869J496n461M554k671k037Q878n043o63L297o148M287K262m172
993a031K509l173q4L149m474L325r12j645P088m541j693L409m979M431J912n991
1009b700L626k970l85N090n137K320K720m060N770k808m471M408k749J813J971
1024B438n232K311r68l63M864m887K025K878n039M605k245m907O127k583O72L129
1040B825o634L724J137k637N516l516j249M317m409J616m43l573M726j405r5J669
$$ plain form
1056 1569 -4398 -169 1771 -2177 3644 77 -2880 3232 -1684 -1550 996 -3322 1412 1134 -1485
1071 -1485 1152 -2611 108 3542 -463 3068 882 -2407 2615 -1196 -1779 704 -2506 1703 947
1086 947 -2294 1830 -2055 -21 4540 -1994 529 769 -4186 1239 -644 -3006 1838 -787 1177
1101 1177 2497 -1249 2120 471 986 4115 -1950 -738 -99 -4071 1930 -254 -2300 3345 -1022
1116 -1022 586 2842 -3675 637 986 -2123 1979 -2039 -3244 601 -1757 1440 1941 -706 2729
1131 2729 -358 466 1804 -3112 1639 1615 -1971 2997 -1900 -2553 2771 -1235 1303 2392 -3022 1422
1147 1422 -236 -2435 1571 -1819 -581 2404 -1941 158 -858 -1927 1864 -555 1563 1110 -2304
1162 -2304 3002 -3 -1381 3794 -1951 -367 3473 -3711 -897 891 -3020 2647 1433 -713 1644
$$ packed form
1056A569n967M229J940l948N821l567k957O112m916J34K546m318M734k78k619
1071a485K637l763K719L434m005L531k186l289N022l811n83K483l210M209p56
1086I47l241M124l885K034M561o534K523K40m955N425j883k362M844k625J964
1101A177J320l746L369j649N15L129o065J212O39l972O001k184k046N645m367
1116a022J608K256o517M312L49l109M102m018j205L845k358L197N01k647L435
1131B729l087Q24J338m916M751k4l586M968m897o53N324m006K538J089n414M444
1147A422j658k199M006l390J238K985m345K099j016j069L791k419K118m53l414
1162b304N306l005j378N175n745J584L840p184K814J788l911N667j214k146K357
$$ plain form
1177 1644 -1360 349 161 -1896 944 -2564 -1276 1338 -3383 659 1598 -829 4748 791 -1003
1192 -1003 2659 -3199 -240 1975 -3828 994 681 -2328 2794 254 -357 2865 436 865 -962 -2271
1208 -2271 -933 -3617 174 1180 -2964 2792 581 -2157 4172 -907 -930 4227 -2280 -279 952
1223 952 -4016 936 1028 -209 2966 -261 310 1179 -1292 859 -1106 -683 1341 -2612 417 -437 -3454
1240 -3454 2982 76 -1475 3963 -2787 -1362 3009 -2666 753 2121 -1538 1873 351 -942 346
1255 346 -1024 1361 169 -511 1562 -1942 377 2287 -1996 2242 395 -3245 2341 -2607 -3082 2474
1271 2474 -2713 609 3205 -2181 1621 1138 -1244 2009 -112 -197 -260 -1753 320 -2021 196 2940
1287 2940 -1168 2842 2666 -3313 2326 -339 -3390 2385 -2362 -2678 1616 -2699 492 1878 -691
$$ packed form
1177A644l004J709j88k057K840l508J288K614m721M042R39k427N577l957j794
1192a003L662n858K959K215n803M822l13l009N122k540o11L222k429M29j827j309
1208b271J338k684L791J006m144N756k211k738O329n079k3N157o507K001J231
1223I52m968M952R2j237L175l227N71Q69k471K151j965M23K024l953L029q54l017
1240c454O436k906j551N438o750J425M371n675L419J368l659L411j522j293J288
1255C46j370K385j192o80K073l504K319J910m283M238j847l640N586m948m75N556
1271B474n187L322K596n386L802m83k382L253k121q5o3j493K073k341K217K744
1287B940m108M010j76n979N639k665l051N775m747l16M294m315L191J386k569
$$ plain form
1302 -691 2731 794 -353 725 -2106 -448 -586 -1206 2026 -1123 32 1931 -1722 2536 1701 -1863
1318 -1863 3324 -1062 -2857 2062 -3340 -1058 2558 -1988 710 1040 -1539 875 -196 112 594 -789
1334 -789 1315 -1785 -878 2204 -2500 1168 2605 -2829 2188 673 -3268 2670 -53 -1141 3022
1349 3022 -1210 -586 551 -1861 720 -717 -620 858 -1727 772 86 -1479 2626 -243 194 2281
1365 2281 -2839 -156 314 -3228 2293 -17 -1323 3166 -1031 -6 2772 -1430 1301 776 -1749
1380 -1749 -244 -1856 -1184 -141 -863 2030 47 -227 2729 -2083 398 2619 -3441 846 1085 -3782
1396 -3782 884 -320 -1572 2908 533 1198 1340 -959 891 -1227 -661 1178 -2231 458 419 -2623
1412 -2623 1576 -303 -315 3109 -785 307 1020 -2961 964 -249 -2304 2239 -1174 -909 1878 -1665
$$ packed form
1302f91L422j937j147J078k831J658j38o20L232l149J155J899l653M258q35l564
1318a863N187m386j795M919n402K282L616m546K698L30k579K414j071L08M82j383
1334g89K104l100R07L082m704L668J437n434N017j515l941N938k723j088M163
1349C022m232O24J137k412K581j437R7J478k585K499o86j565M105k869M37K087
1365B281n120K683M70l542N521k310j306M489m197J025K778m202K731n25k525
1380a749J505j612O72J043p22K893j983k74K956m812K481K221o060M287K39m867
1396c782M666j204j252M480k375O65J42k299J850k118N66J839l409K689l9l042
1412b623M199j879j2L424l894J092P13l981L925j213k055M543l413K65K787l543
$$ plain form
1428 -1665 402 1253 17 1614 -463 70 -182 -2334 1737 -239 -1875 2786 -1833 -1330 2348 -2450
1444 -2450 642 2303 -1381 1450 -430 -1589 715 -1577 464 527 -1633 1154 -757 -748 2202 -784
1460 -784 948 1667 -1334 1484 -1359 -2200 1592 -1666 -91 2226 -2553 1004 1142 -1679 2082 362
1476 362 -602 1175 -1181 -334 -1193 -1285 1176 -1356 1015 1752 -2597 1539 1438 -2036 2618 -275 -2083
1493 -2083 1633 -1999 -801 608 -1482 1697 446 -482 1554 -1225 629 1303 -1413 1147 -1011
1508 -1011 -1643 1048 -2041 488 955 -1237 2577 436 -1682 2013 -1257 -427 2383 -2064 -91 290
1524 290 -2041 721 -104 -475 1246 -206 1414 168 -1189 1261 -1458 -192 1951 -2628 437 475
1540 475 -2131 2231 147 -959 2760 -472 97 926 -1912 620 226 -747 998 -1422 -267 659
$$ packed form
1428a665K067Q51j236J597k077N33k52k152M071j976j636M661m619N03L678m798
1444b450L092J661l684K831j880j159K304k292K041O3k160K787j911RK950k986
1460g84J732P19l001K818k843q41L792l258J575K317m779L557J38k821L761j720
1476C62r64J777k356Q47q59r2K461k532K371P37m349M136j01l474M654k893j808
1493b083L716l632J198J409k090L179j251r28K036k779J854O74k716K560k158
1508a011o32K691l089K529M67k192L814k141k118L695l270Q30K810m447J973L81
1524B90k331K762q25l71J721j452J620j246j357K450k719J266K143m579L065L8
1540D75k606M362k084j106L719l232N69Q29k838K532l94r73J745k420J155R26
$$ plain form
1556 659 -790 2045 230 -492 1998 -1314 -257 880 -2784 1360 689 -1720 1914 -1085 -1035 2088
1572 2088 -642 977 1270 -1318 905 -572 -1161 148 -1552 1026 607 -901 1410 -1119 -212 2552
1588 2552 -1559 948 866 -2511 1243 -511 -2407 1566 -489 417 1981 -1193 579 170 127 1832
1604 1832 -808 -23 34 -2070 696 -319 -1508 1625 -765 314 1547 -1636 971 646 -1100 2380
1620 2380 -938 -1506 1173 -1733 36 1245 -1240 1032 347 -59 948 -1165 690 478 -1258 1526
1636 1526 -1536 -1536 1232 -1746 690 1346 -1603 1421 601 -1380 1353 -1174 -247 1594 -1365 478
1652 478 -614 -1699 1241 -423 469 1541 -1085 1325 302 -1276 1181 -1320 -571 1485 -2244 217
1668 217 -3 -1710 2249 484 -331 1880 -1466 -4 658 -2025 497 -415 -878 1240 -1159 22
$$ packed form
1556F59j449K835j815p22K490l312J057J137l664M144o71k409L634k999N0L123
1572B088k730J619K93k588K223j477n89J309j700K578m19j508K311k529R07K764
1588B552m111K507q2l377L754j754j896L973k055R06J564l174J772m09m3J705
1604A832k640P85N7k104K766j015j189L133k390J079J233l183K607l25j746L480
1620B380l318n68K679k906J769J209k485K272o85m06J007k113J855k12j736K784
1636A526l062%K768k978K436O56k949L024q20j981K733k527R27J841k959J843
1652D78j092j085K940j664Q92J072k626K410j023j578K457k501P49K056l729K461
1668B17k20j707L959j765q15K211l346J462O62k683K522r12m63K118k399J181
$$ plain form
1684 22 533 -407 2605 376 -586 1311 -2012 -49 819 -2209 664 12 -1293 1992 -931 -601 1619
1701 1619 -988 1129 669 -1670 323 -1021 -425 1104 -1203 781 653 -869 1620 -901 -848 2006
1717 2006 -975 776 392 -1755 617 -390 -544 1510 -1265 86 1190 -1737 1221 11 -801 1859
1733 1859 -51 -122 53 -1911 540 -412 -405 1254 -1073 393 1472 -1376 1473 524 -1395 2057 -546
1750 -546 -1488 307 -1561 128 1054 -620 1261 -262 -74 1637 -875 819 117 -1414 837 -1428
1766 -1428 -1333 880 -1041 1363 1718 -826 1634 -243 -1159 1391 -1319 -664 666 -1761 237 16
1782 16 -713 1441 266 1246 1397 -1236 493 -430 -1290 1248 -1272 -343 1088 -1293 1118 600 -1249
1799 -1249 1791 5 -520 1073 -1791 -480 297 -1181 1228 -77 -598 899 -712 421 411 -645
$$ packed form
1684B2N11r40L012k229r62J897l323J963Q68l028K873o52j305L285k923L30K220
1701A619k607K117m60k339J993j344N96J529k307J984j28j522K489k521N3K854
1717B006k981J751l84k147K372j007j54K054k775J351J104k927K958j210q12K660
1733A859j910p1J75j964K451r52PJ659k327J466J079k848K849r49j919L452k603
1750e46r42J795j868J689R26j674J881j523J88J711k512J694p02j531K251k265
1766a428R5K213j921K404L55k544K460j877r16K550k710O55J330k427J998k21
1782A6p29K154j175R80J51k633J729r23q60K538k520R29J431k381K411n18j849
1799a249L040j786n25J593k864J311P77j478K409j305n21J497j611J133j0j056
$$ plain form
1815 -645 1398 -50 -325 1395 -1837 451 1418 -1210 1362 40 -1634 1195 -599 -412 1042 -632
1831 -632 801 225 -1019 469 -1006 -45 845 -1199 779 -250 -846 1640 -109 263 1825 -822
1847 -822 1129 373 -2091 611 -811 -830 1360 -827 45 915 -694 1424 332 -153 571 -1575 -407
1864 -407 -749 -1748 705 -55 -26 2044 -587 362 1632 -987 1104 466 -1579 774 -908 -646 629
1881 629 -607 737 917 -91 1013 -1022 -438 431 -1667 753 -403 -1905 926 -889 -687 1728
1897 1728 -883 718 1202 -958 861 -291 -779 1289 -526 436 559 -805 650 48 -355 897
1913 897 -829 472 474 -1478 494 -485 -829 1643 -818 -471 453 -2067 404 774 -1056 1500 773
1930 773 57 1178 -342 397 144 -643 925 -1019 -365 402 -1318 1014 807 -589 1603 -217 -949
$$ packed form
1815f45K043j448k75J720l232K288R67k628K572j322j674K829j794J87J454j674
1831f32J433n76j244J488j475R61Q90k044J978j029n96K486j749L72J562k647
1847h22J951p56k464K702j422j9K190k187Q72Q70j609K118j092m85P24k146J168
1864d07l42r99K453p60K9K070k631R49J270k619K091o38k045K353j682K62J275
1881F29j236J344J80j008J104k035N84Q69k098K420j156j502K831j815K02K415
1897A728k611J601M84k160J819j152m88K068j815R62J23j364J455o02m03J252
1913H97j726J301Kj952J972r79l44K472k461L47R24k520K471L70j830K556p27
1930G73p16J121j520P39k53p87J568j944O54P67j720K332k07j396K192j820p32
$$ plain form
1947 -949 915 -1716 -805 103 -1545 224 -124 -777 1144 -75 678 1288 -334 834 -372 -739 677
1964 677 -1123 331 1226 -1061 1420 319 -1013 1552 -187 -626 1117 -1382 -748 -216 -1440 408
1980 408 -253 -236 884 -381 429 65 -788 1111 -439 19 522 -1358 446 495 -1058 1854 313 -622
1998 -622 1350 -636 -316 651 -1218 89 296 -1117 -142 -863 -290 -230 -799 823 -132 -496 1498 -1112
2016 -1112 396 1363 -1100 840 804 -1633 697 -439 -461 1220 -278 319 732 -772 801 -339 -417
2033 -417 676 -1401 -121 -446 -1442 286 -612 134 1383 -920 782 640 -1642 1051 58 -1539 1416
2050 1416 -435 -746 798 -519 88 761 553 715 -126 166 -175 -1269 418 -679 -1149 952 -912
2067 -912 -439 1217 -1078 332 967 -890 920 -434 -874 697 -645 272 729 -463 750 -86 -219
$$ packed form
1947i49J864k631R11R08j648J769l48o53J921j219P53O10j622J168j206l67J416
1964F77j800J454Q95k287K481j101j332K565j739m39J743k499O34N32j224J848
1980D08o61J7J120j265Q10l64q53J899j550M58N03j880J804M9j553K912j541r35
1998f22J972j986L20R67j869J307K07j413R75p21N73O0n69J622r55l64J994k610
2016a112J508R67k463J940l6k437K330j136k2J681j498N97M13j504J573j140p8
2033d17J093k077J280l25r96J728q98P46J249k303J702j42k282K693r93j597K955
2050A416j851l11J544j317O07O73k08J62q41K92l41j094J687j097m70K101j864
2067i12M73J656k295J410O35j857J810j354m40J571j342R17M57j192J213q36j33
$$ plain form
2084 -219 871 -200 675 440 -676 805 -1227 -1005 998 -1365 469 1064 -1554 506 404 -1138
2100 -1138 1466 111 -473 708 -695 -419 -33 -337 508 -175 500 714 -843 905 149 -751 1673
2117 1673 -496 -590 929 -1642 -210 342 -1140 1063 110 -767 931 -406 15 692 -279 482 -382
2134 -382 -728 429 -1013 274 563 -605 1349 -94 -571 1078 -1041 69 1163 -1202 171 173 -1444
2151 -1444 513 -94 -396 883 -215 278 482 -512 458 -783 182 429 -1235 478 -191 -1270 1296
2168 1296 -374 -259 1477 -754 -8 617 -1200 352 230 -938 465 -706 -432 478 -252 532 175
2185 175 0 730 -438 56 16 -1120 1018 -100 -794 1163 -756 -449 1237 -593 814 912 -1017
2202 -1017 441 -386 -778 179 -630 238 424 -376 749 -513 12 1292 -303 753 581 -1081 758
$$ packed form
2084b19J090j071Q75k35j116J481k032K22K003k363J834N95k618K060j02j542
2100a138K604j355n84J181j403K76L86l04Q45o83O75K14j557J748p56r00K424
2117A673k169r4J519k571J432N52j482K203r53q77J698j337M21O77r71P61q64
2134c82l46J157j442J287K89j168J954j443m77J649k119J110J094k365J373Kj617
2151a444J957o07l02J279j098M93K04r94R70j241R65K47j664J713o69j079K566
2168A296j670J15J736k231P46O25j817J552j22j168J403j171K74R10p30P84l57
2185A75j75P30j168M94m0j136K138j118o94J957j919L07J686j830J407R8j929
2202a017J458q27l92R57q09Q68J86q00J125j262N25J280j595J056j72j662J839
$$ plain form
2219 758 -496 -609 998 -675 433 997 -804 564 37 -317 1168 74 -395 411 -1193 -4 -221
2236 -221 -409 755 -509 199 638 -668 1011 208 -660 1171 -422 -812 665 -1174 -21 861 -417
2253 -417 561 1 -478 858 -325 186 254 -873 523 -670 -733 404 -1069 518 964 -656 1029
2270 1029 168 -566 762 -913 -111 908 -1027 249 -39 -874 888 10 42 1089 -718 263 102
2287 102 -771 440 -513 -169 396 -1056 297 44 -647 729 59 -92 1165 -814 26 418 -893 462
2305 462 -19 -806 642 -714 -167 667 -295 960 127 -220 748 -787 14 350 -912 535 20 -974
2323 -974 597 -456 -68 993 -261 770 313 -644 330 -666 -467 418 -1107 222 372 -606 717
2340 717 68 -6 1073 -220 256 -57 -977 363 -540 -270 844 -587 437 764 -807 869 201 -653
$$ packed form
2219G58j254j13J607j673J108N64j801J368n27l54J485j094m69Q06j604J189k17
2236b21j88J164j264P08M39j306J679q03q68J831j593l90J477j839J153Q82j278
2253d17R78n60m79J336j183N11O8j127J396j193o3J137j473J587M46j620J685
2270A029q61p34J328j675Q02J019j935J276k88q35J762q78L2J047j807R81j61
2287A02q73J211r53L44N65j452J353k53o91J376o70j51J257j979Q40L92j311J355
2305D62m81p87J448j356N47Q34r62J255q33l47R68j535Q01L36j262J447n15r94
2323i74J571j053L88J061j254J031m57r57R74r96J99Q85j525J329J50r78J323
2340G17o49p4J079j293M76l13r20J340r03K70J114j431J024L27j571J676o68q54
$$ plain form
2358 -653 435 -624 -469 29 -1242 33 100 -77 853 -208 382 633 -762 334 82 -601 1004 -522
2376 -522 -367 648 -606 645 580 -526 680 -463 -209 686 -590 196 280 -710 372 -224 -733 434
2394 434 -832 259 406 -642 690 -157 -289 1285 -695 142 749 -766 543 -176 -720 955 -250
2411 -250 318 780 -536 402 78 -790 525 -749 -511 120 -1322 -156 18 -539 950 52 -151 978
2429 978 -617 87 254 -701 459 -122 -291 641 -328 561 1112 12 1197 114 -473 234 -886 -460
2447 -460 -321 -1328 271 -438 -468 842 -591 15 830 -818 198 -272 -806 252 -254 -100 1012 -22
2465 -22 878 484 -251 1021 -132 63 691 -535 388 52 -1069 543 -425 -493 703 -521 -335 40
2483 40 -934 330 -5 -468 577 -386 371 376 -541 812 152 -48 1252 -368 208 851 -315 1001 602
$$ packed form
2358f53J088j059J55M98j271J275O7j77R30j061N90K51j395J096k52o83J605j526
2376e22J55J015j254J251o5j106J206j143K54Q95j276P86Q4r90J082n96n09J167
2394D34j266J091J47j048J332q47j32J574j980Q37O07j515J309p19n44J675j205
2411b50N68M62j316R38l24q68J315j274K38O31j442J166J74n57J489q98k03J129
2429I78j595P04J67r55J160n81j69R32r69Q89N51j100J185j083n87P07j120M26
2447d60J39j007J599p09l0J310j433O06Q15j648J016m70n34J058n06J54J112j034
2465b2R00l94p35J272j153J95O28j226R23l36j121J612r68o8J196j224J86L75
2483D0r74J264l35m63J045r63P57Nr17J353o60k00J300j620N76O43j166J316l99
$$ plain form
2502 602 -582 330 -477 -665 -312 -883 -40 9 -498 616 -456 -116 526 -779 116 -10 -1133 230
2520 230 -462 -178 685 -331 947 877 -121 849 136 -276 731 -544 -192 201 -1311 23 -8 -370 522
2539 522 -213 39 -9 -1244 77 -570 -789 534 -572 -169 1007 -582 667 925 -244 846 478
2556 478 -21 550 -261 432 -30 -157 770 -572 -92 535 -983 -13 214 -949 406 -321 -1098 332
2574 332 -925 259 594 -570 756 -274 -314 741 -91 232 846 -68 500 53 -399 420 -623 -101
2592 -101 54 -805 549 -280 -863 812 -350 -88 830 -835 -42 -28 -1028 89 -246 -298 660 42 436
2611 436 588 51 1189 42 40 567 -963 272 -65 -865 635 -23 -448 765 -604 -266 581 -720
2629 -720 325 -66 -954 247 -740 -324 317 -228 419 281 -53 835 -124 62 555 -653 306 -101 -871
$$ packed form
2502F02j184R12q07j88L53n71Q43M9n07J114j072L40O42j305Q95j26j123J363
2520B30o92K84Q63j016J278p0r98R70p13m12J007j275L52L93j512J334l1l62Q92
2539E22p35K52m8j235J321o47k19J323j106M03J176j589J249K58j169J090l68
2556D78m99N71q11O93m62j27R27j342M80O27j518R70K27j163J355p27p77J430
2574C32j257J184L35j164J326j030m0J055q32L23O14r14N68m47m52Q19j043N22
2592a01J55q59J354q29n83J675j162K62R18j665P93J4j000J117l35n2R58o18L94
2611D36J52n37J138j147kN27j530J235l37q00J500o58m25J213j369L38Q47j301
2629g20J045l91q88J201r87M16O41n45O47j38l34Q88r59J86M93j208R59m07p70
$$ plain form
2648 -871 586 -227 -441 950 -260 202 794 -659 102 -199 -438 187 -400 -185 4 -499 536 -146
2666 -146 80 971 -486 559 294 -959 620 -150 -772 1002 -199 -505 509 -802 560 453 -293
2683 -293 382 -301 -41 132 -609 51 -354 -496 673 -324 -63 572 -554 812 630 -448 750 -180
2701 -180 -635 688 -770 -30 464 -697 444 14 -495 444 -99 389 223 -422 21 -634 -392 521 -626
2720 -626 232 593 -676 583 186 -648 790 63 -420 897 -982 -145 293 -449 518 -243 -103 654
2738 654 -274 234 63 -582 606 -402 -253 217 -863 167 187 -739 849 86 -141 733 -192 107 490
2757 490 -493 120 -2 -616 -186 -421 228 396 -236 562 -90 -221 776 -603 -79 419 -835 171 -72
2776 -72 -907 528 -234 -132 1127 -23 121 447 -365 401 -62 -344 284 -434 93 -3 -295 673 -165 -109
$$ packed form
2648h71J457q13k14J391j210M62N92j453P61l01k39O25n87K15J89n03J035o82
2666a46K26Q91j457J045k65j253J579p70o22J774j201l06J014j311J362j07p46
2683b93O75o83K60J73p41O60m05j42J169r97K61O35j126J366j82j078J198r30
2701a80m55J323j458P40M94j161J141m30n09R39n43M88j66o45M43o55K42R13j147
2720f26Q58L61j269J259l97q34J438p27m83J317j879Q37M38p42R67p61J40P57
2738F54r28N08j71o45J188j008J49M70j080J030K0r26J588p63k27Q74r25K99L83
2757D90r83O13j22o14M30k35O49J68o32P98o52j31R97j379N24M98j254J006k43
2776g2q35J435p62J02J259j150J44L26q12P66m63k82O28p18N27r6k92R68q38N6
$$ plain form
2796 -109 995 -583 52 62 -878 576 -189 -840 619 -450 -340 501 -337 507 223 54 774 -210 -85
2815 -85 319 -532 239 -142 -554 296 -208 -68 795 -651 620 342 -754 394 -514 -430 225 -536 -93
2834 -93 386 -555 560 -68 -332 730 -263 272 118 -602 271 -207 -189 630 -428 63 448 -952 770
2853 770 233 -293 907 -350 -167 250 -490 -35 44 -131 711 -478 221 209 -390 475 207 -381 654
2872 654 -243 -370 431 -721 310 462 -190 828 -7 -422 557 -182 224 402 -329 590 -24 -616 340
2891 340 -484 139 516 -511 473 -46 -396 630 -593 -160 143 -941 245 -72 -732 658 65 227
2909 227 897 -236 534 18 -490 271 -282 -205 373 -525 30 -97 -498 456 83 -225 627 -612 -98 -73
2929 -73 -696 354 -160 -139 643 -62 182 702 -77 932 270 -59 416 -369 -162 437 -554 479 -33 -475
$$ packed form
2796a09J104j578O35J0r40J454p65o51J459j069J10Q41q38Q44k84j69P20r84J25
2815h5M04q51P71l81m12Q50n04J40Q63j446J271k78j096J148r08Q4O55p61M43
2834i3M79r41J115o28k64J062r93N35j54p20Q73m78J8Q19j058M91L85j400J722
2853G70n37n26J200j257J83M17p40M55P9j75Q42j189O99j2n99Q65k68n88J035
2872F54q97j27Q01j152J031J52o52J018q35m15R79p39M06J78p31R19o14n92R56
2891C40q24O23L77j027R84n19l50J026j223M33L03j084J186l17o60J390n93J62
2909B27O70j133P70n16n08P61n53P7N78q98N55j27m01R54l73l08Q52j239N14K5
2929g3o23J050n14K1P82p05K44N20p79J009o62l29M75p85K07N99r91J033n12m42
$$ plain form
2949 -475 531 -488 -270 281 -556 136 -11 -404 258 -629 -90 454 -582 306 140 -546 783 -6 52
2968 52 679 -160 345 450 -471 474 -39 -381 496 -566 -20 12 -506 490 -71 -294 521 -496 -126 111
2988 111 -838 -76 79 -299 835 -71 443 511 -244 662 314 -227 692 -305 -191 85 -506 364 121 -223
3008 -223 666 -56 -355 289 -842 -20 4 -624 -62 -304 -314 681 -228 473 592 -473 521 -115 -205 640
3028 640 -233 278 577 -421 432 134 -98 514 -267 -63 331 -747 157 -236 -630 323 -517 -353 432 -628
3048 -628 166 99 -565 614 -121 -4 417 -408 449 453 -241 644 -94 85 239 -619 117 387 -380 448 186
3069 186 -488 331 -383 -164 179 -772 -41 -199 -659 454 -95 301 737 -257 371 480 -338 436 -329 -265
3089 -265 484 -418 423 54 -345 627 155 -104 299 -719 -209 -172 -1004 -176 -79 -499 461 -472 154 464
$$ packed form
2949d75J006j019K18N51q37O92j47l93O62q87N39N44j036Q88j66o86J329p89N8
2968E2O27q39N05J05r21R45n13l42Q77j062N46L2n18R96n61k23Q15j017L70K37
2988A11r49P62J55l78J134r06N14O8p55R06l48n41R19r97J14K76n91Q70k43l44
3008b23Q89p22k99O44j131Q22K4o28N62k42j0R95r09P01J19j065R94o36r0Q45
3028F40q73N11K99r98Q53k98k32O12p81K04L94j078R04l93l94R53q40J64P85j060
3048f28P94o7o64J179p35J17M21q25Q57Mo94Q85p38J79J54q58P36K70p67Q28k62
3069A86o74Q19p14K19L43r51P31j58m60J113n49L96M36r94O28J09q18P74p65O4
3089b65P49r02Q41l69l99R72m72k59M03j018N10L7q32Q28R7m20R60r33O26L10
$$ plain form
3109 464 -243 471 55 -192 276 -375 144 199 -143 471 63 27 908 -12 68 700 -223 372 -111 -625 145
3130 145 -545 -270 -47 -243 18 28 -486 581 -384 57 382 -554 365 180 -351 584 -71 -81 697 -142
3150 -142 274 340 -378 439 -51 -511 489 -369 152 131 -689 144 -240 -353 405 -419 159 490 -529 270
3170 270 -41 -167 559 -71 125 282 -421 385 216 46 545 273 -201 164 -204 51 -260 -340 196 -501
3190 -501 -234 470 -434 240 355 -281 539 -281 -313 373 -548 166 374 -241 588 45 -504 714 77 353
3210 353 517 -376 179 -170 -236 73 -331 -191 339 -340 516 3 -181 298 -310 100 575 -464 111 -55
3230 -55 -486 590 228 42 350 -57 134 -27 -296 606 -253 63 397 -667 -155 -10 -457 311 -255 -389
3250 -389 409 -265 -60 322 -342 445 140 -200 153 -48 -74 388 -90 3 102 18 454 -81 -107 174 -277 220
$$ packed form
3109D64p07P14m16k47M68o51N19N5l42O14m08l6Q81r20Q0O32r23N95m83n14P70
3130A45o90K75K23j96K61J0n14J067r65M41L25r36R19j85n31R35o55j0P78q39
3150a42M16O6p18Q17m90m60J000q58N21k1q20Q33l84j13P58q24N78L31j019P99
3170B70l11j26P26o30J96J57p03Q06j69j70M99k72m74L65l68K55l11q0N36o97
3190e01K67P04r04O74J15o36Q20q20l2O86r21P14K08o15Q29n43n49J218o37K76
3210C53J64q93N55l49o6L09m04J40N30o79Q56n13j84M79o08M10M75j039N75j66
3230e5m31J076l62j86L08m07J91j61k69R02q59L16L34j064N12J45m47P68n66j34
3250c89P98o74K05L82o64P87l05l40L53k01k6M62m78R3R9q4M36n35k6K81m51M97
$$ plain form
3272 220 -41 -695 397 -320 -106 649 -386 267 111 -422 405 -69 -481 213 -657 26 212 -140 300
3291 300 -13 -71 466 46 138 239 -410 537 -227 -407 200 -467 -299 280 -471 302 54 -181 492 138 -273
3312 -273 314 107 98 17 -300 128 -101 13 309 -127 482 340 -11 427 -292 -210 320 -322 -82 138 -328
3333 -328 26 -18 -324 246 -200 101 421 -396 122 -376 -398 453 -250 -56 25 -398 377 272 -21 545 -229
3354 -229 -37 491 -408 277 11 -679 448 127 23 135 -364 172 200 -465 21 -99 -236 92 -654 267
3374 267 50 -253 485 61 12 465 -245 72 355 -736 117 -277 -515 197 -497 -127 288 -109 218 111
3394 111 -165 318 -30 -23 -87 -252 116 93 -403 614 -315 -41 545 -73 137 112 -482 246 -78 -197 26
3415 26 -605 -233 228 91 539 14 -18 388 -228 24 39 -496 68 77 -428 170 -277 -309 305 37 71 66 -155
$$ packed form
3272B20k61o54J092p17K14P55j035O53j56n33Q27m74m12O94q70O83J86l52M40
3291C00l13n8N37m20R2J01o49R47p64j80O07o67J68N79p51P73k48k35O73l54m11
3312b73N87k07rq1l17M28k29J14K96m36O09j42l51M38p19Q2N30o42K40K20m66
3333c28L54m4l06N70m46L01L20q17N18m98k2Q51p03J94Q1m23P75j05k93N66p74
3354b29J92N28q99O85k66o90J127l21j04J12m99N36K8o65M86j20j37L28p46R21
3374B67k17l03P38m24m9M53p10L17K83j091Q53l94k38P12o94L70M15l97L27j07
3394A11k76M83l48Po4j65L68k3m96J017r29K74N86o18K10k5n94P28l24j19K23
3415B6o31L72M61j37M48n25l2M06o16K52J5n35N64Rn05N98m47l2O14k68L4nk21
$$ plain form
3438 -155 394 -51 -150 -39 -225 89 -120 -237 182 -35 71 357 -253 72 8 -123 187 -158 -512 225 -577
3459 -577 -24 176 -334 444 -79 -164 90 -95 84 439 -281 16 -231 -139 312 -196 59 -90 -298 335 -187
3480 -187 -187 343 -406 -203 189 -400 91 -119 112 465 23 245 260 -319 124 492 -261 109 -354 -364 406
3501 406 -426 -28 105 -142 294 -9 -76 136 -239 184 229 -454 70 -308 -166 338 -207 75 479 -138 115
3522 115 -73 -88 247 33 71 81 -120 -4 -83 -240 161 45 140 265 -85 242 334 -203 164 33 -33 57 -381
3545 -381 21 82 -197 290 -51 -303 72 -99 76 281 -301 243 -184 -238 92 -310 59 444 -32 493 93
3566 93 -102 118 23 102 32 -394 -3 148 -196 290 -172 -113 204 -104 208 -40 -564 153 -118 -121 228 -174
3588 -174 206 108 -67 480 -75 53 463 -247 -130 147 -314 103 132 -359 205 -147 15 395 -325 11 -74
$$ packed form
3438a55N49m45r9J11j86L14k09j17M19k17J06K86o10L25o4j31L10l45l54P37q02
3459e77N53K00n10P78n23q5K54j85J79L55p20K97k47R2M51n08K55j49k08O33n22
3480a87%N30p49K03L92n89M91k10K31L53m42K22J5n79M43L68p53L70m63j0P70
3501D06q32L98J33k47M36l03o7K12l75M23M5o83N24l78J42N04n45K82M04o17K53
3522A15j88j5L35k14L8J0k01J16p9j57M01j16R5J25l50L27R2n37L67j31o6R0m38
3545c81M02O1k79M87l41k52L75j71J75K05n82N44m27n4L30m02L69L85m76N25m00
3566I3j95K20r5P9p0m26L91J51l44M86m62N9L17l08L12k48n24P17k71lL49m02
3588a74L80r8j75N47n55J28M10p10J17K77m61M17K9m91N64l52J62L80p20L36q5
$$ plain form
3609 -74 -259 233 -364 -83 -37 -236 139 236 75 347 -129 58 190 -394 366 332 -64 250 -155 -314 284
3630 284 -366 12 224 -205 -14 29 -100 217 -82 231 179 -212 106 -244 -390 272 191 321 257 -121 221
3651 221 1 -165 298 -426 -118 148 -467 -42 -209 -154 229 -89 13 17 -203 161 15 -31 425 -310 -180
3672 -180 208 -281 52 149 -81 331 179 -257 271 -54 -120 96 -75 51 -228 -41 223 -354 118 163 -211
3693 -211 331 -40 -370 -78 -369 113 443 20 121 49 -166 369 59 -158 306 -230 96 121 -292 -42 -104
3714 -104 -66 270 -234 65 204 -130 491 5 -150 568 -199 19 189 -446 356 -86 -155 229 -49 19 188
3735 188 74 201 198 -97 396 -114 -26 -18 -270 211 -24 -98 360 -125 19 303 -261 59 -3 -238 149 -141
3757 -141 -180 198 -98 153 337 -96 463 16 100 210 -167 157 -62 -72 -223 -490 -16 7 13 102 281 -164
$$ packed form
3609g4j85M92n97K81M6j99L75R7j61K72m76J87J32n84P60l4l96L14m05j59N98
3630B84o50L78K12m29J91M3j29L17k99L13n2l91L18l50j46O62q1J30o4l78L42
3651B21k20j66M63p24L08K66o15M25j67N5L83l18J02Mk20L64j46m6M56p35J30
3672a80L88m89L33R7k30M12j52m36N28l25o6K16j71J26k79J87K64n77M72M5l74
3693b11N42l71l30K92k91M82L30m23J01p2k15N35l10k17M64n36L26K5m13K50o2
3714a04L8L36n04K99J39l34O21m86j55P18p67K18J70o35Q02m42o9L84k78O8J69
3735A88j14J27lk95M93n10Q8Qk52M81k35p4M58m85J44K84n64L20o2k35L87k90
3757a41l9L78k96K51J84m33N59m47Q4J10l77L24k19j0j51k67M74K3OQ9J79m45
$$ plain form
3779 -164 373 -90 -186 409 -168 -185 345 -171 41 21 -195 258 -193 332 108 -297 69 -338 -113 -62 -155 -249
3801 -249 -14 -28 118 90 -153 445 -231 -389 -11 -220 315 159 -162 22 133 -45 -9 -30 -23 197 -311 199
3823 199 75 -15 223 -357 25 211 -189 192 73 -48 177 -204 53 212 118 120 132 -157 188 -294 -19 79
3845 79 -110 344 120 -144 355 -67 42 340 -417 192 -49 -464 -38 -54 -86 209 -337 44 135 -215 123
3866 123 -96 -23 36 -201 -174 16 -117 167 -291 -228 395 -300 6 40 -199 168 237 -196 124 -131 -116 267
3888 267 51 242 148 53 335 -62 -91 161 -104 29 -226 -305 202 -36 3 602 245 114 290 -264 95 -235
3910 -235 -128 126 -11 94 -61 -249 -42 86 133 161 54 -51 89 -420 -111 -8 -328 254 -256 -25 181
3931 181 -190 417 59 112 112 6 -84 8 -212 38 52 -209 -47 126 -129 283 -98 205 131 -190 -52 -121 -32
$$ packed form
3779a64N37m63r6N95n77j7N30n16K12k0k16M53m51N25k24m05L66m07K25N1r3r4
3801b49K35j4J46k8k43N98o76j58L78k09N35j56l21J84J11j78L6k1PK20n08N10
3823A99j24r0K38n80L82J86m00L81j19j21K25l81K57J59r4KJ2k89L45m82K75R8
3845G9j89M54k24k64M99m22J09K98p57O09k41m15M26j6l2K95n46L81R1l50L38
3866A23k19P3N9k37K7J90j33K84m58O3O23o95L06L4k39L67O9m33L20k55J5L83
3888B67k16J91r4r5K82l97k9K52k65J33k55p9N07k38L9N99l57j31J76n54L59l30
3910b35J07K54j37J05j55j88K07J28M7K8j07j05J40n09L09J03l20N82n10K31K06
3931A81l71O07l58N3%j06r0R2k20K50J4k61J62J73k55M12l81L03p4l21J38o9Q9
$$ plain form
3954 -32 -8 -302 245 19 -63 290 -98 -22 345 7 127 312 -71 -12 38 -163 316 -191 43 -38 -89 297 35
3977 35 115 262 -197 -203 87 -442 23 80 -290 165 1 -205 319 -167 192 106 -217 406 -106 -63 174 -120
3999 -120 -166 120 -157 157 215 -49 364 -62 -17 236 12 -132 66 -315 393 40 97 169 -330 201 67 -175
4021 -175 32 -51 60 91 -40 35 -114 -240 82 -37 -31 -62 -55 215 8 -270 -26 -73 -258 164 154 38 78 -110
4045 -110 411 99 -158 100 -21 36 257 -279 73 159 -29 353 -367 225 208 36 469 208 -250 368 -178
4066 -178 -112 129 -312 83 -188 -113 305 -109 -232 159 -133 -16 146 -197 -2 -55 -65 198 -58 53 97 -113
4088 -113 114 45 251 289 -127 119 144 -94 172 78 -271 88 35 -97 239 -244 101 39 -159 436 81 -147
4110 -147 11 -289 115 -80 -134 -126 -79 -146 350 -133 313 214 -85 190 -178 -127 70 30 80 108 -121 53 -5 4
$$ packed form
3954c2K4k94N47k26q2L53l88P6L67l38J20J85l83N9N0k01M79n07K34q1n1L86k62
3977C5Q0J47m59oK90n29M65N7l70M55j64k06N24m86L59q6l23O23n12M3K37k94
3999a20m6K86k77L14N8k64M13m26M5K53k24j44J98l81P08l53N7P2m99N31j34k42
4021a75K07q3J11L1j31P5j49j26L22j19Ol1PK70k07k78K44m7j85M22j0j16M0j88
4045a10N21l12k57K58j21N7K21n36L52Q6j88L82p20N92j7j72M33k61m58O18n46
4066a78O6K41m41L95k71P5M18m14j23L91k92J17J62l43J95n3j0K63k56J11M4k10
4088a13K27o9K06L8m16K46K5k38K66r4l49L59n3j32L36m83L45o2j98N95l55k28
4110a47J58l00M04j95n4QM7o7M96m83M46r9k99K75l68N1J97m0N0K8k29J74n8R
$$ plain form
4134 4 71 -6 -76 -117 -83 -35 -40 -126 -9 -348 178 183 91 258 -22 50 104 -153 218 12 -45 218 225 -290 32 305
4160 305 -23 105 -223 -188 -106 18 271 -8 -246 321 -93 -32 212 -84 399 266 -131 246 -36 25 167
4181 167 -107 26 57 -198 146 192 -166 80 -253 302 141 -54 64 -295 203 203 62 4 -160 42 114 -300
4203 -300 -44 85 -48 42 -26 42 -29 -19 137 105 -310 -193 -124 -356 120 -72 148 290 -47 69 124 -103 -88
4226 -88 139 -124 122 -147 -260 226 -49 340 -32 -182 9 -325 -298 159 -354 222 44 -118 249 -165 -86
4247 -86 116 -205 72 74 -238 148 -10 -53 -12 -327 84 153 30 86 21 -74 120 -100 -104 -102 -230 245 72 -78
4271 -78 55 -109 7 323 -271 166 -169 -152 74 -3 85 -12 -231 -82 144 58 202 -173 94 1 -137 61
4293 61 85 241 39 -101 -124 -10 -266 -71 129 -81 -77 106 -198 177 -418 -28 179 -21 343 67 -240 35
$$ packed form
4134DO7p7p0m1L4M8nq6J17l39N26Nr2J67k80P2N4k57L71k06n7K63Pn15L22K73
4160C05l28J28l28L5Q2J24K53k79k38N67m14O1K44k96M83j33l97L77k82O1J42
4181A67k74J33L1k55L44M6l58K46l33N55j61j95J18l59M98%j41n8j64K02P2m14
4203c00K56J29j33R0o8O8p1J0J56l2m15J17O9k32M76j92K20J42l37J16N5k27J5
4226h8K27k63K46k69j13M86k75L89l72j50J91l34K7M57n13N76j78j62L67m14P9
4247h6K02l21K77Kl12L86j58m3M1l15M11O9j23N6o5r5J94k20mKj28M75j73j50
4271g8J33j64J16L16n94M37l35J7K26p7Q8r7k19J49K26q6J44l75K67r3j38J98
4293F1K4J56k02j40k3J14k56J95K00k10MJ83l04L75n95L90K07k00L64k76l07K75
$$ plain form
4315 35 -57 -86 124 -52 103 18 92 133 -96 -139 128 -421 122 -19 -140 197 139 -22 246 -113 120 -136 -248
4338 -248 57 86 -34 18 -118 75 134 -18 154 29 -260 214 67 25 51 -252 213 38 98 102 6 14 252 93
4362 93 -165 -188 -76 -91 60 -125 41 -16 -111 -74 51 -19 -187 -138 69 -179 -6 109 -180 210 -64 77 99
4385 99 -238 139 -27 -117 -274 -23 118 119 -24 65 68 -178 -291 -191 -46 101 114 80 203 -80 129 213 147 178
4409 178 -15 -60 65 -460 83 -114 84 341 -104 -8 165 -130 39 5 -189 124 -113 52 -33 -119 153 266
4431 266 60 392 69 70 -6 -44 86 1 -123 157 90 14 -27 -112 -102 -16 -376 -96 -105 -90 192 -77 -3 156 -52
4456 -52 104 131 -201 28 33 333 300 -76 -88 -128 -120 5 -176 20 91 -102 242 -131 -258 81 147 95 93 -159 212
4481 212 122 -307 -18 -192 18 283 -66 99 156 4 244 -13 -87 119 -75 -217 -14 -174 279 43 -143
$$ packed form
4315C5r2k9K10j76J55q5P4M1k29m3K67n49N43j41j21L37n8j61K68l59K33k56j12
4338b48L05K9j20N2j36J93N9j52J72j25k89M74j47m2K6l03M65j75O0Mr6QK38j59
4362I3k58k3J12j5J51j85J66n7r5L7J25p0j68M9K07k48J73J15k89L90k74J41K2
4385I9l37L77j66r0j57K51J41Jj43Q9Lk46j13J00J45J47J3l4J23k83K09Q4o6L1
4409A78j93m5J25n25N43j97J98K57m45R6J73k95J69l4j94L13k37J65q5q6K72J13
4431B66k06L32l23Jp6l8J30q5j24K80o7p6m1q5J0Q6l60K80rJ5K82k69P4J59k08
4456e2J56K7l32K29NL00l3l76j2m0QJ25j81J96P1j93L44l73j27L39O6n2kk52L71
4481B12r0m29K89j74K10K65l49J65N7j52K40k57p4K06j94j42K03j60M53k36j86
$$ plain form
4502 -143 -44 -28 -32 207 -188 150 75 -21 52 -319 195 -134 71 -11 108 -275 209 41 -90 29 142 171 152
4525 152 -156 51 -173 -43 278 -297 31 53 -31 321 227 64 102 -16 -8 98 134 270 18 -299 267 -311
4547 -311 50 5 -57 298 68 -75 138 -127 66 -21 34 112 70 124 230 -154 -82 271 67 244 66 -244 352
4570 352 -274 -183 261 5 34 -107 28 128 166 -175 20 -152 -147 -90 -438 160 177 -68 259 10 -118 130
4592 130 -180 3 -64 17 -17 -264 -51 55 -238 134 188 -42 23 114 -2 114 -137 21 295 -133 276 -99
4614 -99 -174 123 53 50 91 58 101 211 -143 -218 -205 47 102 -146 186 -42 -100 86 94 22 -62 -113 58 -100 -206 82
4640 82 -91 177 -233 -122 133 223 60 188 -50 -71 3 -91 -70 182 -140 197 -23 -189 9 40 155 85 -192
4663 -192 17 20 -153 222 42 -91 181 -6 207 180 -7 69 -93 89 246 -126 -34 92 -175 -168 -139 141 -27
$$ packed form
4502a43R9J6mK39l95L38p5r6P3l71N14l29K05q2J19l83M84j68j31J19J13K9j9
4525A52l08K07k24J30L21n75L28K2q4L52r4j63L8j18QJ06L6J36k52l17N66n78
4547c11L61m5o2L55k30j43K13k65J93q7N5P8m2N4J06l84P2L53k04J77j78l10N96
4570C52o26R1M44k56K9j41J35J00L8l41J95j72NN7l48N98J7k45L27k49j28K48
4592A30l10J83o7Q1l4k47K13J06k93L72N4k30O5R1j16J16k51J58K74m28M09l75
4614i9p5K97p0lM1l3M3J10l54p5J3K52N5k48L32k28n8J86Qp2q4n1J71j58j06K88
4640H2j73K68m10J11K55R0j63J28k38k1P4r4K1K52l22L37k20j66J98L1J15p0k77
4663a92K09Lj73L75j80j33K72j87K13k7j87P6j62J82J57l72R2J26k67PK9K80j68
$$ plain form
4686 -27 -207 157 326 -345 77 218 -100 3 -272 25 -62 -170 49 -133 -33 136 110 124 143 -40 314 -45
4708 -45 -177 84 -76 -223 4 -143 291 -13 -33 -4 -14 -6 -4 26 41 172 -79 49 -97 0 316 -185 11 141
4732 141 -145 223 70 -58 369 -73 -25 247 -184 -156 -24 -159 -4 -164 175 -11 -83 141 -2 120 262
4753 262 -221 -34 172 -133 12 301 -175 192 -136 20 204 13 -66 53 -83 22 -85 -88 130 -389 332
4774 332 287 -122 441 97 74 219 -105 -356 -133 -287 145 60 171 175 16 111 -174 -185 -139 -44 -163 -85 27
4797 27 43 125 36 167 86 143 170 60 52 69 109 4 228 91 -55 -185 179 310 65 195 -4 105 -185 76
4821 76 170 -165 -294 -100 -70 -170 -101 -139 74 94 -162 -55 112 -122 109 -256 -50 47 -57 2 -36 88 140
4844 140 -126 -199 285 -13 -137 193 -16 -54 23 -22 11 -206 3 109 -92 45 42 -196 88 26 -143 50 -10
$$ packed form
4686b7j80L64J69o71M22J41l18J03k75K97q7j08K19j82J00J69k6J4J9j83L54l59
4708d5j32K61j60j47K27j47M34l04k0K9j0QKL0J5J31k51J28j46R7L16n01J96J30
4732A41k86L68j53j28M27m42M8K72m31K8J32j35J55j60L39j86p2K24j43J22J42
4753B62m83J87K06l05J45K89m76L67l28J56J84j91p9J19j36J05j07lK18n19P21
4774C32m5m09N63l44k3J45l24k51K23j54M32q5J11Mj59R5k85j1M6R5j19P8J12
4797B7J6Q2q9J31q1N7K7j10qJ7M0j05K24j37j46j30L64J31k45J30j99J09k90K61
4821G6R4l35j29J94L0j00O9l8K13K0k56J07J67k34K31l65K06R7j04N9l8J24N2
4844A40k66p3M84k98j24L30k09l8P7m5L3k17K09J06k01J37lk38K84o2j69J93o0
$$ plain form
4867 -10 63 3 -18 105 165 164 155 -179 193 38 58 79 -204 -100 -62 -67 20 158 -123 40 16 127 42 58 -49 198
4893 198 77 -67 79 10 57 -163 28 -17 29 -120 136 96 8 122 18 -126 66 34 10 -190 224 -35 -107
4916 -107 74 91 81 -174 -145 6 -39 -66 246 93 -56 133 -104 146 26 -139 -5 -167 13 -18 -251 -17
4938 -17 90 -28 -75 69 -39 141 -23 79 71 -243 114 -229 -115 55 -55 138 170 -284 150 7 -116 113
4960 113 -21 222 209 130 58 -114 -139 330 8 -75 104 -235 186 -8 16 111 -88 -110 126 -174 126 108 -57
4983 -57 128 -136 -120 -13 -76 140 177 110 -29 -77 223 54 -152 122 -32 -157 30 53 46 12 113 71 144 32
5007 32 20 164 38 139 -151 5 60 12 12 97 57 342 -172 -125 178 46 150 -239 -222 382 -147 -183 84 -77
5031 -77 128 -97 -89 77 -274 -3 -154 -95 21 -35 83 164 138 -21 -23 0 44 182 -153 -73 -25 -196 -80 54
$$ packed form
4867a0P3o0k1J23O0jrl34L72j55K0K1k83J04L8nQ7J38k81J63k4J11q5J6j07K47
4893A98j21j44J46o9M7k20J91m5M6j49K56m0q8J14j04j44J92l2k4k00M14k59p2
4916a07J81J7j0k55K9J51m5k7L12j53j49J89k37K50j20j65J34j62J80l1k33K34
4938a7J07j18m7J44j08J80j64J02ql14L57l43J14J70j10J93L2m54M34j43j23K29
4960A13j34K43j3p9p2j72k5M69l22q3J79l39M21j94K4R5j99k2K36l00L00j8j65
4983e7J85k64J6J07o3K16L7o7j39m8L00j69k06K74j54j25J87K3pl4J01m2P3j12
5007C2j2J44j26J01k90J56N5m8%Q5m0K85n14M7L03j32J04l89J7O04n29l6K67j61
5031g7K05k25QJ66l51K71j51N9J16n6J18Q1k6j59kK3M4J38l35Q0M8j71J16J34
$$ plain form
5055 54 168 203 -325 -158 7 -48 167 -37 36 -73 214 110 9 -54 236 -76 45 153 -188 78 232 114
5077 114 -5 -142 -45 224 -13 -32 44 -232 125 59 85 -23 -273 -174 48 -61 36 95 -146 63 -117 -107 -48
5100 -48 19 79 -50 78 76 99 6 58 -64 95 -22 92 123 -71 72 165 -97 -211 158 -74 -6 98 27 59
5124 59 132 -35 84 46 -2 -122 -19 88 -5 -57 153 2 210 -128 -33 -142 104 -90 -13 3 -266 114 17
5147 17 289 -200 177 -79 -257 121 -37 -175 218 -5 122 158 -32 -97 -158 -105 78 99 -47 356 48 138
5169 138 142 40 -90 155 -170 -54 147 8 -93 -116 -2 -34 269 -67 -111 115 112 332 14 -198 195 72
5191 72 -92 -3 -75 63 -62 -339 -274 22 -97 75 111 -62 87 -4 -188 31 139 9 221 -181 -136 -36
5213 -36 89 -25 122 -42 -34 -75 30 -34 164 9 -79 108 140 32 -271 361 9 50 41 -143 -153 -162 -290 96
$$ packed form
5055E4J14L5n28J67J65n5K15k04P3j09K87j04j01o3K90l12J21J08l41K66J54j18
5077A14j19j37R7K69k37j9P6k76L57o6K6j08k50R9K22j09R7N9k41K09j80J0N9
5100d8O7O0j29J28kK3r3N2j22J59j17J14L1j94J43R3k62j14L69k32O8J04p1L2
5124E9P3j67J19l8m8j20J03J07r3n2K10j51K08l38R5j09K46j94P7J6k69L80r7
5147A7K72m89L77k56j78L78j58j38L93k23J27L6j90o5o1N3J83K1j46M03l08R0
5169A38Mj02j30K45l25J16K01j39j01k3J14l2L03l36m4K26lK20l18k12L93j23
5191G2j64Q9p2J38j25k77O5K96j19J72L6j73J49r1j84K19J08j30K12m02M5J00
5213c6J25j14J47j64Qm1J05o4J98j55q8J87L2j08l03O32l52M1rj84j0rj28L86
$$ plain form
5237 96 -85 129 215 -92 186 -42 34 196 10 264 -140 -62 78 -16 247 124 -246 26 233 -340 3 99
5259 99 207 -23 28 -47 35 48 55 -87 -194 115 -28 -81 31 -135 39 -28 182 120 76 -222 -12 -179 41 -94
5283 -94 -4 68 29 -10 46 -30 4 108 112 178 122 60 -143 110 176 33 -37 353 3 88 48 -167 -55 -96 164 170 97
5310 97 -203 145 -39 -103 46 69 217 -173 -70 101 -226 126 191 -203 -242 -67 23 102 -241 73 214 -170
5332 -170 242 40 25 -120 153 -68 145 -187 129 -196 -256 27 -85 55 49 32 46 135 -137 -83 -49 -232 -331
5355 -331 -311 -89 176 -55 11 8 21 -86 -141 -47 -9 -88 142 -58 -72 41 -49 -78 -101 -31 39 -60 -145 -147 110 -87
5381 -87 64 -159 197 -40 -206 126 244 119 -19 91 51 -97 -93 53 72 37 -116 340 81 158 214 52 7
5404 7 -20 178 37 75 183 -135 160 -149 -180 81 -133 39 270 -3 44 -120 -134 345 15 203 -20 -49 98
$$ packed form
5237I6j81K14Q6l07K78k28P6J62j86K54m04P8J40r4K63j23l70K72K07n73L43R6
5259I9J08k30N1p5Q2J3Pj42j07L09j43n3J12j66J74o7K10o2m4k98K10j67K20j35
5283i4R0P2l9l9N6p6L4J04MO6n6o2k03K53O6j43p0L90l50Q5m0k15J12m1K60Op3
5310I7l00L48j84o4J49K3J48l90J03J71l27L52O5l94l9J75R0P9l43L14J41l84
5332a70M12k02j5j45K73k21K13l32L16l25o0K83j12J40oj7J4Q9k72N4L4j83r9
5355c31K0K22K65k31O6lJ3j07n5R4L8p9K30k00j4J13r0k9k3P0P0r9q5kK57j97
5381h7J51k23L56k37j66L32J18j25j38J10m0j48MJ46J9l5j53M56k59P7N6j62m5
5404Gk7J98j41L8J08l18K95l09l1K61k14J72K31k73M7j64j4M79l30J88k23k9J47
$$ plain form
5427 98 103 -252 -43 -63 -33 69 -239 -62 -157 105 -53 109 -110 55 120 -105 -11 59 50 -82 -279 120 35 -189
5451 -189 119 6 85 -123 -6 212 -158 -21 -6 -87 85 126 -267 -12 -174 -132 19 123 17 28 -156 135
5473 135 -80 -58 110 85 4 7 -84 -146 74 4 65 -233 149 354 34 -226 140 -38 179 63 16 -128 3
5496 3 131 -29 -25 119 11 -54 149 -290 -202 14 -164 110 71 -97 66 54 97 166 -72 177 -65 206 -81
5519 -81 -78 19 102 -214 9 -181 66 -72 -197 252 -189 -247 16 285 28 31 -251 339 34 -28 -95 39 -96
5542 -96 96 -13 141 43 15 -200 173 18 -103 -218 144 63 -217 27 188 -95 83 -154 -103 62 -66 163
5564 163 -152 -321 122 -135 60 15 5 -4 83 102 107 -334 -110 54 -230 -35 8 -198 293 223 108 83 97 -98
5588 -98 36 -64 -163 27 -296 14 -201 46 -129 -213 -2 198 -312 97 57 -117 -160 -44 -314 163 -95 3
$$ packed form
5427I8Nl55K09k0L0J02l08J77r5K62j58J62k19J65O5k25R4P0rj32j97L99q5k24
5451a89L08j13P9k08J17K18l70J37J5q1J72M1l93K55j62M2J51J04j06J1j84K91
5473A35k15K2J68k5q1Lr1o2K20p0O1k98L82K05l20k60L66j78K17j16m7j44J31
5496CJ28j60MJ44j08o5K03m39Q8K16j78K74l9j68J63j2M3O9k38K49k42K71k87
5519h1LR7Q3l16K23j90K47j38j25M49m41n8K63K69k57Lk82N90l05o2o7J34j35
5542i6J92j09J54r8k8k15L73j55j21j15L62q1k80K44J61k83J78k37N1J65j28K29
5564A63l15j69M43k57J95m5j0rQ7J9Nm41K24J64k84J95M3k06M91p0j15k5J4j95
5588i8J34j00r9J90l23L10k15K47j75q4K11K00n10M09m0j74m3J16k70M77k58R8
$$ plain form
5610 3 140 -78 -60 -63 116 11 61 -76 121 -119 73 30 166 -103 -113 -75 10 -289 209 -136 80 80 125 264
5634 264 -278 45 -84 103 79 13 -20 27 337 158 170 0 -5 223 -126 17 83 354 99 -30 -26 -20 -52 171
5658 171 241 -263 293 47 69 -203 -189 -148 132 -15 203 255 -144 126 -22 226 -2 -151 142 0 -120 8
5680 8 -126 52 189 5 -60 92 231 128 -179 -57 57 -38 14 72 31 27 106 111 -180 2 196 338 -97 -135
5704 -135 87 -15 -38 -38 216 116 -84 -8 82 -226 7 -93 -14 -35 31 143 41 -7 -1 -144 -127 72 -89 201
5728 201 177 186 -287 -119 -133 -158 -56 -113 91 24 172 42 66 207 233 150 188 -107 114 -150 176 89 148 5
5752 5 173 96 157 94 -157 247 152 -193 71 -5 -13 129 -157 238 -32 -167 -68 96 72 -49 39 -59 -148 -110 95
5777 95 -90 270 66 -56 108 -150 -49 189 -69 112 77 -172 -131 -12 -198 45 13 -79 171 51 -125 305
$$ packed form
5610CJ37k18J8lJ79j05N0j37J97k40J92m3J36k69j0L8Q5k99M98l45K16%M5J39
5634B64n42L23j29J87k4o6l3M7L10j79J2j70nK28l49J43O6K71k55j29MOl2K23
5658A71P0n04N56k46K2k72J4M1K80j47K18N2l99K70j48K48k28j49K93j42j20J28
5680Hj34J78J37j84o5J52J39j03l07J22J14r5N2N8m1mP9Nk91J82J94J42m35l8
5704a35K22j02k3%K54j00k00P6R0l08K33j00P9k1O6J12j02m8Oj43J7J99j61K90
5728B01k4Rm73J68j4k5J02n7K04o7J48j30K4J41K6q3L8k95K21k64L26q7N9j43
5752EJ68p7O1o3k51M04r5l45K64p6qJ42k86L95k70j35R9J64k4j21Q8r8q9L8K05
5777I5j85L60k04j22J64k58J01K38k58J81l5k49M1J19j86K43l2r2K50j20j76M30
$$ plain form
5799 305 -144 108 -14 55 198 -29 63 141 -74 -36 -29 -287 340 -20 -279 -20 -94 96 116 -1 98 -175 32
5822 32 -95 86 133 -103 36 208 132 182 104 -126 26 93 238 -205 21 4 83 -82 108 -42 145 344 22
5845 22 -200 -26 13 -81 240 -119 278 -149 182 396 -193 235 -208 120 134 62 106 132 -17 -163 145 -115
5867 -115 -3 -87 -83 311 247 82 56 -9 -81 -20 11 12 192 -91 -73 -33 -117 163 -25 -6 -166 272 -42 -63 248
5892 248 217 10 21 -6 14 64 8 221 -102 41 150 121 -91 177 -124 -81 65 52 -122 39 62 -90 -62 444
5916 444 -117 124 160 58 59 152 -305 -28 -25 -22 301 -70 -235 248 54 -282 -137 -43 198 -341 -2 336 69
5939 69 -197 -36 -54 22 120 27 359 3 -22 -47 194 -254 -117 8 -131 -74 -47 274 40 145 -35 -189 -81
5962 -81 259 -151 351 -25 334 319 115 -151 153 -37 104 53 -208 172 -112 101 224 228 253 76 -50 159
$$ packed form
5799C05m49K52j22O9J43k27R2P8k15L8Pk58O27l60k59K59p4J90K0j17R9k73K07
5822C2j27J81M7k36J39J72p6N0p8k30J52O7J45m43K26j7P9j65J90j50J87J99l22
5845B2k22J74L9r4L21l59L97m27L31K14n89M28m43L28J4p2M4K6j49j46L08k60
5867a15J12q4ML94o4j65k6o5p2O1L1JJ80k83J8M0q4K80j88J9j60M38l14k1L11
5892B48l1k07J1k7K0N0n6K13l23J43J09k9k12K68l01M3J46j3j74J61K3j52K8N06
5916D44n61K41L6j02JR3m57K77LLL23l71j65M83j94l36J45R4K41n39L39L38k67
5939F9k66J61j8P6R8r3L32l56k5k5K41m48J37J25j39N7K7L21k34J05j80j54J08
5962h1L40m10N02l76L59j5k04k66L04j90J41n1k61L80k84K13J23MK5j77j26K09
$$ plain form
5984 159 29 -130 -253 -148 78 8 -99 43 -40 -36 -97 -187 -36 -60 -143 77 -90 14 -82 -144 -31 134 -119
6007 -119 -33 -140 -127 -94 -193 -14 -79 -53 89 -61 114 81 83 21 -45 13 276 -1 -18 -43 68 -14 151 -132 90
6032 90 -52 -100 41 -36 -32 41 -278 -141 133 -52 -116 -179 0 294 -87 -41 172 -172 -77 -157 -77 46 35 -11 132
6057 132 5 58 -54 137 111 -190 -22 -120 -21 50 -398 -102 -91 65 -71 121 -78 -172 62 -235 146 -52
6079 -52 213 89 -13 -44 164 -36 229 64 -22 38 -159 -137 239 33 62 -81 80 9 55 58 -207 -44 -90 -187
6103 -187 13 -78 -169 72 -210 -124 -59 -30 5 110 -87 45 -317 -94 -102 -189 -17 144 -242 92 -13 -113 64
6126 64 -57 287 64 -202 75 14 55 -188 -177 -231 -40 -72 -45 166 -181 156 137 39 -4 42 177 6 -92 -41
6150 -41 153 55 87 -96 -112 52 118 47 -32 -146 -125 -7 -273 -23 -288 273 101 213 213 16 -1 362 -73 118
$$ packed form
5984A59j30j59j23J05K26p0j07J42q3Mo1r0J51k4q3K20j67J04r6o2J13J65k53
6007a19Q6j07J3L3r9J79o5K6J42j50J75l3Ko2o6N8K63k77j7k5J11q2J65k83K22
6032I0j42m8J41p7MP3l19J37K74j85o4o3J79K94l81M6K13l44R5q0Q0J23j1m6J43
6057A32j27N3j12J91k6l01J68r8R9P1m48K96J1J56j36J92j99r4K34k97L81j98
6079e2K65j24j02l1K08k00K65j65q6O0j97K2L76k06K9j43J61p1M6Lk65J63m6r7
6103a87K00r1r1K41k82Q6O5K9L5J05j97J32l62K23qq7J72J61l86L34j05j00J77
6126F4j21L44k23k66K77o1M1k43J1n4J91l2K7K11l47L37j9r8m3M6J35j71r8N1
6150d1J94r8L2j83j6J64O6p1p9j14K1J18k66K50k65N61j72J12%j97j7L63m35J91
$$ plain form
6174 118 -41 -380 -185 153 93 -119 -99 -3 114 -187 -98 83 -113 -35 -89 123 17 -169 -41 140 239 38
6196 38 105 103 -9 -251 11 -154 -72 56 242 86 95 179 102 114 -72 -107 116 -66 105 -10 -44 79 -81 61
6220 61 163 121 218 55 -124 148 -156 291 22 122 34 -95 310 267 -236 73 -5 -156 -80 -52 71 93 9
6243 9 75 9 -37 -242 20 16 -70 136 130 -98 -185 -164 -71 -9 24 -147 -7 27 -185 -115 169 18 53 -23 271 187 188
6270 188 405 -62 -261 84 12 -66 200 -338 71 200 -198 -28 -25 31 43 -50 169 -77 32 154 -355 -35
6292 -35 120 -90 -210 -267 152 -10 -48 27 131 74 246 117 -326 103 90 -97 142 98 165 -104 -234 70 -24
6315 -24 -172 128 15 -160 84 -110 36 96 -32 -163 103 -40 99 -69 194 67 -40 63 -72 -301 204
6336 204 -22 15 134 -184 -229 204 -167 -204 -1 147 151 -267 195 -154 1 44 99 237 -11 16 164 5 94
$$ packed form
6174A18j59l39J95L38o0k12K0R6J17l01Q9J81j96P8n4K12j06j86J28J81R9k01
6196C8O7kj12k42K62j65Q2J28J86j56RQ4p7J2j86l5K23j82J71j15l4J23j60J42
6220F1J02m2R7j63j79K72l04M47k69J00q8j29M05m3n03L09p8j51P6K8J23K2q4
6243IO6o6m6k05K62mq6K06ok28q7K1R3O2L3j71J40L4k12P0K84j51L5p6K94q4J
6270A88K17m67j99L45p2p8K66n38M09J29l98J70LN6J2r3K19k46J09J22n09L20
6292c5J55k10j20n7M19j62l8P5J04n7J72j29m43M29j3j87K39m4O7k69j30L04r4
6315b4j48L00j13j75K44j94J46O0j28j31K66j43J39j68K63j27j07J03j35k29N05
6336B04k26L7J19l18m5M33l71l7K03J48Mm18M62l49J55M3N5J38k48K7J48j59Q9
$$ plain form
6359 94 30 -95 -61 31 68 -118 128 -19 109 -85 -17 74 1 -182 -8 67 109 190 -73 -43 52 44 -101 17 49
6384 49 2 -13 170 -72 -13 -151 -270 94 -153 -74 105 -161 23 119 -104 45 -8 -81 -40 240 57 143 -35
6407 -35 176 56 -39 -229 -123 10 258 -215 123 127 -52 -38 -273 61 -5 -117 191 -160 -104 9 90 -108 200
6430 200 -75 -223 14 62 7 -163 54 -101 -45 35 -235 -247 -32 -80 -119 119 -108 -52 -99 153 2 -126 -265
6453 -265 145 265 121 141 57 300 282 -42 105 56 121 284 -44 98 117 -150 305 136 41 3 125 194 -24
6476 -24 -43 -231 -233 -128 101 -22 253 -28 -42 -79 -168 -66 330 108 -202 39 -70 -87 -32 11 70 -109 25 57
6500 57 -84 -25 30 105 163 -127 -145 119 -53 31 -29 -42 -124 -8 149 134 25 174 96 48 142 1 95 79 22 -111
6526 -111 64 75 131 97 -80 -170 -33 9 177 46 9 -17 -35 132 160 -101 -66 -25 -62 114 -232 -20 -68 22 180
$$ packed form
6359I4o4j25L4R2L7j86K46j47J28j94O8R1p3j83J74P5M2Q1k63L0R5qj45J18L2
6384D9m7j5J83k42N9j38j19L64k47P9J79k66J84R6k23J49n3p3M1K80j83Q6j78
6407c5K11j20r5j90J06J33K48m73L38Mj79J4k35L34o6j12L08l51N6J13Q1j98L08
6430B00k75j48K37M8n5j70K17j55N6Q0k70j2K15m8l9K38k27N6m7K52j51j28j39
6453b65M10J20j44K0q4K43j8l24J47m9O5J63l28J42J9k67M55j69r5l8J22O9k18
6476b4j9j88kJ05K29j23K75k81j4l7q9J02L96k22l10K41j09j7N5M3N9j79J34L2
6500E7j41N9N5P5N8k90j8K64j72Q4o0j3q2J16J57j5j09J49p8m8R4j41R4j6n7j33
6526a11J75J1N6l4j77r0J37M2J68j31l7k6j8J67K8k61L5M1l7J76l46K12m8R0J58
$$ plain form
6551 180 100 -76 -2 -295 19 94 9 -44 133 -112 143 81 153 41 -52 -87 -64 214 -15 229 161 -80 -223 -73
6575 -73 -23 -30 79 -26 68 -230 -90 218 -50 -118 294 8 -48 345 8 88 -64 65 117 59 -3 78 62 104 20
6600 20 -59 -108 99 52 162 -130 -46 -162 -186 215 -161 296 121 -337 118 127 -34 164 -102 -68 -130 32 146
6623 146 -9 -3 -43 -45 200 -25 36 208 68 233 61 -30 -82 -174 -70 58 108 44 -115 78 -33 -39 -126 -138 -37
6648 -37 -52 184 -108 -137 -132 -101 34 42 -85 428 18 -167 161 -244 151 96 71 -67 74 -34 -87 -61 -27 237
6672 237 -169 79 -155 54 109 78 125 138 -14 85 -27 174 -23 8 169 -81 -219 121 38 175 228 -42 128
6695 128 200 -107 55 24 -24 28 180 224 -127 -271 38 45 -191 201 89 -7 42 -193 -240 59 43 -239 -87 71
6719 71 9 -59 -41 36 213 -51 25 73 -241 -9 48 -27 -60 1 26 93 -11 20 161 57 118 -82 -69 -122 -165 -44
$$ packed form
6551A80q0j76P4k93L14P5q5n3J77k45K55o2P2j12r3l5K3K78k29K44o8k41j43J50
6575g3N0pJ09j05R4k98J40L08k68o8M12k86n6L93l37Q0j52J29N2n8o2Q1j6M2q4
6600B0p9m9K07m7J10k92Q4j16k4M01l76M57j75m58M55Rj61J98k66L4o2J62J14
6623A46j55Om0kK45k25O1J72j40J65j72r1n2r2J04J28N0o4j59J93j11oq7j2J01
6648c7j5K36k92k9NL1J35Qj27N13m10j85L28m05L95n5k5j38J41j08n3K6L4K64
6672B37m06K48k34K09N5l1M7J3j52R9j12K01j97L1J61k50j38L40q3J37N3k70J70
6695A28P2l07J62l1m8N2J52M4l51j44L09Pk36L92j12r6M9k35m7K99j6k82J52J58
6719G1o2o8J8P7J77k64P6M8l14K32N7p5l3O1K5O7j04L1J41j04O1k00J3n3m3J21
$$ plain form
6745 -44 115 156 -179 23 -105 -434 118 -132 17 97 -157 129 -42 317 177 70 -23 -127 -172 -74 134 21
6767 21 -13 155 132 -92 203 47 -6 55 -165 91 -127 68 16 -75 230 -57 57 18 -67 108 -1 140 77
6790 77 0 117 70 -75 -26 22 -99 38 261 29 46 -509 62 10 -169 50 7 1 33 -61 80 139 50 213 -104
6815 -104 25 113 -167 110 1 49 143 59 93 195 126 145 174 -63 -70 137 -56 156 -149 91 -1 167 -69 176
6839 176 104 -63 -112 61 -40 -347 176 3 -39 -311 11 68 -124 -47 -46 222 -79 149 44 109 139 212 293 -10
6863 -10 -14 436 -18 147 132 -106 -30 200 188 31 33 -22 -131 37 -12 -11 -229 -31 10 222 65 117 -93 94 -193
6888 -193 216 75 -23 -17 -97 166 223 97 42 216 -126 124 -47 -176 -94 -221 -126 -28 50 158 -169 241 249 -70
6912 -70 -59 221 -1 -29 -60 -210 90 -11 -21 316 50 -12 -65 -311 77 97 32 39 -29 -73 22 -239 138 34 -59
$$ packed form
6745d4J59M1l35K02j28l29N52k50J49Q0k54K86j71L59j40j07r3j04m5R8K08j13
6767B1l4J68k3k24K95j56n3O1k20K56k18J95n2r1L05k87J14l9q5J75j09J41o3
6790G7p7J17m7j45M9M8j21J37K23k32J7n55N71n2j79K19m3oL2r4J41N9q9J63l17
6815a04J29Q8k80K77j09M8R4q4L4J02o9J9K9k37pK07j93K12l05K40r2J68k36K45
6839A76p2j67m9J73j01l07N23j73m2k72L22N7j92P7JK68l01K28j05O5L0P3Q1l03
6863a0mM50m54J65j5k38P6K30j2j57Kn5j09J68m9Jk18J98M1K12j57N2k10J87k87
6888a93M09j41r8Oq0K63N7j26n5J74l42K50j71j29Q2j27R5R8P8J08l27M10Ql19
6912g0J1K80k22k8l1j50L00j01j0L37k66o2n3k46L88K0o5Po8m4R5k61L77j04r3
$$ plain form
6937 -59 -3 -11 195 23 -242 11 -216 74 -59 -405 -152 250 165 -138 -124 -65 -97 -39 319 106 -68 136 -323
6960 -323 -88 52 -160 -65 -87 -88 -138 93 144 276 -67 223 46 -134 -97 -89 -94 154 -130 107 28 -29 130 216 -129
6985 -129 -144 40 88 359 83 -110 52 111 40 -44 -53 74 -160 27 95 40 108 123 -90 69 -91 80 87 -182
7009 -182 140 106 -92 122 -35 -164 1 -219 42 46 -193 -223 -96 162 18 145 -58 193 -91 -108 23 -131
7031 -131 221 10 17 -91 -95 110 -231 -87 134 -26 94 -60 -29 -84 -186 -40 15 87 -198 42 -138 51 47
7054 47 107 117 -100 -180 35 -178 -31 -16 -208 -35 17 98 -22 -165 230 28 -394 27 -55 34 -222 -232 -80
7077 -80 -12 -45 2 -26 -198 213 -158 65 -70 -136 -2 -75 125 47 -165 -43 -94 -55 142 134 -140 14 -82 -437
7101 -437 -33 -140 166 129 -42 253 100 -81 106 -105 -160 90 191 -98 -65 -113 -53 -73 23 124 -129 15
$$ packed form
6937e9N6qK06j72k65K53k27K90j33l46K53M02q5l03J4N9l2N8L58k13j74K04m59
6960c23K35J40k12R5k2jn0K31N1J32l43K90j77j80L7QnK48k84K37p9n7J59Q6l45
6985a29j5J84M8K71k76j93J62N9p1q4rJ27k34J87O8n5O8J5k13J59j60J71Pk69
7009a82L22l4j98K14j57j29J65k20K61Mk39l0J27K58j44J27k03K51k84j7J31j54
7031a31L52k11Pj08mK05l41J44K21j60J20j54L1n5j02J46N5P2k85K40j80J89m
7054D7O0J0k17q0K15k13J47J5j92J73N2Q1j20j43L95k02m22M21q2Q9k56j0J52
7077h0O8l3M7k8j72M11l71K23j35o6J34p3K00p8k12J22n1L9J97qk74J54r6l55
7101d37M04j07L06l7j71K95j53j81J87k11n5K50J01k89L3m8O0k0R6J01k53J44
$$ plain form
7123 15 -124 36 -33 -47 102 104 148 -210 -27 -7 402 84 -118 13 35 74 34 185 52 -126 -26 -12 -52 -115
7147 -115 153 -38 105 204 41 5 -371 120 114 -34 -132 -148 -21 -105 -290 156 -61 -67 63 186 -42 49 -181
7170 -181 57 58 242 -102 -156 -160 63 -305 0 -82 -86 38 -82 328 329 -115 -86 358 62 73 101 193 234 -26 197
7195 197 0 31 46 65 138 180 -97 -223 40 247 45 -77 -114 -7 -24 68 102 61 356 20 -64 56 -58 83
7219 83 20 59 -133 -135 -77 -298 -166 -44 107 15 -4 -40 154 5 -102 -54 201 -70 -31 -63 182 76 160 -246
7243 -246 9 -94 -124 202 -115 -26 -217 -65 122 62 -75 322 -152 205 -96 -33 78 163 -312 -16 -296 -117
7265 -117 -14 -308 348 110 -20 -21 -25 153 246 -204 -149 147 -41 12 -223 122 220 -224 17 -253 74 -50 -23
7288 -23 -32 -20 -150 52 221 48 191 48 -185 -122 19 279 -52 193 -247 -22 243 200 55 -158 -3 -14
$$ packed form
7123A5j39J60o9j4J49KM4l58J83K0M09l18k02J31K2L9m0J51j33j78J00J4m0o3
7147a15K68j91J43R9j63l6l76M91oj48r8j6J27q4j85M46k17oJ30J23k28R1k30
7170a81K38JJ84l44n4mK23l68L05q2mJ24j20M10Jm44K9M44k96J1K8R2M1k60K23
7195A97j97L1J5J9P3M2k77j26K63K07k02j22l7J07j7R2L4m1K95l36q4J20j14J41
7219H3o3L9j92kN8k21J32J22J51r2j9l6J94j49j07M8K55k71L9l2K45j06Q4m06
7243b46K55j03l0L26l17Q9j91J52J87o0j37L97m74L57l01O3J11Q5m75K96k80J79
7265a17J03k94O56k38j30jmJ78R3m50N5K96j88N3k35L45R8m44K41k70L27j24K7
7288b3rJ2j30K02J69j73J43j43k33O3J41K60l31K45m40K25K65m3j45k13J55j1
$$ plain form
7310 -14 -6 47 -7 311 -175 -91 194 -38 -11 108 145 -89 -40 105 -84 65 116 96 -170 129 -314 15 14 -60 -190
7335 -190 -126 51 -79 -81 173 64 -378 98 -20 53 166 4 -68 172 -79 -17 99 -130 233 39 -105 -21
7357 -21 -204 129 157 116 -19 -229 -293 124 -310 -228 178 -173 -39 -38 239 104 79 -68 120 -165 -31 -4 -74
7380 -74 34 -55 -162 157 -326 68 18 -206 313 -119 -15 80 133 84 29 -199 -192 -2 41 28 -55 -16 91 -352
7404 -352 63 -77 -83 -213 160 18 -13 -115 -181 8 -104 -134 -154 109 300 -100 165 207 -189 62 107 180 -262
7427 -262 52 101 124 -114 -67 -220 44 -101 -54 197 -38 -14 143 -170 -236 110 -263 76 -101 -79 101 91 49
7450 49 4 -127 27 -235 -154 28 -182 -125 -6 -108 54 -187 -89 -26 -138 -166 146 -45 -106 25 -62 36 148
7473 148 185 -19 96 116 135 81 104 9 174 -116 -51 25 9 -151 33 133 -63 -15 -155 14 181 -262 133
$$ packed form
7310a4QN3n4L18m86Q4K85k32K7J19L7k34M9J45j89J49N1k0k66K99m43L29jp4j30
7335a90O4J77j30kK54j09m42M76j18P3J13j62p2K40k51O2J16k29L63j94j44Q4
7357b1j83L33K8m1j35k10o4M17m34Q2M06l51J34JK77j35k5j47J88k85J34K7p0
7380g4J08q9j07L19m83L94n0k24N19m32J04R5N3m9n5k28PJ90M3j3q3L9J07m43
7404c52M15j40oj30L73j42l1j02o6J89j12l0k0K63J91m00K65M2l96K51M5P3m42
7427b62L14M9K3k38M7j53K64j45M7K51k35K4J57l13o6L46l73L39j77K2J80j0m2
7450D9m5j31J54k62Q1J82k10N7J19j02J62k41R8O3j12k8L12j91o1J31q7R8J12
7473A48L7k04J15K0J9n4K3r5J65k90O5P6j6j60J84J00j96M8j40J69J67m43L95
$$ plain form
7496 133 53 -66 -138 -24 116 -146 31 -22 114 401 72 -39 140 117 -95 35 214 -83 -6 57 -104 256
7518 256 87 -24 154 123 118 83 40 -156 21 -277 101 -262 129 104 -105 -24 101 78 156 136 -15 -79 -67 -9
7542 -9 -120 -15 132 -180 -69 127 24 277 -17 39 44 46 81 27 -64 -123 119 -235 67 0 144 239 -81 -57 -271
7567 -271 45 220 -102 -47 47 -31 -15 52 41 151 33 204 -66 71 -34 68 73 266 -32 -192 47 -158 11
7590 11 -66 -4 -89 -90 25 274 -145 -145 44 120 -246 144 19 -139 -31 -16 -1 -24 -210 113 -28 184 -18 -78
7614 -78 85 11 127 -90 -110 -10 198 104 22 35 248 205 -139 -77 -50 -299 188 -120 64 38 289 -153 227
7637 227 37 77 -103 -2 -185 -93 262 -75 167 198 140 69 -129 33 -17 98 17 106 -152 151 57 -215 34
7660 34 -103 -54 -105 -3 -66 -6 16 203 138 -36 -175 -161 -66 69 -233 -68 238 39 133 -87 94 162 62 77
$$ packed form
7496A33q0j19p2J14J40k62J77n3J36K87l29j11J79k3k12J30J79k97P7O3j61L60
7518B56j69j11J78l1nl5m3j96J77k98L78l63L91k5k09Q1J25k3P8k0j51o4J2N8
7542ij11J05J47l12J11J96j03K53k94N6NKL5n4r1n9K42l54L02o7J44R5l20K4k14
7567b71L16J75l22N5R4p8J6O7j1J10j18J71k70J37j05J02NJ93k98j60K39k05J69
7590A1p7O2q5jJ15K49m19%J89P6l66L90j25j58J08J5J5k3j86L23j41K12k02o0
7614g8J63p4J16k17k0J00K08r4q2J3K13m3l44O2K7k49M87l08J84k6K51m42L80
7637B27j90M0j80J01j83R2L55l37K42L1n8p1j98J62n0J15q1Q9k58L03r4k72K49
7660C4j37M9n1J02o3O0K2J87o5j74j39J4R5J35l02J65L06j99R4k20J81O8j00J5
$$ plain form
7684 77 65 -42 -57 -122 -68 103 -248 -72 -176 106 239 70 -132 -9 0 93 41 -163 -70 -364 -286 352 55 12
7708 12 6 10 -79 -63 -158 254 -227 92 126 -119 -78 -223 -4 40 -110 162 94 -192 348 -51 -20 -70 79 85 216
7733 216 -255 25 49 -12 151 -105 -120 42 -130 102 42 -281 159 116 -102 174 -151 150 260 -79 -84 9 75
7756 75 -26 -28 -200 169 -125 71 57 15 61 -48 -53 121 28 79 61 21 -92 67 11 -123 13 -15 -113 -102 283
7781 283 143 26 -94 -117 -54 -278 30 63 -170 -109 29 -111 -148 69 304 104 203 -48 -26 -124 -102 93 -356
7804 -356 207 120 -93 176 -251 180 -33 -126 -29 143 41 60 310 -86 292 39 -8 -47 -63 37 -41 60 73
7827 73 -56 85 -119 -163 -25 -53 -351 213 -144 -162 148 -122 -211 -39 -114 189 130 -74 -36 -210 62 69 22 -63
7851 -63 -93 -115 -54 -83 188 -12 -155 8 24 -184 -173 -35 177 -6 7 140 164 -234 -17 294 -131 22 -115
$$ packed form
7684G7j2j07j5o5N4J71l51J76j04K82J33j69k02J23RR3n2k04R3k94P8O38k97m3
7708A2oMq9J6r5M12m81L19L4k45M1j45K19M4j50K72o8k86N40l99L1n0J49OJ31
7733B16m71K80K4o1J63k56j5J62j72K32o0l23M40m3k18K76l25L01J10l39nR3O6
7756G5j01kj72L69k94J96j4m2M6j09nJ74r3N1j8m0j13J59n6j34J36k8r8J1L85
7781B83j40j17j20k3O3k24L08L3k33O1J38j40l7K17K35k00R9k51K2r8K2J95m49
7804c56N63q7k13K69m27M31k13r3R7J72j02J9K50l96L78k53m7l9j6J00p8J01J3
7827G3j29J41k04m4J38k8k98N64l57j8L10k70q9J72p5L03n9k04L8j74K72Pm7q5
7851f3l0k2O1k9K71k00j43J63J6k08J1J38K12j83J3J33K4l98K17L11m25J53j37
$$ plain form
7874 -115 21 89 -149 29 -103 61 -132 -187 -66 -28 -215 -87 101 130 -10 84 103 -139 -114 -152 -219 -48 4
7897 4 56 -49 66 137 80 -227 -110 75 19 -107 239 57 125 175 -26 356 -18 51 60 -10 141 -210 140 295
7921 295 -111 56 218 -276 136 199 -130 -32 69 30 188 212 89 37 90 -137 156 258 -47 -135 -110 -44 140
7944 140 62 -55 -38 33 44 -82 73 18 83 -80 -205 -7 -30 193 16 -272 197 14 155 8 85 114 150
7967 150 60 109 252 218 176 -214 59 -172 -48 108 94 40 320 -199 -187 -152 -281 112 105 -88 103 -18 23 77
7991 77 -6 289 -14 -22 326 -61 -225 126 133 18 70 -105 -156 -154 -106 -47 -183 90 -104 225 -173 -131 -191 198 143
8016 143 46 325 -75 -141 -21 -56 222 -277 -268 141 -255 -152 -112 -110 19 49 -33 75 -74 88 137 -74 24 159
8040 159 -283 46 -48 -71 123 148 37 37 -2 -80 -44 53 255 109 -3 110 -175 68 31 13 -147 -134 -31 73
$$ packed form
7874a15J36O8k38J78j32J64j93n5J21L8j87J28J88K9j40R4J9k42K5l8o7J71N2
7897DN2j05J15P1n7l07J17J85n6j26L46j82O8N0k01L82l74O9Rp0J51l51L50J55
7921B95m06J67J62m94M12O3l29R8J01l9J58K4j23n2N3k27K93J02l05q8K5O6J84
7944A40p8j17J7P1J1j26J55n5O5j63j25J98k3K23j77k88M69j83J41j47P7K9L6
7967A50r0M9J43l4m2l90K73k31J24J56j4n4K80n19J2L5j29L93pj93J91j21M1N4
7991G7q3K95l03qL48l87j64L51Pj15N2j75n1KM8N9j36K73j94L29l98M2o0L89n5
8016A43r7K79m00o6J20l5K78m99RM09l96J03M0KJ29L0q2J08j49J62M9k11R8J35
8040A59m42L29r4k3J94K5j11%l9p8L6R7K02j46j12J13k85K43l7j8j60J3J03J04
$$ plain form
8064 73 14 -73 -25 -188 212 -60 -3 51 -17 166 69 -60 97 9 27 149 121 121 -125 170 -28 -73 44 62 30
8089 30 -90 108 149 30 -13 -24 32 37 224 13 -299 207 -177 216 141 -168 18 -63 -91 58 -150 -29 16 -129
8113 -129 -30 76 -129 16 255 -278 284 -77 119 22 -81 28 17 29 131 -80 48 164 -87 0 -96 13
8135 13 82 57 143 88 -332 -203 118 -273 -145 -115 -157 -11 -43 73 0 3 -39 -93 16 33 -246 -349 -116 -65 -43
8160 -43 220 67 152 -50 196 78 -57 -253 -143 56 168 17 68 -98 12 -108 -39 133 -81 -85 203 136
8182 136 -150 218 -161 -60 -19 -8 214 -4 64
$$ packed form
8064G3n9q7M8j63M00k72N7N4o8J83r7j29J57q8J8J22k8%k46K95j98m5J17J8l2
8089C0j20J98M1j19m3j1N6NJ87k11l12N06l84L93p5l09J86q1k8J49k08J21M5j45
8113a29R9J06k05J45K39n33N62l61J96r7j03J09j1J2J02k11J28J16k51Q7r6J09
8135A3O9k5Q6n5m20J29L21l91J28L0m2J46l2J16p3Lm2n4J09J7k79j03K33N1K2
8160d3K63j53Q5k02K46j18j35j96J10J99J12j51N1j66J10j20O9J72k14mK88o7
8182A36k86L68l79J01M1J1K22k18O8
8191F4
$$ Imaginary data points
##PAGE= N=2
##DATA TABLE= (X++(I..I)), XYDATA
$$ plain form
0 0 0 0 0 0 0 0 0 -8 8 -8 8 -16 16 -19 24 -32 35 -40 48 -57 71 -80 94 -107 123 -140 161 -184 207 -234 263
31 263 -296 331 -371 414 -462 511 -568 631 -699 773 -856 950 -1049 1163 -1289 1433 -1597
48 -1597 1785 -2003 2260 -2572 2951 -3431 4058 -4913 6152 -8124 11729 -20439 84106 44696
62 44696 -94687 96933 2480 -68490 70774 21288 -85078 19422 35892 -45707 -8707
73 -8707 44191 -43084 -12454 63641 -37838 -51098 21246 -40697 -12612 31227 -24193 -6933
85 -6933 7853 7550 31438 -10353 10687 31935 -15230 30157 18342 -50749 16434 29288 -16032
98 -16032 21283 11727 -35074 -4993 26751 -20532 -33310 25813 -18109 -36208 47746 -31538
110 -31538 -61700 60737 -8498 -36440 61731 -30342 -45022 63077 2186 -22011 42383 8348
$$ packed form
0@%%%%%%%qJ6j6J6k4L2l5M3n6O7p5Q8j05J28j51J74k01K30k63L01l45L91m41M97
31B63n59O27p02P85q76R73j079J199j330J472j629J806j999K212k452K722l030
48a597L382l788M263m832N523o382P489q971J1065j4276J9853l2168J04545l9410
62D4696j39383J91620r4453p0970J39264m9486j06366J04500J6470q1599L7000
73h707N2898q7275L0630P6095j01479j3260P2344o1943K8085M3839n5420J7260
85f933J4786l03K3888m1791K1040K1248m7165M5387j1815o9091O7183J2854m5320
98a6032L7315r556m6801L0081L1744m7283j2778N9123m3922j8099Q3954p9284
110c1538l0162J22437o9235k7942R8171r2073j4680J08099o0891k4197O4394l4035
$$ plain form
122 8348 -13688 32568 17285 -38130 -271 31842 -24315 2138 19789 -50175 1798 33531
134 33531 -28054 9849 4520 -34398 13331 -8442 -28838 2080 -15052 7449 23353 -8472
146 -8472 5345 5891 5159 27417 8966 -2093 -3423 -4012 4814 -7682 1078 30 -7348 31251
160 31251 2152 -23951 17927 -20485 -15380 35047 -31520 -28418 18851 -27194 -5700 26319
172 26319 -15498 -2170 27219 8395 -8287 2925 4470 -14786 17351 24344 -28509 2743
184 2743 18113 -20857 21113 14492 -25092 16454 5514 -15709 4808 -18309 -10094 10320 -4255
197 -4255 2075 -9318 -13752 5971 1017 6860 2874 -6553 11166 376 376 7589 -14480 9421
211 9421 15593 -8741 8754 -9383 -13349 20152 -1557 995 11013 -17562 5337 7426 -18769
$$ packed form
122H348k2036M6256j5283n5415L7859L2113n6157K6453J7651o9964N1973L1733
134C3531o1585L7903n329l8918M7729k1773k0396L0918j7132K2501J5904l1825
146h472J3817N46p32K2258j8451j1059j330n89Q826j2496Q760j048p378L8599
160C1251k9099k6103M1878l8412N105N0427o6567L102M7269m6045K1494L2019
172B6319m1817J3328K9389j8824j6682J1212J545j9256L2137O993n2853L1252
184B743J5370l8970M1970o621l9584M1546j0940k1223K0517k3117Q215K0414j4575
197d255O330j1393m434J9723m954N843l986r427J7719j0790%P213k2069K3901
211I421O172k4334J7495j8137l966L3501k1709K552J0018k8575K2899K089k6195
$$ plain form
224 -18769 1207 -3970 -8525 8385 -3991 -9077 -6596 3753 14505 -926 10014 3696 -19172
237 -19172 14922 3586 -22024 14080 -594 -9940 20534 -5187 -10892 9595 2730 8348 1887
250 1887 -5480 -4568 -14332 4492 1798 -16603 9042 2338 -6132 14097 -5486 -6725 9526 1989
264 1989 7379 -3882 -10125 1711 -10208 6036 11208 -14582 10019 9946 -11038 10599 -2017
277 -2017 -11262 11202 1922 -2790 -5034 -9841 1146 -3598 6305 8248 -11867 8277 7105 -11213
291 -11213 9816 -2624 -8768 13721 -2785 -4954 -590 -11001 6552 4477 399 9014 -7865
304 -7865 1486 8202 -9435 3746 -122 -7360 9625 -4779 -7101 588 -7068 9570 7435 -2517
318 -2517 6628 -6672 -975 7575 -9510 2643 918 -8288 9585 -5800 -8572 8382 -4088
$$ packed form
224a8769J9976n177m555J6910j2376n086K481J0349J0752j5431J0940o318k2868
237a9172L4094j1336k5610L6104j4674r346L0474k5721n705K0487o865N618o461
250A887p367R12r764J8824k694j8401K5645o704q470K0229j9583j239J6251p537
264A989N390j1261o243J1836j1919J6244N172k5790K4601p3k0984K1637j2616
277b017r245K2464r280m712k244m807J0987m744R903J943k0115K0144j172j8318
291a1213K1029j2440o144K2489j6506k169M364j0411J7553k075m078Q615j6879
304g865R351O716j7637J3181l868p238J6985j4404k322P689p656J6638k135r952
318b517R145j3300N697Q550j7085J2153j725r206J7873j5385k772J6954j2470
$$ plain form
331 -4088 7218 11326 -8174 694 -1526 -4524 4467 -5254 202 -223 -4892 7901 -5994 -4948
345 -4948 12880 -3374 5489 9932 -14002 -839 2157 -6821 5913 -2344 -2879 3071 -4297 5815
359 5815 -1527 -4264 12782 -1607 -898 5882 -13746 -2528 4323 -4859 5023 -1950 -1848 4322 -4744
374 -4744 6163 1228 -6118 12687 -2635 -7647 5868 -11858 -2894 9953 -4205 3106 1314
387 1314 -3084 4808 -1537 4006 2640 -5341 8077 -3578 -9643 4407 -8328 -271 10808 -5489
401 -5489 2605 1356 -5455 6806 -1829 -538 5028 -6933 2234 -1037 -9747 4779 -1173 1590
415 1590 10409 -3871 2155 2285 -5066 7533 -868 -3227 4609 -7696 -1087 587 -7906 5832
429 5832 1684 -64 7859 -6597 -588 2643 -7491 5517 -419 -7708 4701 -5025 -2710 5537
$$ packed form
331d088J1306M108j9500Q868k220k998Q991r721N456m25m669J2793j3895J046
345d948J7828j6254Q863M443k3934J3163K996q978J2734q257n35N950p368J0112
359E815p342k737J7046j4389P09O780j9628J1218O851r182R882o973J02O170r066
374d744J0907m935p346J8805j5322n012J3515j7726Q964J2847j4158P311j792
387A314m398P892o345N543j366p981J3418j1655o065J4050j2735Q057J1079j6297
401e489Q094j249o811J2261q635J291N566j1961R167l271q710J4526n952K763
415A590Q819j4280O026J30p351J2599q401k359P836j2305O609J674q493J3738
429E832m148j748P923j4456O009L231j0134J3008n936p289J2409r726K315Q247
$$ plain form
443 5537 -2070 6991 5212 555 5455 -6135 -1050 4449 -7120 5288 911 -9354 4967 -2751
457 -2751 -3570 7032 -2587 2615 1813 -6227 1344 -7460 -3579 5741 -6918 2716 4284 -8650 5428
472 5428 2934 -2167 8584 1510 1658 1651 -4089 2893 -3825 -249 8092 -6755 1331 4677 -11141
487 -11141 3776 3088 -6899 6417 -1512 -5861 653 -6245 -912 -330 -2322 4894 -3589 -128 4790
502 4790 -4691 6644 6339 -921 8437 -1675 -3052 3513 -6253 3033 3336 -5849 5781 -1641 -5103
517 -5103 6847 -3907 -877 4963 -6351 -2002 -4199 -8292 -533 -2889 2581 3535 -1671 7028 164
532 164 425 9300 -3583 2708 6514 -8727 2712 152 -7908 9279 2348 -1206 7699 -3963
546 -3963 -2853 1371 -5326 -2202 -3847 -3094 -2188 -6677 1977 -2416 -2435 11208 -896 40 8183 -8248
$$ packed form
443E537p607R061j779m657M900j1590N085N499j1569J2408m377j0265J4321p718
457b751q19J0602r619N202q02q040P571q804L881R320j2659R634J568j2934J4078
472E428k494n101J0751p074J48pn740O982o718L576Q341j4847Q086L346j5818
487a1141J4917o88r987J3316p929m349O514o898N333N82j992P216q483L461M918
502D790r481J1335l05p260R358j0112j377O565r766R286L03r185J1630p422l462
517e103J1950j0754L030N840j1314M349k197m093P759k356N470R54n206Q699o864
532A64K61Q875j2883O291L806j5241J1439k560q060J7187o931l554Q905j1662
546c963J110M224o697L124j645P53R06m489Q654m393j9J3643j2104R36Q143j6431
$$ plain form
562 -8248 1448 7314 -6139 5552 3789 -3837 6777 -402 -1320 4886 -1225 2881 526 -5189 -1792
577 -1792 -5497 -1101 37 -4347 2059 -5066 -3934 4518 -8165 194 7457 -6502 7304 5862
591 5862 -8940 6630 4035 -2711 8782 391 -3442 2382 -337 732 -506 2387 3074 -1830 4234
606 4234 -3883 -8921 2750 -6435 -4238 4128 -10737 -1652 4493 -7134 7650 5289 -4576 9504
620 9504 1851 -5365 2977 -3165 -1953 4880 3542 960 -793 5481 1864 -964 8986 -4143 -6727
635 -6727 6257 -10543 -8320 3589 -10354 459 7988 -5537 2319 708 -3694 5113 -174 -950
649 -950 1203 -3318 1729 1250 -428 3512 2570 7311 2713 -1028 3708 -6897 -696 7588 -9771
664 -9771 -362 4311 -12766 2875 4434 -11292 3690 4110 -5988 2006 -372 -5437 -846 5831
$$ packed form
562h248R696N866j3453J1691j763p626J0614p179r18O206o111M106k355n715L397
577a792l705M396J138m384O406p125J132Q452j2683Q359P263j3959J3806j442
591E862j4802J5570k595o746J1493q391l833N824k719J069j238K893O87m904O064
606D234q117n038J1671r185K197Q366j4865R085O145j1627J4784k361r865J4080
620I504p653p216Q342o142J212O833j338k582j753O274l617k828R950j3129k584
635f727J2984j6800K223J1909j3943J0813P529j3525P856j611m402Q807n287p76
649i50K153m521N047m79j678L940r42M741m598l741M736j0605O201Q284j7359
664i771R409M673j7077J5641J559j5726J4982M20j0098P994k378n065M591O677
$$ plain form
678 5831 3233 -3412 4762 1025 -5937 8544 991 -6330 9314 121 -2311 7129 -5392 -1262
692 -1262 5034 -3282 2315 -3403 -8584 1057 -3916 -2066 3395 -3067 1323 3612 54 -896 -2403
707 -2403 2293 -340 -1039 5439 -7639 -3106 10946 -3724 3445 11596 -7094 2775 7420 -9485
721 -9485 -1782 400 -6212 741 1007 -3156 -3989 1443 4801 -1376 3588 1810 -7766 3139 118
736 118 -8104 4144 -1500 -1316 9438 -1440 -426 4662 -2020 5653 3503 -4696 545 -3610 -2329
751 -2329 2054 -3060 10 1209 947 2612 -3513 -990 -376 -2388 6067 -2109 -5323 4445 -4986 153
767 153 7708 -6148 1576 6335 -4284 2952 1327 -4882 3105 3527 1274 -1733 -2799 81 -3749
782 -3749 2201 3075 -7068 2677 2927 -5256 4550 -524 -4467 6597 17 -1621 221 -6577 914
$$ packed form
678E831k598o645Q174l737o962J4481p553p321J5644r193k432R440j2521M130
692a262O296q316N597n718n181R641m973J850N461o462M390K289l558r50j507
707b403M696k633o99O478j3078M533J4052j4670P169Q151j8690R869M645j6905
721i485P703K182o612O953K66m163q33N432L358o177M964j778r576J0905l021
736A18q222J2248n644J84J0754j0878J014N088o682P673k150q199N241m155J281
751b329M383n114L070J199k62J665o125K523O14k012Q455q176l214R768r431N139
767A53P555j3856P724M759j0619P236j625o209P987M22k253l007j066K880l830
782c749N950Q74j0143R745K50q183R806n074l943J1064o580j638J842o798P491
$$ plain form
797 914 2110 -761 4112 -1440 410 5119 -1232 794 -428 -1891 2874 -2060 -1859 -1765 -6236 4766
813 4766 3168 -2266 5499 -2242 -2093 6162 -3742 -2181 1450 -3813 2468 206 -3797 442 -419 4604
829 4604 4352 -1382 1854 -2951 -1622 3668 -4571 -1155 1384 -3484 3662 20 -4583 3583 233
844 233 2678 4414 -5025 -927 -136 -2479 3515 -1767 -2376 2333 -876 2322 -340 -2643 3912 131
860 131 1995 2671 -7326 -356 1752 -3542 4019 -851 -4220 3836 -351 157 891 -1760 3528 1062
876 1062 -73 1053 -6602 -65 3615 -2836 3062 -220 -3577 4069 118 79 1466 -2634 3599 566
892 566 -3729 727 -5276 -1214 5719 -1900 148 720 -1911 3261 479 23 798 -2837 3206 -2
908 -2 -5425 1712 -2464 -160 6933 -1699 -927 2166 -1990 2925 818 -2416 691 -2677 765 231
$$ packed form
797I14J196k871M873n552J850M709o351K026j222j463M765m934K01R4m471J1002
813D766j598n434P765p741J49Q255r904J561L631n263O281k262m003M239q61N023
829D604k52n734L236m805J329N290q239L416K539m868P146l642m603Q166l350
844B33K445J736r439M098P91k343N994n282o09M709l209L198k662k303O555l781
860A31J864O76r997O970K108n294P561m870l369Q056m187N08P34k651N288k466
876A062j135J126p655O537L680o451N898l282l357P646l951l9J387m100O233l033
892E66m295M456o003M062O933p619K048N72k631N172k782m56P75l635O043l208
908bn423P137m176K304P093q632P72L093m156M915k107l234L107l368L442n34
$$ plain form
924 231 -5031 1164 598 665 5443 -2461 -1303 1629 -2372 3342 -252 -4229 2415 -2201 -743 2418
940 2418 -3820 1505 3530 -58 3136 -2424 -2459 1939 -1593 2005 -528 -4534 2146 -1068 -682 2827
956 2827 -2780 2254 3706 -1797 2175 -2959 -3053 3743 -1645 293 919 -4727 1900 1311 -1170 2858
972 2858 -989 1591 3222 -2222 -85 -2578 -2279 4121 -1659 -133 962 -4244 3215 2425 -2475 3410
988 3410 -688 -935 2953 -3195 -2189 -492 -1698 3233 -638 -1243 919 -2446 3181 2699 -2162 2669
1004 2669 -1119 -1719 2308 -3947 -1157 1401 -1235 3928 -81 -2502 2613 -1337 1638 3003 -3656
1019 -3656 571 -300 -2988 1109 -2713 -968 2361 -684 2691 -761 -2901 3172 -647 813 2534
1034 2534 -4266 -33 657 -2721 2847 -544 -436 4314 -897 1239 308 -3515 2540 700 -1221 827
$$ packed form
924B31n262O195n66O7M778p904J158K932m001N714l594l977O644m616J458L161
940B418o238N325K025l588L194n560l5M398l532L598k533m006O680l214L86L509
956B827n607N034J452n503L972n134r4O796n388J938O26n646O627n89k481M028
972B858l847K580J631n444K137k493K99O400n780J526J095n206P459p90m900N885
988C410m098k47L888o148J006J697j206M931l871o05K162l365N627m82m861M831
1004B669l788o00M027o255K790K558k636N163m009k421N115l950K975J365o659
1019c656M227q71k688M097l822J745L329l045L375l452k140O073l819J460J721
1034B534o800M233O90l378N568l391J08M750n211K136r31l823O055j840j921K048
$$ plain form
1050 827 -3737 -733 449 -1462 2053 -1142 -572 3915 -2172 -3 743 -3650 3041 1371 -2815 1446
1066 1446 -2478 -484 3323 -765 2201 808 -726 3495 -1689 -1337 1160 -2840 1657 706 -3960
1081 -3960 71 -2099 12 3330 -1431 1967 656 -2325 3007 -2063 -2821 2564 -2563 718 2069
1096 2069 -3632 937 1583 726 4254 -387 586 581 -2579 1200 -1983 -2856 2336 -1961 477 1320 -3582
1113 -3582 2247 1292 -845 3279 -2772 -2383 1356 -3640 581 806 -2113 3240 1083 -72 2105 -1567
1129 -1567 1474 1912 -729 1762 -2984 -1864 1662 -2463 1502 1172 -2570 2892 -305 -2775 1664
1144 1664 -2919 623 2421 -2722 698 -820 -2372 2645 -498 29 1603 -1359 1662 41 -682
1159 -682 1992 -1240 2154 2285 -3484 1103 -1530 -3466 3642 -1757 -2133 2777 -2304 225 2018 -2103
$$ packed form
1050H27m564L004J182j911L515l195N70M487o087K169P46m393O691j670m186M261
1066A446l924J994L807m088K966j393j534M221n184L52K497m000M497r51m666
1081c960M031k170K111L318m761L398j311k981N332n070p58N385n127L281J351
1096B069n701M569O46q57L528m641R73nl160L779l183q73N192m297K438Q43m902
1113c582N829r55k137M124o051L89L739m996M221K25k919N353k157j155K177l672
1129a567L041M38k641K491m746J120L526m125L965l30l742N462l197k470M439
1144A664m583L542J798n143L420j518j552N017l143N27J574k962L021j621p23
1159f82K674l232L394J31n769M587k633j936P108n399l76M910n081K529J793m121
$$ plain form
1175 -2103 1093 143 -854 263 -3087 -347 -450 -869 3829 283 207 3375 -1454 1875 1333 -3199 2242
1192 2242 -1319 -2971 1841 -3478 -806 3460 -1035 2305 1796 -2451 634 -1070 -1609 -412 -1966
1207 -1966 754 -1018 -479 2785 -1769 2167 4147 -1602 2699 429 -4342 2196 -1031 -1976 2869
1222 2869 -1732 121 2132 -1743 1356 343 -900 1601 -1691 -1099 -1311 -2315 1359 -667 462
1237 462 2419 -2460 1293 1371 -3196 2900 529 -2210 4239 -1216 -2158 2654 -2030 881 1985 -1514
1253 -1514 242 -904 -678 471 -1405 1691 69 -890 2432 -2498 -1259 1248 -3437 1420 804 -3621
1269 -3621 2663 -276 -1237 4443 -569 335 2884 -2036 -474 -431 -2070 343 -269 1445 355 -817
1285 -817 2681 -1164 56 3005 -3322 -488 766 -4777 617 56 -2810 3821 1137 -148 2982
$$ packed form
1175b103L196r50r97J117l350K740j03m19M698l546p6L168m829L329n42m532N441
1192B242l561j652M812n319K672M266m495L340n09m247L085j704n39J197j554
1207a966K720j772N39L264m554L936J980n749M301k270m771O538l227r45M845
1222B869m601J853K011l875L099j013j243K501l292N92k12j004L674k026J129
1237D62J957m879L753P8m567O096k371k739O449n455r42M812m684K911J104l499
1253a514J756j146K26J149j876L096j622r59L322m930J239K507m685M857o16m425
1269c621O284k939r61N680n012R04K549m920J562M3j639K413o12J714j090j172
1285h17L498l845J220K949o327K834J254n543N394n61k866O631k684j285L130
$$ plain form
1300 2982 -1297 306 711 -1555 1022 -1353 -1331 385 -1582 1802 840 65 3393 -751 -290 1397
1316 1397 -3817 422 795 -3500 2198 -591 -2636 2841 -743 -206 3108 -711 50 352 -1410 229
1332 229 -944 1061 579 -875 2575 -1407 -1461 2974 -2267 516 3098 -3259 1044 999 -3380 1762
1348 1762 19 -1749 1808 -1552 -453 -1 -1367 1662 260 575 1776 -1690 1096 26 -2288
1363 -2288 1806 -1110 -959 2178 -2484 247 1779 -2230 2951 1211 -1508 1990 -1993 -2170 930
1378 930 -2092 -312 582 -993 1143 -417 1029 1212 -798 2767 -650 -2305 1918 -3240 -1597 2892
1394 2892 -2148 1370 2757 -2001 1896 888 -761 1328 -722 371 -638 -2410 315 -1516 -366
1409 -366 2557 -1060 1279 1286 -2034 1699 -598 -1221 2029 -2174 -177 1133 -2916 1435 1054 -1177
$$ packed form
1300B982m279J603M05k266K577k375K2J716j967L384r62p75L328m144M61J687
1316A397n214M239L73m295N698k789k045N477l584N37L314l819P61L02j762J639
1332B29j173K005m82j454L450l982n4M435n241K783K582o357M303m5m379N142
1348A762j743j768L557l360J099M52j366L029j402L15J201l466K786j070k314
1363b288M094k916J51L137m662K731J532m009N181j740k719L498l983j77L100
1378I30l022J780Q94j575K136j560J446J83k010L565l417j655M223n158J643M489
1394B892n040L518J387m758L897j008j649K089k050J093j009j772K725j831J150
1409c66K923l617K339Pl320L733k297o23L250m203J997J310m049M351l81k231
$$ plain form
1425 -1177 2790 -130 -1166 1178 -1379 351 -324 -799 912 -1623 81 571 -2965 2035 821 -1456
1441 -1456 3002 -930 -1692 2093 -1529 189 1314 -1725 672 -445 -1116 1012 -1386 1403 1912 -1034
1457 -1034 1855 -910 -1409 1574 -1353 140 591 -2543 1122 -529 -1449 2537 -1228 263 2778 -1954
1473 -1954 174 390 -2264 1119 -50 -382 391 -1192 996 -267 -604 2763 -967 447 1945 -2989
1489 -2989 -260 173 -2707 1888 400 -1334 1485 -1153 309 1578 -1073 1358 -97 -866 774
1504 774 -2151 -631 600 -1152 2068 -43 -917 1817 -1284 1037 2074 -2143 1540 -217 -2644
1519 -2644 1636 -1503 -1231 2076 -1014 881 989 -1359 846 -110 548 853 -1487 731 -593 -1889
1535 -1889 1766 -1532 -356 3049 -1340 1148 1293 -2428 1531 327 -1048 1765 -1704 -732 723
$$ packed form
1425a177L967k920j036K344k557J730o75m75J711k535J704M90l536N000j214k277
1441a456M458l932p62L785l622J718J125l039K397j117o71K128k398K789N09k946
1457a034K889k765m99K983k927J493M51l134L665j651r20L986l765J491K515m732
1473a954K128K16k654L383j169l32P73j583K188j263l37L367l730J414J498m934
1489b989K729M33k880M595j488j734K819k638J462J269k651K431j455p69J640
1504G74k925J520J231j752L220k111q74K734l101K321J037m217L683j757k427
1519b644M280l139K72L307l090J895J08k348K205r56O58L05k340K218j324j296
1535a889L655l298J176L405m389K488J45l721L959j204j375K813l469R72J455
$$ plain form
1550 723 -1457 767 270 -199 1957 -495 392 205 -1806 1450 -191 -1172 1399 -2084 -551 1764
1566 1764 -1813 1384 939 -1054 2090 -619 -1304 1264 -1547 468 680 -1750 372 -1049 -366 1682
1582 1682 -736 1424 515 -1233 2040 -1408 -1475 1468 -1824 440 1335 -2452 740 555 -679 2295
1598 2295 -294 -28 876 -1324 507 -732 -1655 1109 -1124 147 1118 -2123 1166 628 -527 2175
1614 2175 -865 -430 1129 -2291 687 388 -2147 1740 42 -1069 1514 -957 291 1520 -418
1629 -418 1026 -866 -1028 577 -1724 375 113 -1403 2094 -164 -979 1973 -1370 407 2141 -1238
1645 -1238 750 -659 -2077 1107 -796 -189 1228 -1075 1140 508 -1010 1456 -490 -3 1185 -1656
1661 -1656 -45 -849 -1743 1654 -619 -57 1964 -1180 1282 1093 -1861 1275 -214 -692 1313 -1900
$$ packed form
1550G23k180K224m97m69K156k452Q87j87k011L256j641r81K571l483J533K315
1566A764l577L197m45j993L144k709o85K568k811K015K12k430K122j421O83K048
1582A682k418K160r09j748L273l448o7K943l292K264Q95l787L192j85j234K974
1598B295k589K66R04k200J831j239r23K764k233J271R71l241L289n38j155K702
1614B175l040M35J559l420K978k99k535L887j698j111K583k471J248J229j938
1629d18J444j892j62J605k301K099k62j516L497k258q15K952l343J777J734l379
1645a238J988j409j418L184j903O07J417k303K215o32j518K466j946M87J188k841
1661a656J611q04q94L397k273N62K021l144K462j89k954L136j489m78K005l213
$$ plain form
1677 -1900 -860 416 -864 1596 417 -119 1510 -727 379 261 -2127 731 -769 -887 1579 -2011
1693 -2011 -295 1357 -736 1897 572 -1274 1005 -691 -583 876 -1414 482 417 -821 1062 -843
1709 -843 -206 1826 -733 1009 104 -1978 1162 -738 -889 1343 -1446 472 807 -1557 1111 -483
1725 -483 -644 2308 -593 339 891 -1815 798 265 -933 874 -942 34 423 -1255 1183 -434 -114
1742 -114 2389 -1151 -374 468 -2235 602 473 -1884 930 -477 -400 1627 -344 729 927 -542 1159
1759 1159 -1129 -1294 154 -1650 691 809 -1256 1578 -7 5 1881 -1055 536 938 -1858 633
1775 633 -1104 -2096 1175 -255 785 1754 -862 848 530 -648 826 -1046 -249 427 -1578 437
1791 437 -438 -881 2027 0 429 1383 -1528 303 507 -1541 947 -578 -1009 1257 -1004 277 871
$$ packed form
1677a900J040J276j280K460j179n36J629k237J106j18k388K858j500j18K466l590
1693b011J716J652k093K633j325j846K279j696J08J459k290J896o5j238J883j905
1709h43O37K032k559J742r05k082L140j900j51K232k789J918L35k364K668j594
1725d83j61K952k901R32N52k706K613n33j198J807j816R76L89j678K438j617L20
1742a14K503l540P77Q42k703K837j29k357K814j407P7K027j971J073J98j469J701
1759A159k288j65J448j804K341J18k065K834j585J2J876k936J591M02k796K491
1775F33j737r92L271j430J040R69k616J710l18j178J474j872P97O76k005K015
1791D37q75m43K908k027M29R54k911J831K04k048K488j525m31K266k261J281N94
$$ plain form
1808 871 -518 1341 230 -108 291 -1310 537 492 -1146 1326 -681 -858 1347 -1615 -274 980
1824 980 -1458 1434 583 -1116 856 -592 -89 1145 -959 453 -313 -1012 892 -1102 200 1566
1840 1566 -429 1580 412 -1454 1142 -966 -611 1092 -1844 -503 224 -1203 1429 426 -263 1773
1856 1773 -218 57 52 -1791 -155 -730 -153 860 -892 642 1239 -410 2191 409 -588 1631 -1330
1873 -1330 -833 485 -2190 596 821 -983 1147 -331 -259 772 -555 398 -261 -1240 435 -1459 -456
1890 -456 677 -1119 1270 1104 -692 1493 -406 -728 1679 -891 97 900 -1740 545 -136 -782 1187
1907 1187 -645 433 622 -1143 368 -529 -557 1104 -720 193 307 -1568 876 -265 -1104 1824 -310
1924 -310 151 1758 -1054 678 1114 -570 1135 -174 -827 -25 -1234 -12 -33 -732 1224 -546 123
$$ packed form
1808H71j389J859j111l38L99j601J847m5j638K472k007j77K205k962J341J254
1824I80k438K892q51j699J972j448N03J234k104J412p66o99J904j994J302J366
1840A566j995K009j168j866K596k108L55J703k936J341P27j427K632j003o89K036
1856A773j991K75nj843J636n75N77J013j752J534N97j649K601j782r97K219k961
1873a330M97J318k675K786K25j804K130j478P2J031j327R53o59r79J675j894J003
1890d56J133j796K389j66j796K185j899l22K407k570R88Q03k640K285o81o46J969
1907A187j832J078J89j765J511q97k8J661j824R13J14j875K444j141q39K928k134
1924c10M61J607k812J732M36j684J705j309o53Q02j209J222k1o99J956j770O69
$$ plain form
1941 123 1231 -1778 356 223 -1730 732 -692 -1510 901 -610 480 1776 -110 1180 848 -319
1957 -319 633 -615 -34 243 -1107 330 -338 -608 1346 -350 533 1258 -1577 241 -247 -1822 572
1974 572 -1140 -1018 1255 -686 158 747 -461 1137 509 516 753 -1078 233 12 -829 1301 -200 -59
1992 -59 1448 -1085 424 545 -1438 1051 54 -1510 714 -1157 -1005 512 -763 387 12 -248 790
2009 790 -391 322 524 -522 1535 -180 -670 1402 -1343 -344 1385 -1427 695 799 -898 931
2025 931 -9 -533 822 -685 -108 -40 -1494 217 -522 -362 651 -289 553 569 -508 1337 -228 -38
2043 -38 1513 -1246 221 407 -1834 598 477 -957 1547 217 -686 438 -568 -108 -307 -553 116
2060 116 -1287 -64 -71 -1498 972 672 -801 1817 -191 -727 1248 -880 376 535 -1145 760 -50
$$ packed form
1941A23J108l009K134j33j953K462j424q18K411j511J090J296j886J290l32j167
1957c19R52j248N81K77j350J437o68k70J954j696Q83P25k835J818m88j575K394
1974E72j712J22K273j941Q44N89j208J598o28PK37j831J311k21q41K130j501J41
1992e9J507k533J509J21j983K489r97j564K224j871J52J517j275J150l75k60J038
2009G90j181P13K02j046K057j715m90K072k745R99J729k812K122J04j697J829
2025I31r40n24J355j507N77O8j454J711p39J60J013r40Q42J6j077J845j565J90
2043c8J551k759J467J86k241K432j21j434K504j330r03J124j006M60j99k46O69
2060A16j403J223pj427K470l00j473K618k008n36J975k128J256J59j680J905q10
$$ plain form
2077 -50 -760 859 -280 614 1008 -542 292 -672 -680 213 -906 -16 -77 -1115 859 -793 -620 2081 -803
2096 -803 403 1444 -1384 110 350 -1158 571 245 -447 408 -427 196 85 107 850 -588 292 471
2114 471 -1486 231 -360 -1550 1118 -350 -727 1231 -1178 -11 1054 -695 781 354 -593 488
2130 488 -676 -241 137 -430 595 15 -232 902 -874 425 764 -1174 1028 -361 -1217 654 -901
2147 -901 -589 992 -751 475 964 -597 828 275 -52 713 -168 -182 -255 -799 311 -481 271 1007 -741
2166 -741 877 600 -1262 1101 -226 -784 874 -1043 -611 544 -907 409 662 -200 902 1 -8
2183 -8 390 -487 610 -127 -368 637 -1171 -52 255 -1088 1154 551 -630 1187 -683 -695 616 -1070
2201 -1070 -21 428 -944 350 -55 -9 715 -197 980 716 -276 775 -643 -484 628 -934 -24
$$ packed form
2077e0p10J619j139Q94L94j550Q34r64qQ93j119Q90o1j038J974j652J73K701k884
2096h03J206J041k828J494K40j508J729l26o92Q55q35O23j11K2P43j438Q80J79
2114D71j957J717n91j190K668j468l77J958k409J167J065j749J476m27r47J081
2130D88j164M35L78n67J025n80k47J134j776J299L39j938K202j389q56J871j555
2147i01L12J581j743J226M89j561J425n53l27P65q81j4p3n44J110p92P52P36j748
2166g41J618k77j862K363j327n58J658j917M32J155j451J316K53q62J102r01r
2183hL98q77J097p37k41J005j808J119L07j343K242o03j181J817j870j2J311j686
2201a070J049M49j372J294m05M6P24r12J177k64r92J051j418J59J112j562R10
$$ plain form
2218 -24 366 -1276 554 -60 -290 1321 -323 28 720 -1354 180 -98 -1115 554 -138 -154 420 -531
2236 -531 479 308 66 991 -631 195 457 -1226 315 235 -1149 841 -237 -653 999 -658 152
2253 152 740 -469 526 -400 -874 -56 -822 172 359 -524 995 124 -414 885 -388 531 872 -1119
2271 -1119 536 -534 -811 758 -572 84 1018 -694 662 212 -657 831 -133 -197 576 -1038 238
2288 238 -98 -740 678 -518 153 740 -620 564 318 -1010 861 24 -558 1150 -907 -505 385
2305 385 -770 612 262 -319 753 -207 196 470 -854 463 -322 -853 168 -1045 -234 326 -648 1074
2323 1074 491 -557 831 -454 -261 671 -794 59 -156 -912 660 -645 130 1315 129 659 488
2340 488 -661 278 -626 -427 428 -1046 181 225 -564 1160 -31 150 1404 -608 -196 246 -1330 -152
$$ packed form
2218b4L90j642J830o14k30J611j644L51O92k074J534k78j017J669o92j6N74r51
2236e31J010j71k42R25j622Q26K62j683J541q0j384J990j078m16J652j657Q10
2253A52N88j209R95r26m74Q18p66R94J87q83J519q71n38J299j273R19L41j991
2271a119J655j070k77J569j330O56R34j712J356m50q69J488r64o4P73j614J276
2288B38l36o42J418j196O71N87j360J184k46j328J871q37n82J708k057M02Q90
2305C85j155J382l50n81J072r60M03K74j324J317p85n31J021j213Q11N60r74J722
2323A074n83j048J388j285J93R32j465Q53k15p56J572j305P75J185j186N30j71
2340D88j149R39r04J99Q55j474J227M4p89J724j191J81J254k012M12M42j576J178
$$ plain form
2358 -152 -38 -736 684 -428 174 407 -531 977 135 -156 845 -557 -244 248 -1064 680 303 -379
2376 -379 895 -254 -182 689 -765 299 -93 -782 736 -553 -659 432 -749 249 502 -705 469
2393 469 -402 -320 647 -464 749 699 -647 749 -253 -403 999 -629 192 544 -888 350 208 -469
2411 -469 748 -567 -212 143 -1388 -90 -258 -1040 486 -293 211 901 -518 934 368 -522 755
2428 755 -239 -415 639 -1049 -19 397 -69 1117 535 -49 724 -755 -162 -117 -1196 30 -360 -1034
2446 -1034 500 -626 190 973 -264 851 382 -598 621 -547 -94 733 -554 556 144 -153 1077
2463 1077 -60 288 772 -401 334 -297 -1177 565 -536 -242 474 -872 28 -108 -1186 537 5
2480 5 -339 804 -345 247 643 -513 585 144 62 833 -456 165 507 -652 754 94 -363 552 -308
$$ packed form
2358a52J14o98J420j112O02K33r38J508q42k91J001j402L13M92j312J744l77o82
2376c79J274j149P2Q71j454J064l92o89J518j289j06J091j181R98K53j207J174
2393D69q71Q2R67j111J213n0j346J396j002j50J402j628Q21L52j432J238j42o77
2411d69J217j315L55L55j531J298j68p82J526p79N04O90j419J452n66q90J277
2428G55r94j76J054j688J030M16m66J186n82n84P73j479N93M5j079J226l90o74
2446a034J534j126Q16P83j237J115m69r80J219j168M53Q27j287J110m12k97J230
2463A077j137L48M84j173P35o31q80J742j101K94P16j346R00j36j078J723n32
2480El44J143j149N92L96j156J098m41q2P71j289O21L42j159J406o60m57R15q60
$$ plain form
2499 -308 -405 351 -1224 38 -135 -844 249 -583 -336 492 -309 641 646 -439 824 -708 -286 577 -340
2518 -340 704 613 -236 1071 358 -104 981 -469 26 228 -1165 -79 -725 -951 493 -386 -101 548
2536 548 -560 529 -47 -352 560 -620 13 180 -725 833 295 -215 1457 312 143 1030 -691 -40
2554 -40 17 -820 152 -511 -322 -37 -808 91 -97 -595 738 -441 -331 401 -715 272 329 -594 759 -138
2574 -138 -250 1009 -259 555 1085 -449 691 -77 -535 548 -274 136 293 -419 80 -675 -593 402 -746
2593 -746 210 487 -825 685 -46 -796 761 -322 -374 599 -531 35 571 -137 1039 415 370 524 -491
2612 -491 38 -392 -859 259 -613 -274 625 -966 57 367 -703 718 -159 -767 563 -606 -196 579
2630 579 -457 448 520 -18 620 -41 190 586 -229 515 -91 -610 425 -810 -193 502 -661 522 182
$$ packed form
2499c08r7P56j575J262j73p09J093q32K47Q28q01R50Nj085J263j532M22Q63r17
2518c40J044r1q49J307p13m62J085j450M95K02j393J086o46k26J444q79K85O49
2536E48j108J089n76l05R12j180O33J67r05J558n38n10J672j145j69Q87j721O51
2554d0N7q37R72o63J89K85p71Q99j88m98J333j179J10P32j116R87N7r23J353q97
2574a38j12J259j268Q14N30j534J140p68m58J083q22M10J57p12M99p55Q2R95j148
2593g46R56K77j312J510p31p50J557j083n2R73j130N66N36p08J176o24m5J54j015
2612d91N29m30m67J118q72L39Q99j591J023L10j070J421q77o08J330j169M10P75
2630E79j036R05P2n38O38o61K31L96q15P44o06n19J035j235O17O95j163J183l40
$$ plain form
2649 182 -924 675 -222 -354 513 -722 -14 195 -722 184 26 -194 607 -58 699 318 -177 625 -271
$$ packed form
2649A82j106J599q97j32Q67j235P08K09r17R06j58k20Q01o65P57l81m95Q02q96
$$ [...]
8191a30
##END NTUPLES=NMR FID
##END=
