##TITLE=1H_77-022
 CDCl3
 8 sc, 
 22.09.2022
##JCAMPDX= 6.0         $$ Bruker NMR JCAMP-DX V2.0
##DATA TYPE= NMR SPECTRUM
##DATA CLASS= NTUPLES
##ORIGIN= UXNMR, Bruker Analytische Messtechnik GmbH
##OWNER= root
$$ XWIN-NMR		Version 3.5
$$ Thu Sep 22 13:54:02 2022 Russian Standard Time (UT+4h)  she@DPX200
##.OBSERVE FREQUENCY= 200.1313499994
##.OBSERVE NUCLEUS= ^1H
##.ACQUISITION MODE= SIMULTANEOUS
##.ACQUISITION SCHEME= undefined
##.AVERAGES= 8
##.DIGITISER RES= 18
##SPECTROMETER/DATA SYSTEM= spect
##.PULSE SEQUENCE= zg30
##.SOLVENT NAME= CDCl3
##.SHIFT REFERENCE= (INTERNAL, CDCl3, 0, 15.737)
##AUDIT TRAIL= $$ (NUMBER, WHEN, WHO, WHERE, WHAT)
$$ ##TITLE= Audit trail, XWIN-NMR		Version 3.5
$$ ##JCAMPDX= 5.01
$$ ##ORIGIN= Bruker BioSpin GmbH
$$ ##OWNER= she
$$ F:/spectra/data/she/nmr/H-F/1/pdata/1/auditp.txt
$$ ##AUDIT TRAIL=  $$ (NUMBER, WHEN, WHO, WHERE, WHAT)
(   1,<2022-09-22 13:52:38.01 +0400>,<she>,<DPX200>,
      <created by zg, POWCHK disabled, PULCHK disabled
       configuration hash MD5:
       00 E9 B6 7A A2 85 ED C7 34 08 36 98 17 FE 4E 26
       data hash MD5: 16K
       31 66 11 B4 B9 0B 55 84 5C 5A DD 8F 08 11 D9 92>)
(   2,<2022-09-22 13:52:40.28 +0400>,<she>,<DPX200>,
      <Start of raw data processing
       efp BC_mod = 2 LB = 0.24 FT_mod = 6 PKNL = 1 PHC0 = -18041.1 PHC1 = 12.00069 SI = 16K 
       data hash MD5: 16K
       6F 4A 80 9D 95 74 58 28 62 06 63 32 A1 73 8F 72>)
(   3,<2022-09-22 13:53:07.31 +0400>,<she>,<DPX200>,
      <pk PHC0 = 11.73635 PHC1 = -7.6 
       data hash MD5: 16K
       E6 2C 0F B2 6C 63 B4 B9 E3 69 25 83 C5 5E 5A 0C>)
(   4,<2022-09-22 13:53:10.40 +0400>,<she>,<DPX200>,
      <abs ABSG = 5 
       data hash MD5: 16K
       82 23 96 63 EA 3E 88 AF B7 F7 F7 33 73 75 14 4D>)
$$ ##END=
$$ 
$$ hash MD5
$$ 2A 57 E8 46 2F 14 A4 11 BE C4 1C 8B EA 93 10 CF
##$RELAX= 
##$RELAX= 
##$RELAX= 
##$RELAX= 
##$RELAX= 
##$RELAX= 
$$ Bruker specific parameters
$$ --------------------------
##$DU= <F:/spectra>
##$EXPNO= 1
##$NAME= <H-F>
##$PROCNO= 1
##$TYPE= <nmr>
##$USER= <she>
##$AMP= (0..31)
100 100 100 100 100 100 100 100 100 100 100 100 100 100 100 100 100 100 
100 100 100 100 100 100 100 100 100 100 100 100 100 100 
##$AQSEQ= 0
##$AQ_mod= 1
##$AUNM= <au_zg>
##$AUTOPOS= <>
##$BF1= 200.13
##$BF2= 200.13
##$BF3= 200.13
##$BF4= 200.13
##$BF5= 200.13
##$BF6= 200.13
##$BF7= 200.13
##$BF8= 200.13
##$BYTORDA= 1
##$CFDGTYP= 0
##$CFRGTYP= 5
##$CHEMSTR= <none>
##$CNST= (0..31)
1 1 145 1 1 1 1 1 1 1 1 1 1 1 1 1 1 1 1 1 1 1 1 1 1 1 1 1 1 1 1 1 
##$CPDPRG= <>
##$CPDPRG1= <>
##$CPDPRG2= <>
##$CPDPRG3= <>
##$CPDPRG4= <mlev>
##$CPDPRG5= <mlev>
##$CPDPRG6= <mlev>
##$CPDPRG7= <mlev>
##$CPDPRG8= <mlev>
##$CPDPRGB= <>
##$CPDPRGT= <>
##$D= (0..31)
0 1.2 0 0 0 0 0 0 0 0.06 0 0.03 0 0 0 0 0.0002 0 0 0 0 0 0 0 0 0 0 0 0 
0 0 0 
##$DATE= 1663840357
##$DBL= (0..7)
120 120 120 120 120 120 120 120 
##$DBP= (0..7)
150 150 150 150 150 150 150 150 
##$DBP07= 0
##$DBPNAM0= <>
##$DBPNAM1= <>
##$DBPNAM2= <>
##$DBPNAM3= <>
##$DBPNAM4= <>
$$ [...]
##$SUBNAM3= <"">
##$SUBNAM4= <"">
##$SUBNAM5= <"">
##$SUBNAM6= <"">
##$SUBNAM7= <"">
##$SUBNAM8= <"">
##$SUBNAM9= <"">
##$SW= 18.0517283424941
##$SWIBOX= (0..15)
0 0 2 0 0 0 0 0 0 0 0 0 0 0 0 0 
##$SW_h= 3612.71676300578
##$TD= 16384
##$TD0= 1
##$TE= 0
##$TE2= 300
##$TE3= 300
##$TEG= 300
##$TL= (0..7)
0 120 120 120 120 120 120 120 
##$TP= (0..7)
150 150 150 150 150 150 150 150 
##$TP07= 0
##$TPNAME0= <>
##$TPNAME1= <>
##$TPNAME2= <>
##$TPNAME3= <>
##$TPNAME4= <>
##$TPNAME5= <>
##$TPNAME6= <>
##$TPNAME7= <>
##$TPOAL= (0..7)
0.5 0.5 0.5 0.5 0.5 0.5 0.5 0.5 
##$TPOFFS= (0..7)
0 0 0 0 0 0 0 0 
##$TUNHIN= 0
##$TUNHOUT= 0
##$TUNXOUT= 0
##$USERA1= <user>
##$USERA2= <user>
##$USERA3= <user>
##$USERA4= <user>
##$USERA5= <user>
##$V9= 5
##$VALIST= <valist>
##$VCLIST= <CCCCCCCCCCCCCCC>
##$VD= 0
##$VDLIST= <DDDDDDDDDDDDDDD>
##$VPLIST= <PPPPPPPPPPPPPPP>
##$VTLIST= <TTTTTTTTTTTTTTT>
##$WBST= 1024
##$WBSW= 4
##$XGAIN= (0..3)
0 0 0 0 
##$XL= 0
##$YL= 0
##$YMAX_a= 285958
##$YMIN_a= -317324
##$ZGOPTNS= <>
##$ZL1= 120
##$ZL2= 120
##$ZL3= 120
##$ZL4= 120
##$ABSF1= 15.74689
##$ABSF2= -2.304959
##$ABSG= 5
##$ABSL= 3
##$ALPHA= 0
##$AQORDER= 0
##$ASSFAC= 0
##$ASSFACI= 0
##$ASSFACX= 0
##$ASSWID= 0
##$AUNMP= <proc_1d>
##$AZFE= 0.1
##$AZFW= 0.1
##$BCFW= 0
##$BC_mod= 2
##$BYTORDP= 0
##$COROFFS= 0
##$CY= -3
##$DATMOD= 1
##$DC= 0
##$DFILT= <>
##$DTYPP= 0
##$F1P= 0
##$F2P= 0
##$FCOR= 1
##$FTSIZE= 16384
##$FT_mod= 6
##$GAMMA= 0
##$GB= 0
##$INTBC= 1
##$INTSCL= 3.70164e-10
##$ISEN= 128
##$LB= 0.24
##$LEV0= 0
##$LPBIN= 0
##$MAXI= 10000
##$MC2= 0
##$MEAN= 0
##$ME_mod= 0
##$MI= 1.114404
##$NCOEF= 0
##$NC_proc= -6
##$NLEV= 6
##$NOISF1= 3.799351
##$NOISF2= 2.8
##$NSP= 0
##$NTH_PI= 0
##$NZP= 0
##$OFFSET= 15.73697
##$PC= 1
##$PHC0= -18029.36
##$PHC1= 4.400691
##$PH_mod= 1
##$PKNL= yes
##$PPARMOD= 0
##$PSCAL= 0
##$PSIGN= 0
##$REVERSE= no
##$SF= 200.130006917269
##$SI= 16384
##$SIGF1= 3
##$SIGF2= 2
##$SINO= 5.538805
##$SIOLD= 16384
##$SREGLST= <1H.CDCl3>
##$SSB= 0
##$STSI= 16384
##$STSR= 0
##$SW_p= 3612.71676300578
##$SYMM= 0
##$S_DEV= 0
##$TDeff= 16384
##$TDoff= 0
##$TI= <>
##$TILT= no
##$TM1= 0
##$TM2= 0
##$TOPLEV= 0
##$USERP1= <user>
##$USERP2= <user>
##$USERP3= <user>
##$USERP4= <user>
##$USERP5= <user>
##$WDW= 1
##$XDIM= 16384
##$YMAX_p= 476741821
##$YMIN_p= -885254
$$ End of Bruker specific parameters
$$ ---------------------------------
##NTUPLES= NMR SPECTRUM
##VAR_NAME=  FREQUENCY,     SPECTRUM/REAL,   SPECTRUM/IMAG
##SYMBOL=    X,             R,               I
##VAR_TYPE=  INDEPENDENT,   DEPENDENT,       DEPENDENT
##VAR_FORM=  AFFN,          ASDF,            ASDF
##VAR_DIM=   16384,         16384,           16384
##UNITS=     HZ,            ARBITRARY UNITS, ARBITRARY UNITS
##FACTOR=    0.220516191357247, 1,           1
##FIRST=     3149.43990451306, 0,            0
##LAST=      -463.276858492722, 0,           0
##MIN=       -463.276858492722, -885254,     0
##MAX=       3149.43990451306, 476741821,    0
$$ Real data points
##PAGE= N=1
##DATA TABLE= (X++(R..R)), XYDATA
$$ [...]
6357C28199l6482L3572K6116o7657n2393n2491M406p3561q611p4396L8856Q2287
6345A47845M7117J13376r8302j8783J8701J4952J10241l2925L1986p7404j4447
6334B42357J89120j0852J0200q1777k3599J7500j94784J0781J62563j6899j45748
6323A58862j22264M8626J60383P9574j45156j12472l376k7368M5142L2642k2340
6312I2253K22326r7687K3907p5554k88727L3563M4753M8544l5276Q6958p0526
6301a5466O583k1048j9811J86058P9915j31288L7542N6381p1967j65774J12283
6290E3408l2563o6135J26724m8798J10416n2077P2126j74871k931R9931q3919
6279A311o0648O0045K11161M0743k95737r623n7715o3971O6989K11315N2496j07814
$$ y = [328199, 291717, 325289, 351405, 283748, 231355, 178864, 183270, 109709, 101098, 26702, 65558, 147845, 194962, 308338, 210036, 191253, 209954, 224906, 335147, 302222, 334208, 256804, 242357, 431477, 420625, 430825, 349048, 325449, 342949, 148165, 158946, 321509, 304610, 158862, 36598, 85224, 245607, 325181, 180025, 67553, 64177, 36809, 81951, 114593, 92253, 314579, 216892, 240799, 165245, -123482, -89919, -45166, 3378, -31898, 55060, -15466, -8883, -29931, -49742, 136316, 216231, 84943, 122485, 178866, 106899, -58875, 53408, 20845, -45290, 81434, 32636, 143052, 90975, 163101, -11770, -14701, 85230, 1311, -59337, 708, 211869, 252612, -43125, -52748, -110463, -174434, -107445, 103870, 156366, 48552]
6267D8552o8923L5135q8321j6122M1856P151O3658k1072k8123k3007J5811R0955
6255E7550J13981j22086l2256j91589j5219M7722l2579J09414M6321J3843L6699
6244C1801O008J13506K0869j0904N6451n3651k5195j23228j680J06461p9385j10169
6232f9116j1665J31225O2362R2495l0694j30403L4149j05188q065O3402l2696
6221d194L2721N2437J68918l872m3578j26484o8438J3092k6106K25479p041j11293
6209A01641L0931J29363j04826N8140P8198P725M0785j64803J5746j1552l8949
6198A42399j11638j13064K15492Q5080j55766P2068k872Q8639m3770n2685q4204
6187C9679m7168j27676m0440J49660J82662O7262r6282R4156j39081p3476R9530
$$ y = [48552, -20371, 14764, -73557, -89679, -47823, -40672, 22986, 1914, -26209, -49216, -33405, 57550, 171531, 49445, 17189, -174400, -189619, -141897, -174476, -65062, -18741, -4898, 31801, 37809, 151315, 172184, 161280, 217731, 164080, 138885, 15657, 13977, 120438, 41053, -69116, -80781, 50444, 112806, 205301, 174607, 44204, 78353, -26835, -34900, 28502, -4194, 28527, 80964, 249882, 246010, 202432, 75948, 7510, 20602, -5504, 219975, 212934, 101641, 132572, 261935, 157109, 215249, 293447, 301172, 341957, 177154, 192900, 181348, 142399, 30761, -82303, 133189, 218269, 62503, 134571, 131699, 220338, 176568, 123883, 39679, -7489, -135165, -175605, -25945, 156717, 223979, 127697, 221853, 82772, 9296, 108826]
6176A08826n0097J64883r0177J10572J03825L5661M1230j27278k6616N7542J2473
6165C40844p7796P4180n3052j06895J34269J15524r1278p8387Q9557J87491J33754
6154F68211m7834k23268N3856O1655q3570J4154J48780m9793R9759J5806n0130
6143F07626p6782P4686J29993p5025j25931J396Q7721N7705P671j7745j45735
6132E25580p4405J20212J84833P3022R0689j03968J28091r0773j40230J22486
6122H35537J67639m1356O6462K10823k14878p0910J56661J2246r7846J50810J03852
6111A279040j38341m0157N2879N7513Q8318K6521J06582L864N2367m4243J03623
6100A547966p1244J60592L6523J7952J30688l0458J28136K53874p2397P0930n0142
$$ y = [108826, 58729, 223612, 133435, 244007, 347832, 383493, 424723, 297445, 270829, 328371, 340844, 263048, 337228, 284176, 177281, 311550, 427074, 335796, 257409, 346966, 534457, 668211, 620377, 397109, 450965, 512620, 429050, 443204, 591984, 542191, 641950, 657756, 607626, 530844, 605530, 735523, 660498, 534567, 535963, 623684, 681389, 689060, 671315, 525580, 451175, 571387, 756220, 829242, 919931, 815963, 944054, 853281, 713051, 835537, 1003176, 961820, 1028282, 1239105, 1024227, 953317, 1109978, 1122224, 1024378, 1175188, 1279040, 1140699, 1100542, 1153421, 1210934, 1299252, 1325773, 1432355, 1436219, 1488586, 1444343, 1547966, 1476722, 1637314, 1673837, 1691789, 1822477, 1792019, 1920155, 2174029, 2101632, 2172562, 2122420]
6089B122420J33052K3744K17629P7209J65177J36404j2111J17068J7996M504K8108
6078C031200J6588J59608j2870k5627K42212J78127Q6769m9341K60941J41089
6068D028696J17508O8610P4739J42207L07768O1016J14337P1781K96504N5610
6058E338776O3659K18675K53014K77388L26445J73367J99867L18753K47079L22833
6048G739856J90762K68588L76295M95282L29630L49874M25036M47869N45009O18954
6038A1787155M57568N76254O11987O90780Q52178P34302Q91957R66433J073439
6029A8642053J369306J420338J620008K049392K080245K560682L181597L735587
6021C6659208M161268M779367N422552N985256O655736P397503P779257P263609
$$ y = [2122420, 2255472, 2279216, 2496845, 2574054, 2739231, 2875635, 2863524, 2980592, 2998588, 3003092, 3031200, 3047788, 3207396, 3194526, 3168899, 3411111, 3589238, 3676007, 3626666, 3887607, 4028696, 4146204, 4214814, 4289553, 4431760, 4739528, 4800544, 4914881, 4986662, 5283166, 5338776, 5402435, 5621110, 5874124, 6151512, 6477957, 6651324, 6851191, 7169944, 7417023, 7739856, 7930618, 8199206, 8575501, 9070783, 9400413, 9750287, 10175323, 10623192, 11168201, 11787155, 12244723, 12820977, 13432964, 14123744, 14975922, 15710224, 16602181, 17568614, 18642053, 20011359, 21431697, 23051705, 25101097, 27181342, 29742024, 32923621, 36659208, 40820476, 45599843, 51022395, 57007651, 63663387, 71060890, 78840147, 86103756]
6013H6103756N583971K526309j716198n971885q942426r522835r109599p606701
6005E1344392o211847n207095m207864l457130l362433k522372k088066j997571
5997B2290014j688486j642743j369988j184362j106720r38573q70540q57548o58823
5988A1972231n00988o76611m14921m54564n32086l73644m43542k36389k27315
5979H112171k27250k33365l99030l64147j66496k24013k82673k41357j98344l48103
5969E427393k48909j04411m8623k58125j63302j84870j36992j57488o3519n1708
5959D009446J03637k22838m6395j17548j02894j42143j22099q3066j12662k00905
5949B962533o6366j23221l2133K4856n5017n4629M3950k6600n2711o2827r4974
$$ y = [86103756, 91687727, 94214036, 92497838, 86525953, 77583527, 68060692, 58951093, 51344392, 45132545, 39925450, 35717586, 32260456, 28898023, 26375651, 24287585, 22290014, 20601528, 18958785, 17588797, 16404435, 15297715, 14359142, 13488602, 12631054, 11972231, 11471243, 10794632, 10379711, 9925147, 9393061, 9019417, 8575875, 8339486, 8112171, 7884921, 7651556, 7252526, 6888379, 6721883, 6497870, 6215197, 5973840, 5775496, 5427393, 5178484, 5074073, 5025450, 4767325, 4604023, 4419153, 4282161, 4124673, 4061154, 4009446, 4113083, 3890245, 3843850, 3726302, 3623408, 3481265, 3359166, 3276100, 3163438, 2962533, 2896167, 2772946, 2740813, 2765669, 2710652, 2656023, 2699973, 2673373, 2620662, 2557835, 2462861]
5938B462861p0099Q1595j43024l421j88308q187R207k59878j15418j54049o4360
5927A546919R764L3709l0167o0055j7185Q8408j70882o2235j75970m8073J19455
5916A233688r4603N4415j9654o7381J28816j45934k7073O269N0650q5921k42271
5905G91001n3322N7537N0696O2421p9337R5732j54760q4861K38520Q8280l7614
5894I74293k86129M8012J43074m7377o2893j16604k5596O2742p268M3115J34559
5883H59928n9353n2140r1641r6642R2709O6765j28931J2851m8863Q4305R0873
5872G29861j17751M6478J0888R799o3636O67Q7216j02433N9547j30739j02414
5861D27483q6625l786J02958q3894j8680J99781l6836L7784O8967q2324k185J35690
$$ y = [2462861, 2392762, 2474357, 2331333, 2327912, 2139604, 2131417, 2140624, 1880746, 1765328, 1611279, 1546919, 1556683, 1590392, 1560225, 1500170, 1482985, 1571393, 1400511, 1338276, 1162306, 1114233, 1233688, 1139085, 1193500, 1173846, 1106465, 1235281, 1089347, 1062274, 1068543, 1119193, 1033272, 791001, 737679, 795216, 845912, 908333, 828996, 924728, 769968, 685107, 923627, 1011907, 974293, 688164, 736176, 879250, 831873, 768980, 652376, 626780, 689522, 682254, 725369, 859928, 800575, 748435, 656794, 560152, 652861, 719626, 590695, 603546, 554683, 638988, 729861, 612110, 658588, 669476, 679275, 615639, 616306, 703522, 601089, 660636, 529897, 427483, 340858, 337072, 440030, 356136, 337456, 537237, 500401, 538185, 607152, 524828, 522643, 658333]
5849F58333j22846j51820Q2314L3911M8826O0222p3869P2093R0161J07241o7463
5838G37103J091n6665l92449J10208l0205M5548J05578m2735n2658J13491M0172
5827E78479O2265J1520j38286O7540J1501j14909M6549p492j20090k5336J7564
5816C89305K7877L5996K07900j6386q4775q5144p1677Q7804K4363Q8596R9618
5805G03477l2164J14740N3337m1228p396k19094J1658J9386J42927O1129l5700
5794G71072Q3692j45509p3646J1354N594l5166o5179j52773J04419j07109m6971
5783C49778M9132j54262R577L4988p5287o9754j5993L6449K4777J1128O1530j332
5771B60731k9127J6338O3983L4753J17202M4118k55939k7593J85261o6914k0979
$$ y = [658333, 535487, 383667, 465981, 499892, 548718, 608940, 535071, 607164, 697325, 804566, 737103, 738194, 681529, 289080, 399288, 369083, 414631, 520209, 477474, 424816, 538307, 578479, 640744, 652264, 513978, 581518, 593019, 478110, 524659, 517167, 397077, 371741, 389305, 417182, 453178, 661078, 644692, 559917, 474773, 403096, 490900, 515263, 603859, 703477, 671313, 786053, 839390, 798162, 790766, 571672, 583330, 602716, 745643, 806772, 771072, 854764, 709255, 635609, 646963, 652557, 617391, 552212, 399439, 503858, 396749, 349778, 398910, 244648, 254225, 289213, 213926, 144172, 128179, 164628, 189405, 200533, 262063, 260731, 231604, 247942, 311925, 346678, 463880, 507998, 252059, 224466, 409727, 342813, 321834]
5760C21834n6831j9772n0330p3112P2313N9266q1081N7543q4931q9383q2274L7742
5748A0984N5003M3197J56216J62501n4138j59619L4789N5102m7485M0079l4694
5737B61935j32379p5562J52521J07476L3845j457j15719J32082q3434k41257l803
5726C4248J06620J40204O2321q9863j59544j89980k6717J03364K02675J34095
5716C17423j21992j7689R4601j3065M1655o394J1595j11181Q0706m4159m9977
5705A81523n8484O6385O5883j37862p9158J58558J08172R0289J0414l9932k8946
5694C36842R5867Q5991j27501q0794l8717K51162j4666n702Q3486Q1244j6577
5683F50635p1091j39733J4481j13272j14558K6909O5210l1436j00120j76059J44447
$$ y = [321834, 265003, 245231, 194901, 121789, 194102, 253368, 172287, 229830, 144899, 55516, -26758, 10984, 65987, 109184, 265400, 427901, 373763, 214144, 248933, 304035, 256550, 296629, 261935, 129556, 53994, 206515, 313991, 347836, 346379, 230660, 362742, 279308, 38051, 34248, 140868, 281072, 343393, 253530, 93986, -95994, -122711, -19347, 183328, 317423, 195431, 177742, 272343, 259278, 300933, 294539, 306134, 194953, 275659, 231500, 181523, 123039, 189424, 255307, 117445, 38287, 196845, 305017, 395306, 405720, 365788, 336842, 432709, 518700, 391199, 310405, 271688, 522850, 508184, 502482, 585968, 667212, 650635, 579544, 439811, 454292, 341020, 226462, 253371, 318581, 287145, 187025, 10966, 155413]
5672A55413J54947p5648N9003o2490j6334J21919k04092N2297m4954j35596J0871
5661A5336k5136K16771n9591M0867J5832k1911k3569k26658J44177N9410Q4306
5650B19834l7516k55800J61105J51165r4740r8906J43313l7962L7126o5386n2338
5639F9895m013L9997o5823j5484J51332o1785l9220R7965j01752r6675K34703
5628B09140p7703n0537l7706l0999N9867O2431n5692K4849N53K742M1258M3081
5616A91284O1581j80303K5615K9468P2653n2446p3061k4892J7745k9562O985R5077
5604A40144J8058n8689M1032j23658J8677m5589j09125J8580J16515j19640M4634
5593e9061K5699r5438K42137j44858J98878R5198l10382o1131K6788J27658j24067
$$ y = [155413, 310360, 234712, 293715, 231225, 214891, 336810, 132718, 185015, 140061, 4465, 15336, -9800, 206971, 147380, 188247, 204079, 182168, 158599, -68059, 76118, 135528, 219834, 182318, -73482, 87623, 238788, 144048, 45142, 188455, 150493, 187619, 122233, 69895, 65882, 105879, 40056, 24572, 175904, 114119, 74899, 172864, 71112, -25563, 209140, 131437, 80900, 43194, 12195, 72062, 134493, 78801, 103650, 104203, 106945, 148203, 191284, 252865, 72562, 98177, 127645, 200298, 147852, 74791, 49899, 67644, 38082, 45067, 140144, 158202, 99513, 140545, 16887, 35564, -10025, -119150, -100570, 15945, -103695, -59061, -33362, -128800, 113337, -31521, 167357, 262555, -47827, -108958, -82170, 45488, -78579]
5582g8579N0841J26358j43227M647j3186J0092j6545k4432j2825j7596k9552m0999
5570a85003M7646P1999j3467Q5041Q7801j44086P924J51920o3188j46859R8272
5559b000p004k2111j39173J43474J12983p7924L0530n8560o4192j34234L00927
5548H2716q4835o8305J69043p9432R2592q7115j04114n1351Q0189M4065j54622
5537a61169K7248J50678m5775N0994K32471j4790j20691j65802J67044l5222j03884
5526a8898M2538q7141O917J3109o553J4523j5862R5043j6677r8760J40463J43064
5514B11766q2296m719M9264j16246r344j11328j4078j4976O3297K3828n7267K2933
5502c9166m846N4220R8801j6291m6811m0859J12606k8670k16693J35891m1238
$$ y = [-78579, -27738, 98620, -44607, -39960, -53146, -43054, -59599, -84031, -96856, -114452, -144004, -185003, -137357, -65358, -78825, 6216, 94017, -50069, -42145, 109775, 46587, -100272, -2000, -9004, -31115, -170288, -26814, 86169, 8245, 38775, -19785, -83977, -218211, 82716, -2119, -70424, 98619, 19187, 111779, 24664, -79450, -130801, -50612, -6547, -161169, -133921, 16757, -29018, 21976, 254447, 239657, 118966, -46836, 120208, 84986, -18898, 23640, -63501, -56584, -43475, -50028, -35505, -51367, 43676, 26999, -71761, 68702, 211766, 129470, 124751, 174015, 57769, 48425, -62903, -76981, -91957, -28660, -4832, -62099, -39166, -44012, 10208, 109009, 92718, 45907, 5048, 117654, 88984, -127709, 8182, -33056]
5491c3056O6825J1174l8275K3273K7843n144n1652l7964P7531Q724m4762Q4480
5479H8997j46181j24867J83601M290q5124L5899K13236q8985r6492P7932L6231
5468I8537j33134O4726L672k0195q94Q8466J4707K6315q1242n3016j06604R2932
5456e730K50093p7260K5774r2712m2021j00254K34855M1062p702j05974n857m7313
5444F6961l5840N1998j93772P0982R2670P363J6616m6815J86055j1664J1297o9239
5432A46612K0737m7074k4347o2859J22398J52978N9306L6842j09496r6703q8410
5421A09984R8502n565Q4879q0140k9356k9233J67165j18606J34854j7105k58413
5410E6966R5939O9151J02814O0407K31223j94206k22201j2871J45494R951o3412
$$ y = [-33056, 33769, 44943, 6668, 29941, 57784, 52640, 988, -36976, 40555, 49279, 4517, 88997, -57184, -182051, 1550, 5840, -79284, -43385, 169851, 80866, -15626, 62306, 98537, -34597, 30129, 33801, 13606, 12712, 101178, 115885, 142200, 60958, 7942, -98662, -5730, 244363, 167103, 192877, 100165, 58144, -42110, 192745, 233807, 226105, 120131, 114274, 66961, 31121, 83119, -110653, -39671, 52999, 60362, 76978, 30163, 216218, 204554, 215851, 146612, 167349, 120275, 95928, 33069, 155467, 308445, 367751, 404593, 295097, 198394, 109984, 208486, 202921, 287800, 207660, 178304, 149071, 316236, 197630, 332484, 315379, 56966, 152905, 222056, 324870, 385277, 616500, 422294, 200093, 187222, 332716, 342667, 279255]
5399B79255n7543n3478N5486J37411J07580k34254M5744J16436k4607J26288N68
5388D98886j63678q7066m8266j1193L7901j36445O4883J11576J26375q6284m7979
5377B58710o5580p861R5694p3135l2529M3909P6920j1720J03241N5609O4084N6206
5365E63548j31861j0032j18200k06214J43074L2612j8236M2996J99437j06407
5355C90717m2275N7081p9722j68591n1857J26977L3422J27832j09127k1159j695
5344B61603k0452M1446r9872Q7442J09679L2985l3304j33474N910l2980l7634
5333A81349L8128O3712J449K8724m5489k0378K3585Q3866j7211o9120J13383J24677
5321E06675j22817J0073L8403k3475m2165j26354J02550m8391q9389J01325J27766
$$ y = [279255, 221712, 168234, 223720, 361131, 468711, 234457, 280201, 396637, 372030, 498318, 498886, 335208, 248142, 199876, 188683, 226584, 90139, 155022, 266598, 392973, 306689, 258710, 193130, 185269, 280963, 207828, 175299, 219208, 296128, 284408, 387649, 443258, 507342, 563548, 431687, 421655, 303455, 97241, 240315, 272927, 254691, 297687, 497124, 390717, 348442, 405523, 325801, 157210, 105353, 232330, 265752, 393584, 284457, 263298, 261603, 241151, 282597, 182725, 270167, 379846, 412831, 379527, 246053, 251963, 218983, 181349, 219477, 283189, 284638, 313362, 267873, 247495, 271080, 354946, 337735, 268615, 381998, 506675, 383858, 393931, 432334, 408859, 366694, 240340, 342890, 294499, 205110, 306435, 434201]
5310D34201j9584p7393k6711j2842n8980n6603J01216N7984J1908J56390l4768
5299D74818l7696l5923L5946L5407j8863K1206j49096Q7369j0605J6692P0458
5288D89713O5315l5527n1535j0541p0759k6409Q5048J1132r0823l579M3461J68211
5276E73707P8305j86071n7390J06611j21033L0616M5181N8226K5901n7119q7760
5265D09174R4654R0776O2618j2177N8739o9100j4284k507Q081O1306j05846o318
5253E75116Q6011N1988j02305j21122J30079K11947p4090K7070j45686j27403
5243E11605K3320l8238L8581M2805R9806L3554O0270n5045P2691L0959j78842
5232F41466l147L3824K8455J03982L593J22889r7462K04410R3316N618j19207
$$ y = [434201, 414617, 337224, 310513, 297671, 238691, 182088, 283304, 341288, 353196, 509586, 474818, 437122, 401199, 437145, 472552, 453689, 474895, 325799, 413168, 402563, 419255, 489713, 555028, 519501, 467966, 457425, 386666, 360257, 445305, 456437, 365614, 362035, 405496, 573707, 652012, 465941, 408551, 515162, 394129, 424745, 469926, 528152, 554053, 496934, 409174, 503828, 594604, 657222, 645045, 703784, 634684, 620400, 617893, 625974, 687280, 581434, 575116, 661127, 713115, 610810, 489688, 619767, 831714, 757624, 784694, 639008, 511605, 534925, 496687, 535268, 578073, 677879, 711433, 771703, 716658, 789349, 820308, 641466, 638319, 672143, 700598, 804580, 808173, 931062, 833600, 1038010, 1131326, 1136944, 1017737]
5221A017737q8647n3670n6602N9311k0661O5104Q4602L6010K01372r9762j34751
5210A010043R0941J28860J32118j76722K05435n2193J5992O784Q9096o9566L778
5199A384566J73690M5463j0346j16914j2665j2571K38462J09240j14979P3496
5189A757442M6106p9798J54852O2034L9877J71116J4682K8728J59719J8056j07058
5178B265756J96024J94553O301O7244J54185j27014K4212J62851R6285L5511J24464
5167C200372R3100J38374k324Q0832k4164M8324J32111K78903K52592J34661K11165
5156D543946n6625m3128K39639J60789J63311J80131L74850J77148R7243L12235
5146F149539K68847K11813K94550J96443J35726M60974P53182N09069L49727L22165
$$ y = [1017737, 929090, 875420, 818818, 878129, 857468, 922572, 1007174, 1043184, 1244556, 1144794, 1010043, 1100984, 1229844, 1361962, 1185240, 1390675, 1338482, 1354474, 1361258, 1450354, 1380788, 1384566, 1558256, 1603719, 1593373, 1476459, 1463794, 1451223, 1689685, 1798925, 1683946, 1757442, 1803548, 1723750, 1878602, 1940636, 1980513, 2151629, 2166311, 2195039, 2354758, 2372814, 2265756, 2461780, 2656333, 2662634, 2729878, 2884063, 2757049, 2781261, 2944112, 3040397, 3075908, 3200372, 3293472, 3431846, 3429522, 3510354, 3486190, 3534514, 3666625, 3945528, 4198120, 4332781, 4543946, 4487321, 4444193, 4683832, 4844621, 5007932, 5188063, 5562913, 5740061, 5837304, 6149539, 6418386, 6630199, 6924749, 7121192, 7256918, 7717892, 8471074, 8980143, 9329870, 9652035]
5136I652035M34760N97651Q21039R61115P49921R81618J136562J094805J236122
5127A7665628J302620J255172J174841J252021Q57810M43742O1027k52339m67526
5118B3292996p52946o62456p88036o85919n43366n63942m95317M4238j41457J55022
5108A8858817L39980L11906L29899N76503M67309R73658J085908J065456J130655
5099B5140091J197129J317509J082194J179333J155459Q24407N87560O24117N74059
5090C3681858M04308L81099R9604j85615l84958o94942p45250p54081o37108n42657
5080C0622258q17169p14790p32758r01580r46291j094784j149243r63344q40735
5071B2461564o32782m67328m25664m05337j66120M7550K07745K81324J89677N53603
$$ y = [9652035, 10086795, 10684446, 11505485, 12466600, 13216521, 14198139, 15334701, 16429506, 17665628, 18968248, 20223420, 21398261, 22650282, 23508092, 23951834, 24012861, 23760522, 23292996, 22540050, 21877594, 21089558, 20403639, 19860273, 19296331, 18801014, 18845252, 18703795, 18858817, 19198797, 19510703, 19840602, 20417105, 20884414, 21858072, 22943980, 24009436, 25140091, 26337220, 27654729, 28736923, 29916256, 31071715, 31896122, 32483682, 33107799, 33681858, 34086166, 34467265, 34566869, 34381254, 33996296, 33301354, 32556104, 31802023, 31164915, 30622258, 29805089, 29090299, 28357541, 27455961, 26509670, 25414886, 24265643, 23302299, 22461564, 21828782, 21361454, 20935790, 20530453, 20364333, 20411883, 20619628, 20900952, 21090629, 21644232]
5061B1644232P29374Q86674Q92692Q80357Q06144Q06348Q85979O52776P2933l62455
5051B7895054p72942r64345j286901j395904j371894j134860j054522q65672q43483
5042A8204531q43738o94471n48182k97980j46410j52817m6104j1601N368K88583
5032A5757179J46889K37745M15281N24762M40220N01248P67049Q26554R51661
5023B0568588Q95736Q55223R98104Q62736Q73998L86475K28653k5242l59153m66921
5013B4818197r23924p24428o00597o44818o51736m31368k55727k81657l4149J54042
5003B0423835J01549K99574K79830M62249O50165O67329O89846R24730R16429
4994B5415536Q95170R10636J040294Q96057Q96296R06165P42883N15537N36963
$$ y = [21644232, 22373606, 23260280, 24152972, 25033329, 25839473, 26645821, 27531800, 28184576, 28257509, 27895054, 27122112, 26157767, 24870866, 23474962, 22103068, 20968208, 19913686, 19048014, 18204531, 17360793, 16666322, 16118140, 15820160, 15673750, 15520933, 15474829, 15463228, 15468596, 15757179, 15904068, 16141813, 16557094, 17081856, 17522076, 18023324, 18790373, 19616927, 20568588, 21464324, 22319547, 23317651, 24180387, 25054385, 25440860, 25669513, 25644271, 25285118, 24818197, 23894273, 23169845, 22569248, 21924430, 21272694, 20841326, 20585599, 20303942, 20269793, 20423835, 20525384, 20824958, 21104788, 21567037, 22217202, 22884531, 23574377, 24499107, 25415536, 26310706, 27221342, 28261636, 29157693, 30053989, 30960154, 31703037, 32218574, 32755537]
4985C2755537J36383K9244m9860j90982l43275p01919n83300o72977p77663q29037
4975B8772151r14522r28700q60342r51522r63545p27770p67909q25578o85285
4966B1146978n44913n36557n32997k78070m63782k01916J6666K43935K61407K45540
4956A9356291L47301N92442O61164O08256N91427N46445M84879K54375Q5664m53731
4946B3074513o63574j041646j194500j202573j475636j099924j170950j146031
4938A4079679j001661r60974q59599o73115o02063p34660o15610k66773m11009
4929G954215n38595m12708l12807l28664k33856j38310k49649m19946j93388j28042
4919D998250j74169j07233r0450k59602k39317p2858j4078j39239o9957m7833
$$ y = [32755537, 32891920, 32921164, 32871304, 32680322, 32337047, 31635128, 31051828, 30378851, 29601188, 28772151, 27857629, 26928929, 26068587, 25117065, 24153520, 23425750, 22657841, 21832263, 21146978, 20602065, 20065508, 19532511, 19254441, 18790659, 18588743, 18605409, 18849344, 19110751, 19356291, 19703592, 20296034, 20957198, 21565454, 22156881, 22703326, 23188205, 23442580, 23528244, 23074513, 22410939, 21369293, 20174793, 18972220, 17496584, 16396660, 15225710, 14079679, 13078018, 12117044, 11257445, 10584330, 9982267, 9247607, 8631997, 8365224, 7954215, 7415620, 7002912, 6690105, 6361441, 6127585, 5989275, 5739626, 5319680, 5126292, 4998250, 4824081, 4716848, 4626398, 4366796, 4127479, 4054621, 4040543, 3901304, 3831347, 3783514]
4909C783514j51308j08681o2373j44067j03312k38581J27437K3168j98556j07854
4899B819387j12421j9150N2868j5020r7689k22440j42873j54360k6639L1847r7813
4888B015697J42808L0670o9698o9329J8894j25805K6918k2896j68176J8969J11615
4877A909667j42631J5554j25941o5832Q6978O6261k03611m6697k8532j02836P2012
4866A434392K69491j23355l07677K15169J9212j00247o5458j01734N5047j22114
4856A172726j03711n6055K08302Q5782o9669p8693J00000r0819j48809K932J99662
4845A221648j52506j03644o1167M9669j10689J14809j5826l7807O8811j58916
4835H14382M9953p9160J84768n5785j16048O5145O2056j24939O7259m5192N7999
$$ y = [3783514, 3632206, 3523525, 3461152, 3317085, 3213773, 2975192, 3102629, 3125797, 2927241, 2819387, 2706966, 2687816, 2740684, 2725664, 2627975, 2405535, 2262662, 2108302, 2081663, 2113510, 2015697, 2158505, 2189175, 2119477, 2050148, 2069042, 1943237, 1970155, 1947259, 1779083, 1798052, 1909667, 1767036, 1782590, 1656649, 1590817, 1677795, 1744056, 1540445, 1493748, 1465216, 1362380, 1434392, 1703883, 1580528, 1272851, 1488020, 1507232, 1406985, 1341527, 1239793, 1294840, 1172726, 1069015, 1012960, 1221262, 1307044, 1237375, 1158682, 1258682, 1167863, 1019054, 1021986, 1221648, 1069142, 965498, 904331, 954000, 843311, 958120, 942294, 904487, 973298, 814382, 864335, 785175, 969943, 914158, 798110, 863255, 925311, 800372, 867631, 822439, 880438]
4824H80438p9241p5828j5167L9619j39293J8521M4417O4402o4026M1474K14705
4813I30021o1615j73164P2288O190k8070M7130j7497j6734N7711O361j38677n1935
4801F32009j16751M7005J58875O2264j06180q1802J03376q8420P3117M6507j91536
4790E38464q0687O1741R7365R8769J34525n2521p4900K8801Q3732j31295O1174
4779G65168l6560r7909q4403P5549n0096o5135o5858J0058L9405J18167Q5112
4768F93498l3867n2531q3578j305j95030R2494R0647J11025j15664n9711L4194
4757D80172R6240O0001r148p7307l0516k2714K8406N542l5001O8984K6390k2732
4745E68317j29333n6774J82258P9688j3926j3299k411j437J58533m882J9049N1265
$$ y = [880438, 801197, 725369, 710202, 749821, 610528, 629049, 673466, 737868, 673842, 715316, 930021, 868406, 695242, 767530, 773720, 745650, 792780, 775283, 758549, 816260, 822621, 683944, 632009, 515258, 562263, 721138, 783402, 677222, 595420, 698796, 610376, 683493, 730000, 538464, 457777, 519518, 616883, 715652, 850177, 797656, 722756, 751557, 835289, 703994, 765168, 728608, 630699, 546296, 621845, 571749, 506614, 440756, 450814, 490219, 608386, 693498, 659631, 607100, 523522, 522217, 327187, 419681, 510328, 621353, 505689, 445978, 480172, 576412, 636413, 627265, 549958, 519442, 496728, 525134, 530676, 495675, 564659, 591049, 568317, 438984, 382210, 564468, 644156, 630230, 616931, 614520, 613083, 771616, 766734, 785783, 837048]
4733H37048j08290M0441K7928j52521j45622k6596J67919P2389j15949J5461j25915
4722D86293L3513j7460K8231Q6931o3097K5831p6847k30614O8541m7362J28087
4711D22047J36701n7998j8952l9475J42335k4436n0922m9013M3618j1152L7727
4700E30480Q8033p4407k7547R1471j03197M5455N1148n1448k5097l3574n0494
4689D40823K8697j35301M5553R671q4314q8638J19347p3656o0971L5786R7332
4678C34329J09674M5541O0159j03909K1273l8256L0257k8820j34471M803n3423
4667B47157j45707J46772J04103O7676J3972N514o7649K09392j74222n2488J30971
4656D85491J47759k30990r2939L2685n7477j203K9776K7324O7757j82445j4287
$$ y = [837048, 728758, 769199, 797127, 644606, 498984, 472388, 640307, 712696, 596747, 612208, 486293, 519806, 502346, 530577, 617508, 554411, 580242, 503395, 272781, 341322, 293960, 422047, 558748, 500750, 481798, 442323, 584658, 560222, 509300, 460287, 503905, 492753, 530480, 618513, 544106, 516559, 608030, 504833, 550288, 601436, 549988, 524891, 491317, 440823, 469520, 334219, 379772, 389443, 305129, 216491, 335838, 262182, 201211, 236997, 334329, 444003, 489544, 549703, 445794, 467067, 428811, 459068, 430248, 295777, 300580, 247157, 101450, 248222, 352325, 420001, 433973, 439487, 371838, 581230, 407008, 354520, 485491, 633250, 402260, 309321, 342006, 284529, 283326, 313102, 340426, 408183, 225738, 211451]
4645B11451l1543R6007O4819P5786l2504n7260n3395P2682P6063k8160K8429n1649
4633C70726n3401q9069k557L779n2327j5226J48463l4191n1488R8909O1596K0638
4621D05852O410l422k48477n5693k0058n6541J33981l7108j97027M8379P2074
4610D8370K3809M514j34291P4335l918J74449p0968M5431j16290J8691J28863
4599A92995j61503k6611J23538n5847J3326j17664P9547K9712p5701j0505k2679
4588c1392j09734K81841N3397K572o3054R058O363p7443q8728j0746J2290J3345
4576b231N0816k9184M2175r1730j1300J52420K0752M0177M0098n8997L032R0942
4564B46970l4601L2672L5719o5133j60961p0120J69800j1720K2102p8119j08962
$$ y = [211451, 179908, 275915, 340734, 416520, 384016, 326756, 273361, 346043, 422106, 393946, 422375, 370726, 317325, 228256, 225699, 229478, 177151, 161925, 310388, 276197, 224709, 323618, 385214, 405852, 412262, 408840, 160363, 104670, 84612, 28071, 162052, 124944, -72083, -23704, 48370, 72179, 76693, -57598, 16737, 12819, 187268, 116300, 161731, 45441, 64132, 192995, 31492, 4881, 128419, 72572, 85898, -31766, 47781, 77493, 1792, -8713, -31392, -141126, 140715, 194112, 196684, 133630, 142688, 149051, 71608, -17120, -27866, -15576, -2231, 48585, 19401, 61576, -30154, -41454, 110966, 131718, 171895, 211993, 152996, 156028, 246970, 212369, 245041, 280760, 215627, 54666, -15454, 154346, 142626, 164728, 86609, -22353]
4553b2353J00876J6671j35433K0289l0914O1630N8341j6683o9136K2550Q7112
4542I2950J76792j06704l3176q4971p5222Q0493J57103k63315p3689k8699n7067
4531b15505N6347j1428J01583J06513L3944j08185r0480J6714N0414Q0959K2219
4520D3095m4017K21480N6186P234o2960k1683n0221j2768j69741K5749J56385
4509A48739j06504j41379J92765M2782k42756M2116O7668l4680J41141k7881k28955
4498a46944K7272q6578J50262J80245R064j50207j34605J9500N1852j24604N8
4487b04685K10517j85577N9497J55291K9532l1409j3463J52305J06526j58937
4477A19597l0760J1219j10969r9236j1045M0973J28575n2993R752L390K4779k6114
$$ y = [-22353, 78523, 95194, -40239, -19950, -50864, 10766, 69107, 52424, -16712, 5838, 92950, 269742, 163038, 129862, 44891, -30331, 50162, 207265, -56050, -129739, -158438, -215505, -159158, -170586, -69003, 37510, 71454, -36731, -127211, -110497, -60083, 20876, 43095, -922, 220558, 276744, 283978, 221018, 199335, 149114, 136346, -33395, -7646, 148739, 42235, -99144, 93621, 136403, -106353, -64237, 3431, -31249, 109892, 82011, -146944, -119672, -206250, -55988, 124257, 133321, -16886, -151491, -131991, -80139, -204743, -204685, 5832, -179745, -120248, 35043, 64575, 33166, 19703, 172008, 278534, 119597, 88837, 100056, -10913, -110149, -121194, -80221, 48354, -4639, 5113, 8503, 33282, 7168]
4465G168J2949J36153o0797p256o0500n293o178r9940P8939K2980r3345J24638
4453D9518l8738J66582j29443M522q6654q1696J90978q5211P4100M9180K3446
4442A36584k01356r2685J95427M0170N8J2091q1482J4423J10000m8938J2335j03639
4430g012n573m6438K3005J65546N8683k02981K5139l5795m7796N0821J81458j35408
4418B3649L9190J22077M0305k9559j10530l133k1864P6476j39729J47887M7830
4407A92599l4580j27786J14939J04692l2289q6254N7039J4962j14337o0722J29617
4396A57880l4808j06655o127J09689p7140m7663J2635J07899N2177q3858o444
4385G7585j32666P0380j54133k824N4346O9403J18365j1819j517J3826m7750Q8742
$$ y = [7168, 20117, 156270, 95473, 88217, 27717, 22424, 16246, -83694, -4755, 18225, -75120, 49518, 10780, 177362, 47919, 52441, -34213, -115909, 75069, -10142, 63958, 113138, 136584, -64772, -157457, 37970, 78140, 78198, 90289, 8807, 23230, 133230, 84292, 96627, -7012, -12585, -59023, -36018, 129528, 188211, -14770, 10369, -25426, -73222, -22401, 159057, 23649, 62839, 184916, 225221, 195662, 85132, 81999, 60135, 136611, -3118, 144769, 192599, 158019, 30233, 145172, 249864, 217575, 131321, 188360, 203322, 88985, 28263, 157880, 123072, 16417, 10290, 119979, 42839, -4824, 7811, 115710, 167887, 84029, 77585, -55081, 15299, -138834, -141658, -87312, -17909, 100456, 88637, 87120, 100946, 53196, 141938]
4373A41938O7799K6193j16816J2683l9101k4300O1404P7193J9080n6033L8707
4362B08747k4694j72891j00392N4393O5172J39434p2147J1159j24307j5592K9619
4351a499L9816P6948j01339j013j1438J07248r154m8402J41254j03733k31611
4340a42923j8538J74933Q5998l5346J4950n8646j87766J9316J1773m1606M0776
4329a37079P2840J53833L4935k43137M1745J03957q5125R3287r7906J11188K8730
4318G7268r8598l2663q5373L4839R2834J35695j41031P5050J00166n4774r8428
4307D985j5948j67515J04453Q3855p476K0283n7247K7288K9052k475N6421j05018
4295b9342M7817P9017J91354r0598q2674o0625l5793P3970r6798O5639p9739K1934
$$ y = [141938, 209737, 235930, 119114, 131797, 92696, 68396, 129800, 206993, 226073, 170040, 208747, 184053, 11162, -89230, -34837, 30335, 169769, 97622, 108781, -15526, -31118, -1499, 38317, 115265, 13926, 12913, 1475, 108723, 99569, 51167, 192421, 88688, -142923, -161461, 13472, 99470, 64124, 79074, 20428, -167338, -148022, -136249, -177855, -137079, -64239, 89594, 124529, -118608, -76863, 27094, -58031, 35256, -62650, 48538, 77268, -21330, -53993, -139366, -104527, -11693, 124002, -17029, 58021, 158187, 103413, 4985, -10963, -178478, -74025, 9830, 2354, 22637, -34610, -7322, 21730, 19255, 75676, -29342, 18475, 97492, 288846, 198248, 115574, 54949, 19156, 93126, -3672, 61967, -17772, 4162]
4283D162K7792j82049J00492j0436q1374k8798o1125P9188Q4373O9870j99366
4272a97271Q670J26844J88598o6879j18856M8735q0116L4144o2038j5023O9560
4261f3632J97902R7290j07698m1015M7600j39868j15621J18583P8656m5092j20935
4250i3830O7466J0239m0442J53867K2852j71553j13574O1978K33853l8633M0791
4239A33014N6104M6374k59572Q1028j02504j0425l223O6542R1124j8513q3382
4228c433K0221p5450J01183q4740j60757K10292M4857m9585r1213J08059R9953
4217A19387l5550q241j00457K6931q460K8620J52667n879m4373j43056M3039O691
4205C1319l5289K7962J8918N6229q7109k4232R3745j06254n8950J91962o7801
$$ y = [4162, 31954, -150095, -49603, -60039, -141413, -170211, -231336, -152148, -67775, 2095, -197271, -188601, -61757, 126841, 59962, -58894, -10159, -90275, -56131, -118169, -133192, -63632, 134270, 231560, 123862, 82847, 130447, -9421, -125042, -6459, 72197, 27105, -93830, -26364, -16125, -56567, 97300, 120152, -51401, -164975, -102997, 130856, 92223, 133014, 189118, 235492, -24080, 56948, -45556, -55981, -59204, 7338, 98462, 79949, -3433, 16788, -58662, 42521, -42219, -202976, 7316, 52173, 2588, -88625, 19434, 119387, 83837, 75596, -24861, 2070, -6390, 22230, 174897, 169018, 124645, -18411, 24628, 31319, -3970, 23992, 42910, 99139, 12030, -12202, 81543, -24711, -83661, 108301, 40500]
4194D0500L7273R753q8428L2538J12549J01274j69528p2962m7533R8976N730j069
4182E9073o2344j4817J22658K2930k1407K2462j7989K4365n8857L3284k7446j16239
4170c4327J53368K0848K1252j3356k6151j17351j6360K11740j12906r521j3793
4159F3443R7518j67301K31363o7607j41364N2069J13055j36289n9699J91809o079
4148A70918m6604o8275K3975J3096q3389o0950j7612J42471n4547r4591J39954
4137F4446L9781J23312j62792R2186n9106p0858N7742k8965J5033k2171n012R3091
4125A36687j04539L9285N8860P9051N9751r474m8869j19073j7656l4180L1561
4114G1404L508J04829k686q5571n7123m2393P7419Q14P3608M0078o0227p0573
$$ y = [40500, 77773, 87526, -902, 31636, 144185, 245459, 75931, 2969, -44564, 54412, 60142, 59073, -3271, -18088, 104570, 127500, 106093, 128555, 110566, 134931, 76074, 109358, 81912, -34327, 119041, 139889, 161141, 147785, 121634, 4283, -12077, 199663, 86757, 77236, 63443, 160961, -6340, 225023, 157416, 16052, 68121, 181176, 44887, -14812, 176997, 170918, 124314, 56039, 80014, 93110, 9721, -51229, -68841, 73630, 19083, -75508, 64446, 104227, 227539, 64747, 156933, 97827, 26969, 84711, 55746, 70779, 48608, 43596, 136687, 32148, 71433, 130293, 209344, 269095, 259621, 210752, 91679, 74023, 39843, 71404, 74912, 179741, 177055, 91484, 34361, -8032, 69387, 70201, 143809, 183887, 123660, 53087]
4102E3087n8663q527q5018L8125J16904M5956r031j07113j01428J56257K08811
4091B49360P4517J6035k47375o5443J41211j73412J49048r4520m4414J88084O3232
4080B56323J1180k71088j27997J72465M6203p3379n146j1473P1719M793M6551
4069A20151m8566J37525Q76j4125j1798l855p9143p1417K17948r4224m5918Q4228
4057A91682r634P0870j8797j45800k0337m8585j8367J44952k1171M1933Q9274
4046B56020p2441L3934j51078J94884L2759k18147J38838q643n5964n2155q0676
4035A7331j2515J49950R0328o3663q2661M072R4200K6214m3469N047P8026R4653
4023C57513N0463q5350l977K221J58595n589k75111j0525n3296Q1774N8684p8703
$$ y = [53087, -5576, -14103, -99121, -60996, 55908, 101864, 92833, -14280, -115708, 40549, 249360, 323877, 339912, 92537, 27094, 168305, -5107, 143941, 49421, 5007, 193091, 256323, 267503, -3585, -131582, 40883, 87086, 13707, 8561, -2912, 68807, 73600, 120151, 71585, 209110, 209986, 195861, 184063, 180208, 101065, 29648, 247596, 153372, 107454, 191682, 182048, 252918, 234121, 88321, 67984, 19399, 1032, 145984, 124813, 166746, 256020, 183579, 217513, 66435, 261319, 294078, 75931, 214769, 206126, 150162, 98007, 17331, 4816, 154766, 245094, 181431, 98770, 102842, 197042, 223256, 179787, 184834, 262860, 357513, 407976, 322626, 318649, 320870, 479465, 473876, 198765, 188240, 134944, 216718, 275402, 196699]
4011A96699q053o081n7894m5287M8609J80324K6996p9679o4924q8440J33147M2928
3999B78345j89474K1498L4885m3939r5235J07186J42618K2827k7349j6706j06899
3988A27757j09821R7666O5613p3950K9280K57450j5345j52617J02221p3341j56379
3977I8534J1026r2930K4869q1159l1172P4662M0560P4706K8219j50211K07520
3966B04624R5688P19L7097j91317K2946J60765P6848j38390K5294j91559R182
3955A11897N0142k3304k2558J41426K4075o0246o1139l5500R4266R8423O045k06298
3943A17229M9971p287n5392O1577M688r4795Q8569N179j84059J5841J43456l3050
3931A11927j61391K2886K04792j559K1858j00998l7167n2130O1649J6800j22249
$$ y = [196699, 188646, 182565, 124671, 79384, 127993, 308317, 335313, 255634, 190710, 102270, 235417, 278345, 88871, 110369, 145254, 101315, 6080, 113266, 255884, 278711, 251362, 234656, 127757, 17936, 115602, 181215, 107265, 136545, 393995, 378650, 226033, 328254, 254913, 98534, 109560, 16630, 41499, -39660, -70832, 3830, 44390, 119096, 147315, -2896, 204624, 300312, 301031, 338128, 146811, 169757, 330522, 407370, 268980, 294274, 102715, 111897, 162039, 138735, 116177, 257603, 281678, 221432, 160293, 124793, 219059, 317482, 323527, 117229, 167200, 159913, 104521, 166098, 170786, 75991, 164560, 169739, -14320, 1521, 144977, 111927, -49464, -26578, 178214, 176655, 198513, 97515, 60348, 8218, 69867, 86667, -35582]
3920c5582R9979j19446N6132J32945Q4843j9139L9505L7908J78740j72602R6432
3909C79715j61407q4526K19315j38193j33205j33532J64781L3051J9845j30939
3899C4905k0476Q8092n7753j4694k5910M6556N9979n8675J41382K03103p6994
3888C19515p3620l4621n9609m5147p7812N5417k303n1926N4037Q6142L8336j0552
3876A97857l7200J27232j47140P6993j1539K0601N334J23526j39201o8943J72666
3865C20186r1565j86175Q3963Q502l544j4052j39309k1620Q1289J72302r8148
3854A11829M4486O6852o9874K1180o8555J00327J05163R8658j7251j13400l8666
3843B40749p3360J10685l6638k9961Q5716L3637j42863P0376P1935j2384Q5753
$$ y = [-35582, 64397, -55049, 1083, 134028, 218871, 199732, 239237, 277145, 455885, 283283, 379715, 218308, 133782, 353097, 214904, 81699, -51833, 112948, 145999, 165844, 34905, 14429, 102521, 44768, 30074, 4164, 50720, 110699, 52024, 193406, 396509, 319515, 245895, 211274, 151665, 106518, 28706, 84123, 81820, 29894, 83931, 170073, 208409, 197857, 160657, 287889, 140749, 217742, 206203, 226804, 232138, 355664, 216463, 147520, 320186, 228621, 42446, 126409, 134911, 131367, 117315, -21994, -43614, 37675, 209977, 111829, 156315, 223167, 153293, 174473, 105918, 206245, 311408, 410066, 392815, 279415, 240749, 167389, 278074, 241436, 211475, 297191, 330828, 187965, 258341, 330276, 317892, 403645]
3832D03645j52410R2264J88140j07053k53278j3987J19687L5834M4860p1046M471
3821B91127k4682K4747j3371J18880k8009j04005p6009M7248L0564J19754P3929
3810D60173J77205p2959k93676n6489J58711K4681M3746J18339O6759j7851P728
3799F16367J55509j05279m2681m5116P8583o4108p6861O7424j49425J40244K45991
3788H20648m4761m9374M231Q5557m6821k25863Q7633Q4422J8452L1983k2673M6334
3776G89768o0106J20359k8280R7668R8111j05037o2428j32628J12214J49816p932
3765I71525N6059J60770j0657q6228p6245k8865P9927l6268q3438J41790M1831
3754A130201M8239N0543O7728p4669K8414P6715o8045N0177M9901j5414j1065
$$ y = [403645, 251235, 343499, 531639, 424586, 171308, 157321, 277008, 312842, 357702, 286656, 291127, 266445, 291192, 277821, 396701, 368692, 264687, 188678, 235926, 266490, 386244, 460173, 637378, 564419, 270743, 214254, 372965, 397646, 441392, 559731, 626490, 608639, 616367, 771876, 666597, 623916, 578800, 657383, 593275, 516414, 583838, 434413, 574657, 820648, 775887, 726513, 730744, 816301, 769480, 543617, 631250, 715672, 734124, 766107, 743434, 789768, 729662, 850021, 821741, 919409, 1017520, 912483, 850055, 717427, 829641, 979457, 971525, 1027584, 1188354, 1177697, 1091469, 1015224, 986359, 1066286, 1030018, 946580, 1088370, 1130201, 1178440, 1228983, 1296711, 1222042, 1250456, 1327171, 1259126, 1309303, 1359204, 1343790, 1332725]
3743A332725o1854Q4344L8876j166R2405Q5610o647J7608P9713q2788K0620J04961
3731A704407J9693M0071l1233J68376j03718l7508K04030O5836j14232o0945K57320
3720B112097q1055R3981P2318N9446J65930j0545j2365P8405K0320J16559J25081
3709B740172L5422J34503J61769J98114N2426J66345J89231J14385L3397O648
3699C832412K35849K84618J16963K98558K56100N5818L61001Q8575L25095L63971
3689F218960M74821L96973M58701O70108Q06108J040026J216275J420696J771241
3680A4473909K194743K498841L078602L652421L422742K737003J725936p60719
3672C3023478l602177n031565m559863l379521k508192j692876j315634j271138
$$ y = [1332725, 1270871, 1355215, 1394091, 1392925, 1485330, 1570940, 1564293, 1581901, 1661614, 1578826, 1599446, 1704407, 1724100, 1764171, 1732938, 1901314, 1797596, 1760088, 1964118, 2029954, 1915722, 1854777, 2112097, 2031042, 2125023, 2197341, 2256787, 2422717, 2412172, 2399807, 2478212, 2498532, 2615091, 2740172, 2775594, 2910097, 3071866, 3269980, 3322406, 3488751, 3677982, 3792367, 3825764, 3832412, 4068261, 4352879, 4469842, 4768400, 5024500, 5080318, 5441319, 5529894, 5854989, 6218960, 6693781, 7090754, 7549455, 8219563, 9025671, 10065697, 11281972, 12702668, 14473909, 16668652, 19167493, 22246095, 25898516, 29321258, 32058261, 33784197, 33023478, 29421301, 24389736, 19829873, 16450352, 13942160, 12249284, 10933650, 9662512]
3664I662512r07548p23099o30730o24469n39801m57431l97454j58697j85066l92684
3654D645533k18764k15671j47526O3568j06733j66757l7671l1980j41909j31278
3644C510812q1056q165o9142j21431q5657m4331N5592J03430n1780m9583r9164
3633C059525n200Q3817r9645m6510L9973J4131K7179q1392M5072J36682k7879
3622C145753j20985m7592N103O0010K11014J012m6657N0541j06765P0959J2436
3611C234829J07589J5458J704K59891N1627Q194N0406K31857J08164r4395M457
3600C979781O1315J49759O1848j0243j6510n55J21822J22721K51969j1595J03766
3589D814078R0267J52804L05947k7172J3461J92098J00408J34967J68959K28708
$$ y = [9662512, 8754964, 8031865, 7401135, 6776666, 6236865, 5779434, 5381980, 5223283, 5038217, 4645533, 4426769, 4211098, 4063572, 4127140, 4020407, 3853650, 3815979, 3783999, 3642090, 3510812, 3429756, 3421591, 3352449, 3231018, 3145361, 3101030, 3156622, 3260052, 3208272, 3158689, 3059525, 3054325, 3138142, 3038497, 2991987, 3031960, 3046091, 3073270, 2991878, 3036950, 3173632, 3145753, 3024768, 2977176, 2982279, 3042289, 3253303, 3254315, 3207658, 3258199, 3151434, 3222393, 3234829, 3342418, 3357876, 3359580, 3619471, 3671098, 3679292, 3729698, 3961555, 4069719, 3975324, 3979781, 4041096, 4190855, 4252703, 4242460, 4225950, 4225395, 4347217, 4469938, 4721907, 4710312, 4814078, 4904345, 5057149, 5363096, 5335924, 5349385, 5541483, 5641891, 5776858, 5945817, 6174525]
3579F174525K1644J313L06272K34079K43046K24026K78675K43530J54167L34840
3569H216117J65598J61338L33081M42113K17190K71077K47728K54370L35249L56391
3559A1000252M08062L95934N13359L61364L23206L31528L89938N62515N08336
3550A4794494L48260N80342L09552M00940L30803L67158O64425K65840K31242
3541A8293056M05728M21383N09156M33795L17795N57495O02792L56331O84151
3532B2581682O59785O58890O33247O85474P85371P68511R50053O24330Q69428
3523B9216771J049824P41075P46889Q68131R15262P39088P88816O07510O12314
3514C6285680O32393M60134M04089M45788M62070M28448M19271J82045K96256
$$ y = [6174525, 6196169, 6197482, 6503754, 6737833, 6980879, 7204905, 7483580, 7727110, 7881277, 8216117, 8381715, 8543053, 8876134, 9318247, 9535437, 9806514, 10054242, 10308612, 10643861, 11000252, 11408314, 11804248, 12317607, 12678971, 13002177, 13333705, 13723643, 14286158, 14794494, 15142754, 15723096, 16032648, 16433588, 16764391, 17131549, 17795974, 18061814, 18293056, 18698784, 19120167, 19629323, 20063118, 20380913, 20938408, 21541200, 21897531, 22581682, 23241467, 23900357, 24533604, 25219078, 26004449, 26772960, 27723013, 28347343, 29216771, 30266595, 31007670, 31754559, 32622690, 33537952, 34277040, 35065856, 35673366, 36285680, 36918073, 37378207, 37782296, 38228084, 38690154, 39118602, 39537873, 39719918, 40016174]
3505D0016174L25264L13011K79155K31707J69269M65256L26420L83421M31152
3496D2940829M66621M32537N26969N33889N35289N15139L95942L57125M75495
3487D7179835M93306R5864L29242M02704m1965N7879J13612j37464j01433j16980
3477D8274600j20171p1843k23325j00788k86437k83646k94563n02929k26165j54337
3467D6010396l45200l92288l77705n12505m06746m02868m86560m01277m05137
3458D2280110l68483m31628j97994j79108n49392k41348l73402m10235l48816
3449C9179704l16430m27120m28313n29308o61127n62892o13276m90461o59546
3440C4491231r01403o77520p99862o37233p84574q13025o02975p28508o18147
$$ y = [40016174, 40341438, 40654449, 40933604, 41165311, 41334580, 41799836, 42126256, 42509677, 42940829, 43407450, 43839987, 44366956, 44900845, 45436134, 45951273, 46347215, 46704340, 47179835, 47673141, 47769005, 48098247, 48500951, 48458986, 48516865, 48630477, 48493013, 48391580, 48274600, 48154429, 48082586, 47859261, 47758473, 47472036, 47188390, 46893827, 46390898, 46164733, 46010396, 45665196, 45272908, 44895203, 44382698, 43975952, 43573084, 43086524, 42685247, 42280110, 41911627, 41479999, 41282005, 41102897, 40553505, 40312157, 39938755, 39528520, 39179704, 38863274, 38436154, 38007841, 37478533, 36817406, 36254514, 35641238, 35150777, 34491231, 33589828, 32912308, 32112446, 31475213, 30690639, 29877614, 29274639, 28546131, 27927984]
3431B7927984o18077o62203m83716n67474o52651n05457n51668m91317l43139
3422B3052282l07781l43818m75330l34238k84995m37356l86804k76492m28549
3413A9776919n13043l35305m43272k88745m55136m95462k09541k68431l60017
3404A6407967m84042k58063j67917j09292k73626l7185l13385r1913N9595j37881
3394A4594258j92215n8539O6851k98937j97780R4624J08984M8468j5959p5875
3384A4073880J16759P2063J16376r4584N5673J52032N3376J63201L36887J00882
3374A5146545J06276J78715J81537J27023K43982K98470K36404L9273J58843K46309
3364A6963377M49199L17357J38401L54780L31688K62778M90081M26437N70317
$$ y = [27927984, 27309907, 26647704, 26163988, 25596514, 24943863, 24438406, 23886738, 23395421, 23052282, 22744501, 22400683, 21925353, 21591115, 21306120, 20868764, 20481960, 20205468, 19776919, 19263876, 18928571, 18485299, 18196554, 17741418, 17245956, 17036415, 16767984, 16407967, 15923925, 15665862, 15497945, 15388653, 15115027, 15077842, 14764457, 14672544, 14732139, 14594258, 14402043, 14343504, 14410355, 14111418, 13913638, 14008262, 14117246, 14165714, 14149755, 14073880, 14190639, 14262702, 14379078, 14284494, 14340167, 14492199, 14545575, 14708776, 15045663, 15146545, 15252821, 15431536, 15613073, 15740096, 15984078, 16282548, 16518952, 16558225, 16717068, 16963377, 17412576, 17729933, 17868334, 18223114, 18554802, 18817580, 19307661, 19734098, 20304415]
3355B0304415M73308L48863N54785L99715N01985M70648O03219M84669M82356
3346B4623963N60115P45941M75911O31015O33142Q55701N87545N51005Q80212
3337C0544550R17696R13727Q91818Q64698Q49759R33702R25435J064009J006432
3328C8911826J228360J245487J235050J200943J330514J182292J026370J046103
3320D8406945J343867J306377J143789J253881J193084J267474J434752J380956
3312E8731125J470242J554491J618723J716680J904609J902089K061249K243444
3304G3202652K434470K430706K482462K464267K539642K814750L090021L080366
3296I4539336L298178L389744L301126L646414L835684L819002L901864M237348
$$ y = [20304415, 20777723, 21126586, 21681371, 22081086, 22583071, 23053719, 23656938, 24141607, 24623963, 25184078, 25930019, 26405930, 27036945, 27670087, 28525788, 29113333, 29664338, 30544550, 31462246, 32375973, 33267791, 34132489, 34982248, 35915950, 36841385, 37905394, 38911826, 40140186, 41385673, 42620723, 43821666, 45152180, 46334472, 47360842, 48406945, 49750812, 51057189, 52200978, 53454859, 54647943, 55915417, 57350169, 58731125, 60201367, 61755858, 63374581, 65091261, 66995870, 68897959, 70959208, 73202652, 75637122, 78067828, 80550290, 83014557, 85554199, 88368949, 91458970, 94539336, 97837514, 101227258, 104528384, 108174798, 112010482, 115829484, 119731348, 123968696]
3288A23968696M295717M725551M800598M951972N372385N765623O123078O283251
3280A66286871O661362P112836P485806P895295Q222200Q553880R131695R263047
3272B30612992R594887R851479J0084700J0491304J0966657J1311366J1891647
3265C04805032J2586098J3020133J3431899J4203056J4868830J5187236J5402911
3258D03505195J5295282J4711115J3707852J1892412R165341O105484K359140
3251D76741821j322847n273558q829926j2155109j4814272j6656268j7560048
3244D00129793j7988285j8301793j8072554j7527613j6516177j5879757j4816157
3237B81027457j3972539j3174854j2116879j1338095j0753081r992688r334659
$$ y = [123968696, 128264413, 132989964, 137790562, 142742534, 148114919, 153880542, 160003620, 166286871, 172948233, 180061069, 187546875, 195442170, 203664370, 212218250, 221349945, 230612992, 240207879, 250059358, 260144058, 270635362, 281602019, 292913385, 304805032, 317391130, 330411263, 343843162, 358046218, 372915048, 388102284, 403505195, 418800477, 433511592, 447219444, 459111856, 468277197, 474382681, 476741821, 475418974, 470145416, 461315490, 449160381, 434346109, 417689841, 400129793, 382141508, 363839715, 345767161, 328239548, 311723371, 295843614, 281027457, 267054918, 253880064, 241763185, 230425090, 219672009, 209679321, 200344662]
3230B00344662r212164q472137q108328p958939p578723p221224o709796o502001
3222A38581350o192726o037535n752247n315580m929180m591499m546873m209602
3214I7006108l905154l713555l386324l250746l141771k862717k869601k861021
3206G1015219k468101k685476k451758k115594k159853k041145k083267j864496
3198E3145529j926823j774692j682441j752307j608157j407602j363071j368169
3190D0262267j312096j299734j397938j044772j175579j009541r48008j035326
3182C1039273j061879r03020q08198p80301r50811o97093p99836q80347p19445
3173B3438343p01226o25280m84452p12104o16159p15735p65154m91995n40228
$$ y = [200344662, 191132498, 182660361, 174552033, 166593094, 159014371, 151793147, 145083351, 138581350, 132388624, 126351089, 120598842, 115283262, 110354082, 105762583, 101215710, 97006108, 93100954, 89387399, 86001075, 82750329, 79608558, 76745841, 73876240, 71015219, 68547118, 65861642, 63409884, 61294290, 59134437, 57093292, 55010025, 53145529, 51218706, 49444014, 47761573, 46009266, 44401109, 42993507, 41630436, 40262267, 38950171, 37650437, 36252499, 35207727, 34032148, 33022607, 32074599, 31039273, 29977394, 29074374, 28266176, 27485875, 26535064, 25837971, 25038135, 24157788, 23438343, 22737117, 22111837, 21627385, 20915281, 20299122, 19583387, 18818233, 18326238, 17786010]
3164A7786010m42386n45095l75751m93283n05360n44965k01115k74747k24242
3155A4179066o00372j78846l44066l69477k45832m57063k64356j48661k5994m25574
3145A1118825j97975k15951l73206k17105j63937j78417k09060k48424k17802
3136I096948k50766k00567k1440l6012k60673K2419k70641j80676o6037l31326
3126G501229k88210j19026J52012j66703j14008k60913k07546K5085q9894L4657
3116F466683o5070j10888n8892K0763j27068k88423Q4279j06977j24992m9697
3106E639718N7908L1215Q522k1855q7870m4315l8478m7164M3225m8860K8620j89185
3094E331481p4332J82419r7624l1989J18379n9451O7367p5359n2425l0959j2660
$$ y = [17786010, 17343624, 16798529, 16422778, 15929495, 15424135, 14879170, 14678055, 14403308, 14179066, 13578694, 13399848, 13055782, 12686305, 12440473, 11983410, 11719054, 11570393, 11544399, 11118825, 10920850, 10704899, 10331693, 10114588, 9950651, 9772234, 9563174, 9314750, 9096948, 8846182, 8645615, 8624175, 8588163, 8327490, 8349909, 8079268, 7898592, 7832555, 7501229, 7213019, 7093993, 7246005, 7079302, 6965294, 6704381, 6496835, 6521920, 6432026, 6466683, 6401613, 6290725, 6231833, 6252596, 6125528, 5837105, 5921384, 5814407, 5689415, 5639718, 5697626, 5728841, 5737363, 5715508, 5627638, 5583323, 5544845, 5497681, 5540906, 5492046, 5520666, 5331481, 5257149, 5439568, 5341944, 5309955, 5428334, 5368883, 5436250, 5360891, 5308466, 5277507, 5264847]
3083E264847J15149j43657p2729J20144j51001j75046r2961j0021K1731j13383
3073D763073J8013j41356M1359N6907N9237L732K1907m7473N5942r5414k16332
3062D519595L4357m7772M6369k0560j8053o5162K3520M164L3505n3582j15954
3051D340427P8679N8158R7331J3987P357k033j53552J42517J28620L739j14495
3040D600735o0422o218P7307K57329o7492Q5322j8408N9008J52553O7643N292
3029E152649L725P4565r1976j3671J62271N6097J47913K5736J03540J74274p7580
3018E717543k2558J74720J34478J00135J7497J74984J5522L0245P6194R2646L5685
3007F547091Q1094K18740J81847J88808J8632r937J52703K06610R5574O686L16991
$$ y = [5264847, 5379996, 5236339, 5163610, 5283754, 5132753, 4957707, 4864746, 4854725, 4876456, 4763073, 4781086, 4639730, 4681089, 4737996, 4797233, 4800965, 4822872, 4775399, 4831341, 4735927, 4519595, 4553952, 4506180, 4552549, 4531989, 4513936, 4448774, 4472294, 4476458, 4509963, 4456381, 4340427, 4419106, 4477264, 4574595, 4588582, 4595939, 4593906, 4440354, 4582871, 4711491, 4715230, 4600735, 4540313, 4534095, 4611402, 4868731, 4801239, 4886561, 4868153, 4927161, 5079714, 5147357, 5152649, 5156374, 5230939, 5138963, 5125292, 5287563, 5343660, 5491573, 5517309, 5620849, 5795123, 5717543, 5694985, 5869705, 6004183, 6104318, 6121815, 6296799, 6312321, 6342566, 6418760, 6511406, 6547091, 6628185, 6846925, 7028772, 7217580, 7236212, 7226275, 7378978, 7585588, 7681162, 7687848, 8004839]
2996H004839L63101Q8445J39121J60667J62855J28182J03068K41120L95813K42144
2986A0029355Q9534K83597Q2941K07713L04549J17996L69446L37647J70768K09570
2976A2203116L22669L59206K98434L24254L11692J87136M82530L71488L08507
2967A5169032L82854K59099M43357M85941L75648N02877O91003O44131M06228
2958A9360170M23264O74158O03070N76932R25666Q37346R92303P19160R24822
2949B6036891J133709J141177J279744J275906J510329J686226J635594J796278
2941C7495854J943059K265229K335214K406296K607710K729130K641583K611336
2933E7035411K950379K504246K208335K206313J939187J752559J840326J546550
$$ y = [8004839, 8367940, 8456385, 8595506, 8756173, 8919028, 9047210, 9150278, 9391398, 9787211, 10029355, 10118889, 10402486, 10485427, 10693140, 10997689, 11115685, 11485131, 11822778, 11993546, 12203116, 12525785, 12884991, 13183425, 13507679, 13819371, 14006507, 14489037, 14860525, 15169032, 15551886, 15810985, 16254342, 16740283, 17115931, 17618808, 18309811, 18953942, 19360170, 19783434, 20457592, 21060662, 21637594, 22563260, 23400606, 24392909, 25112069, 26036891, 27170600, 28311777, 29591521, 30867427, 32377756, 34063982, 35699576, 37495854, 39438913, 41704142, 44039356, 46445652, 49053362, 51782492, 54424075, 57035411, 59985790, 62490036, 64698371, 66904684, 68843871, 70596430, 72436756, 73983306]
2925G3983306J262240J089642Q84711N71390N48206M56036L26306K77200N68315
2916G9967352O81267J057559J112105J420351J762973K221938K746547L079137
2908I4049229L620889M275847M697491N059348M780424L533701J372295o11175
2900A20778049j694605k029876j344785q37571r29398k022813l937673n744078
2892A02237250o901302o710958n811575n051448m122387l497093k807307k231527
2884F5103653j733931j397642j289778r37471m94159m15726N3505N6881L52995
2875E9298327J69004K17653J19399q2675m09751p11077j210953j340451j574230
2866E4475246j698917j782460j997368k143374k631779k392790k484763k713411
$$ y = [73983306, 75245546, 76335188, 77219899, 77791289, 78339495, 78795531, 79121837, 79399037, 79967352, 80648619, 81706178, 82818283, 84238634, 86001607, 88223545, 90970092, 94049229, 97670118, 101945965, 106643456, 111702804, 116483228, 120016929, 121389224, 120778049, 119083444, 117053568, 115708783, 114871212, 113941814, 111919001, 107981328, 102237250, 95335948, 88624990, 82813415, 77761967, 73639580, 70142487, 67335180, 65103653, 63369722, 61972080, 60682302, 59744831, 59250672, 58834946, 58888451, 58945332, 59298327, 59467331, 59684984, 59804383, 59721708, 59311957, 58600880, 57389927, 56049476, 54475246, 52776329, 50993869, 48996501, 46853127, 44221348, 41828558, 39343795, 36630384]
2858C6630384k499463k128163k086788j831432j931426j674041j466333j295364
2850B1717374j282095j052044r42393q20345r90607r54457p67746p66603m98033
2841A3643051n65003n63555p16523n02297k55335l04158m21634k52715l98836
2832I662995n58425l04104k61661l30951k28921k50404k01183j39800k30909l50997
2822F805640j85538l12695m11091j89146q489r2416l71316k33377R637q1176j41521
2811D788512j47897j78697j39659r1726j12679j71046j28354j9013K4432q7739
2801C736134j08060j55101O5170j82851j60524J2040k2131j06688n4873j13167
2791B909949k2531n0387j26878n7851k08485L4554o252p6096O2231m8497j75661
$$ y = [36630384, 34130921, 32002758, 29915970, 28084538, 26153112, 24479071, 23012738, 21717374, 20435279, 19383235, 18440842, 17620497, 16629890, 15675433, 14907687, 14141084, 13643051, 13078048, 12514493, 11797970, 11295673, 11040338, 10736180, 10314546, 10061831, 9662995, 9104570, 8800466, 8538805, 8207854, 7978933, 7728529, 7527346, 7387546, 7156637, 6805640, 6620102, 6307407, 5896316, 5707170, 5698681, 5606265, 5234949, 5001572, 5011209, 4930033, 4788512, 4640615, 4461918, 4322259, 4230533, 4117854, 3946808, 3818454, 3799441, 3823873, 3736134, 3628074, 3472973, 3538143, 3355292, 3194768, 3206808, 3184677, 3077989, 3023116, 2909949, 2887418, 2837031, 2710153, 2652302, 2443817, 2478371, 2472119, 2396023, 2458254, 2409757, 2234096]
2780B234096j57200J1280L9550j01656O8267L7216j03892j29628j09917j7044
2770A771072J17073L4069q6076l2306q826J08762Q1646j39280p6551m9609j64493
2759A555481o6384Q4083l0395K5616J7684k12524M2664R4804j14652Q2157J53060
2748A631594k48902M3891p8260k1955J9808P9415l2123j36580L4027L4190k7019
2737A298086P0582K3909l6555l186K6322k21375O1867J30637J20249j63228J9122
2726A326430O409j7118P9423j86098j32407j2947k990q3938Q6339M1956J0633
2715A115692j66822J38755P6385K1657j77061J1206n0090m6256p874R9691l4583
2704I80700Q8868j73294n3576l6736J16163q2796O1400J47718n3468j70404j31465
$$ y = [2234096, 2076896, 2088176, 2127726, 2026070, 2094337, 2131553, 2027661, 1898033, 1788116, 1771072, 1888145, 1922214, 1836138, 1803832, 1795006, 1903768, 1985414, 1846134, 1769583, 1719974, 1555481, 1489097, 1573180, 1542785, 1568401, 1586085, 1373561, 1416225, 1511029, 1396377, 1478534, 1631594, 1382692, 1426583, 1348323, 1326368, 1346176, 1425591, 1393468, 1256888, 1290915, 1325105, 1298086, 1368668, 1392577, 1356022, 1352836, 1379158, 1157783, 1219650, 1350287, 1470536, 1307308, 1326430, 1332839, 1315721, 1395144, 1209046, 1076639, 1063692, 1060702, 976764, 1063103, 1105059, 1115692, 948870, 1087625, 1164010, 1185667, 1008606, 1019812, 969722, 923466, 915592, 1015283, 980700, 1069568, 896274, 842698, 805962, 922125, 839329, 900729, 1048447, 994979, 824575, 693110]
2693F93110K1384p8688Q788j40141K2710K0189P6230O369M0988J8257r1238K1066
2681F19024j12082r986J35967J90243R894j65878o7308n8357k1563J58612R3334
2670G71900n0977J16583j23737p1828J2268R9524r7613l9047J0984r1278K4798
2659E61577R712J31565j6074j30530R4338J47301N7303k2873r8196L3505R3954
2648H61582P53j13672J2526p2374N1504j28958j01965R9578p8180N2442J09170
2637F92406J85973j44895m9791K6998o0265O5907O1386r4237J45279n3332j50082
2626F25347J46659m072p165o6828J22623l3746K603o4657N0786P3539m0305J10714
2614I15498o8342J58128j5768K2431l4905k24882r8751J56689j89320j62090P954
$$ y = [693110, 714494, 635806, 644594, 504453, 527163, 547352, 623582, 629951, 670939, 689196, 597958, 619024, 506942, 496956, 632923, 823166, 833060, 667182, 599874, 541517, 519954, 678566, 771900, 720923, 837506, 713769, 641941, 654209, 753733, 656120, 617073, 628057, 536779, 561577, 571289, 702854, 686780, 556250, 650588, 797889, 855192, 832319, 734123, 767628, 861582, 862335, 748663, 761189, 688815, 740319, 611361, 509396, 608974, 530794, 583236, 692406, 878379, 733484, 683693, 710691, 650426, 716333, 777719, 683482, 828761, 775429, 625347, 772006, 767934, 760769, 693941, 816564, 782818, 785421, 720764, 771550, 845089, 804784, 915498, 847156, 1005284, 989516, 1011947, 977042, 752160, 653409, 810098, 620778, 458688, 466642]
2603D66642P7682j0881O1045N8311j57433k0714r598j06833J62181M6706J8962
2592E86070o4651k04296K11516M5149k90244J28082K1260J8414l7413l590l7341
2581C72956p9799M2497P4457j6481K8045k703r9463J20024K0231j80551j29722
2570A49491J48705q775k641j80304q9606J58322Q9842m2556K1758j00393J56518
2559C00361K860n1868j00870m405n1132k7861J16583J00252j10471j6230K6759
2548A83978J20792O868o8223r6633O0558O8769K9282j49439m4765j2440L1853
2537A30600J10424j95541m607q1204N251R2683L3626L5437j4133J64225k8060
2526B48701r8263m2057q6934o3445J37199J23589l2480q3671P1600j8766q3074
$$ y = [466642, 544324, 533443, 594488, 652799, 495366, 474652, 465054, 358221, 520402, 567108, 586070, 521419, 317123, 528639, 573788, 283544, 411626, 432886, 451300, 413887, 410297, 372956, 293157, 335654, 410111, 393630, 421675, 418972, 319509, 439533, 459764, 279213, 149491, 298196, 289421, 286780, 106476, 16870, 175192, 265034, 222478, 244236, 143843, 300361, 303221, 251353, 150483, 146078, 94946, 67085, 183668, 283920, 173449, 157219, 183978, 304770, 311638, 243415, 146782, 207340, 276109, 305391, 155952, 111187, 98747, 130600, 241024, 45483, 40876, -40328, -35077, 57606, 91232, 126669, 112536, 276761, 248701, 150438, 108381, 21447, -41998, 95201, 218790, 186310, 102639, 174239, 155473, 72399]
2515G2399l80P354K14599m6222k7917j28608r2629o3645J59822p0818j19771J22128
2503B6312j240j12015n3240L2289P0700Q657N1832n370J23775j32973N7310q770
2491E7267p1033J55829r554r3608R2851J17676m4553j55444k653R2375O5759o2728
2479A42184p4789N1940n0450o0024J17258O6712p0965Q6655j61711K4118J0354
2468H1282q6729J50916J7695O334k7239o5682o6780J3161J67574m8606l0623m0803
2456G0500o0826r6395J10474J75346P5548o7884j60715p742o4589P5625K2311
2445G1653j9928q8828J163p3161n5746K45472l961Q076K6811R6994j44143j04915
2433d0513J33093K738j5184j51960o3869k4734P2368J03818L3297k1364M2704
$$ y = [72399, 72019, 79373, 293972, 247750, 219833, 91225, -1404, -65049, 94773, 23955, -95816, 26312, 25072, -86943, -140183, -107894, -37194, -28537, 23295, 17925, 141700, 8727, 66037, 57267, -13766, 142063, 132509, 38901, 131752, 249428, 204875, 49431, 46778, 139153, 204912, 142184, 67395, 119335, 68885, 8861, 126119, 192831, 121866, 208521, 46810, 70928, 81282, -5447, 145469, 163164, 169498, 142259, 76577, 9797, 22958, 190532, 141926, 111303, 70500, 9674, -86721, 23753, 199099, 274647, 206763, 46048, 38306, -26283, 49342, 71653, 51725, -37103, -35940, -109101, -164847, 80625, 76664, 84740, 111551, 208545, 64402, -40513, 92580, 95318, 80134, -71826, -135695, -160429, -88061, 15757, 49054, 27690, 70394]
2422G0394L708J3589o9896j23144p663O7802R7760Q3317j1520m7418q6561r6606
2410a06238L1578O5629J77183k1396j09495o5150K9037J07980j22327k46746k4689
2399b84634K66485J05137M3391L1640j50252M797J70300o589p8943N7447j12301
2388D6478P2044j0891j32165P4472j1315q5787J8835Q710q2119m8821Q9497M1041
2376b0021J54307O396J21316m640m8403p6038p2233J22344Q6672N4565K37258
2365E61523j36349j79817j45371N127K66567q0215j85512j01509n846N1742O5532
2354A15872j02300N2344K5241M7550l108p8853q7072K4147O756O6023N273N2943
2342A24816j97113L4075P9260o2838k2165J27971J02795j34447j32448J33855
$$ y = [70394, 74102, 87691, 17795, -105349, -113012, -45210, 52550, 135867, 124347, 76929, -9632, -106238, -74660, -9031, 168152, 146756, 37261, -27889, 1148, 109128, -13199, -259945, -284634, -18149, 86988, 130379, 162019, 11767, 16564, 186864, 180275, 101332, 158779, 46478, 118522, 107631, -24534, 49938, 38623, -47164, -28329, -19619, -101738, -150559, -61062, -20021, 134286, 140682, 261998, 257358, 208955, 132917, 60684, 183028, 269700, 324265, 561523, 425174, 245357, 99986, 105113, 371680, 291465, 105953, 4444, -1402, 50340, 115872, 13572, 65916, 91157, 138707, 135599, 56746, -30326, -6179, 577, 66600, 71873, 124816, -72297, -38222, 41038, -21800, -43965, 84006, 186801, 52354, -80094, 53761]
2332E3761r0933j46938J04105J41860o0826j21297M0091o2922l8670N618P2323
2321a03828k0819k253j8164K62558l297j57115J9269J09525M0470j52396O320
2310a9730J10663j5324j8636l2775k6684j25807Q1150J50787N652M3986j36876
2299A6406j00287Q8937k152k4982j12425J63407J50108k89770j57670K1603R4918
2288a51907K11179O4496R0742m7951k43103j09515m6386K07487K1954Q8975K6885
2277A12856r6850N119M0301m8290p5383p4583P7099K2930N5993J18467P3125l3828
2265A76956q0650J42609j40389j50789K5258N6826j2437o5858O4234J17137j07736
2254B5161K7584K44057q6347J2292O8260L1526j58290P1728R5531o4367p4475
$$ y = [53761, -37172, -184110, -80005, 61855, 1029, -120268, -80177, -143099, -181769, -176151, -103828, -124647, -126900, -145064, 117494, 114197, -42918, -23649, 85876, 126346, -26050, -19730, 90933, 75609, 56973, 24198, -2486, -128293, -47143, 103644, 109296, 153282, 16406, -83881, 5056, 2904, -22078, -134503, 28904, 179012, -110758, -268428, -246825, -151907, 59272, 123768, 214510, 166559, -76544, -186059, -232445, -24958, -3004, 85971, 112856, 16006, 21125, 61426, 13136, -62247, -136830, -59731, -36801, 19192, 137659, 210784, 176956, 96306, 238915, 98526, -52263, -27005, 29821, 17384, -48474, 15760, 132897, 25161, 52745, 296802, 210455, 222747, 291007, 322533, 164243, 235971, 331502, 267135, 192660]
2243A92660Q5176R7203j26561M1669m3175q5054K2650R886L4895L9028o630N8347
2231C20094J94051j08758k27298J24494l8403L7559K19169m0912M597n7172n5482
2220C71939j2915l9367P5186j41935R3362J21365N7870q7825J4724p3882J31722
2209E10244L1379k9300J09088r8849j38110J24449N1310q5573M8340Q6333M976
2198F14287R1010j03346j23572k9126J57048K2409l9469R9577l2722O6776N0506
2187G73378J46003j46053r4674j10316J11745J81685K6846J53812o4250J53738
2177A131914Q7948n4458l1252J32925J32278Q7171j3764n989j21145l4965M7242
2166A357905R50P5783J22414J21979m8754J06450Q2932l0165P5110J59620o8416
$$ y = [192660, 277836, 375039, 248478, 290147, 246972, 161918, 184568, 194454, 229349, 268377, 261747, 320094, 514145, 405387, 178089, 302583, 264180, 301739, 520908, 479996, 484593, 427421, 371939, 359024, 319657, 394843, 252908, 346270, 467635, 525505, 437680, 452404, 378522, 510244, 541623, 512323, 621411, 522562, 384452, 508901, 560211, 474638, 522978, 609311, 614287, 705297, 601951, 478379, 449253, 606301, 628710, 589241, 688818, 656096, 722872, 773378, 919381, 773328, 678654, 568338, 680083, 861768, 888614, 1042426, 978176, 1131914, 1219862, 1165404, 1134152, 1267077, 1399355, 1486526, 1472762, 1466773, 1345628, 1310663, 1357905, 1358855, 1434638, 1557052, 1679031, 1630277, 1736727, 1819659, 1789494, 1864604, 2024224, 1955808]
2155A955808P7773m0375L32995J6178L4533J23845P0806J13789J08720P3600M5751
2144B913423q3275J86113K32603J10493j6176J94053J92051J50466M2750K22857
2134D145358K07151J13031J66980R9687K07022K50260K81395L10912L39875L74542
2124F496213L62534K50065J95603M70994N06654P36618P89459P16223P83317Q11814
2114A2119494O08136P61090J257460J538611K163253K488311K999852L338327
2106B7274534L837303M656867O403163P533774P173415O135902L210683o863180
2098E9362461j2079054j0132255p832423n165995l614780k719542k165521j647149
2090A4005742j357479r82210p56545n90674o40769m87499o50360r20732o72953
$$ y = [1955808, 2033581, 1993206, 2326201, 2342379, 2376912, 2500757, 2571563, 2685352, 2794072, 2867672, 2913423, 2830148, 3016261, 3248864, 3359357, 3343181, 3537234, 3729285, 3879751, 3922501, 4145358, 4352509, 4465540, 4632520, 4732207, 4939229, 5189489, 5470884, 5781796, 6121671, 6496213, 6858747, 7108812, 7304415, 7775409, 8282063, 9018681, 9808140, 10524363, 11307680, 12119494, 12727630, 13488720, 14746180, 16284791, 18448044, 20936355, 23936207, 27274534, 31111837, 35768704, 42171867, 49705641, 56879056, 63014958, 66225641, 59362461, 47283407, 37151152, 29318729, 24152734, 20537954, 17818412, 15652891, 14005742, 12648263, 11666053, 10909508, 10318834, 9678065, 9190566, 8540206, 7619474, 6946521]
2081F946521n25283l48831l14724m47531l26171l48105j78062j88170k32501p3694
2071C963449l12081p7088k0204k14260k46384q7690P2783j68092j48010M4598
2061B807021j13285J992j71462j89337j27277j25681n3055m7902l4578k22115
2051A724321j35264Q9405k4077k01026p6579J11226q9066j39505l0078j6959j94506
2040A017892q4350J00374n4258K941l3299j57220K9610l629j84847j11147J05485
2029F27552J02555j15139P0401o6760J9453L024J43330k24912j79224J49336j8742
2018E10874k7360L2156j04950K5103J5968L5715o1008K1201R1600j36629j39504
2007B63166m8879r0465J0593L1630O6309J52338Q9548k06613l6727l6168J20217
$$ y = [6946521, 6421238, 6072407, 5757683, 5310152, 4983981, 4635876, 4457814, 4269644, 4037143, 3963449, 3651368, 3574280, 3554076, 3339816, 3093432, 3005742, 3078525, 2910433, 2762423, 2807021, 2693736, 2695728, 2524266, 2334929, 2207652, 2081971, 2028916, 1981014, 1946436, 1724321, 1589057, 1678462, 1654385, 1453359, 1376780, 1488006, 1398940, 1259435, 1229357, 1212398, 1017892, 933542, 1033916, 979658, 982599, 949300, 792080, 821690, 818061, 633214, 522067, 627552, 730107, 614968, 685369, 618609, 638062, 641086, 784416, 559504, 380280, 529616, 510874, 483514, 515670, 410720, 435823, 451791, 487506, 426498, 447699, 539299, 402670, 263166, 214287, 123822, 134415, 166045, 232354, 384692, 474240, 267627, 230900, 194732, 314949]
1996C14949J50377o1720r8246M5892J33036l7818j73245l2290J76956p5231j9701
1985C22959O8487o8501j59766Q3995l557l9123q3408P9212J623j73818P2009K0475
1973A20587j68068M0250Q2354m8187J54626J7586l8302J16792j36460o4573J58865
1962B35470j00191M8205j18523k5141p2785O4919q9117M8437K50751J75315o630
1951D10710r1312o3526j10388J01785l0546j14840J7561L9759j07283O448R010
1940F7378P10J60933J6986j05798m4179P7973j3246J65041K3377j35852J6087
1929B29410k16868L5697Q0248o2362j46840J54949J19305n8044j18597m2748r3690
1918a19540J46889l3998O3841P58k18215L8235J70106q741J3611k10929P8976
$$ y = [314949, 465326, 403606, 305360, 351252, 484288, 446470, 273225, 240935, 417891, 342660, 322959, 391446, 322945, 163179, 247174, 243617, 204494, 121086, 200298, 201921, 28103, 100112, 120587, -47481, -7231, 75123, 26936, 181562, 199148, 160846, 277638, 141178, 76605, 235470, 135279, 183484, 64961, 39820, -32965, 31954, -57163, -8726, 242025, 417340, 410710, 319398, 255872, 145484, 247269, 216723, 101883, 119444, 159203, 51920, 58368, 67378, 68088, 229021, 246007, 140209, 96030, 174003, 160757, 325798, 349175, 213323, 229410, 12542, 48239, 128487, 66125, -80715, 74234, 193539, 135495, 16898, -25850, -119540, 27349, -6649, 57192, 57950, -160265, -122030, 48076, 39335, 52946, -157983, -79007]
1907g9007Q407J6092P8853K160L2789k9471J00406l6927j04179L8055k1161K908
1895H925J8541q6744P4963q9042l7711Q2169O5554o956r5597P9878j0301k4769
1883b1090p047J07446M7703j27058p4928k6431Q9955K27841j90463J611q009n6326
1871c6796q7393K9227J92993L1429M9557l4295j52154l0779R3985J30575l6544
1860A49805o750J04079q5715j81982j02930J45908j279j40116m0964N6491J57619
1849E4166R9543j33689N8759m5324q2087J7890J29508o5940J1657J26548l1577
1838A39454o1167J64347J2040L6946n7685j3473p5642R3899r7529P9033r8796
1827A21427o0493o2468J2480O7125L5945m7589J35603l728j4201L4230k16192
$$ y = [-79007, -70600, -54508, 24345, 26505, 59294, 29823, 130229, 93302, -10877, 27178, 6017, 8925, 27466, -59278, 15685, -73357, -111068, -28899, 36655, 29699, -65898, 13980, 3679, -21090, -28137, 79309, 127012, -46, -74974, -101405, -11450, 216391, 25928, 27539, 19530, -36796, -124189, -94962, 98031, 129460, 179017, 144722, -7432, -38211, 55774, 186349, 149805, 143055, 247134, 161419, -20563, -123493, 22415, 21136, -118980, -159944, -103453, 54166, 153709, 20020, 78779, 33455, -48632, -30742, 98766, 32826, 44483, 171031, 139454, 78287, 242634, 254674, 291620, 233935, 220462, 144820, 238719, 141190, 220223, 121427, 60934, -1534, 10946, 78071, 114016, 66427, 202030, 198302, 184101, 218331, 2139]
1816B139o6829o1110l6059O0697N6666j09323M5964O4694K2449j70458J4313m7847
1804b24704Q8613K2335j26753L09103J26052k20831j40632L0988J14790o0548
1794h1587L7012j13137j41641J50605P7558M3763k4714o3288M1019N8520o3200
1783g9090p3991J9033J70064J53551j10733q4963n3298j57042m9134j09635Q3624
1772b91614K66658n1672L9395P0481K3834k5945o9716j90806K03777Q3017R3647
1761A51056j05238j41624M8166m3188L1666q6611R6052M3116m0278j0424j15564
1750a72871O5428P2483l3096Q549q8370r3728N9264J63350J7744n1341Q5904N622
1738C8938k12213L4088j9314l9776o9489P3550J23600o9966O0137n0899k3809
$$ y = [2139, -64690, -125800, -161859, -101162, -44496, -153819, -107855, -43161, -20712, -191170, -176857, -224704, -136091, -113756, -240509, 68594, 194646, -26185, -166817, -135829, -21039, -81587, -44575, -157712, -299353, -148748, -71190, -27427, -52141, -115429, -74410, -15890, -79090, -153081, -134048, 36016, 189567, 78834, -6129, -59427, -216469, -265603, -375238, -291614, -24956, -76628, -37233, 33248, 57082, 31137, -38579, -229385, -25608, 57409, 151056, 45818, -95806, -47640, -90828, -59162, -145773, -49721, -6605, -46883, -57307, -172871, -107443, -34960, -68056, -59507, -147877, -241605, -182341, -18991, -1247, -52588, 33316, 38938, -173275, -139187, -158501, -198277, -267766, -194216, -70616, -140582, -80445, -131344, -155153]
1727a55153O7641k1414J8463P2137p1320N3286M4923o3506J8102N3566P3026o3447
1715B6304n0800m6451K35120j52149o4221l0284j40701J76668J11275Q5834l1286
1704A19309p3956k65290n4675J02685R1944Q1326n257k4590k7416r7661J3586
1693a39995M5059j182j35972L4577J17055Q6641j45959k2332R3599J14657n1056
1682d908r9331J8251k4672q2444J94427j48641K4716Q5707k7533L1049R2689M0571
1670I9881n5125n1474j18739K1140m3600N673N3829L5124r9139n4950m9625J22724
1658a34281M409q861j11029P8234O7622j83874o1978Q0036R4068O5268J521L7712
1646g1153J966p0924j30544j2473R8207J47179j32381N4767M6329k8718J0295
$$ y = [-155153, -87512, -108926, -90463, -18326, -89646, -36360, 8563, -54943, -36841, 16725, 89751, 26304, -24496, -70947, 164173, 12024, -52197, -82481, -223182, -46514, 64761, 150595, 119309, 45353, -219937, -274612, -171927, -79983, 1343, -3914, -28504, -55920, -153581, -139995, -94936, -96118, -232090, -197513, -80458, 6183, -139776, -162108, -68509, 46148, -4908, -104239, -85988, -110660, -193104, 1323, -147318, -122602, -36895, -64428, -33379, 59310, 99881, 44756, -6718, -125457, -104317, -147917, -142244, -88415, -53291, -152430, -207380, -257005, -134281, -129872, -138733, -249762, -171528, -103906, -287780, -349758, -269722, -175654, -110386, -108865, -71153, -69187, -140111, -270655, -283128, -184921, -37742, -170123, -115356, -69027, -97745, -87450]
1635h7450m554n9067O3402O4503j1199J01127m7434q2134J29440r5709j43509
1624a72584k5325K291N7539r0495P3486J52669j63035J78075R3584j93029l6895
1613a23719J13192n8862P201j9810j54941Q8101K2472m1858J05707L9697k06835
1602b29655Q7513J11943k3788l3248k5431N9751R457l1087j09772M1387J09933
1591c2997j64017P3684r7224J0880L2373L1192k1875Q7319N1550r1239q576k452
1579a31382K1284J86281k12460j3085M508k064k8803L3679j49854o333K52668
1568d5561o41K6645j33535O1713L350O2219j4147L5631o8030M5758N0076P9404
1556A02882J19791j57243j97901j182n8011j17309J08497K26183J87972j20033
$$ y = [-87450, -92004, -151071, -87669, -23166, -34365, 66762, 19328, -62806, 66634, -29075, -172584, -197909, -195618, -138079, -228574, -155088, -2419, -165454, 12621, 106205, -86824, -123719, -10527, -69389, -62188, -81998, -236939, -148838, -126366, -168224, -62517, -22820, -229655, -142142, -30199, -53987, -87235, -112666, -52915, -43458, -74545, -184317, -142930, -32997, -197014, -123330, -220554, -209674, -177301, -146109, -167984, -80665, -29115, -120354, -128930, -131382, -110098, 76183, -136277, -149362, -144854, -146918, -175721, -142042, -291896, -298229, -45561, -46202, -19557, -153092, -91379, -88029, -25810, -39957, -4326, -72356, -26598, 23478, 102882, 222673, 65430, -132471, -133653, -191664, -308973, -200476, 25707, 213679, 93646]
1546I3646j6137J9175k26486j71787K1349L05419R8375j49057k27045J19566q9757
1535b22739P3722l4863K18682q0677k4902J65827l738l0494m9708q0379l7013
1524a06282J9701o5747L2591j64734Q1410J85266L108p1059j36186j02678J92584
1513a32026R3028o6178N7468j03395O9701O7649M1224K5584j40545P408r6068
1502a76150Q0250J3755J07096n2634k9383m5181l530J1517J86475j01517m4651
1491e3953M3963p2548m1295m3610K6272j4050J5890P7405N511N505J150O0388
1479A0628p5882r0979K6969J23312o6301l2924o6672M7368J21960l3310j53247
1468a89078O7134q8542k4293J32064J9911J85237k8642j9359m1414r885M5740
$$ y = [93646, 77509, 96684, -129802, -301589, -280240, 25179, 123554, -25503, -252548, -132982, -222739, -149017, -183880, 34802, -45875, -70777, 95050, 91312, 60818, 11110, -69269, -106282, -86581, -152328, -119737, -284471, -203061, -17795, -14687, -85746, -221932, -324610, -132026, -38998, -105176, -47708, -151103, -81402, -13753, 27471, 53055, -87490, -80082, -176150, -95900, -82145, 24951, -27683, -57066, -102247, -105777, -94260, 92215, -9302, -53953, -9990, -82538, -123833, -167443, -141171, -155221, -139331, -61926, -56415, -50910, -49760, 10628, -65254, -156233, -129264, -5952, -72253, -105177, -171849, -124481, -2521, -35831, -189078, -121944, -210486, -234779, -102715, -82804, 102433, 73791, 54432, 13018, 3133, 48873]
1457D8873M7657j38039o7957j17481O7889M4104j8792o0046O8494R0640l2645
1446f7303K1451r8175N7156K0025k5248N729k6029J3814J296N8778o984j20272
1434a65762J5628N0555R2118J0266m4259K11147j12181L7272j70933J8813K03721
1423A46385r4061j6223J296j03390m2852j10404j36657J54288O0242J22004N6690
1412C7318j55414r3230l3380k0443q2932m3499J21663N0360O6512K05812k35295
1401a82528l9346P0694N6418J05769K1708j05992K1151j17446p360o015P2530
1390a10417Q7888k28702J78269J41876k17005J04472N4563r0210L6272k5222m6010
1379a14226r404J29632n8641J45932o507O3218j72295p3221P5928M0653m215r0820
$$ y = [48873, 96530, -41509, -109466, -226947, -159058, -114954, -133746, -193792, -125298, -34658, -67303, -45852, -144027, -86871, -66846, -92094, -86365, -112394, -98580, -97284, -38506, -45490, -165762, -150134, -99579, -7461, 2805, -41454, 169693, 57512, 94784, -76149, -57336, 146385, 52324, 36101, 37397, -65993, -108845, -219249, -355906, -201618, -141376, -19372, 37318, -118096, -211326, -244706, -265149, -348081, -391580, -269917, -219557, -153045, 52767, -182528, -221874, -151180, -94762, 11007, 32715, -73277, -52126, -169572, -176932, -182947, -110417, -22529, -251231, -72962, 68914, -148091, -43619, 10944, -79266, -42994, -68216, -114226, -123630, 6002, -52639, 93293, 86786, 150004, -22291, -95512, -19584, 21069, 16854, -73966]
1367g3966M8826p3026q4948J19908N6451r8259j6234J16899O7942J58989j99741
1356B2841n4569J33762j99454J4091O9656o0913N3043K0633J44382p7505Q843
1345G4810r1657k6459L7424N5664p1927k2624r9253L1290r0460K3337L49163Q0388
1333B49696j19013j50486j47057P4278J41691j40266o092l6594N5222P7606l4105
1322c5120k1934P4276k4771J98279j79793m3281q2395m4990J98534m5361j66339
1311a72895Q4910k30J65247j64844q0167j9693J1039J62759o2475n3352J7229
1300a12472J30962J84308j8819J2495n6770j65809n6809Q3146o7295k16497R747
1289b73813J7995J18336K30117k7388j49400L7888Q1182Q8909p938j44385L8500
$$ y = [-73966, -25140, -98166, -183114, -63206, -6755, -105014, -121248, -4349, 63593, 222582, 22841, -31728, 102034, -97420, -83329, -13673, -74586, -21543, -910, 143472, 65967, 74810, -16847, -43306, -5882, 49782, -22145, -44769, -144022, -112732, -203192, -179855, 169308, 249696, 130683, -19803, -166860, -92582, 49109, -91157, -97249, -133843, -78621, -1015, -35120, -57054, 17222, -7549, 190730, 10937, -32344, -114739, -159729, 38805, -6556, -172895, -87985, -88215, 77032, -87812, -167979, -187672, -176633, -13874, -76349, -129701, -112472, 18490, 202798, 183979, 196474, 139704, -26105, -82914, 232, -67063, -283560, -273813, -255818, -137482, 92635, 65247, -84153, -46265, 34917, 123826, 115888, -28497, 10003]
1278A0003j05312N2978j5052j42375o6671R9929L44964j32700R857j33338p5249
1267a52966P4646M2089M3827j14675l0375r2493J0415P2866l2653O3568M9965
1256f5786q2462K413j4200R90K3195m1515o9687L02946J22574j65357l8735j30126
1244a55750K29K6035j35002r5129Q165J55840J00243m7647j20487k0224r1622
1233c75349P3594J69147r2722J27125J56852J69355k34792k2275O2796j75457
1223a41726R8607J57837L6565j35755r0631o2792q9002K17785m1619J42485j14221
1212b2467j34780O2990K37421l5708k48422O0551L2669L0329J5324j719M9300
1201D5488m706P8692j3102l0429q7126K5232J48755q6739o5830K2222j18356m0177
$$ y = [10003, -95309, -42331, -57383, -199758, -266429, -166500, 178464, 45764, 55621, -77717, -152966, -78320, -36231, 7596, -107079, -137454, -229947, -219532, -146666, -179319, -115751, -65786, -148248, -145835, -160035, -159045, -135850, -177365, -247052, 55894, 178468, 13111, -25624, -155750, -155521, -129486, -264488, -359617, -351452, -195612, -95369, -143016, -263503, -283727, -375349, -301755, -132608, -225330, -98205, 58647, 228002, -6790, -29065, 33731, -141726, -43119, 114718, 151283, 15528, -75103, -137895, -226897, -9112, -50731, 91754, -22467, -157247, -94257, 143164, 107456, -140966, -80415, -47746, -17417, -2093, -3812, 45488, 40782, 119474, 106372, 75943, -11183, 14049, 162804, 76065, 10235, 32457, -85899, -126076]
1189a26076P0321j30355O705J7724J44969K8841k01104J78761Q2360L5594K3526
1178A31266J7729j15030j16257M5883j46851J24885Q245k6240R8552j42544r2295
1167b12657K01818k2772j2652k5347O063J6631j00191L8693q5777k9133Q0787
1156a44537l6116O826k5965J18947j9083K5571r6342j6002R7113K4485N3000o0451
1144g2554l9957n3350J92428O903o2071p352N0178l4087j44589k629o7347R9197
1132a35230J0451Q620L9161M5419l1629k0483J1808Q9819J67147J6289l5030l8894
1120A27448j9417j7305j119K3557j79785p0918O1880J34494k2919n1741o6749
1109h2574J3495P0716m3823L5189p0739N0206J03916K692j80837j26323J18650
$$ y = [-126076, -55755, -186110, -179405, -161681, -16712, 12129, -188975, -10214, 72146, 107740, 131266, 148995, 33965, -82292, -36409, -183260, -58375, -50130, -76370, 22182, -120362, -212657, -10839, -33611, -46263, -71610, -65547, -48916, -149107, -110414, -196191, -225324, -144537, -180653, -173827, -199792, -80845, -99928, -74357, -170699, -186701, -89588, -65103, -12103, -72554, -112511, -165861, 26567, 33470, -28601, -35953, 14225, -19862, -164451, -167080, -234427, -135230, -124779, -116159, -76998, -31579, -63208, -83691, -71883, 17936, 185083, 201372, 166342, 127448, 108031, 90726, 89607, 113164, -66621, -137539, -75659, 58835, 35916, -15825, -82574, -69079, 1637, -42186, -6997, -77736, -27530, 76386, 79078, -101759, -228082, -109432]
1098a09432J2609n5143k2943m8281K2592K22839p1510o861J62494j16362P3936
1087F3938m3138j27070J83235P8576p7301j45133O561J03877m3486K0841p7546
1076e6646j35543K53452m3177p5375J65860j16276r3695O7140P7555N8467K5217
1065A26979p5781o7532Q7088L073k14453m7829J80398J7071m125P4777P4022j02229
1053E1459q3419J68013j30541L6413l6511l1756p4161L4899J77265k8833r396
1042G3432N9357j21165j84951j6920L9719O9676l8169Q973k7511n4701l8917j3583
1030b44760P8218P5740J45464k9371p7630j29922O1248J13660j21525L3884r6255
1019a91249J20941l770k2380o5003J92746j05167j07777K16831n6355m8644o8356
$$ y = [-109432, -96823, -151966, -174909, -223190, -200598, 22241, -49269, -56130, 106364, -9998, 63938, 20800, -106270, 76965, 155541, 78240, -66893, -60332, 43545, 59, 20900, -56646, -192189, 61263, 18086, -57289, 108571, -7705, -101400, -34260, 43295, 101762, 126979, 51198, -16334, 70754, 73827, -140626, -188455, -8057, 9014, 4889, 79666, 153688, 51459, -31960, 136053, 5512, 41925, 5414, -26342, -100503, -65604, 111661, 82828, 73432, 132789, 11624, -173327, -190247, -150528, -80852, -119021, -110048, -137559, -192260, -231177, -244760, -166542, -90802, 54662, 25291, -52339, -182261, -121013, -7353, -128878, -94994, -191249, -70308, -74078, -96458, -161461, 31285, -73882, -181659, 35172, -21183, -69827, -138183]
1008a38183n7766L0175R8083P504N9123K075J79913j9936J21477j83908r6183
997B374K3249n2248j13804r6993J84097J73166j33050N756R8913Q8976j43068
986C7368N6162m7242O044O3537r9151k41058Q1098J37950j22852O5579r3604L6669
974a19500P0948J09854P3065j6128k21248P5730r6965P7215j2842j2849R1017
963A8297j28719K15027J2446k03130Q5819N6275N3410L4457l5879m1643Q0427
952A46787K2098j39200j22663J05385j02858Q6077J11210n6734L1083j46453j1447
941g6715m562Q6280K1461j7865K0076J6530j70454L602l9512J30777n045j0530
929d5957q873r6323J39784K703K5559Q4318R9971j16292n1628m8265q853J84121
$$ y = [-138183, -195949, -165774, -67691, -60187, -1064, 1011, 180924, 160988, 282465, 98557, 2374, 25623, -26625, -140429, -237422, -53325, 119841, -13209, -7453, 91460, 180436, 37368, 93530, 46288, 52332, 115869, 16718, -224340, -143242, -5292, -128144, -62565, -156169, -119500, -48552, 61302, 134367, 118239, -103009, -27279, -124244, -47029, -59871, -72720, 18297, -110422, 104605, 117051, -86079, -260, 56015, 109425, 143882, 108003, 66360, 146787, 168885, 29685, -92978, 12407, -90451, -4374, 106836, 50102, 81185, -65268, -76715, -81277, 5003, 26464, 8599, 28675, 45205, -125249, -121647, -161159, -30382, -35427, -45957, -54830, -151153, -11369, -8666, 16893, 101211, 201182, 84890, 33262, -15003, -23856, 160265]
917A60265K0207P0916q0573l8360p088j13570Q2284k9492M1979o1145J15962q8058
905G3327j14763o2966R5899K75684j15685j54510J39327Q7097j03091o9677L5855
894H6497K9874K01745k6947q7008j687l06759Q9243J65045o2216j00506K9557
883A6838J18307j24079m9667j95146j4162K06569P8394L0394P067R252j44924
872f1157k9340J10375L2306N4828r2353J0378j8814l5197Q317l3546n3840M5769
860f2274J07468J40914j2533j03408K0894r801j14159l313J65588k4864l6753
849F7759K3088L1672M2511J10299o8591k53124J00556O2453j47939J29271L8026
838A35981p308k2177J681o905m3423j76116Q2772L8327o5101k3339o1606M7844
$$ y = [160265, 180472, 251388, 170815, 132455, 125367, 11797, 94081, 64589, 106568, 45423, 161385, 73327, -41436, -104402, -8503, 267181, 151496, -3014, 136313, 223410, 120319, 50642, 86497, 116371, 318116, 291169, 204161, 202474, -104285, -15042, 150003, 87787, -12719, 16838, 135145, 11066, -38601, -233747, -247909, -41340, 37054, 67448, 74515, 83767, -61157, -90497, 19878, 52184, 107012, 14659, 25037, 6223, -28974, -20657, -54203, -108043, -62274, 45194, 186108, 173575, 70167, 91061, 81260, -32899, -36212, 129376, 104512, 67759, 90847, 122519, 165030, 275329, 206738, -46386, 54170, 116623, -31316, 97955, 135981, 128673, 106496, 108177, 101272, 57849, -118267, -35495, 2832, -62269, -85608, -147214, -99370]
826i9370o3560R8933k4125J54109r0855N635N2016L8597P9758j48548j01438L7740
814f1108j3430J16712j5835j24460m8214P4905J6833q5366N6932j72558J614K3618
802b30357J30225P1733N8003j8819N2416L8592m0851O3690r9922q8953P5820N6147
790F7724r6898N2817J27138j4075k0849l0327r205q0974N3937M7164M497p4903
778B6046M588p7245J3410N1039k8817o1085J91081j5470r4197j6675j36130j77514
766c20969J37554m6493J38484J14656R8388p4513o2433N879J697R2818j4093m4153
754B6822j27100k325N9298J60248p8061r9216J10016J3398R2378l7059j45940
743b7541J6497q3917j618J05400m1495J0004J4937K9036n1910L5729R4941Q7714
$$ y = [-99370, -162930, -63997, -88122, 65987, -24868, -19233, 32783, 71380, 151138, 2590, -98848, -61108, -74538, 42174, 26339, -98121, -146335, -71430, -54597, -139963, -83031, -255589, -253975, -230357, -100132, -28399, 29604, 10785, 63201, 101793, 60942, 124632, 24710, -64243, 11577, 67724, -29174, 23643, 150781, 136706, 115857, 85530, 76325, -4649, 49288, 96452, 100949, 26046, 30634, -46611, -33201, 17838, -10979, -72064, 119017, 103547, 9350, -7325, -143455, -320969, -183415, -229908, -91424, 23232, 121620, 47107, -15326, -9447, -7750, 85068, 70975, 26822, -100278, -102603, -43305, 116943, 38882, -60334, 49682, 63080, 155458, 118399, -27541, -11044, -94961, -96579, 8821, -32674, -22670, -7733, 21303, -30607, 5122, 100063, 187777]
731A87777j13755o3934L2419j60744P6275J58824P2044k15777n4280Q7693P4014
720H0556j21125J4279Q7488k7066q5218j1237k4582N5359J6797o8530M2996J53387
708A13104j3272O9773j20909k5632J18236J66463j73455R0745j18777K4985K8659
697A59920p2747J5674q614J06171j48043o1789K40263j14510k60844O8659M0241
686c5619J42592K6326L2127q7291p8836M5363q3258J07984o0619n2298M3683p0330
674g0176j09707J51282O6997p2859k65757J02236J20947L270K7769j2534K4955
663c3577Q2963J6649o9538J3056J22315O8880j58920N8924l2247J2946j09751
652b8300O2244l3319k8060J29547j94607k3020J39205k428J49578j28644m6806
$$ y = [187777, 74022, 10088, 42507, -118237, -41962, 116862, 188906, -26871, -81151, 6542, 80556, -40569, -26290, 61198, 34132, -51086, -62323, -86905, -31546, -14749, -83279, -40283, 113104, 99832, 169605, 48696, 23064, 141300, 307763, 134308, 225053, 106276, 131261, 159920, 87173, 102847, 94233, 200404, 52361, -9428, 230835, 116325, -144519, -75860, -35619, 106973, 133299, 165426, 78135, -701, 44662, -38596, 69388, 8769, -43529, 154, -70176, -179883, -28601, 38396, -34463, -300220, -197984, -77037, -73767, -45998, -58532, -33577, 49386, 66035, -3503, 9553, 131868, 200748, 41828, 100752, 68505, 81451, -28300, 33944, 625, -27435, 102112, -92495, -115515, 23690, 21262, 170840, 42196, -4610]
641d610Q8442N9143O433L8852N6788J01084j13006j44949L0656R1882p6216p9728
629E4771j39284J84403k1019l6671J19588p4735o1173J34126L4504j85720m8928
618d0138J60460K3927n9643Q545r2559j08358K09070P4335p4441j0519k15396
607a24717r7412Q1399J31021R4366k4274R504K27399R504j02421r8242n5185M2178
595I3120j7837j7787o206n091Q8159R022j78494O1422l9926L9474R3262J08311
583B27429o4632j60573p915j01366n0995L1420L6999J68397J59359q3264j09825
572D5034N6351Q8967j42238M1239j00892N6791Q3165J0103j13563q5930N3261
561g712J65330j9733j96792j0472M6923m4054p3553J04684Q26J36320o6533M3009
$$ y = [-4610, 83832, 142975, 149408, 188260, 245048, 346132, 233126, 88177, 118833, 210715, 134499, 54771, -84513, 99890, 78871, 42200, 161788, 87053, 25880, 160006, 194510, 8790, -40138, 120322, 144249, 84606, 93151, 592, -107766, 101304, 175639, 101198, 90679, -124717, -222129, -140730, -9709, 84657, 60383, 69887, 297286, 306790, 204369, 106127, 50942, 93120, 75283, 57496, 51290, 46199, 134358, 143380, -35114, 26308, -13618, 25856, 119118, 227429, 162797, 2224, -5691, -107057, -158052, -126632, -89633, 78764, 238123, 154859, 45034, 101385, 190352, 48114, 89353, -11539, 45252, 128417, 138520, 24957, -60973, -7712, 157618, 137885, -58907, -69379, -22456, -66510, -140063, -35379, -34553, 101767, 35234, 78243]
549G8243K9878j38959k8551M0614K14280q4075Q2356p3572j17125Q9450m712P3875
537A61702q9853j5888k9738M2751J712q5528R0189j2218j2628n5825N0754O727
525E2157l1635N559j09527J99601N4856j59082m979m3190J7577J2461O0190L9910
513I3898J12297k30323l14P7087O825L5294k09788o1208J51909J8433O5268P2821
501A32199p4497J24o320K17625r7274j16791j9649M8767k1715J24340o7834O3286
489A82261J0429j94929O3362k2458L4869j04316p6980J28291J617K2095l0156
478A4085J9013J36354j6349p5582r7731J62028k4572j51789R6244K8207O2278
467A52186M4538l7905L1075j77169M0804p8187J17025n3074N5591K7340P813l7796
$$ y = [78243, 108121, -30838, -59389, -18775, 195505, 111430, 193786, 120214, 3089, 92539, 87827, 161702, 71849, 55961, 26223, 68974, 70686, -14842, 75347, 63129, 50501, -5324, 45430, 52157, 20522, 26081, -83446, 116155, 171011, 11929, 6950, -36240, -18663, -6202, 53988, 93898, 206195, -24128, -24442, 52645, 59470, 94764, -115024, -176232, -24323, -5890, 59378, 132199, 57702, 57826, 51506, 269131, 171857, 55066, 35417, 84184, 62469, 186809, 118975, 182261, 192690, -2239, 61123, 38665, 73534, -30782, -107762, 20529, 22146, 44241, 14085, 33098, 169452, 153103, 77521, -20210, 141818, 117246, -34543, 61701, 89908, 152186, 196724, 158819, 189894, 12725, 53529, -24658, 92367, 39293, 94884, 122224, 130037, 92241]
455I2241k10320J78842Q4556r0289L5514P652j5129m6130k8633J85119o6837J27009
443B53595K6320j28861j65550Q787J63145j17816j47763J21891K8728Q849Q5919
432A37244j55371M6667J40832m7619j49714n6265j4019J61459K26932j8144n0664
421B21338l5545Q485k9631n2680l6657j02785P7636O1915p6940P3539p939j57550
409e6814k8809j9228L34766J608k32784n4931R8568M8552j21423l0678M6039Q0302
397F5168J8844R8960r5861J31298l6209p2935p9262L5130R609J45544p5278p7460
385F7548j908L4559J01610n9594j12176l3791N974O9770k1484J1921k5538J01367
373A38258l2427m2611o5599q8316J01686N580k3329M0157R8459j11596N0544j23777
$$ y = [92241, -118079, 60763, 145319, 55030, 90544, 98196, 83067, 36937, 8304, 193423, 126586, 253595, 279915, 151054, -14496, -5709, 157436, 39620, -108143, 13748, 42476, 51325, 137244, -18127, 28540, 169372, 121753, -27961, -84226, -98245, 63214, 290146, 272002, 221338, 185793, 194278, 164647, 111967, 75310, -27475, 50161, 112076, 35136, 108675, 100736, -56814, -85623, -104851, 229915, 231523, -1261, -56192, 42376, 90928, -30495, -61173, -15134, 65168, 84012, 182972, 87111, 218409, 182200, 109265, 30003, 65133, 74742, 220286, 145008, 67548, 65640, 100199, 201809, 142215, 30039, -3752, 2222, 71992, 50508, 62429, 36891, 138258, 105831, 63220, -2379, -90695, 10991, 16571, -6758, 33399, 131858, 20262, 70806, -52971]
361e2971R5849J18081j6211M4312l7288K1007q0550l1947m4117J03976M7860j38986
349B9015J27874n128r5207R6978J204j07466J99550l7056K4812J25800k26186
338A34190j2264L4808k8932R645j51179j62005J03903J92125k7916k5583j2971
327E3821k123j18185P7429K19230l5663j14334k1949n2228k4853J2654q3774N3021
315c6954P3154J14400o7617N3167l8646m6461m596R2717L6900k12091Q4718N8416
303A07107K3125m4505J45198k09580n0550r543J48132j6949M2032J16734k19396
292C1805m0259J42103L4743o8776k00826J4036l1273J6204J13098o1622L3438
281a7329K6322J6563j9265M4856J02768j3477k6943o5843R13K58632k2315j2904
$$ y = [-52971, 42878, 160959, 144748, 189060, 151772, 172779, 92229, 60282, 16165, 120141, 168001, 29015, 156889, 151761, 56554, 153532, 154736, 47270, 246820, 209764, 234576, 360376, 134190, 121926, 156734, 127802, 137447, -13732, -175737, -71834, 120291, 92375, 66792, 53821, 51698, -66487, 10942, 230172, 194509, 80175, 58226, 5998, -18855, -6201, -89975, -36954, 36200, 150600, 82983, 136150, 97504, 51043, 46447, 139164, 176064, -36027, 48691, 107107, 130232, 85727, 230925, 21345, -29205, -38748, 109384, 92435, 134467, 251201, 31805, -8454, 133649, 168392, 99616, -101210, -87174, -118447, -102243, 10855, -50767, -17329, 8993, 25556, 6291, 51147, 153915, 140438, 113495, 47652, 48565, 307197, 284882, 271978]
269B71978o1707K2941o9364n7989l482m2578j00996K3444O3706M3930J8271R621
257A17775Q4161K2017j46808p6379O9713l4147L8320K46709L0863n1581j59283
246A41360m9677N0391p0054Q2685m0802j16746j27992q5253J73513J956p5890
235a16509J67498Q1171p6788k1605J8337p4940K8496N3015P0459K7208p5338J00915
223A81919j18082P331l5348P9697N1424K1491k5955Q4932J19753j03686M9923
212C13399j70018m5327K0167J23416j07982o0378j025q2505Q5356j9549K622k0084
200C8092k5845M9358K328M1308J92789n9602k07944p1819M451Q4365R1150Q6315
188B24946l6313j51119O6615O2818n7228O8587J0688N1720j35983N1713j5233
$$ y = [271978, 210271, 233212, 163848, 105859, 102377, 59799, -41197, -17753, 45953, 89883, 108154, 117775, 201936, 223953, 77145, 766, 70479, 36332, 74652, 321361, 352224, 300643, 141360, 91683, 142074, 72020, 154705, 113903, -2843, -130835, -216088, -42575, -40619, -116509, 50989, 132160, 55372, 33767, 52104, -22836, 5660, 58675, 129134, 156342, 81004, 181919, 63837, 71168, 35820, 115517, 166941, 188432, 162477, 247409, 367162, 263476, 313399, 143381, 98054, 118221, 241637, 133655, 73277, 72252, -10253, 75103, 55554, 58176, 38092, 12247, 61605, 63933, 105241, 298030, 238428, 30484, -41335, -36884, 47481, 138631, 224946, 188633, 37514, 104129, 166947, 109719, 178306, 188994, 240714, 104731, 156444, 141211]
177A41211r3532O2889j7732k2634N8310K2110O068J33895j20767m2365k6428L9311
165A40336N402K8065r5636j68844J78284J12495j06522o6318N9803K09790j1974
154B84881k44078J4647M5632O4277k2139j52915P4883Q9178o2091Q3264Q6615
143B62154j14177j42809L8517L8943L5146N0694n9622l6001l1560M0390l1166
132E0509J8381P1467K2840o3380o7726m9241l483P5165K4885k8459j6328j9498
120A5132J79485j33594n0280J44115j44074J63433q6047Q1503O0440j36968q3708
109I437O0912K1337O103j7266L4555O6605K2985j03580p0648k8886O9021K8919
97I9494P3575N902p5330p7089J51617J9484m4406j3242p4446J19645p8947j926
$$ y = [141211, 47679, 110568, 92836, 70202, 128512, 150622, 156690, 290585, 169818, 127453, 101025, 140336, 145738, 173803, 78167, -90677, 87607, 200102, 93580, 27262, 87065, 296855, 284881, 40803, 55450, 101082, 165359, 143220, -9695, 65188, 154366, 92275, 175539, 262154, 147977, 5168, 43685, 82628, 117774, 168468, 108846, 72845, 41285, 81675, 50509, 68890, 140357, 163197, 99817, 32091, -17150, -20633, 54532, 79417, 50958, 34630, 15132, 194617, 61023, 10743, 154858, 10784, 174217, 88170, 169673, 230113, 93145, 9437, 70349, 91686, 97789, 80523, 115078, 181683, 204668, 101088, 30440, 1554, 70575, 99494, 173069, 178971, 103641, 26552, 178169, 197653, 153247, 140005, 65559, 185204, 106257, 104331]
85A04331m9144n1378J61832p2023p2485N378N6541J06216J2946j08957k0971O1288
73A33574J07702o8525m9756M766P714M6234j4156R2649o1710j9434j2680m5480
61A20898J13924J7766k20297L0059M8207M2387r9368J57292p852o7580l9042O4790
49A61184L8963j59487R360P4020N4693L8219j27780R5434o5181p496l9893q9775
$$ y = [104331, 55187, 3809, 165641, 93618, 21133, 26511, 83052, 189268, 202214, 93257, 72286, 133574, 241276, 172751, 122995, 127761, 135475, 181709, 167553, 260202, 198492, 179058, 166378, 120898, 234822, 252588, 32291, 62350, 110557, 152944, 53576, 210868, 203016, 135436, 96394, 161184, 200147, 40660, 50020, 124040, 178733, 216952, 89172, 184606, 119425, 111929, 72036, -17739]
$$ [...]
##END NTUPLES=NMR SPECTRUM
##END=
