##TITLE=1H_76-2024
 CDCl3
 8 sc, 
 11.9.2024
##JCAMPDX= 6.0         $$ Bruker NMR JCAMP-DX V2.0
##DATA TYPE= NMR FID
##DATA CLASS= NTUPLES
##ORIGIN= UXNMR, Bruker Analytische Messtechnik GmbH
##OWNER= root
$$ XWIN-NMR		Version 3.5
$$ Wed Sep 11 13:58:17 2024 Russian Standard Time (UT+4h)  she@DPX200
##.OBSERVE FREQUENCY= 200.1318
##.OBSERVE NUCLEUS= ^1H
##.DELAY= (6, 6)
##.ACQUISITION MODE= SIMULTANEOUS
##.ACQUISITION SCHEME= undefined
##.AVERAGES= 8
##.DIGITISER RES= 18
##SPECTROMETER/DATA SYSTEM= spect
##.PULSE SEQUENCE= zg30
##.SOLVENT NAME= CDCl3
##.SHIFT REFERENCE= (INTERNAL, CDCl3, 0, 15.7039)
##AUDIT TRAIL= $$ (NUMBER, WHEN, WHO, WHERE, WHAT)
$$ ##TITLE= Audit trail, XWIN-NMR		Version 3.5
$$ ##JCAMPDX= 5.01
$$ ##ORIGIN= Bruker BioSpin GmbH
$$ ##OWNER= she
$$ F:/spectra/data/she/nmr/H-F/1/audita.txt
$$ ##AUDIT TRAIL=  $$ (NUMBER, WHEN, WHO, WHERE, WHAT)
(   1,<2024-09-11 13:57:11.76 +0400>,<she>,<DPX200>,
      <created by zg, POWCHK disabled, PULCHK disabled
       configuration hash MD5:
       00 E9 B6 7A A2 85 ED C7 34 08 36 98 17 FE 4E 26
       data hash MD5: 16K
       8A 57 A5 15 98 72 4B DC 51 CD 42 D5 BF 13 E2 2C>)
$$ ##END=
$$ 
$$ hash MD5
$$ 51 0B 77 63 0D CE D5 A8 18 CB FD 7D 02 7A 9C 9E
##$RELAX= 
##$RELAX= 
##$RELAX= 
##$RELAX= 
##$RELAX= 
##$RELAX= 
$$ Bruker specific parameters
$$ --------------------------
##$DU= <F:/spectra>
##$EXPNO= 1
##$NAME= <H-F>
##$PROCNO= 1
##$TYPE= <nmr>
##$USER= <she>
##$AMP= (0..31)
100 100 100 100 100 100 100 100 100 100 100 100 100 100 100 100 100 100 
100 100 100 100 100 100 100 100 100 100 100 100 100 100 
##$AQSEQ= 0
##$AQ_mod= 1
##$AUNM= <au_zg>
##$AUTOPOS= <>
##$BF1= 200.13
##$BF2= 200.13
##$BF3= 200.13
##$BF4= 200.13
##$BF5= 200.13
##$BF6= 200.13
##$BF7= 200.13
##$BF8= 200.13
##$BYTORDA= 1
##$CFDGTYP= 0
##$CFRGTYP= 5
##$CHEMSTR= <none>
##$CNST= (0..31)
1 1 145 1 1 1 1 1 1 1 1 1 1 1 1 1 1 1 1 1 1 1 1 1 1 1 1 1 1 1 1 1 
##$CPDPRG= <>
##$CPDPRG1= <>
##$CPDPRG2= <>
##$CPDPRG3= <>
##$CPDPRG4= <mlev>
##$CPDPRG5= <mlev>
##$CPDPRG6= <mlev>
##$CPDPRG7= <mlev>
##$CPDPRG8= <mlev>
##$CPDPRGB= <>
##$CPDPRGT= <>
##$D= (0..31)
0 1.2 0 0 0 0 0 0 0 0.06 0 0.03 0 0 0 0 0.0002 0 0 0 0 0 0 0 0 0 0 0 0 
0 0 0 
##$DATE= 1726048631
##$DBL= (0..7)
120 120 120 120 120 120 120 120 
##$DBP= (0..7)
150 150 150 150 150 150 150 150 
##$DBP07= 0
##$DBPNAM0= <>
##$DBPNAM1= <>
##$DBPNAM2= <>
##$DBPNAM3= <>
##$DBPNAM4= <>
##$DBPNAM5= <>
##$DBPNAM6= <>
##$DBPNAM7= <>
##$DBPOAL= (0..7)
0.5 0.5 0.5 0.5 0.5 0.5 0.5 0.5 
##$DBPOFFS= (0..7)
0 0 0 0 0 0 0 0 
##$DE= 6
##$DECBNUC= <off>
##$DECIM= 24
##$DECNUC= <off>
##$DECSTAT= 4
##$DIGMOD= 1
##$DIGTYP= 9
##$DL= (0..7)
0 120 120 120 120 120 120 120 
##$DP= (0..7)
150 150 150 150 150 150 150 150 
##$DP07= 0
##$DPNAME0= <>
##$DPNAME1= <>
##$DPNAME2= <>
##$DPNAME3= <>
##$DPNAME4= <>
##$DPNAME5= <>
##$DPNAME6= <>
##$DPNAME7= <>
##$DPOAL= (0..7)
0.5 0.5 0.5 0.5 0.5 0.5 0.5 0.5 
##$DPOFFS= (0..7)
0 0 0 0 0 0 0 0 
##$DQDMODE= 0
##$DR= 18
##$DS= 0
##$DSLIST= <SSSSSSSSSSSSSSS>
$$ [...]
##$SUBNAM2= <"">
##$SUBNAM3= <"">
##$SUBNAM4= <"">
##$SUBNAM5= <"">
##$SUBNAM6= <"">
##$SUBNAM7= <"">
##$SUBNAM8= <"">
##$SUBNAM9= <"">
##$SW= 24.0689170037331
##$SWIBOX= (0..15)
0 0 2 0 0 0 0 0 0 0 0 0 0 0 0 0 
##$SW_h= 4816.95568400771
##$TD= 16384
##$TD0= 1
##$TE= 0
##$TE2= 300
##$TE3= 300
##$TEG= 300
##$TL= (0..7)
0 120 120 120 120 120 120 120 
##$TP= (0..7)
150 150 150 150 150 150 150 150 
##$TP07= 0
##$TPNAME0= <>
##$TPNAME1= <>
##$TPNAME2= <>
##$TPNAME3= <>
##$TPNAME4= <>
##$TPNAME5= <>
##$TPNAME6= <>
##$TPNAME7= <>
##$TPOAL= (0..7)
0.5 0.5 0.5 0.5 0.5 0.5 0.5 0.5 
##$TPOFFS= (0..7)
0 0 0 0 0 0 0 0 
##$TUNHIN= 0
##$TUNHOUT= 0
##$TUNXOUT= 0
##$USERA1= <user>
##$USERA2= <user>
##$USERA3= <user>
##$USERA4= <user>
##$USERA5= <user>
##$V9= 5
##$VALIST= <valist>
##$VCLIST= <CCCCCCCCCCCCCCC>
##$VD= 0
##$VDLIST= <DDDDDDDDDDDDDDD>
##$VPLIST= <PPPPPPPPPPPPPPP>
##$VTLIST= <TTTTTTTTTTTTTTT>
##$WBST= 1024
##$WBSW= 4
##$XGAIN= (0..3)
0 0 0 0 
##$XL= 0
##$YL= 0
##$YMAX_a= 842782
##$YMIN_a= -911634
##$ZGOPTNS= <>
##$ZL1= 120
##$ZL2= 120
##$ZL3= 120
##$ZL4= 120
##$ABSF1= 10
##$ABSF2= 0
##$ABSG= 5
##$ABSL= 3
##$ALPHA= 0
##$AQORDER= 0
##$ASSFAC= 0
##$ASSFACI= 0
##$ASSFACX= 0
##$ASSWID= 0
##$AUNMP= <proc_1d>
##$AZFE= 0.1
##$AZFW= 0.1
##$BCFW= 1
##$BC_mod= 2
##$BYTORDP= 1
##$COROFFS= 0
##$CY= 11.3945322036743
##$DATMOD= 1
##$DC= 2
##$DFILT= <>
##$DTYPP= 0
##$F1P= 15.6554695791079
##$F2P= 12.8336369535428
##$FCOR= 0.5
##$FTSIZE= 0
##$FT_mod= 4
##$GAMMA= 1
##$GB= 0.15
##$INTBC= 1
##$INTSCL= 1
##$ISEN= 128
##$LB= 0.24
##$LEV0= 0
##$LPBIN= 0
##$MAXI= 10000
##$MC2= 0
##$MEAN= 0
##$ME_mod= 0
##$MI= 1.114404
##$NCOEF= 0
##$NC_proc= 0
##$NLEV= 6
##$NOISF1= 3.799351
##$NOISF2= 2.8
##$NSP= 1
##$NTH_PI= 0
##$NZP= 0
##$OFFSET= 15.70392
##$PC= 1
##$PHC0= -25996.69
##$PHC1= 14.78748
##$PH_mod= 1
##$PKNL= yes
##$PPARMOD= 0
##$PSCAL= 0
##$PSIGN= 0
##$REVERSE= no
##$SF= 200.130013532006
##$SI= 16384
##$SIGF1= 3
##$SIGF2= 2
##$SINO= 400
##$SIOLD= 16384
##$SREGLST= <1H.CDCl3>
##$SSB= 0
##$STSI= 0
##$STSR= 0
##$SW_p= 3612.71676300578
##$SYMM= 0
##$S_DEV= 0
##$TDeff= 0
##$TDoff= 0
##$TI= <>
##$TILT= no
##$TM1= 0
##$TM2= 0
##$TOPLEV= 0
##$USERP1= <user>
##$USERP2= <user>
##$USERP3= <user>
##$USERP4= <user>
##$USERP5= <user>
##$WDW= 1
##$XDIM= 8192
##$YMAX_p= 0
##$YMIN_p= 0
$$ End of Bruker specific parameters
$$ ---------------------------------
##NTUPLES= NMR FID
##VAR_NAME=  TIME,          FID/REAL,        FID/IMAG
##SYMBOL=    X,             R,               I
##VAR_TYPE=  INDEPENDENT,   DEPENDENT,       DEPENDENT
##VAR_FORM=  AFFN,          ASDF,            ASDF
##VAR_DIM=   8192,          8192,            8192
##UNITS=     SECONDS,       ARBITRARY UNITS, ARBITRARY UNITS
##FACTOR=    0.0002076,     1,               1
##FIRST=     0,             0,               0
##LAST=      1.7004516,     0,               0
##MIN=       0,             -911634,         0
##MAX=       1.7004516,     842782,          0
$$ Real data points
##PAGE= N=1
##DATA TABLE= (X++(R..R)), XYDATA
0@%%%%%Qj9J9k0K8m0O4q8R9j12J39j75K15k58L04l54M18m96N78o67P67q80J008
28E38j151J307j478J670j882K113k365K643k951L287l655M057m497M982n520O112
44C210o763P485q287R190j0213J1373j2700J4237j6046J8214k0855K4142k8339
57a5352L3842m1179N0166o2310Q77615j055693m53856J370857r46801k57297J283762
68G83754q38496o59473J320555l67944p60942Q31860j99679o19821Q44644j02976
78B31482p71111N75737K64056m80080K21137N8949k48929K26563J14938k22960
88c0218j38620J22530K42946k36290j69388L12395j50160o7362M31718l87249
98f9698k75528O98001j83619n12484N31200j23919m39972O94791j49743p52237
$$ y = [0, 0, 0, 0, 0, 0, 8, -11, 8, -12, 16, -24, 40, -48, 51, -61, 78, -97, 118, -140, 164, -190, 228, -268, 310, -357, 410, -470, 538, -613, 694, -784, 886, -996, 1117, -1248, 1395, -1556, 1731, -1924, 2133, -2364, 2618, -2902, 3210, -3553, 3932, -4355, 4835, -5378, 5995, -6705, 7532, -8514, 9700, -11155, 12987, -15352, 18490, -22689, 27477, -34833, 842782, -212911, -666767, 704090, -242711, -500008, 783754, -54742, -714215, 606340, 238396, -522546, 309314, 109635, -510186, 334458, 231482, -539629, 36108, 300164, -179916, 41221, 100170, -148759, 77804, 192742, -30218, -168838, -46308, 196638, -39652, -209040, 103355, -46805, -114167, 317551, -69698, -345226, 352775, 169156, -343328, 187872, 63953, -376019, 318772, 169029, -583208]
108e83208P64961J78872p86568N87582J08059p75410P63623J84480j020479N96850
118A8762L98133q29194M70745K68107q36534N44592M82206q78084K19060N35124
128C92917o19096J82239M20364p04328J36670O17399n61350r6241M55281l41592
138a17737M6161L52457m04127m6535L59084j42093r9439M3565o0212R3197K6388
149E0709p1306q933n9011J35034J23069k70883o305K59983j72945l4442K06217
160A51187l01173l830M47405l34246k21707M74043k16940j64589M63188l60808
170f7470k30582O14344k53253l54144M71161j81749k26224M91376k37599l48936
180c23076N14129m1958l63896L40365o9260k93187M28194o1567m33030L69269
$$ y = [-583208, 181753, 360625, -425943, 161639, 269698, -505712, 257911, 442391, -578088, 18762, 416895, -412299, 58446, 326553, -509981, 34611, 516817, -361267, -142207, 392917, -226179, -43940, 376424, -327904, -191234, 426165, -135185, -231426, 223855, -117737, -71576, 280881, -123246, -169781, 189303, 47210, -52229, -8664, -68876, 24321, 50709, -20597, -29530, -88541, 46493, 169562, -101321, -107626, 152357, -20588, -55030, 151187, -149986, -153816, 293589, -40657, -262364, 211679, -5261, -169850, 293338, -67470, -298052, 316292, 63039, -291105, 180056, -1693, -227917, 263459, 25860, -323076, 191053, 149095, -214801, 125564, 56304, -236883, 191311, 129744, -303286, 65983]
190F5983P7051l23076K82459l6813k94215L65472K5344l45158K01952N9882j73697
201i4816J67752l3866j97065J72961R1492j49667J3826M1769k5967O9883j5368
212D0934r7006L4184L8159J5278j5296j12639P7177J06751j33819N1084M8469
223E3276j66983J80548Q1714l07487J35563J58960k50770J21596J03993k90776
233a80366J66762K17045l17763L0456K46127k30067K2861K27018k98063j5121
243a31111L37906k46768j13851K86856j80047n0900K79287k18832j06608K90779
253A46711j07944j34402J62098p8526p4262J69831o0702j41912J33391N0971j00490
264c5236M9750R462p0207Q5033K0097j03010J2174M2041J899j4939l2062K9317
$$ y = [65983, 143034, -180042, 102417, 65604, -228611, 136861, 162205, -182953, 18999, 78881, -94816, 72936, 39070, -157995, 14966, 106458, -43209, -29383, 12386, -13581, 56302, 40934, -56072, -21888, 16271, 31549, 16253, -96386, -19209, 87542, -46277, 4807, 53276, -113707, 66841, 148555, -158932, -23369, 135591, -115179, 6417, 110410, -180366, -13604, 203441, -114322, -83866, 162261, -67806, -44945, 182073, -115990, -131111, 206795, -39973, -153824, 133032, -47015, -97915, 181372, -37460, -144068, 146711, 38767, -95635, 66463, -12063, -86325, 83506, 22804, -119108, 14283, 65254, -35236, 14514, 23976, -46231, 38802, 58899, -44111, -31937, 10104, 12003, -2936, -34998, -5681]
276e681N344J458N6039q1255k7635J36021o6466p7150J01626o3332l8010J33825
288G4784q1403r6852J54408J632j16729J03820K064j23921J39726K3333k00177
299a19315J17331Q4685j73094R6315N7763j70602J24355R1435j80501N2427R8642
310G9441j14085K6188O8079j15952P760J19136q2737n5581J06742l2618l8364
321c1991R2197n8163n5543J03276k1292o8670M0055r86j8540K5708P13k9262M134
334a8364N5622j5125n2696M7849L912m4844M7423j7369o0132O1894K2569o4386
346c3647J9438M1403l8302R705M8981o5784j4918R1614o1301m9637R0081n2012
358a4379l2598J00598o2158m6743J05058k8908n5206O4981j7397m9194N9157J032
$$ y = [-5681, -337, 1121, 57160, -24095, -51730, 84291, 17825, -59325, 42301, -21031, -59041, 74784, -6619, -103471, 50937, 52569, -64160, 39660, 41724, -82197, 57529, 80862, -119315, -1984, 82701, -90393, 5922, 63685, -106917, 17438, 108873, -71628, -19201, 79441, -34644, -8456, 59623, -56329, -48569, 70567, -12170, -67751, 38991, 6373, -31991, 60206, 2043, -53500, 49776, 28484, -40186, -131, -1117, -19657, 6051, 6764, -22498, -18364, 37258, 22133, -30563, 17286, 21198, -23646, 23777, 6408, -53724, 8170, 30739, -33647, -14209, 27194, -11108, -1403, 47578, -18206, -33124, 58490, -2811, -52448, 37633, -14379, -46977, 53621, -8537, -55280, 49778, 20870, -34336, 30645, 13248, -35946, 23211, 24243]
370B4243p6975M4444M5420p2136K6636M6051p2391L7198N3261q4081J3956N2385
382C8011n4337K643K9239l6058O19L7603j1942k9581L0960J9453l9334J9996J5957
395B3229m9443K7510K4419n4351J3424L0750k7641L725K3566j4586j1947L2884
407B1539j972m5106L3309J4572n6083L7067J5705o2188M8665K4282o1386L5871
419D275K6611m8024K0428K4902m4660J087M0225l5039k0610N1954k4565k6325
431b9741O2202k8067l3483O5136k6449l5752N0552k3700k6154L7744j2825k1839
443b2376K3486Q827j7676N710K0801k0238l625K6466k6234r811K8182k1058q759
456a6305K1289q723l870J0588O946r738l889K4472k0476j6911L8776k9400j9906
$$ y = [24243, -52732, -8288, 37132, -35004, -8368, 37683, -34708, 2490, 55751, -28330, -14374, 38011, -16326, -13683, 15556, -20502, -19883, 17720, 5778, -23803, 7157, 26610, -12724, 7272, 23229, -26214, 1296, 25715, -28636, -15212, 15538, -12103, -8378, 15188, 602, -11345, 21539, 19567, -25539, 7770, 22342, -33741, 3326, 19031, -43157, 5508, 29790, -31596, 4275, 30886, -17138, 3290, 28192, -16468, -15381, 24844, -10195, -30805, 21149, -3416, -29741, 32461, 4394, -29089, 36047, 9598, -26154, 24398, 698, -25456, 12288, -537, -22376, 1110, 9937, -7739, -2029, 18772, -1466, -5091, 21375, -4859, -14670, 13512, -7546, -16305, 4984, -3739, -7609, 2979, 9925, 187, -3702, 20770, 294, -16617, 22159, -7241, -27147]
469b7147N0151l2840j7648N4476k9329j8045M9005k1814k5309L9331j0009l7342
481b6520L4569N617m8099L7005J9326n6867M1925K4504o2855M4048J9551o3390
493c1186M0700J3381n4792L4264J1196l9734K5625J3858k6376J3543J6921k1012
505c612K024J8795k2021k335J8248k2738L087J5515k0834J4859N563j6573K4595
518A4573j1770j0208K9467k9581k972L1097m0198P960L2436m2303J2733L4018
530B5252l9882Q380L6414l9332l238M3136l9851j6838N6057m1104k3141P0545
542C6398m5880k6060Q1210n0656k6666P9512n5354k3625P4134n4132k2635O6295
554C2541m1558k0620N7742l0642k3172N4640k1171l3251N0701j7795l4379N0359
$$ y = [-27147, 23004, -9836, -27484, 26992, -2337, -20382, 28623, 6809, -18500, 20831, 10822, -26520, 8049, 13666, -34433, 2572, 21898, -34969, 6956, 31460, -31395, 12653, 32204, -31186, 9514, 22895, -31897, 2367, 13563, -26171, -546, 13312, -13064, 479, 17400, -3612, -1588, 17207, -4814, -7149, 11099, -11639, -8552, 6963, -13871, 988, 6551, -10022, 14573, 2803, -7405, 22062, -7519, -10491, 20606, -19592, -11632, 20804, -21499, -8766, 25252, -14630, -6250, 30164, -9168, -12406, 30730, -9121, -25959, 30098, -11006, -34147, 36398, -9482, -35542, 45668, -4988, -31654, 47858, -7496, -31121, 43013, -11119, -33754, 32541, -9017, -29637, 28105, -2537, -25709, 28931, 7760, -25491, 25210, 7415, -26964, 23395]
566B3395k3559l2277N6062k6130k2690N1232l4476m806M5721m4831L512L5973
578B7126m4916J5170K2444m7326K4486K4844m4986K0954K5253m3603K3354K9898
590C2698n8678J9702M3667o6472J9448M5901p6743L3284N4272q9774L5629N5381
602D8315q6367M0765M2730r0143M3932M5638q4134L0660M2451o8831L1276M2643
614C8935p2669K3454N5707o8946J3862M8723p1679K5799N1027q3305K6530N0465
626C7903p2420L7328L0493p4693N0952K8253p1600M0682J4779n4952M7493O727
638B0945o1583M5925K0767n4597L6736J2998n6837N2825J7264p6834M9730K1424
650B8763o9100N8971K677p6432P8474O784p5705O6845n003n6200P5626j9349o5106
$$ y = [23395, -164, -32441, 23621, -2509, -25199, 26033, -8443, -13249, 32472, -12359, -8847, 27126, -17790, -2620, 19824, -27502, -3016, 21828, -23158, -2204, 23049, -20554, 2800, 32698, -25980, -6278, 37389, -29083, -9635, 36266, -40477, -7193, 47079, -42695, -7066, 48315, -38052, 2713, 45443, -44700, -768, 44870, -39264, -8604, 33847, -34984, -3708, 38935, -33734, -10280, 45427, -23519, -9657, 39066, -32613, -6814, 44213, -39092, -12562, 37903, -34517, 2811, 33304, -41389, 9563, 37816, -33784, 6898, 21677, -33275, 14218, 20945, -40638, 5287, 26054, -28543, 8193, 21191, -35646, 17179, 34443, -42391, 7339, 28763, -40337, 18634, 21311, -55121, 23353, 30137, -45568, 21277, 16274, -39926, 35700, 16351, -48755]
663d8755P2041m906n4677N7739j4836m9875P4528q800o9632O8332N01o1085P4204
676C4779k1070p2215R5726j4109p7683Q4919k2116n6469R5916l6698o7166R3012
688C6826j8492n7121P0075k8759m7158Q1208j9890o5201O6876j824m9363O2972
700C0149k1549n5899Q1158j2823o0700O2773k3273l1440P3106m6634l6824P5033
712C3077l3205j8902N1148n2618j300O7437n4541k0205N6276l9180k953N4837
724C9871o2695j2182Q3414n2207k7544P0299n9057n541Q7021q4252k1534R5887
736E1480o4537j2260P1780p8852M577Q8619p6379j9170P2488n0435l332N9864
748D3843o7973j1519Q2561m8848k9565O1356m5818m115P0885o8837j9188P7809
$$ y = [-48755, 23286, 18380, -36297, 21442, 6606, -43269, 31259, 22459, -47173, 21159, 21660, -39425, 34779, 13709, -58506, 37220, 23111, -54572, 30347, 8231, -48238, 47678, 10980, -56186, 36826, 18334, -38787, 31288, 2529, -44629, 36579, 16689, -48512, 18364, 16540, -32823, 30149, 8600, -47299, 33859, 21036, -39664, 23109, -164, -31604, 41502, -5132, -41956, 33077, -128, -19030, 32118, -20500, -21800, 45637, -8904, -29109, 27167, -12013, -14966, 39871, -22824, -35006, 48408, -3799, -31343, 38956, -20101, -25642, 61379, -22873, -44407, 51480, -13057, -25317, 46463, -32389, -27812, 60807, -15572, -34742, 37746, -12689, -16021, 43843, -24130, -35649, 46912, -1936, -31501, 29855, -15963, -20078, 50807, -18030, -37218, 40591]
760D0591m7489p818M6133o3110J8154O0004o5596oM0863l9180K4174K0986o0597
773c2891K2996M3218m4458N317J9652m1660L4705L1277p2273J9913M6949n3869
785b1124K7355K0823p5784N5165M2147q6825L2541L1728o0655N3318J4481q3809
797e0639M9836M2093o5454K2112K1614n4294M4269L2390p9622K0889N3184n3746
809a7368J8288K4547o7194M3257M4418p5349J8173L1580m3139L9323M852o1929
821d0541M2261K7028m1777J5511j185k3550M1142J234m7866K1800K0907k2089
833g125J9705j0128l5128N0072R128n0882K6983O44k2984N1616k7530m7473O2237
846A9135l693l3224L6447k9304j6018O4157k6633m6736M4889k02k2360L5586k4656
$$ y = [40591, -6898, -14716, 31417, -31693, -13539, 46465, -19131, -19137, 21726, -17454, 6720, 27706, -32891, -9895, 33323, -11135, -5818, 13834, -27826, 6879, 38156, -34117, -14204, 32745, -21124, 6231, 27054, -48730, 6435, 48582, -38243, -5702, 26026, -34629, 18689, 33170, -50639, -803, 41290, -24164, -2052, 19562, -34732, 9537, 41927, -37695, -16806, 36378, -17368, 920, 25467, -41727, 1530, 45948, -29401, -11228, 20352, -22787, 16536, 21388, -40541, 1720, 28748, -13029, 2482, 1297, -22253, 18889, 20123, -27743, -5943, 14964, -7125, 12580, 2452, -32676, 17396, 26524, -24358, 2625, 3269, -19715, 31901, 4371, -43102, 19135, 15442, -17782, 18665, -10639, -26657, 37500, 10867, -35869, 9020, 8818, -13542, 22044, -2612]
859b612l6652O3909K085n7952L5751M012l0405N2136k0203n5344N9958Q300m2138
872a9155K7865j4392j5789M9176j5407l9119K6773R721q293Q980j8868j1497L4423
885A4418J214k9145Q005K140J919K4931k8479k1138M1406o474j3127J5138l2256
898b1448J1544M3051l9732j4275K9729j4083J1233J3652m0997O694M0292j9419
910F241j8388J2984j0288Q289K6302l6055j6096M4563q500j4937J6488k8724J0220
923g901M1916l9650j5834K9922j2656R518R964l7881J0265L5884j7843j4560P652
936a204m640J0414J4744k8523j3785L3471J23j6158P018j4429Q514K9986k6729
949a198j5369K0014j937Q579l539k7005J5676J8258j1318l674q524L170K2516
$$ y = [-2612, -39264, 24645, 26730, -31222, 4529, 8541, -21864, 30272, 10069, -45275, 14683, 22983, -19155, 8710, -5682, -21471, 27705, 12298, -26821, -48, 9673, 1380, 10360, -8508, -20005, 14418, 15632, -13513, -5508, -3368, -1449, 23482, -4997, -26135, 15271, 8797, -4330, 10808, -21448, -9904, 33147, -6585, -20860, 8869, -5214, 6019, 19671, -21326, -14632, 25660, 6241, -12147, 837, -9451, -1162, 25140, -10915, -27011, 17552, 9052, -5885, 10603, -18121, -7901, 34015, -5635, -21469, 8453, -4203, 5315, 15279, -22602, -12337, 23547, 5704, -8856, -1204, -5844, 4570, 19314, -9209, -22994, 10477, 10600, -5558, 1460, -12969, -4455, 25531, -1198, -16567, 3447, 1510, 10089, 6550, -20455, -4779, 13479, 2161, -1513, -10037, -6867, 15649]
962A5649n627k0953L053J3502J479k019j0015j2811K1791J5583k9185r97J4449
975C899p997J9085n789l3838K6007J7123k3085L592n301o530K7438l742k7049
988a6187Q316J7045k205l003o146j0958J6876J5748k6639q011J7983l857Q003
1001F965r65k5405J8190J9333j7573k908k810l21J8842p898j7744M348R835O851
1015H740o458j1660M025J1793N546j1670j0371Q359O909K743j0447j2767J6075
1028H17Q252r282J252j0023N449K3186j8158j3065J3953l442N584L640k2541M601
1042i777K0890o024j0184J633K390M722Q320j1851j5842K0007P016j7548N161
1055a087m351l724K4256j0836j9273J7471K994k375L663j4924R70J5244k673j0450
$$ y = [15649, 10022, -10931, -7878, 5624, 7103, 5084, -4931, -17742, 4049, 19632, -9553, -10550, 3899, -4098, 14987, 9198, -24640, 1367, 18490, -4595, -1003, -6304, -12834, 14604, 10862, -16187, -7871, 9174, 6969, 3966, -2180, -13138, 3738, 19486, -7153, -15164, 2819, -1038, 6965, 6000, -19405, -1215, 18118, 545, -2363, -5173, -5494, 13348, 5450, -12294, -7946, 1889, 8740, 2282, -9378, -5353, 6440, 11986, 316, -10055, -1696, 5213, 7956, -2491, -15258, 817, 9069, -213, 1039, -8984, -3535, 19651, 1493, -11572, 2381, -1061, 4523, 8163, -14378, -9777, 11113, 5089, -5095, -3462, -1072, 3650, 11970, 119, -15723, 4284, 11300, -6248, -1087, -5438, -9162, 15094, 4258, -15015, 2456, 5450, 3075, 6738, -8186, -7216, 8028, 5355, -5095]
1069e095l301O378O942l59n362p584R398J0463j0251m544o84J985J1531j0485
1083i68r801J0029M02N344M04j6926J1036J1733j1567J653m343m808J5413k195
1097E406j5532M530Q650j066j31l22q621P727J4109j7667o656J5895j0170M027
1111A79Q513k3879R561K0437j8597R01P426j1134J2356N040j8997K090J1410l924
1125A382m232K224n272L068J3690j0939q915J5149l912k408P344j5926L988J4776
1139A0017j4110J052L253o719J3665j925j3049R605J163k621N067q920l814J1664
1153D328j238q682L357L000l943R353j294j5816J5059O282j9697J2600k12j7399
1167a4302K3483l160k3024K1873J035j4410J6999n648j4299J9916j45j7935R056
$$ y = [-5095, -8396, -2018, 4924, 4565, -797, -8381, 1017, 11480, 1229, -3315, -3999, -2014, 9517, -968, -10769, -740, -338, 5006, 5410, -11516, -480, 11253, -314, 1339, -3004, -7812, 7601, 5406, -10126, -5596, 3054, 1988, 1857, 1535, -7086, 641, 14750, -2917, -9573, 6322, -3848, 179, 8692, -15187, -5626, 14811, -3786, -2885, 4541, -6593, 5763, 10803, -8194, -6104, 5306, 1382, -2850, -626, -5898, -2830, 10860, -79, -8994, 6155, 2243, -165, 7179, -8747, -4759, 10017, -4093, -3041, 212, -6507, 7158, 5233, -7816, 1789, 2952, 331, 5398, -3522, -7336, 4328, 3090, -5592, -2235, 765, -3178, 6175, 4881, -10935, 4124, 10406, -9291, 3309, 3097, -14302, 9181, 6021, -17003, 4870, 5905, -8505, 8494, 2846, -11453, 8463, 8318, -9617, -561]
1180e61M932j2188J0267L846j9318J3478J2169k1251R695O976j8273J6789J741
1193H302k2292J6522K000j3504J4809o648q215J6837m686q224R279l522l205Q516
1207E969o364p721J1479p43j0282J2003l975r262K0037q406j4683K3081j0629
1220E04j0438K2665j7631p589K6295j7818o430K2026j5987k312K0311j5940o803
1233i147K0025j0357j0214J8812j0507j1420K4975j1368j5592K7617j1376j3454
1245a2006K7570j7089j1395K9173j8273j0173K4246j7131m059K0925j6315l890
1257h417J9356j1612n494J5069r724o394J6840j0628r528J9152j0579o918K0018
1270A1141j5714k962K2329k0391O40J8264k2218O200J5280k4253R079J3312k1722
$$ y = [-561, 4371, -7817, 2450, 6296, -13022, 456, 12625, -8626, 1069, 8045, -10228, 6561, 8302, -13990, 2532, 4532, -8972, 5837, -811, -9026, 7811, 3125, -5099, 4180, 658, -2547, 5969, -395, -8116, 3363, 2620, -7662, 4341, 366, -8896, 11141, 2735, -11948, 11133, 504, -9934, 12731, -4900, -12489, 13806, -4012, -10442, 11584, -4403, -6715, 13596, -2344, -9147, 10878, 521, -9693, 9119, -1388, -12808, 12167, 799, -14793, 12824, 1448, -12006, 15564, -1525, -12920, 16253, -2020, -12193, 12053, -5078, -9137, 11788, -4527, -8417, 10939, -673, -6167, 8902, -822, -7216, 9624, -1004, -10532, 8620, -1959, -8877, 11141, -4573, -7535, 14794, -5597, -4957, 13307, -8911, -2711, 12569, -11684, -2605, 10707, -11015]
1283a1015J0451J1027k0650R824J2961k1430O374J6016k3572N139J9848k7147
1295a2174N819K3855l0432P714K4520l2974J0660K2478l3451J1348J9475l0682
1307a3844J1076J6479k6340R459J6136k2254N972J6123j9459L128J6481k0086
1319g129K445J7371k1782M266J6542k2518R169J3154k2988J3827Q562k3141J7534
1332E312K817k1177J8829k47j8487J8851q15j7648J8230J032j8777J7911L517
1345I348k2726J8780N662k7428K1112O475l0148K5041N291l1119K7679L393k9370
1358a8010K7341M29k6070K4538p16k2514K1112M89j9684J7401K646j8768J6336
1371D530M276k0522J6624L747k1873J9134J094k1880K2932l410j9938K5270o745
$$ y = [-11015, -564, 10463, -10187, -363, 12598, -8832, -2458, 13558, -10014, -4875, 14973, -12174, -6355, 17500, -12932, -5218, 19302, -13672, -3012, 19466, -13985, -2637, 16838, -13844, -2768, 13711, -12629, -3170, 12966, -9288, -3316, 12807, -6652, -3524, 12957, -7129, -4684, 12687, -9095, -4829, 11713, -10805, -1636, 11518, -11470, 2357, 10919, -12222, 5312, 8129, -13048, 5781, 5534, -12953, 5898, 5083, -12565, 5665, 6697, -12080, 5831, 9348, -13378, 5402, 11064, -16364, 4748, 11223, -18925, 6116, 11407, -19712, 7967, 11360, -18010, 9331, 9760, -16310, 8228, 7512, -15002, 6110, 6599, -13085, 4316, 6962, -11806, 4530, 8806, -11716, 4908, 8655, -13218, 5916, 7010, -14870, 8062, 4652, -15286, 9984, 3239]
1384C239j6890K5909j0819j3302K4210j1935j1356K1498j0487j1531K0650p935
1396A251j2644K0710o318j5210K2218n605j7694K4257p572j7676K6152j0548j5559
1409a4238K6385j2602j1507K4952j4760p226K1449j4806m865J7671j3489m165
1421g201J6004j1946m808J7391j1715o144K0310j4292p159K3795j7609p232K5899
1434A5293k1061m573K6190k3493k016K5476k2845j002K2601k0525r66K0048j7395
1447d268m172J9092j2719o615J7890j1129p408K0072j1599q041J9802j2807m461
1460f363J6991j5628k23J4785j5852L952R662j5412R139O370j5176R264M699j2965
1474f757R282L187j4535R613P375j7060P496J0943j9311R216J3102k4696J0565
$$ y = [3239, -13651, 12258, 1439, -11863, 12347, 412, -10944, 10554, 67, -11464, 9186, 1251, -11393, 9317, 2999, -12211, 10007, 4402, -13292, 10965, 3393, -14283, 11869, 1321, -14238, 12147, -455, -11962, 12990, -1770, -8996, 12453, -2353, -7218, 10453, -3036, -7201, 8803, -3143, -7951, 9440, -2275, -8419, 11891, -2401, -9560, 14235, -3374, -10606, 15293, -5768, -10341, 15849, -7644, -9660, 15816, -7029, -8031, 14570, -5955, -6921, 13127, -4268, -8440, 10652, -2067, -8682, 9208, -1921, -9329, 10743, -856, -8897, 10905, -1902, -6363, 10628, -5000, -5223, 9562, -6290, -2338, 7324, -8088, 1051, 7421, -7755, 1509, 6208, -6757, 2525, 5712, -8823, 790, 8165, -8895, -1399, 9544, -9767, -551, 12551, -12145, -1580]
1487a580J6178k6710J1576J3278k6232J3750J2790k5804J1000J2719j9735P985
1499g85J0203j6790N007J2594j5142K19J2686j2015Q2J2451j4339J376J3497j3538
1513d494K559Q071j2569Q783L385j3043R371O27p942J0293n627o589J3006m431
1527A400o237Q954l993n054J1141m215j0734J2341J015j3017J2742r35j4999J9340
1541G749j315j8715J8525j020j4792J7637n601j4020J8366k474j2808J1319q62
1554A989q136J0833q52j1702Q961N599j1402M926L776j1259J0190K619j4030R387
1568H99K882q236Q983m465o288J2079m244n110N921n078J496O102p434j161N820
1583B166j725p78K176l701r44Q442m720o845R169l790l011J0654j1006k789J5603
$$ y = [-1580, 14598, -12112, -536, 12742, -13490, 260, 13050, -12754, -1754, 10965, -8770, -785, 9418, -7372, -2365, 10229, -4913, -4694, 7992, -4023, -3941, 8510, -5829, -4453, 9044, -4494, -1935, 6136, -6433, 2350, 5735, -7308, 2063, 2690, -5252, 5041, -586, -7175, 5831, 1400, -4837, 4117, 124, -4930, 6211, 1996, -8738, 3603, 4618, -8399, 4343, 3408, -11591, 7749, 6434, -12281, 6244, 5224, -9568, 8069, 2468, -11552, 6814, 4340, -8468, 2851, 1989, -6147, 4686, 3834, -7868, 1093, 6692, -4710, 216, 3992, -7267, 2923, 5542, -8488, 899, 3781, -4455, 4528, 63, -6225, 5854, 1610, -3500, 2421, -2657, -1161, 4941, -2493, -3654, 2166, 441, -337, 1839, -1862, -2806, 5636, 916, -5929, 3240, -550, -3561, 7093, -3913, -6702, 8901]
1598H901j0409l173J0956j0559K501J0827j3013o45R486n763q28M615o178j41
1612c423R571m703p518Q919o47n265Q643p227n451J4151o252n720Q181o347K151
1627i37P205r424Q8O146k851R93j003l694L508L003l330k835K485J231M87J321
1643B393n028R6P600n006j723L732o249N801L863j1628M969M865o503O412k454
1658A140p151Q905J704p299J987Q88k000M323r6p091K666P654o770q39M855o743
1674c867N095N878j3429L634P581p883M242j6p500Q025K955o834J321Q57K68K214
1690B541j723l903J073M931k057l248K070j059K968K244p430K810L763l857L883
1705C006l737m845R475j772n977N306m003J323P348p107k733O002m75k040J008
$$ y = [8901, -1508, -4681, 6275, -4284, -1783, 9044, -3969, -4614, 4872, -891, -1719, 2896, -3282, -3423, 6148, 1445, -6073, 2846, 2199, -3066, 5577, -1650, -7101, 7050, 798, -4922, 3259, -3088, -937, 6268, -3156, -3068, 3078, 227, 1220, 217, -3477, 31, 3034, -296, -3131, -646, 585, 1072, 2393, -2635, -2539, 5061, 55, -1668, 2064, -4185, 1616, 5479, -6149, -1180, 3685, -2818, 3594, 1140, -6011, 2894, 4598, -2701, -714, 174, -1826, 2497, 2401, -4690, -2024, 5630, -1140, -1979, 2876, -3867, 1228, 7106, -6323, -2689, 4892, -2991, 1251, 1235, -6265, 1760, 4715, -2119, -798, 59, 327, 2541, 818, -3085, -2012, 2919, 862, -2386, -316, -1375, 1593, 3837, -3593, -783, 2980, -877, 3006, -731, -5576, 3899, 2127, -3850, 1456, -2547, -1224, 6124, -983, -3716, 2286, 1811, -229, 779]
1720G79k544j003O125p60q392M944L844n055N926l368p135J1621r57q801O305
1735A529k759j402P840o620m078P615k40j792P29k378O03M238j061o463K658L817
1751B236l356K876k424m374Q994m20o676M616k772O74O474q444j831P003k898
1766c22Q37L38n238M751M287m880j622J795N32Q57Q59n364p55Q092l404m411N394
1783A746m516K134Q294j1468j41R432p170K081K437r090N580O692q684K14M029
1798A570k219K222J761o395p7Q404m045n208N682m003O46P595r577j524J0551
1813E383n627L48K867p592N351M380p651P57J695j172L954k194m400L495L713
1828C307k303j172M43k438M051K345r455L037N943o964N048M38j0026J0991L409
$$ y = [779, -1765, -2768, 3357, 2597, -5795, -851, 2993, -2062, 3864, 496, -6639, 4982, 4025, -4776, 1529, -1230, -2632, 5208, -1412, -5490, 2125, 1885, 93, 822, -1556, -953, 3285, 2224, -4239, -1581, 2236, -1120, 1756, -668, -5042, 3952, 3532, -3144, 1472, -1300, -626, 5848, -2596, -4427, 2576, -322, 515, 853, -4385, 366, 4653, -227, -1849, -54, 478, 1335, 2194, -3170, -3925, 4167, 763, -3648, 1746, -2770, -636, 7658, -3810, -3951, 5481, -1689, 392, 2829, -6261, -681, 6011, -2673, -2459, 1570, -649, 1573, 3334, -3061, -3138, 5266, 1221, -3987, 1695, -2308, -1662, 5933, -3644, -5168, 5383, -244, 104, 2971, -4621, 730, 5110, -2541, -1784, -89, -1261, 2693, 499, -3901, -406, 3307, 1004, -168, 275, -2163, 1888, 4233, -5222, -2185, 3758, -3206, 1842, 2280, -7746, 3245, 6654]
1843F654j2246P005O86o660R124k532r369Q066L155o807K914R89m774O042L505
1858E752j0706L010P804q228K713K226r739Q405M711j1495N250K452n097P608
1872D666k927p257P339N76l940K547k747j163O017j338n675M077K060l624M362
1887B973k303o308J0012q13r892Q444j833n503J1792o630p402J2811l395n323
1901c370P428n699k240R544n263o059P262m69l649N577l045n594J0137q90q929
1916e259Q089j786n313J0419p189o337J2124m319l936P882o687n23R814p626l389
1931d036P110l642j313N197n763k465R451l206o245Q232l501k967J0081p874m743
1946e684J1675o709l427Q933q850N63J0487r267q30P757o324J685M303p363P69
$$ y = [6654, -5592, 1413, 2099, -4561, 4563, 2031, -7338, 728, 3883, -2924, -10, 979, -3795, 2247, 5752, -4954, -1944, 5860, -2368, 345, 2571, -7168, 1237, 5948, -5547, -297, 2155, -2942, 4666, 1739, -5518, 1821, 2397, -1543, 1004, -1743, -2906, 3111, 1773, -3902, 175, 2235, -1389, 2973, 670, -5638, 4374, 3561, -6331, 2113, 280, -5223, 6569, -61, -7463, 5348, 1953, -3370, 4058, -1641, -3881, 5663, 400, -5659, 1603, 1134, -2515, 3062, 17, -5577, 4560, 3670, -5259, 2830, 1044, -4269, 6150, -1039, -7376, 4748, 429, -3507, 4375, -2312, -2835, 6979, -647, -4036, 3074, -568, -1881, 3316, -2447, -4912, 4539, 1333, -4912, 3320, -181, -3148, 6933, -941, -5684, 5991, -718, -4145, 4788, -4062, -3499, 6988, -2279, -3109, 4648, -1676, 9, 4312, -3051, -2282]
1961b282O670n413k164N487m694L18P759q239j340R965p695k53P601j0780L284
1976a776R212j2208K009P590r641N275M919j0540M496O819q659J166N029p045
1990c354K076O664r221k41R495p622K84P424r288K298Q626j1188K338O437r179
2005d451M733L347r341O114L419p043M192J368n025M438J693p108L245L511o239
2020c147L120L211q393O040M270j0369O335L562j0270Q805R83j1527R843J415
2034C878r813P842K22p755Q327M74p901N908K875p121M382K037q401N436L988
2049D378r896N277L824q351O966J441r145Q198N19q048P606k038n222P598k715
2064C92m566O415j590l179N293j849m134O187j267n728O256q97o388Q328j781
$$ y = [-2282, 4388, -1025, -3189, 2298, -2396, -2078, 5681, -2558, -3898, 6067, -1628, -1881, 5720, -5060, -1776, 7436, -4772, -2763, 4827, -4814, 461, 5380, -5160, -664, 6155, -2504, -1338, 3691, -3354, -1278, 5386, -3835, -4076, 5419, -2203, -1919, 5505, -3783, -1485, 7141, -4047, -1709, 4728, -4451, 282, 3629, -5712, 402, 3821, -3222, 970, 2338, -2687, 1751, 3444, -3664, -419, 3092, -3147, -27, 3184, -5209, 831, 5101, -5268, 1067, 4629, -5641, 3164, 4147, -7380, 2463, 3878, -5935, 1907, 2129, -5626, 2701, 3175, -4726, 1182, 4057, -3064, 1318, 3355, -5046, 390, 4378, -5518, -241, 3583, -4768, 2198, 3639, -5506, 2692, 3211, -4837, 2769, 731, -4491, 3107, 392, -4174, 2241, 651, -2528, 2765, 916, -3218, 2969, 1702, -4026, 2230, 1333, -5055, 3273, 1492]
2079A492p767J0087k189o635R771l820n742J0341n382m888Q696m301l355O851
2093C159l294l710O533j073m655N651j157m671O358j802n946P285j933n122P830
2108C453l759l139Q205n333k091O986n674n08N629o082K89M882m556l81M935m074
2124a218n08N514m131k289O600m447l163P993n796k243Q351o166j879Q295o724
2139a811l52O900o724K84N505n557K74L989m111K62L460l189q21M322k829j306
2155a704M682l580j316N179m777r2M945o006J916M023o735L132L698o502L940
2170H03J761n742L982J204m826K475K363m411J538L280m452J048M571n883J373
2185i16M959o785J988M365o936L028L533o888L664K783n727L683J500m089K139
$$ y = [1492, -6275, 3812, 1623, -5012, 4759, 939, -4803, 5538, 156, -4732, 3964, -337, -3692, 3159, -135, -3845, 2688, 1615, -3040, 2611, 1454, -3217, 3141, 1339, -4607, 2678, 745, -4377, 3453, -306, -3445, 4760, -573, -2664, 4322, -1352, -1860, 3769, -2313, -2024, 2858, -1698, -2079, 2856, -1218, -1726, 3788, -343, -2632, 3968, -479, -3642, 4351, -1445, -3688, 4663, -1503, -3382, 4913, -1811, -2163, 4737, -1987, -1703, 3802, -1755, -1481, 2508, -1603, -1341, 2119, -1070, -1891, 2431, -398, -1704, 2978, -602, -1918, 3261, -1516, -1608, 3337, -2669, -753, 3270, -3465, -333, 3365, -3137, 803, 2564, -3178, 804, 2008, -2818, -343, 2020, -2391, -853, 2427, -2025, -977, 3594, -2289, -916, 4043, -2742, -754, 3611, -3325, -297, 3236, -3652, 12, 2795, -2932, 751, 2251, -1838, 301]
2200C01R74k943J464J427k492O65K328l197Q05K907l811J659K634m942K908J104
2216A791m823M110k6l950M626p40l609M738j581k415M090j632k446L392j053k395
2232a923K623J47l217K768J445m303L572J039n120M315P11n110M846r73m063N205
2248A962j605k967M073j325j406K813j232j121J700p4j768J270Q03k394J667N47
2264I43l393L230M22l394M078j037k900M435k340j732L891l210n51L337l087O69
2280f39K204k110k3J748j499n43K016r86j832K688j003k008L676j589k241M634
2296B493k478j619M396l824k73L431l360K02K984l205P94J593j885K48J366q01
2312F2r55K020o74j621K510j042k003L025j508j602L350k149n88L361l008N32
$$ y = [301, 1275, -1668, -204, 1223, -1269, -604, 1724, -1473, -668, 2239, -1572, 87, 2721, -2221, 687, 1791, -3032, 1078, 1052, -2898, 1728, 988, -2621, 2117, 536, -1879, 2211, 579, -1867, 1525, 472, -1923, 700, 847, -2370, 398, 1843, -2460, 1112, 2151, -2969, 1346, 2057, -3053, 1793, 820, -3243, 1962, 357, -2610, 1463, 138, -1268, 1545, 313, -808, 892, 818, -950, 320, 1123, -1271, 396, 943, -2450, 780, 1202, -2192, 1886, 849, -2051, 2384, 44, -1688, 2203, -1007, -1558, 1779, -1308, -639, 1565, -545, -568, 1180, -319, -862, 1154, 168, -1664, 1024, 21, -1987, 1689, 100, -2141, 2493, 15, -1604, 2792, -1032, -1305, 2126, -1234, -1032, 1952, -1253, -459, 1134, -751, -503, 863, 62, -893, 1127, 453, -1168, 1342, 300, -1703, 1322, -186, -1788, 1562, -587, -1175, 2186, -822, -290]
2328b90K017l187J603J100k803J971k5j161Q88K43q79M64Q28j097l80J936j811
2345e83o6J985k721R60K435l777J483K007l582K752O92l607L135M5k922K530j67
2362E99k161J792M05j695P83J533j964L32J609k165L44K754l581J066J976l382
2378a755J877J302l756L135M82k632K308p20j356K036o90j363J353k92j46M87
2394B70l2r94J005Q40j668O67J159k383K232n75k853L436o07k389L329j897j207
2411a667M117k811j119K892j751k32J531j582n47J803j19j900J875M06k138K218
2427I76J4l081L111k26l290L908j166k319L993j784j876L154j606k41K026j939
2443c46n56J742q00p19N46k9n78J038J42j668J922l6j521K422j938n80L110k946
$$ y = [-290, 1727, -1460, 143, 1243, -1560, 411, 386, -775, 113, 356, -523, -59, 769, -328, -708, 1228, -583, -649, 1336, -1385, -425, 2010, -1767, -284, 1723, -1859, 893, 1585, -2022, 1113, 1158, -1764, 766, 599, -1562, 230, 635, -1060, -277, 1256, -708, -376, 1233, -932, -588, 2166, -1415, -349, 1627, -1755, 122, 1424, -2332, 803, 1285, -1347, 961, 241, -1115, 921, 231, -1132, 221, -71, -217, 270, 238, -756, 249, 1089, -579, 88, 1247, -1136, 1096, 521, -2332, 1104, 497, -1892, 1437, -460, -1667, 2450, -361, -1480, 1412, -339, -571, 960, -622, -1169, 634, 515, -1385, 490, 896, -1242, 976, 990, -2091, 1020, 794, -2496, 1412, 246, -2073, 1920, 136, -1740, 1414, -192, -433, 1593, -346, -902, 840, 40, -679, -133, -162, -740, 298, 440, -1228, 694, 658, -863, 1559, -379, -959, 2151, -795]
2461g95m59K677k517R74K077l870J627K074k733Q64Q49j711Q70J233k052m98K439
2478A049j300j113K847k081q20M326l420j074L947l445L83K469l349N29L202l341
2494a191J024R85j602J206J094k150J27J312j206KQ99j438P1K809k769OK527k942
2512a236J595J737m126J751K418m241K378O09k960K785M32k952K249O65j632R41
2528D13L36j793P85K258l059J96J932k274J035J528l209J896K280l860K502p6
2544H90l194L588l73k992L132n70j511K003n41j663K166J61k177J142Q84k343
2560a398J453J409m043K613J564l622K747O03l704M026m69l155L223q92j743K479
2576A091j305j336K441o24j081J079J22q08J197k33j717J776J87k297K263m47
$$ y = [-795, -1254, 1423, -1094, -120, 1957, -1913, -286, 1788, -945, -81, 768, -943, -73, 1160, -892, -1390, 1049, -251, -1364, 1483, -598, -1418, 2908, -512, -1586, 2361, -1084, -701, 1768, -1581, -1052, 2150, -1191, -167, 818, -784, 422, 1516, -634, -507, 805, -401, -399, 500, -938, -867, 1942, -827, -821, 1706, -1236, 359, 2096, -2030, -279, 2139, -2102, 276, 885, -2075, 710, 1142, -1810, 439, 1104, -528, 413, 749, -1044, -259, 1999, -1060, -864, 1068, -1206, -171, 1357, -1852, 44, 2324, -1536, 966, 890, -2304, 1284, 911, -2081, 1051, 481, -1030, 973, 432, -1231, 935, 1096, -1081, 61, 945, -1398, 55, 1464, -2579, 34, 1598, -2024, 723, 1326, -2378, 1648, 1179, -1976, 1247, 355, -1388, 1091, -214, -1550, 891, 267, -814, 265, 387, -421, 776, 543, -1174, 602, 789, -1508, 755, 308]
2592C08k299L690j619j918L711k104j128L701l334n89L604k804n48K572k025l81
2608a163K810j686j506K653k69k275K877j110k671M376j523l055M233j590k130
2623b029M156k713q60L810k510r74K306j877K54J301j367k96J516q19k03J050
2639G45p83r32K634j762j364K948j925p65L062l037j82L733l755J179K335l463
2655a332J211K168l537J085J472k332O25J590j665o3K627k173p30K686j774r49
2671a091L379l543j89L622l178L28K425l555J592K513l744J378J927k925J413
2686C52N62k182R88J410k017pJ853j313j52K406k639O4K643l023N59J989l463
2703a970J754J709l518K155J278k686K183q5j938J982k71j551J184j2j319J114
$$ y = [308, -1991, 1699, 80, -1838, 1873, -231, -1359, 2342, -992, -1581, 2023, -781, -1329, 1243, -782, -1163, 1647, -39, -1545, 1108, 839, -1436, 1441, 331, -2340, 2036, 513, -2542, 1691, 101, -2029, 2127, -586, -1446, 2364, -146, -1120, 1186, -691, -437, 864, -503, -799, 717, -102, -305, 745, -38, -970, 1664, -98, -1462, 1486, -439, -1204, 1858, -1179, -1361, 2372, -1383, -204, 2131, -1332, -121, 2047, -1490, -405, 1067, -1265, -640, 950, -715, -778, 1849, -324, -1054, 1632, -142, -1091, 2288, -1255, -1444, 2178, -1000, -672, 1753, -1802, -210, 2303, -1441, -63, 1864, -1061, 352, 914, -1268, -280, 1130, -887, -894, 959, -354, -506, 1900, -739, -675, 1968, -1055, -496, 1493, -1970, -216, 1493, -2025, 130, 1408, -1278, 905, 820, -1118, 864, 593, -958, 226, 214, -1105, 9]
2719IP90k156J002J588k598J428J441l257K068J290l941K643M69k867K975k26
2735F58k314K378L70j944J963n69j620J466M84j654P52Q94j983J308P00k330J954
2752E13J035k797J728P33k480K365r28k195L065j089j070K266j339n63J828r17
2768A55j008J720l12j134Q77m6j483J561K96k247K368L62k618L148j081k633L618
2785A543j305j711K593j594o13K288j391p99J965r89j21Q53n85o47R82N37k322
2802a316J744k18j548K217o96j721L132j270j418K380j788o2J931k264J54J723
2818I80j803M13J054j351L77J220j041k75J258o92m37J165j224j030K547j332
2834a71j128K476j779j27K186k080k8K104j954M89P81j856P09P09q91N44L01n41
$$ y = [9, 799, -1357, -355, 1233, -1365, 63, 1504, -1753, 315, 1605, -2336, 307, 776, -2091, 884, 658, -1656, 722, 1092, -852, 1111, 542, -1078, 388, 872, -782, -30, 864, -1119, 189, 889, -1441, 513, 1548, -1249, 479, 1212, -1268, 1097, 169, -2026, 1039, -50, -1120, 1146, -193, -756, 1072, 155, -853, 867, 555, -579, 298, 252, -1231, 330, 626, -1621, 747, 1109, -1509, 1639, 558, -2075, 1543, 238, -1473, 1120, -474, -1087, 1201, -190, -989, 976, -13, -134, 719, 134, -513, 469, 1006, -1316, 428, 210, -1338, 879, 183, -1538, 1594, 324, -1094, 1286, -502, -564, 1367, -897, -743, 980, -823, -410, 644, -707, -330, 890, -151, -426, 832, 140, -297, 868, -356, -1386, 1161, -171, -1299, 1177, -602, -729, 1457, -623, -651, 1453, -501, -12, 769, -1087, -378, 331, -560, -16, 285, -256]
2852b56R9P24k81p87J466j122m61J548j647j31K228k265L69J814k050Q13R74k064
2870a029J352O09j624Q40Rp07P58M58j224N52R25j066k95J386j367j19J732k205
2888a015L20J617j757J052R62k339J351N68j629J601l11j401J483n85m27Q59k26
2905A23l14QQ66j105L00R58j469J32J099j720J278O01j798J309J02j410J779l13
2923D26j367K050p36o04J078j055j82L96k25j36J74M34r08O89J012j788J218K22
2941F98j859J395N46k156K030m90j170J896q72q23J437m28m80J027p39m93M04
2958g7n1m40O03Jp39P42L58j066J020Oj198J591q43q18J632j067m47J596j265
2977d62j54J722j697O96P10j132r7O37m14k40N13R5r22J011j34p63J474n06q35
$$ y = [-256, -157, 567, 286, -501, 965, -157, -618, 930, -717, -848, 1380, -885, -516, 1298, -752, 61, 1035, -1029, 323, 932, -692, 148, 157, -550, 208, 666, -558, -6, 919, -147, -442, 944, -423, -542, 1190, -1015, -695, 922, -835, 217, 1179, -1160, 191, 759, -870, 731, 420, -981, 502, -83, -510, 349, 123, -191, -183, 683, -422, -122, 836, -633, -501, 598, -1122, 156, 757, -1041, 268, 370, -1040, 739, 426, -941, 1109, 373, -231, 847, -208, -390, 6, -219, -355, -181, 253, -655, 34, 1046, -742, 476, 698, -1161, 234, 780, -1376, 654, 164, -1006, 890, 18, -805, 632, 204, -276, 751, 12, -481, -77, -128, -568, 35, 36, -703, 39, 397, -669, 351, 357, -841, 750, -93, -911, 721, -346, -793, 803, -462, -616, 1106, -591, 105, 815, -317, -414, 223, -191, -431, 82, 177, -745, 266, 132, -631, 843, 337, -498]
2996d98J341j306m40J532j011k55J277j466N89P52p01kO46m79l3K36j21l77N28
3015B12k73n20Q77q9n35J238q56m90J162j095K07J093j744O42O97j403J131m3
3033B11p81J115m15p92O27N93o13l90Q27m95k55O94o00k69J346j450L74J073j584
3052g84P17J088j771Q16J95j215P76M62j027Q41R9l21L68l26O4j83M40K9o23P01
3072C46n01l71J399j372M68R20j548J111J02j254J347m02j044J357n43o09J074
3089D80p11j62O47k92j53P11k09n16M45J88p67N90K84j236Q80M75j770J325K48
3108D57j276J689n35j084J406o51m28P98n58j34O45l97j19j7N78m34M8K47n73
3127c38O51J30j505J439m0j010J448p53n73J044p85j69J122j160J46R79r45J48
$$ y = [-498, 843, -463, -903, 629, -382, -637, 640, -826, -237, 515, -186, -188, 458, -21, -54, 182, 61, -316, 212, -61, -581, 296, 207, -328, 910, 54, -436, 726, -369, -162, 931, -813, -171, 526, -877, 254, 211, -570, 545, 130, -662, -35, 558, -55, -445, 382, -113, -368, 326, -274, -543, 803, -647, -273, 800, -784, -67, 1021, -750, 66, 261, -954, -178, 284, -743, 98, 197, -124, 244, -82, -18, -201, 239, 268, -355, 346, -155, -526, 873, -499, -31, 889, -659, 452, 554, -700, 647, 245, -799, 558, 15, -594, 480, -231, -393, 254, -38, -191, 520, 311, -205, 240, 428, -339, 251, 535, -701, 179, 654, -1116, 209, 457, -819, 870, 335, -749, 657, 6, -422, 376, -182, -316, 329, -68, -187, -204, 374, -60, -12, 235, -338, 313, 443, -1062, 377, 337, -673, 775, 22, -551, 493, -292, -461, 661, -499, -353, 626, -319, -171]
3145a71O27o80J7N63j76q52R94Ko59O44k44p83J435p22q56J447p62j34J446j225
3165h9p9R25j136M17K65m39k5M48n58k0M90l36J47K91l79k02R47p46n15J383j047
3186b58m1J009j154P7J290j577L68J140j445P56M24j086N78j21JoL96m65m79Q67
3206B74j84m91J008n53j92P60p19j82R75j354P94K52j161J278l14o39O22O6m90
3225b50Q67o96m16O68M9p33M91K20m44M32N55j314R63M05j568Q23O32j386J108
3244D06K41j498J084P4r23J144p0j094R16p2k67k08K22J79m09M58m68Q5N52p61
3264d09L32P82j322P78L87j232J356n11q71J397p43m50J128p74j35Q31m53l84
3282b93N75j63o14N49K61p38M89N10j171O58M14j297J619l20j010J048n25q72
$$ y = [-171, 456, -224, -207, 356, 180, -672, 322, 324, -335, 309, 65, -718, 717, -5, -861, 586, -176, -310, 1136, -89, -168, 757, -379, 38, 303, -136, -161, 287, -271, -291, 199, -137, 10, 301, -78, -280, 667, -79, -594, 789, -258, -299, 710, -444, -367, 923, -654, -286, 854, -591, 165, 589, -497, 81, -40, -39, -45, 351, -114, -593, 274, 90, -401, 607, 54, -138, 622, -97, -279, 696, -658, 136, 388, -773, 505, 191, -448, 174, 240, -250, 617, -79, -495, 173, 222, -511, -20, 200, -244, 188, 743, -571, 392, 797, -771, 52, 684, -702, 406, 647, -851, 233, 307, -616, 528, 458, -636, 280, 208, -59, -267, -45, 134, -275, 183, -285, -200, 352, -409, -77, 705, -617, 161, 548, -684, 672, 161, -710, 687, -56, -506, 622, -152, -287, 544, 91, -293, 282, 119, -495, 54, 315, -423, 66, 576, -595, 63, 477, -820, 799, 479, -531, 517, -8, -880]
3300h80J619r93j02Q50o29j32N69k78k0L41j18n59N48M7o12N02n9o30P86P5j020
3321f95R30l34j72R64p50k66J075j099M5O79q34K20N10l72K20m2j30k87P96m30
3341B8m17O85l92p02J078m92j43J296r86k72Q37p85r1Q63r63M12O32q36P0M16
3361B38j70j95J27J88j91O50q50j40O11m31l65J250j136j14J330r04m6J173j539
3380e14K50P29r86Q39K90p44K23Q2n99N79J30k87l11N98k36r7N08o84j53P72o47
3401b58J94N88j222P27Q02j256O51M88j192O14L58p96M94j69l11K62Q6k42K95
3420A13K30p28L69O33p93K26M69j181R53L07j637Q38M28p88Q87rp81Q53k24m23
3440b58O38r9m95L24r7k52K61L57n78JQ16p89K35K03l77R1L9p01P86j92m94Q54
$$ y = [-880, 739, -254, -356, 494, -135, -267, 302, 24, 4, 345, 227, -332, 216, 263, -349, 153, 94, -536, 250, 325, -695, 235, -99, -271, 693, -57, -323, 752, -347, -302, 377, -457, -237, 273, -99, 121, 79, -51, -338, 458, 28, -389, 296, -96, -798, 280, -212, -355, 941, -45, -317, 520, -265, -356, 507, -456, -44, 588, -248, -178, 238, 68, -127, 0, 188, -3, 647, -203, -343, 268, -163, -528, 722, -414, -528, 802, -102, -148, 1025, -514, -264, 465, -521, 318, 608, -136, 87, 169, -430, 149, 279, -8, -319, 279, 43, -54, 454, -230, -383, 389, -258, -64, 524, -698, 29, 831, -425, 226, 714, -478, 136, 494, -302, 192, 23, -288, -26, 60, -182, 113, 343, -385, -16, 617, -176, 50, 519, -662, 291, 598, -1039, -201, 227, -561, 326, 317, -464, 389, 165, -258, 380, 281, -214, 110, 13, -239, 22, 379, -199, -198, 618, -171, 64, 267, -110, -19, 20, -681, 105, -87, -581, 273]
3462B73J14q54Q50l39l27P69o15q0L75M3p69N69J58l49K15M31r37N55L99r58P10
3483B33j6o60J254r05o38Q63M8m39O03l46l40O06r3j06K0J24m08K03J01l61K48
3504iL41p32P16l06m04J070l43q43M25M9j26N88q12k9M93k52K14N6j6K09j60r9
3526C0k34L38q0m15M39P1n00P37j30q22J142q13L82O93j430K46N86p32J53O86
3546C47n44N11o3k36n1L31m6k57Q8l98N4N79l52l08M50j54j21M92m93p4Q25l49
3568B31l38O15j053M34M70n87KM37l81M12P7k70L9K49l61j13L80j19n36M75k59
3589a96M00L1o77N17L02r46N72k43k16N94m31q3O87m62k63Q33k28k86M9M96n58
3610a08j25K82j22K75K04q19K92L50n39N22L52o19J8J22J29J50o88k05M93k42
$$ y = [273, 387, -467, 383, 44, -283, 486, -129, -209, 166, 209, -560, 9, 167, -182, 33, 464, -473, 82, 481, -477, 233, 217, -443, 811, -94, -732, 131, 179, -260, 343, -3, -343, 263, 170, 64, 84, 208, -200, 3, 104, -257, -9, 332, -400, 316, 10, -394, 676, 333, -510, -85, -36, -162, 426, -386, -415, 78, -174, 40, 96, 80, 289, 129, 30, -204, 134, 54, -361, 78, 149, -351, 386, 256, -566, 576, -237, 145, 838, -592, -346, 240, -492, -339, 347, -197, 314, 251, 15, -36, 295, 249, -8, 80, -318, -264, 315, -37, -345, 105, -49, -170, 322, -171, -245, 580, 231, -107, 508, -545, -111, 359, -228, -226, 211, -170, 242, 319, 49, 88, 337, -24, -137, 243, 124, -412, 63, -196, 204, 235, -442, 75, 377, -569, 3, -240, -456, 138, -293, -376, 311, -151, -414, 419, 191, -95, -46, 450, -108, -233, 49, -73, 202, 406, -413, -121, 229, -310, 212, 564, -55, -37, 85, 214, 364, -324, -529, -36, -278]
3630b78K4M55j36j33K46L34n93O5K48n13J56L29n35L05K44n61M36J62l81O47o05
3651h4n68R41m00j32K56l78K55K93n37P6K09L84m30L84j49k78m2N34j043P00K74
3672B65p49P95n40j20J023l99p03O91k52m20O82k19n8l87N60m52oL29k15N38j66
3693A97n06K84K58k90K24l55J11J83Ll22N84n54J03K74q1k46J38mK4o9J06l44
3715b82J42J62j35M69m69m2K93o0l15O45l82j51M77n48k22O97m41Q5K99m47J3
3736b12N10n54M45k88R3j51K08r9M3J43K2l41K96k14M13q5m11k0M69l83L2L23
3758B39n81K40J45j72L20k00r3K15L1p7K1o5k99P8M49j62k85N06o91N16K36o09
3780b38L64K71q48N18k44k03L82r1j82P5M29m58M72l59N2m4J61j40J87Q3k38o6
$$ y = [-278, -254, 201, 65, -68, 178, 512, -81, -16, 232, -281, -125, 204, -331, -26, 218, -343, 93, 255, -126, 521, -84, -652, 289, -111, -243, 13, -365, -110, 183, -354, -278, -69, 315, -115, 269, 120, -158, -200, 334, -709, -9, 265, -484, 311, -229, -349, 674, 275, -428, 263, 11, -409, 273, 54, -4, -391, 169, -283, -289, 40, -175, 363, 197, -309, -25, 233, -57, 167, -188, -77, 106, 109, -213, 371, -183, -80, 194, 113, -133, 5, 1, 25, -44, 62, -282, -140, 22, -113, 356, -113, -155, 138, 78, -237, 408, 26, -125, 352, -196, -418, 279, -162, -77, 222, -225, -212, 298, -256, 189, -99, -6, -157, 51, -48, -5, 138, 160, -181, 115, -99, 314, 229, -182, -202, 267, -116, -84, 239, -342, -102, 43, -129, 191, -9, -102, 113, 144, 67, 88, 23, -276, -198, 251, 89, -196, 310, -381, 135, 371, -238, 126, 397, -451, 67, -177, -380, 2, -89, -271, -196, 233, -225, 247, -112, -60, -104, 57, -83, 104, 187, -51, -117]
3802a17N05o03m4P63p00K95r9o98J025j88o27O90l44m99O46K23n00L18l0N3l7
3823C2N7j63k82M03j64j40L77j31j59M70o81P17l01k54K69m03J48L71j58k15J58
3844d9R8J09k50k06K20O4O8p6J2L83n87J27P1j98L09j94k30M83M2l39N45n96J29
3867f5L23k72q2J86k14P7J13j31kJ80k24K10Rj25k6n9J97l67N25l55j14N19l91
3890h8j99O53l05k94M73l30J47J16l99K10k65M28j41L0N0o0L5J89n77M96K1or6
3913H8k60K7P90q57K49J62l36Q8K70l05k49N26o4l1N9l3Rk97L97o86O89J8o48
3936c94P52m94K3O26n13k84P45p53J62L99m83K87j8l66K81k04J40L69j84j71k17
3957b97N88m96j6N60m02q1N20o2l60N00n84Q3L24l54j36L27n95M38j26j04N15
$$ y = [-117, 388, -215, -259, 504, -196, 99, 0, -698, 327, 139, -488, 202, -142, -641, 5, 228, -272, 46, 16, 69, 32, 89, -74, -356, 47, -117, -257, 120, -11, -170, 300, -381, 336, 35, -219, 50, -353, -205, 166, 8, -207, -49, 49, 158, -92, -298, -78, -14, 54, -22, -10, 373, -214, -87, -16, -214, 95, -99, -329, 154, 196, -143, 402, -194, -65, 258, -14, -96, 90, -124, -47, 66, -65, -67, 113, -111, 99, 108, -17, -43, -102, 95, -272, 253, -102, -216, 303, -88, -287, 366, 61, -233, 240, -90, 57, 173, -226, -16, -281, 147, 6, 36, 86, 26, 61, 250, -327, 169, 190, 184, 88, -172, -145, 645, -212, 37, 199, -137, -49, 221, -84, -333, 193, 129, 98, 157, 124, 133, -164, 233, -453, 236, 254, -394, 358, -136, -113, 513, 0, -284, 461, -292, -130, 269, -214, 73, 55, -311, -30, -234, -94, 275, 91, -80, -297, 291, -205, -221, 339, -63, -144, 376, 314, -46, 454, -130, -47, 277, -77, -213, 114, -481, -43, -169, -273, 242]
3978B42ml69J96k8l51K02J64K17l53K29j39K7K20l27j24M16l17M5L57m62M26j13
4000A54k53K51j26J15K95l36L9k33Jj91K90M5O4j36M4p2q7M19p38N07Q6m17P17
4023D38m15l32N30m3l92L35j33k39L49m06M30k3p4M8J83k37k86m9L96n15N04K7
4045I6j76Q4K25j98RJ93n82N54j54k63L55l31K96L48m14l47N46j08k09K00j87
4066f3j37J43M6j32K61J06k19K21J29m76J8K02l09O05o46K63L19l80j21N11n70
4087b29L59j29j41J12K77k97m5L3K15n10L70j45j09N16l97j03M20Q3o07M83k94
4108a38J0K78k34j39M53l69J60m6o44N39L64m37M1L79m7l31K0j72K0L38r0r0K52
4131A17j40j48L59l52K99K72n45K77J74m03J35k66J79J11J27j82p9P6j27k54N15
$$ y = [242, 238, -131, 65, 37, -314, -112, 52, 269, -84, 145, 6, 33, 253, -74, -198, 218, -99, -54, 303, -159, 267, 154, -99, 152, 26, 141, 436, 100, 139, -94, -93, -284, 6, 51, 115, -21, 23, -49, -136, 283, -455, 52, 138, -279, 438, 23, -309, 221, 178, -214, 121, -12, -251, 98, -308, 122, 99, 25, 73, 256, 19, -267, -316, 80, -435, 69, 96, -80, 4, 229, 31, 40, 233, -349, 205, 51, -212, 143, -188, 108, 456, 42, -305, 241, 133, -76, 124, -63, -200, -57, -11, -143, 118, 224, 5, 226, 355, -121, -103, 99, -210, 395, -251, 12, 331, -49, -170, 341, -229, 130, 1, -140, -28, 249, -48, -93, -60, 155, -355, 15, -130, -239, 277, -120, -223, 197, 280, -327, 156, -138, -128, 150, -84, -223, 230, -139, 21, -25, -669, -130, 234, -203, -162, 217, 170, -161, -141, -313, -293, 45, -45, -135, 117, -23, -171, 188, -164, 135, 407, -138, 139, 313, -90, 45, -221, -42, 69, 196, 14, -65, 11, -116, -370, 145]
4152A45n42QO18j02k77L71k41k4M74p95N47L6k89L79j71k12J76J51l63j7L09j89
4174hj92N40l35j96O17l64j22J90l47J29L53m29J41nk05N73j4m78L44j69j5N8
4196F6jk05k45Q54n88J41j4r2N1O32n48r7L68p80M81J69n19M70j5l79L42m42j19
4219d70O50m98K12P5j4J55k59J28k46o5N32n67L41R3k96J91K20l10L33O5o64M20
4241B6l6l08L59k42r7L45LQ2k86R6J30N8j15l87M26k28J01j83M96n79M96J84l82
4264d1L45k88j00L40l63j0L37k95O7N2J70k31N1J43j69Q0r3K35k14j20o1m1M84
4287B78l61j06O56o05M85l30k8L46n88L38j75Jj3K07j41J18L3p7K77l20k76M6
4309b35L21K01p49L97L85n70K93k49k6N50o05J35L40n08J19K43l53L57k21J02
$$ y = [145, -397, -389, 229, 127, -150, 221, -20, -44, 430, -365, 182, 218, -71, 308, 137, -75, 101, 252, -111, -128, 181, -8, -200, 340, 5, -191, 426, 62, -60, 130, -217, -88, 265, -164, -23, -28, -233, 340, 326, -152, 192, 23, 8, 66, 65, -140, -385, 469, -119, 22, 8, -84, -33, 599, 51, -46, 322, -458, 23, 192, -327, 143, 128, -251, 91, -351, -470, 180, -318, -106, -31, -45, 110, -149, -21, -267, -332, 200, -367, -26, 67, -229, -38, 182, -128, 205, 270, -394, 26, -10, -318, 41, -201, -298, 47, 50, 132, -154, -58, 72, 130, 15, -372, 54, -174, -73, -256, 240, -339, 157, 341, -41, 304, 16, -84, 256, -107, -117, 220, -75, -8, 44, 214, -17, 34, 177, 8, 88, -5, 230, 16, -104, -165, -206, 278, -83, -189, 467, -138, 347, 17, -11, 335, -253, 85, -90, -89, -102, 105, -36, 82, 115, 38, 315, -5, -281, -235, 86, 287, -462, -65, 320, -250, 43, -206, -232, 318, -287, -152, 188, -320, -201, 42, -311, 46, -175, -73]
4329g3J43J08k06j32M42l78K29Q4l3k34K67n10pM06p2j94M72o43N41j35k53K47
4351F9m1r0j75M56m93M56j61M0k3l83P60k68Q5l41Q5J70j8m56M27o88L15N60k15
4374G1j07j59RM16k05l22K61J86j32k48Q7K3J78N8k24K05J52p7j98m3j25L59J63
4397C28l92j16J56l46L43K47n79O50n9l14j4L6J97l8p5j59J1j08K09k39M03l19
4419a78rM27l37J25m9q6J78j52m09L99M0k78N06k37K58J09l68J86p6qK52n29K29
4442gj96M25r8K00m06L43m80L28n2k23O43l02l58K53r5l30P33m07j6N70o00J37
4464F2K95l72j94K54j99K00j62n4J37N0K1j00l7L2J35q9K6k00N79n84J18K18k04
4487f8L1J48k89K61o6J16L4j68Q2r9J36N8l32K36p0k99M29l75l1L59k8j45L88
$$ y = [-73, 70, 178, -28, -160, 282, -96, 133, 217, 184, -50, 217, -293, -300, 106, 34, -160, 312, -331, 210, 75, -178, 69, 28, -62, -237, 219, -274, 182, 21, 61, 38, -345, 415, 147, 232, -109, -24, 146, 128, -328, 99, -589, -274, 286, 71, -36, -195, -186, 230, 25, -297, -36, 150, 18, -230, -143, -120, 58, 116, -108, 97, 249, 172, -26, -69, -194, 165, 328, -64, -180, -24, -370, -27, 220, -359, 291, 232, -82, -96, -60, 137, 99, 24, -135, -124, -232, -23, -262, 141, -178, -187, 240, -97, 28, -21, -107, 71, -81, -490, -91, -51, -329, 177, -60, 198, 307, -61, 125, 49, 41, 293, -236, -7, -203, 222, 124, 324, -82, 261, -219, 109, 57, -166, 477, 175, -183, 70, -25, -355, 378, -29, -45, 525, -75, 62, 357, -15, -209, 45, -154, 46, -116, -170, -33, 17, 38, -62, -99, -67, 68, -21, 5, -195, 384, -200, -82, 136, -68, -37, 111, -178, 83, 17, 133, 167, -1, 81, -18, 118, 176, -156, 80, 10, -289, 140, -235, -266, 93, 65, -80, 308]
4510C08k87p8L73p69J59M05j12Q1M0N2j47j91M2j23L54m56K14J03J20j39N02q69
4532d18M29K9k48K36k27J85J05p9n3P4L71m74J51K41k98N2p7j26L0q0NJ50Pm73
4556d88K37L10j83P1L37m20J70P4j85p2J87J71l13j8j15M82n15M27K36o39J62
4577h4L13l25P5l04M91k91J09J75l05R8P2k44L29N2j71J95o9l53K97pQ1l0q0N4
4601G8j36P0k31J28%L2K54m5l65Q5O48n22p3L42n21L75R2m01L13l24Q1K24j13
4624iJ26jm59M63j22p5L0j52L62Q9l19R4j80J40n5j17K88k41J10O2l13L10L47
4647C78n49K96n3k00K16J60l92K0R4j70K9J63J33k95L35p1j22L21j35j12L47p23
4669c30K23l5P9J55j5l99L89L43n12L01r7j33O7k7j42J91O7k46k13O81k35m43
$$ y = [308, 21, -57, 316, -453, -294, 111, -1, 80, 120, 172, 25, -166, -124, -247, 107, -349, -135, -32, 88, -51, 451, -418, 11, 40, -208, 28, -199, -14, 91, 12, -41, 33, 404, -70, 81, 322, 24, 76, -1, -127, -97, -177, -172, -22, -15, -488, -251, 59, -124, -53, 284, -136, 34, 108, -77, -149, 38, 209, -104, -122, -237, 245, -270, 157, 393, -246, -84, 229, -96, -21, -325, 166, -125, -16, 159, -146, -48, 24, -220, 109, 161, -10, 185, 116, -237, 60, 53, 134, 104, 24, 78, -58, 12, -219, -91, -91, -59, 195, 150, -215, -130, 518, -4, -77, 265, -256, 119, 211, -190, 123, -201, -120, 104, -9, 117, 116, -343, 120, -2, -77, -47, -199, 163, 252, -67, 27, -153, -13, -68, -185, 103, -138, -28, 34, -279, 31, 378, -171, 125, 72, -128, 88, 248, -144, -124, -30, -200, -171, -8, 125, -170, 165, 94, -28, 293, 158, 46, 393, -330, -107, -142, -63, 92, 77, -322, 67, 410, -102, 199, 102, -31, 36, 9, -133, 58, 125, -121, -334, 347, 112, -331]
4691c31N48q4k93M13j47l46N43k11j62J90m84N49jk14L7J45l49K36o8ok93K43
4713h5R3K8J43L6j89J12r0j6N1J70k00j76j1L93l03M4j5q3J24O7R3l54N43n02
4737a27M6j27J59Q1j84L7N8J1J95l35K44J76m82J8L53k74J50J56k25J26K0m01
4759c25L10j13J34k33P3K19j27M41n70r7L66k85J7N06l99L1O84p64K65j68m46
4780d81M75M0l97N17j31n20P58k45k15K93j62m9J49P7j63K53L1K2k90J44j70J40
4802G6l0l86J90L12R2k76K0k29J59P8K69j06l16J19K29n93K86R9k28J8j1N45o21
4825c04K26M14m49j36L81l13M36l93k8K67o9k60L31j03J6q1K52l1J1k53KJ05J57
4848A78j76L3P3k69K84l72J77M56n18m16J041q62N8L93m6J28p7j72o5K08J1J45
$$ y = [-331, 217, 133, -160, 253, 106, -240, 303, 92, -70, 120, -364, 185, 184, -30, 7, 152, -197, 39, -29, -35, -328, -85, 8, 36, 179, 215, 26, 138, 48, 32, 83, 253, 53, -123, -134, 259, -44, 0, -15, -98, 26, 93, 186, -168, 375, -127, -81, -208, -49, 32, -152, -115, -57, -46, 149, -186, 58, 234, -248, -230, 123, -151, -1, 155, -70, 56, 76, -325, -15, -128, 6, -227, -154, 65, -62, 379, -191, -288, 78, -207, -190, 316, -83, -52, 632, -132, 133, -35, -481, -6, 34, -363, 154, 23, -497, 261, 16, -199, 94, -68, -117, 32, 109, -54, 199, 230, 252, -38, 106, -64, 76, 46, -340, -150, 162, 254, -22, -2, -231, -72, 6, 275, 169, -147, -28, 201, -392, -106, -7, -235, -217, -228, 317, -304, -78, 336, -113, -249, 132, -181, 255, -138, -166, 101, 32, -228, 103, 0, 16, -65, 187, 156, 167, -86, -84, 21, 178, 2, 35, 108, -161, 123, -249, -72, 384, -134, -550, 491, -371, -313, 80, 34, 162, 85, -87, -152, 56, 67, 212]
4870B12o6k1j56k87L02J78l93J61j92M06l22J17L86j24j74K6j82K04Q6k60J67
4891F8q2n2K36p6l43Mk4M70q5j56J63M4j93k86R9N69k57k4L50o49L9L16l07J51
4915b5O45p38J72m7k05M92j25k50M48n83n3P3K78L1j04J21l4L2j45Lo2L22k66
4938b0j09J36J09j76K54o0J40n46L48K07r7j44j29J77j52j72J44O0P4J43j37J9
4960F9J58j36m54P83m58J19K45l98J71j25k20L78j72J85R9j64J63k73J91j01r0
4981c0J01q2n1K50l10K14K1n04L56L32l79L76l9o64O45k64j24L44p04N96K93n25
5003a48J07j61J05K23r5j23o6N4J69k60L82j66k83L76m5j86L17j58m4J07k61K25
5025F9M2j53j24M72l45q3J97O2k59K73j11m05L89m3l26K81K52m70Q06o20J78M29
$$ y = [212, 146, 125, -31, -318, -16, 162, -231, -70, -262, 144, -178, -61, 325, 201, 27, 53, -129, 75, 161, -99, 68, -14, -66, 170, 94, -249, -245, -269, 201, 116, -40, 123, 167, -26, -312, -213, 356, 99, 75, 425, -224, -185, 131, -176, -25, 620, -118, 54, 7, -198, 294, 169, -81, 367, -216, -269, -196, 82, 113, 9, 130, 96, 128, -17, -14, -76, 246, -20, -129, 7, 116, -60, 194, 134, 274, -272, 76, 283, 186, 42, -87, 90, -62, -234, -90, -30, 44, 187, 50, 69, 227, 91, -363, 420, -38, 81, 326, -72, 99, -26, -246, 132, -40, 145, 244, 80, 243, -30, 161, 60, -30, 71, -11, -62, 188, -122, 92, 113, -391, -35, 297, -82, 294, 255, -409, 236, -28, -152, 192, -512, 84, 377, -148, -41, -202, -97, 126, 31, -92, -158, -104, 65, -195, 187, 21, -262, 114, 69, -117, 200, 42, -2, 105, -156, 69, 111, -42, -166, 306, -39, -122, 75, 137, -122, 151, 40, -365, 24, -19, -345, -64, 188, -282, 524, -96, 82, 511]
5047E11m29k02K58j75J03P7N1l57L47j62mN2j02J41J50l76O8k09L74j64K73m30
5069b05r2M97q0k48M05m32L02L19n60K27q3O3J11m11K51j37j05J64nM5P7k44N72
5092D31k88l74M97j89j10J24m08L67L90l11k8j36J83l4K1n18J53K35k13J61k53
5113c00M11l33N59J06p04M67k70n1J54j10k25N26m11M2K55k97J28p5j38J57J04
5134em3J57k30J84%n7K6j40L26j08j99J44R2j03K49m55m5K10J14p0O3l77J20L25
5158A78m34M10k61J2K78q1l38K34j82L00k31J87j47K03k0r0OJ46n18K53L26k24
5180GJ11Q7o37O39j66n1K61k71j70J38ON17l57l32L02R5o9m4k17L45l74K00M5
5203F5k62n6N55o52O38l82r6J27j2M4L55j16O6l03m15L57K63j8k2m06J73j54M41
$$ y = [511, 82, -120, 138, -37, 66, 143, 194, -163, 184, 22, 18, 70, -32, 109, 259, -117, -49, -258, 116, -48, 225, -205, -297, 200, 120, -128, 277, -155, 147, 466, -94, 133, 50, 113, 224, -187, 64, -73, -178, -14, -19, 26, 103, -141, 431, 143, -231, 266, 77, -33, 91, -317, 50, 440, 129, 101, -35, 148, 114, 135, -383, -230, 5, -208, -47, -300, 111, -222, 337, 443, -261, 206, -64, -115, 39, -71, -296, 230, -181, -139, 116, -181, -53, -128, -266, -109, -5, -48, 109, -121, 63, 63, 6, 32, -108, 218, 110, -89, 55, 147, 44, 293, -162, -207, 3, 117, 47, 110, -267, -147, 178, -256, 154, -107, -95, 183, 102, -236, -2, -184, 116, -115, 72, -75, 128, 108, 18, 24, 170, -348, -95, 231, 7, 118, 205, -432, 207, 41, -10, 251, -20, -190, -52, -46, 471, 114, -218, 84, 179, 110, 66, -151, 194, -180, 20, 65, -197, -253, 302, -350, 288, -94, -190, -63, -75, -31, 324, 208, 274, -29, -444, -87, 176, 158, 136, -270, -97, -251, 190]
5226A90j89j92O12j12q10N28J46n51O08m73k20O34l34L01k57J8K34rL3k92K2K29
5248A16Q5m82M52l3j45J40o55O74j29J8m0k07k16O73k01K67j08l42N5M07k13k54
5270a38L36n41L39R3k0n2k55K74l19L82l05q5J45l7k4K70j35j08L29l18M52j82
5292A01k40K70j53m28N57l42M7K51N6NO1l78K58j40K72k89o6J82l88L32Q8j20
5314f4q0L45k37K22j24k60N10n54K86J28j69l6k28P6L00m60M94L7m27K38j40J57
5336A4J01j41j89L87l85J08M75n49L47M5n87O68k44k03R6m6L26l0j95j98K15L5
5358E0K54j45m7j73k90N74m21o4J27M5M35l45l66N25j10rJ20j99M6K25m61J16
5380a13J79k74O33m94j05O6K76J21n46J34J18O1K93k37l05O26l56j16K01k48k96
$$ y = [190, 1, -191, 421, 309, -501, 27, 173, -378, 230, -243, -463, 171, -163, 138, -119, -101, 133, 124, 157, -135, -113, 116, 201, -281, 171, 138, -7, 133, -522, 152, 23, 41, 1, -206, -422, 251, 50, 317, 209, -133, -78, 329, 116, -138, 198, -343, -4, 89, 69, 17, -238, 36, -283, 99, -206, -291, -146, -183, -207, 63, -72, -180, 149, -169, 283, 101, -139, 131, -22, -450, 107, -235, -188, 63, 119, 124, 185, -193, 65, -75, 197, -92, -158, 24, -364, -32, 56, -64, -144, 201, -36, 186, 62, -198, 312, -242, 44, 172, 3, -33, -261, -185, 115, -345, 149, 186, -241, -3, -143, 14, 115, -26, -215, 172, -213, -105, 370, -179, 168, 213, -374, 294, 50, -153, -57, -103, 223, 193, -2, -200, 15, 50, 304, 159, 112, -61, -351, 223, -198, -262, -135, -90, 345, 0, -366, 159, 49, 40, 160, -39, 7, 232, -229, -113, 66, -208, 425, -69, -174, -108, 168, 289, -257, -123, -5, 56, 349, 112, -193, 433, 77, -39, 162, -86, -382]
5401c82O82j97r1J50k36K80m16J99R5k90L59J8n13L66k18N01J0n32L94p5l10M33
5423B27j55j92n5K15k40L81n40L69K17l75N02m80K14k99k4R8J59j39R9l74L44
5444d8L74n50N29m33j92M61m24J12L29l19M6K26n80Q33k45o6p7L0M9J96o5j39
5466D7K0j66K13k51L22j85J50Kl57j17O85m35N0L94n38K44o1R5Q5k57L1j29M7
5489a11K06R9k81L28jk09K1l55O40l10n30Q35m69m0J0j56N16k45j46Q3J71l24
5511b68N15l03n0Q2J0J31M3j80J41q4J35k38K4K44n87P7N98n67M48k40j50k0O03
5534C64o30M39m20L07J76l67K27k02R7j3l76M84l69J59m7p3K96J72m66K48p1k61
5556c26N51L0m00L52Qn49N52l96J63o2L7K08k98K11m05L73k15J76K5J46m66M6
$$ y = [-382, 300, 103, 12, 162, -74, 206, -210, -11, 84, -206, 153, 171, -342, 24, -194, 307, 317, -215, 179, 104, -206, 227, 72, -120, -175, 40, -200, 181, -359, 10, 227, -148, 354, -126, 88, -211, -235, -137, 22, -117, -18, -392, -48, 326, -224, 305, -128, -320, 141, -283, -171, 158, -161, -115, 111, -469, 364, 119, 53, -24, 6, 55, 251, 186, 47, 67, -99, 114, -137, 185, 0, 150, 152, -205, -322, 363, -72, -22, 372, -166, 78, 17, 112, 197, -60, -29, -158, -111, 95, 194, -87, 241, 240, 31, 52, -303, 337, 27, -503, 332, -137, -177, -167, -323, 193, -52, -198, -115, 56, -268, 247, -56, -106, -24, -14, 117, 160, -20, 121, 37, 172, -66, -42, 202, -385, -308, 290, -277, 171, -69, -219, -239, 364, -266, 173, -247, 60, 236, -131, 96, -106, -9, -22, -398, 86, -283, -124, -171, -244, 52, 224, -242, 6, -65, -326, 225, 255, -145, 207, 215, -334, 218, -178, -15, -77, -40, 168, -130, 81, -324, 49, -166, 10, 35, 181, -285, -239]
5578b39L07k8P7P8n75M20J75n70N87k68j43N43k94j5J3l32M88m79K12M8k11J33
5600g3L53m38J87M9q0k25L20K0l25K32J80k81q9O97r03K60K83k61K28l9l67L18
5622D6j05j44L75r5J44Kk42L67o74L74M0M3mk10j07L48j49k19O97n70L23m46l6
5645b42L26j41N2J14j51j68J66J77j26j58K30q8m1q4n9j6M40l01j30o7m3J36L26
5668A52l76L91r9j33L66m74M41r0k67J93l40J37N75n26j2P3l77P22O9k79j01j54
5690a09Q0K19l76J79K37o88O80k19OK06j17K41j55j70k03l5M37l67L4O03n69k16
5712c02O06j95l51P20n40P1L29k82K25l68l56O28r8l78L64l4%M18n30l7K20J20
5734B30O6j72m24L04j55L65k11K06q1q0J70o6m19M57k14m26O00r4k52M04m38K50
$$ y = [-239, 68, 40, 117, 195, -380, 40, 215, -355, 232, -36, -179, 364, 70, 55, 68, -264, 224, -255, -43, 5, -206, -73, 280, -158, 29, 78, -2, -227, 93, 113, -212, 20, 200, -81, -170, 527, -376, -116, 167, -94, 134, 95, -272, 46, -59, -203, 172, 77, 221, 223, -19, 348, -326, 48, 88, 131, 127, -83, -190, 158, 9, -210, 487, -83, 240, -206, -242, 84, -57, -5, 109, -42, -210, -44, 133, 7, -151, 79, -9, -50, -134, -193, -209, 231, -70, -200, -267, -310, -174, 152, -224, 167, 68, -65, 301, -173, 268, 178, -89, 104, -236, -99, 476, -50, -62, 11, -366, 356, 425, 146, 45, -109, -29, 190, -186, -7, 230, -458, 222, 3, 9, 215, 98, 339, 184, 14, -189, -224, 213, -154, -120, 483, -86, -302, 304, 109, -242, 478, -62, 9, 338, 56, 281, -87, -443, 185, 87, -291, 73, 39, 39, 457, -73, -110, 110, 230, 296, 124, -300, 4, -151, 214, 3, 209, 128, 48, 218, 152, -267, 190, -24, -450, 150, 56, -196, 208, -230, 20]
5756B0j07K3K95l95J80J88N5l70R9m4R4k57M9L03j23K04j89k58L83j60k5J77r5
5779D7p3Q2j7K19k91K34j82L5J91l24J7J78m41N04J5j53nk37R2M15k02j30K26
5802B00o04N48o9k80L89J59n63O30k68j43qK51k99j50L64J31m21k9L63o58M06
5823e1k93L28N18o96J81K61m58K64l32J97M67m40j11N10m30l9j06J50L5mr0K67
5845A28m90L32j01J74o4J84m10K37l94J79M6J33J24K72q99R52l38j15M06n93J23
5866a14K87m75J68J95j77J84J0R5j78j14j23n8J09N34o23L86l37J12J90j59j66
5887b54N11l42J42j69M1LJ98l92P1k5J77J31k19K38N1L1j27q1J0r6l89P18q5j02
5911D1J8k53J95J29k76K42L25n65N63j75j95j64J20Q1k52K79N9j89m6J65m65O12
$$ y = [20, -87, -64, 231, -164, 16, 204, 259, -111, -12, -56, 38, -219, -170, 133, 10, 214, 25, -233, 150, -10, -35, 142, 47, -26, 56, 39, 258, -33, 201, 19, 54, 245, -79, -62, 116, -325, 179, 194, 41, 36, -201, -109, 306, 104, -26, 200, -404, 144, 75, -205, 184, 343, -220, 410, 142, -1, -9, 242, -57, -207, 157, 288, -133, -162, 201, -457, -51, -344, -16, 502, -194, -13, 248, -210, 54, -278, -81, 386, -54, -165, 345, -85, -124, -230, -80, -45, -49, -139, 128, -362, -30, -131, 43, -21, 163, -247, -10, -404, -225, -179, -46, 78, 350, -549, 403, 65, -50, 356, -237, -114, 173, -302, -134, 61, -116, 68, 78, 173, -5, -119, -242, -300, -191, 343, -280, 106, -231, -119, 71, -88, -254, 257, -85, 57, -112, -71, -68, 130, -262, -191, -216, -39, 92, -127, 111, 162, 193, 66, -15, -5, -101, -490, 228, 143, 41, 59, -194, 1, 130, -146, 96, 421, -144, 419, 244, 49, -115, 5, 86, -166, 113, 172, -17, -63, 102, -363, 249]
5933B49J32o30J68J22m7j59k51L03L72L7j6k03j12J51j57o3%j71K23k5O4L6k28
5956b05N14l10p0K59k27Q8L33n47l8P0P4K65k15k45N79j64k36K73m89J90j49J97
5978e3j10J1M34k29k40L09k49k3N36m33O8K31l59K07q0m40O02j08k97J83J60k88
6000a68L72j26J69j89J68j25j76k12K95k34M69k03k39P08l21l70L68m95M89Ro20
6021d31P45k25l32q4K49M0J47k02R7j74K91j83L45k86j64%L74m21k66Q51p27M24
6043F8j18j69L09o4Q2j06m6J91J18k96J27J26k54J57j88j8L31k62J95j68Q1P5
6065A71m48J47K34o14O37k29k7N57m06r7J83k41lK98o18N44j49j36O8j03O05k29
6087A44k94L61n88M28R5k16q5K75k85K43M3m81Q62r4j83l0n06M05m4j1M0l22L54
$$ y = [249, 381, -249, -81, 41, -6, -165, -416, -113, 259, 296, 280, 77, -35, 116, -41, -104, -104, -275, -52, -77, -13, 23, -205, 309, -1, -71, 188, -39, 49, 382, -165, -203, -133, -59, 206, -9, -254, 325, 161, -75, 198, -291, -101, -250, -53, -163, -152, 282, 53, -187, 122, -127, -150, 386, -47, 21, 252, -107, 100, 20, -420, 182, 74, -223, -40, 120, -168, 204, 78, 247, 58, 226, 101, -75, -287, 8, -226, 243, 40, -199, 509, 188, -182, 186, -309, 180, 189, -431, 314, 89, -243, -327, -78, -38, 109, -93, 4, -170, 121, -62, 283, -3, -167, -167, 207, -214, -480, 371, -356, 68, -50, -219, 90, 26, 108, 2, -44, 147, 265, -31, 96, 222, -32, 125, -63, -81, 250, -12, 183, 15, 96, 171, -277, -130, 104, -510, 127, -102, -129, 428, 22, -75, 108, -133, -136, 162, -456, 88, -61, -197, -129, -232, 373, 144, -150, 211, -377, 51, 146, -70, -155, 120, -165, 78, 121, -360, 502, 408, 225, 195, -311, 94, 50, 39, 79, -243, 111]
6110A11K01m56K58n6n8P9r2J0K83m13L39k41j60L90j43qq3r0N6L01j92K15m41
6133a90k49N15j31k4J01l3q8j20K84m8m95N81J11m18K55m0r6J62k10M2J80l82
6155b93L11J43j15L95m87k13J89n7r3M6o1M64o3m38P11n30K46j69J6k17n6M40
6177A69m1p27L90L64r5M7O2k30L89l78K48Nn42L87k9K25o79J9L05J84l66L98j87
6200h2J16J34r19O92K79j21j57J23m82M33P4n6K4r0J19l42K64J53j89K2p0j08
6222a83J90qP4R1o3m66N17k44o6N9j47L34j30k74K38J99j2J40o12M75q8j22K28
6245A30L6j79J58m85N13L1k76M26m71K44n5p3O2K44j7ol60J0J52k91J93j08o7
6268a89K83k08J51M21m97J43p5j21J0J69L4k77oK26l71K37O86o84M7l8k10K63
$$ y = [111, 312, -144, 114, 58, 0, 79, -13, -3, 280, -133, 206, -35, -195, 195, 52, 44, -39, -129, -73, 228, 36, 251, -190, -439, 76, -55, -79, 22, -11, -99, -219, 65, 17, -478, 103, 214, -204, 51, 11, -85, 77, -133, -91, 89, -293, 18, 161, 46, 441, -46, -259, -70, -127, -220, -174, -235, 229, 166, -272, 439, -91, 155, -14, 2, -215, -271, 169, 128, -599, -209, 155, 60, 107, 169, -61, 328, -50, 198, 203, -339, 48, 19, 244, -435, -416, -111, 73, -293, 105, -82, 34, 168, -751, -59, 220, 99, -58, 65, -417, 16, 90, 34, 58, -32, 87, -255, 9, 162, -27, -5, -75, -183, 7, -1, 73, 164, 101, -365, 152, -92, -158, -99, -246, 88, -42, -316, -78, 121, 109, 249, -363, 112, 24, -98, 130, 166, -13, 145, -340, 173, 204, -72, 354, -117, 127, 72, -1, 61, 305, 288, 282, -78, -68, 84, -207, -14, -122, -189, 94, -114, 37, 458, -39, 104, 29, -92, -82, 87, 121, -156, -162, 64, -307, -70, 616, -68, -21, -59, -269, -6]
6290fJ34k53L31m31R1P8N9o4J29j62J66P2k87J78m12J31K65n26N81m1l14M09l1
6313I7m22N50m38L44l39p3QM86l75n0j9K05P0j63K09j32K38k12MjJ19k71K51k34
6337a48N6K36j12q4K78m84M57J66o63O22l82r3K12j55K7k2J14L73n47K01J82o66
6359d32P84l25j77P6J40k48L73n51N14k79k82O41j69k51K82Ml4k09p2R1JK17j34
6382d0Q6M21r5l91Q0m09LN70m86j18N69n38N16J01j66K23l39Q8K24q2k89K81m16
6405b07J83j45p6L03RJ68J49p03L94l53J14O61n53Q3j7m97N94j04M5N3l3k41p3
6428b46L10j43L38m51M09l92P2j60L56J03j91J15K56k60j51J37q8M77m08k04L68
6449B47j30R7j48l55j0N70l11r0n2J61o6k57K40p3k11N48m6R7k29J26k0O8m07
$$ y = [-6, 128, -125, 206, -225, -134, -56, 3, -61, 68, -94, 72, 144, -143, 35, -377, -246, 19, -507, 74, 33, -281, 128, 97, -325, 225, -213, 131, -208, -281, -273, 213, -162, -212, -231, -26, 44, -119, 90, -42, 196, -16, -12, -13, 106, -165, 86, -148, -92, 144, 32, -52, 226, -258, 199, 365, -298, 324, -58, -151, 61, -94, -67, -89, 25, 398, -149, 52, 234, -432, 352, 27, -150, -74, 66, -182, 191, -360, 154, -125, -407, 234, 65, -186, 96, 100, 66, -143, -215, -124, -123, 94, -40, 46, 467, 372, -19, 61, -348, -345, 225, -261, -379, 190, -348, 168, 269, 103, 326, -13, 75, 299, 217, -72, 209, -207, -24, -169, -245, 58, 67, 235, 384, -319, 75, -278, -164, 497, -56, 27, 10, -487, 107, 3, 48, 101, 68, -173, -246, 64, -79, 259, -192, 217, -175, -103, -263, 93, 196, 5, 120, 376, 116, -35, 102, 14, 491, 83, -121, 247, 117, 214, 66, -289, -299, 271, -40, -130, -182, -21, -87, -344, -104, -177, -388, 160, 114, 211, -18, 108, 88, 156, -251]
6472b51N21m77K55L19m59K57k6k80J95j19k93M25k07L10k57j06J84j61r0J27q1
6493b14L49K01o03N28l27l2M04j83K3M8j25L1L32o14L10k57j24O86m27L3P1J2
6515A22j26q0k1L23j65M8j95k76O16m74K16K38l98L39J22n50o9M03l44M45q2r8
6537fJ66k03j50J89k28M89n4k88Q8P3rK2l94P06l11m43O77m54K18k2j48L63k89
6560hk26K70K4p4K87q2k18j57Q7K46j00k8J52n97N73l04J51Qj20K24J07k65K75
6583B25J12q77N14j16j52M46k34kN3p3J80j57j94N56l54o8K91L8q9m54J76J23
6605e6r2P1K10j60K93k14k68M55k62j0J66l59L97k54k91L13l21L70l4m5J74j16
6627c3k12M71m76J14j55K47J37j68k31L49k54R1K53l22O01n42O8K72m87L33J9
$$ y = [-251, 270, -207, 48, 367, -92, 165, 139, -141, 54, -65, -358, 67, -140, 170, -87, -193, -9, -170, -260, -133, -214, 135, 336, -267, 261, -66, -98, 306, 123, 146, 194, 69, 100, 432, -182, 128, -129, -253, 433, 6, 39, 110, 122, -4, -84, -105, 218, 53, 101, -94, -370, 246, -228, -12, 226, -172, 167, 289, -261, -330, 73, -271, 174, 92, -6, 160, -43, -193, -4, -232, 257, 203, -85, 3, 76, 67, 89, -305, 401, 90, -353, 324, -130, 88, 66, -82, 281, -8, -234, 36, 60, -14, 273, 191, -27, -184, -97, 149, 49, 21, 173, -424, 149, -155, -4, 4, -116, 108, 215, -50, 225, 337, -540, -26, -142, -294, 152, -82, -84, -31, -104, 76, -81, -275, 281, -73, -141, 150, 188, 99, -355, -179, -56, -148, -77, 133, -27, 266, 52, -216, 239, -23, -33, 133, -226, 171, -83, -374, -61, -382, -12, -46, -91, 83, -33, -245, 226, -250, -136, -291, -44, 93, -75, -306, 43, -211, -120, 133, -189, 412, -130, -62, 210, -277, 56, 75]
6648G5j47MQ6J00l36K69j40M70l60J12J43n57N43m82J54L21l11j5R7k70N72m0
6670B88n64J39J90K4Qro9N3k85L01j83N54k35l84O93l72k87P65q83L07K97o89
6692c41M95n2l9J83jj32J06j23On8l4j76j9K41Q8m66K52L06p44N90j26j03O80
6715E33o84Q9J12k86K47j63j84N04m25M85M0k63j49L86m57K30q6PK24n49N21o3
6737F9Q0L0r6l65N36j4l47J80k25R9k24K28K20n9Q5j0k57J65j55K8J64p6J12k11
6761d3K9L3k6j11J06j45L95M3m09M74o06J68J86j13q1K75j94l6o9k9K13ln3M8
6785E2q0L3L9j01K65k45j59K89N2Lj02k13M20L8j79j5j78L05O3m88J05p5k6Q4
6809a13N6K1J82k39N40j007L60L83k08O1k21n9L66j17l7K49r9r9K50l88J5o6j19
$$ y = [75, -72, -68, 18, 118, -218, 51, -89, 381, 21, 133, 276, -281, 262, -220, -66, 255, -56, -71, 26, -244, 328, 288, -276, -137, 53, 77, 85, 76, 7, 60, -225, 76, -107, 447, 212, -172, 521, 149, -138, 627, -256, 51, 348, -341, 154, 102, 63, 246, 245, 113, 219, 96, 102, 44, 10, -166, -185, 56, 144, -322, -70, 236, -508, 82, -44, -147, 533, -151, -62, 50, -236, 11, -152, -336, 168, -257, 228, 268, 5, -144, 242, -215, 15, -71, -64, 160, -389, 132, 69, 149, 179, 83, -282, 254, 240, -107, 73, -152, -53, -277, -49, 171, 112, 197, 187, -70, 95, -60, -32, 132, 56, 168, -43, -14, 19, -7, -118, -12, -157, 238, 281, -128, 346, -260, -92, 94, -19, -100, 175, -19, -55, -124, -153, 60, 57, 4, 52, -28, 5, 44, -57, 208, -37, -196, 93, 145, 148, 46, -167, 253, 291, 112, 97, -81, 224, 287, -201, -96, -171, -197, -113, -57, -36, 146, -93, 447, -560, -200, 183, -25, 36, -185, -244, 122, 5, -32, 217, 118, 19, 269, -119, -104, -170, -289]
6832b89L80k52K11K93n45L52L9l07K94j50j51K44l66K02K80l60M04J36k89j97
6852g1N4k7J86k76J06K3l29M00q9ON0k45K78nj86k8J11j2K08k15J62k05k27L92
6876F1k00p9L42l77L20Qn02N81J76m05J62j03OJ13j49J33j04l6K77k27J11l60
6898b52K92K24j75j46N0r0j90M15m39Q2M39m06N54l65k90O68m52L47n31K03J71
6919A09m1l31K88j48K35rk80J77LJ62p9l96L23p9n2K3R7l18L17o7J18L56l46Q5
6943A47j94j27K04l37M93l71J3K77k09r5M00o20N26l50j15M91j25R8k02L62k94
6964b8k19Q3K87j47j15M43o21K03j20J38K13m0l79M16k00L19L8m35j53M39l81
6985b59N39n95L72p6J21l63L11l48N02j85J4Rk23m2J48J86j78j40K03J12n19L31
$$ y = [-289, 91, -161, 50, 343, -202, 150, 189, -118, 176, 26, -125, 119, -247, -45, 235, -125, 279, 415, 126, -71, -17, -44, 142, -134, -28, -5, -334, 66, -23, -17, 33, -212, 66, 61, -125, -153, -42, -54, 154, -61, 101, -104, -331, 61, -139, -218, 124, -253, 67, 75, -427, 154, 330, -75, 87, -16, -10, 103, -46, 87, -17, -53, 224, -3, 108, -252, 40, 264, 89, -57, -7, -97, -287, 128, -311, -229, 210, -196, 358, -7, -297, 371, -81, 266, -265, -62, 109, 68, -263, 25, -123, 112, 103, -177, 0, 3, 165, 86, -310, 13, -66, -118, -95, 2, -316, 1, -66, 52, 408, 62, 147, -47, -174, 30, -307, 186, -185, -172, 105, -104, -199, 201, -419, 107, -243, -358, 133, 8, 106, -96, 266, -28, -247, -164, 123, -24, -139, 304, -317, -114, -234, -96, 117, 77, -302, 114, -86, 233, 271, -164, -317, 122, -259, 280, -315, 57, -19, 102, -261, 50, -298, 204, 19, 33, 42, -181, -223, -75, 111, -67, -207, -4, 108, -411, -80]
7007h0J61%m7L07m14P4J55l26L01k83K60J4l37K83O6l62M58m27K07q9J90J32o58
7030d15M18K22j71j14N3m40N93j91J34K68m91R7L36o02L46jk24N47l62j43L82
7051B42k87OL12l98M2mK07j88j33K60m16M40o5j38K38J54m28K47J46m84L73j52
7073b6j28K29P6k1J90k30J17l48J96K67n62Q8L49l29K14k63J51L75m15R0NJ10
7095A35O3k49J01K70l26J31n15L39pJ82j85l0m5K52k71Q0o8j60M42k53N4j02K55
7118I3l11J73K8k86N48j57j32J73j85LK95l53k3L8J07k77K77M4l9j98L19j62j86
7141b11P0N1K03j14p2j31J93K07j31J06l39M91l32JJ9l07M03k09j55K0J09K10
7163H2l55j00N96j41r3L5k69R7J25k21J97Rj77J93j62M45Q0m74J17P5j89J87j35
$$ y = [-80, 81, 81, 34, 341, -73, 1, 156, -170, 131, -152, 108, 122, -215, 68, 134, -228, 230, -197, 10, -79, 111, 243, -415, 3, 225, 54, -60, -7, -447, 146, -45, 89, 357, -134, -37, 299, -303, 43, 42, -182, 365, 3, -140, 242, -45, -39, 273, -125, -83, -87, 120, -68, -201, 59, -357, 83, 18, -120, 118, 272, -156, 91, 237, -247, 126, -26, -154, 75, 151, 130, 320, 90, 207, -141, 55, 322, -240, -152, 197, -132, 82, -181, -30, 345, -70, 20, 25, 135, 198, -51, 50, 320, -6, 125, -390, -51, -58, 124, -61, -91, -136, 116, -155, -75, -143, -303, 139, -114, -60, -162, 93, -218, -45, -17, -303, 245, 88, -44, 129, -56, -53, 242, -111, -134, -96, 11, -266, 11, 55, 16, -182, 137, -25, -211, -141, -90, 113, -1, -73, -204, -11, 196, 65, 171, -168, 323, -9, -8, 11, -296, 107, -102, -257, -237, -128, 82, -273, -373, 223, 82, -11, 24, -245, -148, -23, -244, -47, -38, -215, -22, -184, 261, 341, -133, -16, 59, -130, 57, -78]
7186g8K55m5l16M94l79M4K17l95K12P6M2J98k78j08K10k93l47P70j90l47J92m62
7208e28O66J32m03N30l43n1Q5k47K86k02J52J27k51K51k56J10J60k60j21M91n97
7229b69K1N40l90J61K0k31Q1L0k1L47n34L97m54p3K25J17p7k19M05j37j95K21
7251c5L19j27j4k1pj66K20l37K09J17J80k94K8J24o9j40K1j52j47K75N6L1k22
7274a51J62K55k46J03m6j98L19l02M8J63k0l60J61j29N2J6p8R6J61m7K51k28K00
7297A82k46J80l9r4k63L89j76J88J72j34j0p9o39R06j91m47O70m79N4K23k80J22
7319Im43L55J99k09K68j0k93Q9k5L37M2k69k57j29J6L83j00j27K80k92J80J80
7341A84m14K53K17j39O3k19r7J42N1n5K65l85J82j80N5K55k9Ok32n1K78l98K37
$$ y = [-78, 177, 132, -184, 310, -69, -25, 192, -203, 9, 85, 127, 325, 47, -61, 149, -144, -491, 279, 89, -258, -66, -528, 138, 270, -133, 397, 54, 3, 88, -159, 127, -75, 77, 204, -47, 204, -52, 58, 218, -42, -163, 328, -269, -248, 292, -98, 63, 83, -148, -67, -37, -58, 289, -245, 152, -302, -375, -150, -33, -110, -329, 76, -61, -256, -35, 284, 157, 143, 122, 115, -51, 169, -168, 41, 158, 338, 44, 72, 196, 127, -13, 8, -144, -291, -16, 40, 71, -151, 11, 266, 20, 123, 77, -121, 198, -104, -56, 107, 87, -273, -112, -241, -189, -173, -251, -155, 6, -41, 210, -18, 182, -64, 116, 77, -17, -280, 109, -67, 121, 293, 159, 149, 70, -569, 337, 146, -301, 369, -110, -56, 167, -113, 9, -434, -79, 120, -89, 179, 169, -124, -35, -60, 277, 319, 50, -207, -336, -320, 63, -37, -164, 116, -176, 4, 184, -230, 23, 240, 101, 164, -55, -152, -10, 41, -14, 251, -134, 48, -132, -77, 178, 149, 155, -77, -128, 150, -248, -11]
7364a1K14j94k20O71l87r8J49j08%k65L20N6k12K43o4k90K39J1q8j73L16p8p7
7387d6j05L93j05k28O2j9j39L40m04L51k32k3M80m27N8J66k45K77l78K07J52j74
7409c9K11L0j06j82L86o17N46n35J9M83o2%N2J42k84n5p5L87j16o8k82o7r2L38
7433A4o8M7R5K07l45J66j38N7M1L9p4J83k41k94O20k39K57l67Mm5m4J01q5K00
7457I1j54J48m20M36K04m65L46pk71K73J3l06k1m8J20j40j15L66J9j21Q8j29o8
7480a61K58o9J69p3k17R5j33J83j73j29M49j11r4jJ26J31p2o83O61k07K7l0L4
7503b0J43j10%p4K63Nj14k83K49J78l33L75l20n8J70k48R2K97j21jq5m20N27m76
7527c64K24L13l55K21J79p29N00P0J34p9k65O39l50k39M97l72j96J97R2k82J59
$$ y = [-11, 203, 9, -211, 460, 73, -25, 124, 16, 16, -249, 71, 127, -85, 158, 94, -196, 43, 54, -34, -207, 109, 31, -46, -151, 242, 137, -91, -29, -48, -187, 153, -251, 100, -132, -155, 325, -102, -44, 122, -123, 154, -224, -17, 135, -39, 172, 202, 96, -86, 300, -317, 229, -306, -287, 196, 134, 134, 186, 328, 44, -11, -86, 301, 185, 117, -165, -232, -324, 14, -54, -7, 88, 295, -50, 116, -22, 35, 76, 115, 41, 224, -17, -311, 309, 70, 327, -40, -36, -81, -125, -24, -109, 91, -63, 85, -335, 101, 305, -160, 186, 179, -92, 181, 194, -112, -133, -181, -61, -201, -316, 50, 69, -52, 36, -93, -161, 97, 28, 197, 124, -93, 2, -131, 52, -121, -250, 199, 88, -6, -7, 119, 250, 178, -505, 156, -51, -24, -54, -20, 123, 13, 13, -61, 202, 207, 93, -190, 59, 237, -96, 279, -41, -99, 71, -177, -85, 212, 91, 90, 5, -415, 112, -364, -140, 173, -182, 39, 218, -511, -11, 59, 193, 114, -151, 488, 138, -101, 396, 24, -172, 25, 117, -165, -6]
7548fk57M72k72j66K80j79K71n0k14J82J54k76n6K52k99J41N9r7j1o2M00m90J21
7571a03M0J44Q3ok97M82m65J3K69l16Q4o6M4M5L20o27L05L5j29J09l82N85l63
7594a96J29M40m27K1L59n28R7J49j78J71j30J53n5Q0r2J87k77J28j92J43j65j43
7616c26L05j5n8J17J56J30j61lj4J59o36O37m00J62j82j7L46j69k22N75m62lP9
7639bl4j80Q5J08M7l82L82J21l15k7J65l9lj65j56N54n72M43jk41Q0K22m58L84
7663A6m0k0J2l22N00Rk15J42m90O14j80j32J21j41J70J31j96o9L73k82M7Q4l17
7686a85J72k34J61M62n18J40J74q6j40J03k07R9K86m1p7J1m82L68J97l60n2J87
7708b2M2l83O32l60J5K61m82R2L08n6L6K8l75L06J93m35J22K59L7l92J71J67L71
$$ y = [-6, -263, 209, -63, -229, 51, -128, 143, 93, -121, 61, 215, -61, -117, 135, -164, -23, 36, -61, -72, -134, 266, -224, -103, -63, 81, 164, 158, -139, 343, -122, -109, 160, -156, -72, -138, -94, -49, 271, -356, -51, -16, -145, -36, -418, 167, -196, -67, 373, -54, -33, 326, -202, -105, 44, -134, 37, -93, 60, 5, 85, -7, 180, -97, 31, -161, -18, -183, -326, -21, -36, -94, 23, 179, 309, 148, 145, 131, 290, -346, 291, -109, 53, -129, -146, 200, 31, -191, 384, -78, -81, -2, -36, -216, -131, -23, 24, -358, 24, 145, -170, -197, -32, -71, -74, -239, -395, 159, -413, 30, 29, -212, -132, 90, -368, 16, -24, -44, -32, -354, 146, 155, -60, 82, -408, 206, 26, -106, 15, -126, 44, 175, -21, -90, 283, 1, 48, 132, -185, -13, -247, -86, 376, -142, -2, 172, 86, -54, 49, -158, -59, 227, 186, 109, 120, -362, 6, 203, -157, -209, -22, 20, -363, 269, -91, -76, 185, -297, -205, 103, 47, 83, 111, -264, 42, 235, -200, -78, 181, 218, -174, -3, 164, 535]
7731E35o24J94k25j0K56m5j66K42k34L08m8k08J23l62M75m7j28j86Q9N2K13j76
7753B8k2r6L3M6J14j64J13l44Q59o36q1K59j58NJ88n22Q1J61q9M90l49k8L36m4
7777A80k40k1P8j2j18J84J67m12K85j2n8j14J47j48J74j12R0j86q6L47j63r6Q3
7800d3j97N04m13O5L66j21q6k0j55J61J12k85k3P2o3N9l17K80N0k54J6N13l28
7823a07M97n54k1K46j8j30q8J33K03p4j83N9L05l77K42K35j22r3k60J82j06J18
7845H7l6j39n3L81k15O9j67L5J8J6m6K20OO5k66K03j59k92nM54P5m42j99L35K28
7870A73k90J06m3RQ9J90k28L29l26k41O65n53J57L9k43o4J28J89j43k35O54k46
7892A16l7l8k93L72r4j05R0m7P9M4K12k34K17m32L22k52P8Q6L8M69o18M3J03k34
$$ y = [535, -89, 105, -120, -130, 126, 81, -85, 157, -77, 231, 183, -25, 98, -264, 211, 164, 36, -150, -61, -9, 204, 28, 6, -90, -57, -11, 103, -61, 52, -292, 567, -69, -150, 109, -49, -44, 144, -378, -297, -136, -225, 265, -84, -112, 224, 180, -60, -81, -3, -15, -133, 51, 218, -194, 91, 79, 21, -93, 54, -94, 80, -32, 58, -128, -214, 133, -30, -126, -43, -240, 264, -149, -84, 282, 161, 75, 55, -100, 61, 173, -112, -135, -63, -126, -67, -384, -104, -54, -308, -292, 221, -107, 390, -164, -185, 61, 43, -87, -175, -42, 161, 87, -96, -37, 268, -109, 133, 368, 246, 153, -107, 75, -31, 87, 51, -88, -141, 240, 25, 94, -73, -38, -20, -4, -50, 170, 176, 241, -25, 178, 19, -273, -278, 176, 251, -191, -390, -55, 173, -117, -11, -54, -45, 44, 234, 6, 335, 9, -232, 433, -120, 37, 76, -167, -231, -103, 86, -57, -292, 362, 116, 79, 41, -252, 120, 26, -79, 11, -36, 43, 87, 299, 65, 282, -150, 172, -80, -2, 84, 122, 591, -27, 16, 119, -115]
7916a15M38l08m11M61p4j42L02l27J32K33k64p2rN6K89N4o02M37N2l44J28K7j12
7939a71L13k13K85k70K68N3l73j39p1J14m4L70k18J74P5Nj32J62j30l1k12K68
7961H3L7l69M89j88j66R2R9j07J74l76J12K87k69j58J36L04k49J39J67l02L5N6
7983B6J6m06J50K78J12k1j6J59j46p8N4j74L30m38o1J52k52j17J93L78Jj44m2
8006d6K9n4K46j63q3K61k42j16L12k95K31p1L5n39N61j61O0J05j09J0o9K93m6
8029A49k32P6J61k33J49j25Q8J00j83KK69k0k98j48L92k44j00q2N80j90j04j01
8051i4K2O0k4K99k20j63K65l78L61q8p9J59J18k58N2K2P0j61J9J31l40K06J87
8074A66l98K87o8O5rJ58r2k9l00L74k42j12L43J23l51K41j62J10K00m88N3K95
$$ y = [-115, 323, 15, -396, 65, -9, -151, 151, -176, -44, 189, -75, -147, -156, -100, 189, 243, -359, 78, 130, -214, -86, -59, -171, 142, -71, 214, -56, 212, 265, -108, -247, -318, -204, -248, 122, -96, 78, 153, 158, 26, 188, 58, 27, -185, 83, 120, -249, 240, 52, -114, -22, 77, -30, 144, -232, -120, 167, -102, -260, -124, 180, -69, 70, 237, -65, -30, 26, 42, -364, -214, 64, 176, 155, 139, 298, 152, 74, 128, -46, 284, -154, -215, -63, -315, -432, -239, 139, 140, -4, -46, -17, -71, 175, 12, -71, 190, -52, -168, 144, -151, 80, 9, 44, -495, 66, -95, -35, 70, -39, -29, -98, 195, 149, -83, -7, 154, -79, 70, -55, 33, 133, -50, -48, 221, 201, -97, -245, 147, -97, -197, -279, 301, 111, 7, -94, -72, -12, -36, 263, 43, -120, 145, -233, 128, 40, -39, 120, 238, -20, 32, 54, 124, -37, -18, 113, -227, -21, 166, -232, 55, -13, 52, 43, 201, 109, 80, -220, 154, -88, -200, 143, 266, -85, 156, -6, 104, 304, -184, -131, 164]
8096A64k85K97l37j59M70j7j65j11R3K19l08K89J68m49K60k31qK85q9k77K84k
8118I1mq5k77Q4RM78k99Q5O5M3L7l02k6M0R2N2P3k00L1N3P7L7j21m7j4J84l52
8145a96K17K73n59K76j0n4K80l70p7J02J50L8j96P4L9r6J76Q5j58K79k50J59l38
8168a56l7J72L3j81L47l31j17M81k74J27K76j95m64L96oK8l24J50L83m92J94J2
8190B2o2
$$ y = [164, -121, 176, -161, -320, 150, 133, -32, -143, -50, 169, -139, 150, 318, -131, 129, -102, -110, 175, 86, -191, 93, 91, 87, 2, -275, -191, -182, 296, -3, 82, 147, 190, 227, -75, -101, -61, 31, 83, 156, -44, -13, 40, 117, 154, 33, -14, -28, 156, -196, 21, 294, -265, 11, 1, -53, 227, -143, -220, -118, 32, 70, -126, -52, -13, -109, 67, 152, -6, 273, 23, 182, -156, -193, -21, 12, -169, 178, -153, -270, 211, -63, 64, 340, 145, -319, 77, 71, 99, -225, -75, 308, -184, 10, 22, -40]
8191d0
$$ Imaginary data points
##PAGE= N=2
##DATA TABLE= (X++(I..I)), XYDATA
0@%%%qK4l2M0m8O4r1J23j52J76k16K70l34M01m73N55o52P70r03J049j206J382
25G39j587J813k063K340k641K975l349L756m198M686n225N818o463P169p945Q798
41D623r743J0787j1942J3225j4660J6281j8124K0236k2679K5543k8966L3145l8368
54b0642M5099n4146O7013q6843J21492j98256O22034k27472j179913J490545m20497
65A58414q56555J198844k91355j096775J259846J23606j092085O90167L14849
74D08956q30972O06634K41322r04288L66243N35422o19158K7526K80236k59973
84a48052J38219K07420k40481q2545J57269J94285j77294k60744K76016J1420
94G5513k50613L23842j49366l97270O06845Q4004o57470M12003K30407n57420
$$ y = [0, 0, 0, 0, -8, 16, -16, 24, -24, 40, -51, 72, -80, 96, -120, 150, -184, 217, -256, 299, -353, 417, -486, 563, -643, 739, -848, 965, -1098, 1242, -1399, 1576, -1773, 1983, -2215, 2471, -2754, 3064, -3399, 3770, -4175, 4623, -5120, 5667, -6275, 6950, -7710, 8571, -9553, 10683, -11996, 13547, -15419, 17726, -20642, 24457, -29689, 37324, -49519, 71973, -126283, 495751, 268279, -911634, 578911, 158414, -698141, 500703, 209348, -887427, 372419, 496025, -596060, 94107, 408956, -422016, 184618, 425940, -478348, -112105, 423317, -195841, -168315, 111921, -148052, -9833, 197587, -42894, -125439, 31830, 226115, 48821, -211923, 64093, 75513, -175100, 148742, -624, -397894, 208951, 292955, -364515, 47488, 277895, -279525]
104b79525M38541J71081q27898M78069N16017q79945K32121N27356p71319L76057
114a9445N73095r93104K41189P94693q24696M5883O10858p63955J45347P30554
124E40419p98667j26005P95006m72567j73675O02476m96698j58342P33769m09799
134C5917l95310N66152j75285k28748M04876k66229k02089M42234p2561k23584
144a14627J24560p068L3353M8017j15888j3002m39N2899J10841k08682p6123L01730
156A35571p8004j63872K21470j36021j39094M07850j75573l89427M44833K067
166A29800l72792L96054r3245l96581N56917o058n40674M19075Q3681m06928L81454
177A50703j3010m77841M19186J64161m86848K30388J70566l58532K85487J38845
$$ y = [-279525, 159016, 330097, -497801, -19732, 496285, -383660, -151539, 375817, -395502, -19445, 553650, -439454, -198265, 596428, -228268, -182385, 428473, -335482, -190135, 540419, -258248, -384253, 410753, -61814, -235489, 366987, -129711, -288053, 445716, 35917, -359393, 206759, 31474, -197274, 207602, -58627, -260716, 181518, 108957, -114627, 9933, 2865, 36218, 84235, -31653, -44655, -45094, 7805, 118646, -90036, -166159, 135571, 57567, -106305, 115165, -20856, -159950, 247900, 72327, -317100, 127733, 129800, -242992, 153062, 59817, -336764, 220153, 214095, -326579, 92496, 176177, -230751, 150703, 137693, -340148, 79038, 243199, -243649, -13261, 157305, -201227, 84260, 223105]
187B23105m85272K42194K76502m05773J23439J59722l40765K33568J80780l96862
197a89362J21133K22930k17085P7839P4919k11404J16795J44884j85654l4667
207g9672R9254k8979K3647J4124q9615L8093P5918j8864j7824p1133L1177J24103
219A00229j21546m2407J14130j25638O4762J57588k66608K9401K68672k20596
229d2013k1905K03052k39671K5148K78945k70779j02649L13918j43394j21742
239a21090K64952j70443j38161L55529j29700k56416K99543m9482j97829K62661
249A19564r8265k14309K92730n606k26808J64115K3955j30639J40579j05j73829
260a08618J02620R6660j31662L562O1866o7661M9562N5248j01122N480P5818j3017
$$ y = [223105, -262167, -19973, 256529, -149244, -25805, 133917, -206848, 26720, 207500, -189362, -68229, 154701, -62384, 15455, 90374, -121030, -4235, 140649, -45005, -79672, 19582, -9397, 14250, 28374, -61241, -23148, 52770, 33906, 16082, -55051, -23874, 100229, -21317, -63724, 50406, -75232, -10470, 147118, -119490, -90089, 178583, -42013, -63918, 139134, -100537, -75389, 203556, -67223, -169872, 144046, 652, -121090, 143862, -26581, -164742, 190787, 61087, -195329, 104214, 54732, -143097, 119564, 21299, -193010, 99720, 94114, -132694, 31421, 55376, -75263, 65316, 65211, -108618, -5998, 90662, -41000, -37438, 24428, -43233, 6329, 61577, -39545, -34065, 41753, 28736]
272B8736k4674k7024J5655K2252k5717K8799l6180n1212J25307j2540j17325J00176
284B6253Q355q3363J08141k6690j32887J24576N0118j49227N7302P0877j23179
295f9724P7282R1575j85688N0107J60344j68437L260J29118j59321L5282J46658
306A10456j72072j3738J57775r3159l0444J03222p8868l2220J24325n3177r9187
317g7087J00363Q970q3343P3318q556q0681R6794J8846r1708M0759L0243l3790
329e872J4772K337k9962o35M0258n280n7349L5822L6906n0501K7320J8031o1236
342c5389M2143M0646p1418k916N2693l1297j7354M9282l5165l5413Q8957k0017
354B4752q0225Q4949k377p5223Q5569j9288q5806R5125O835q5692N7647K0112
$$ y = [28736, 4062, -22962, -7307, 14945, -10772, 18027, -18153, -69365, 55942, 43402, -73923, 26253, 34608, -48755, 59386, 32696, -100191, 24385, 74503, -74724, -17422, 53455, -69724, 7558, 99133, -86555, -36448, 123896, -44541, -41281, 87837, -71484, -36202, 110456, -61616, -75354, 82421, -10738, -41182, 62040, -16828, -49048, 75277, 22100, -77087, 23276, 32246, -51097, 22221, 13665, -67016, 29778, 48624, -43084, -2325, 27918, -5872, 8900, 11237, -18725, -19360, 20898, 15618, -41731, -5909, 30997, -19504, 7816, 25847, -35389, 6754, 47400, -24018, -26934, 25759, -5538, -22892, 26390, -8775, -44188, 44769, 24752, -55473, 29476, 27099, -48124, 37445, 18157, -67649, 27476, 34311, -51381, 6266, 26378]
366B6378n8938M3654K7144p2981J9874O4967o6148j3883O6513n6919n908P4037
378D7790o6685j7679P8909m1027k3567M6286k6864j4681L6222r691l4872K0171
390e688K9053l6377M68L5397l7573O968M2672m7809o281M4410k7052j3877K5594
403I905j0835j6029K4632R638l9486J7379L7330n0378R765M0909n9792J6530M7880
416C7448o4230Q898M9271m6518J474M0931l4469j1447M4199j8516l5844M4481
428A5678j939m6958M8078J204n4597N5068N971n5927M7453N117m3441L5673K406
441A3786l3605J9289J2628k1210j285K0503r703j3075K8182j0600k1024L1676
453A5562r472k1627K2719m435j3490J0420M080o403o093K0035l865k4833L3197
$$ y = [26378, -32560, 11094, 38238, -34743, -14869, 50098, -16050, -29933, 36580, -20339, -26247, 47790, -18895, -36574, 42335, 1308, -22259, 24027, -2837, -17518, 18704, 9013, -25859, -5688, 23365, -13012, -12544, 22853, -14720, -7752, 34920, -12889, -19170, 25240, -1812, -15689, 9905, -930, -16959, 7673, 17311, -22175, -4796, 32534, -17844, -8079, 32830, -26962, -10432, 37448, -26782, -17884, 31387, -15131, -13657, 27274, -7195, -18642, 25557, 7041, -28803, 15678, 13739, -33219, 14859, 16063, -38534, 16534, 22505, -33422, 14031, 19148, -24293, 11380, 13786, -19819, -530, 12098, -9112, -10397, 10106, 403, -12672, 15510, 4910, -16114, 15562, 6090, -15537, 7182, 2747, -10743, -323, 3757, -2646, -8739, 11296, 7431, -17402, 15795]
466A5795m651l6788M3659q487m1792M9587p991m0186M6012j714l7960L5281R263
479B0028m0812K2815K2770m6850J3384L7468n3772J0776M8853n9611J2728N0445
491C8222o1071J4863M3778n6579J3523L3605m4857R240K6443k9281J986K4253
503A4125j7455n845K3704j1860j2461K2855j2903j1100K1781j7701j656J7546
515I030k0751J3851O216k1669K7578r086k0993L6623k3078j6476M1031l0675j2965
528b1364M4097l0012j2448M3971k4514k0549M6716j8586l5584N1483j2493m9063
540c8346O1313j1124n7935P4018j1887o1872P7710j5209n8850P6379k0349n5828
552d1980O8475j4835m9588N5982p465m3666M8907K264m7074M1702J0288m9224
$$ y = [15795, 11144, -25644, 18015, 9528, -32264, 17323, 9332, -30854, 15158, 13444, -24516, 10765, 20028, -20784, 2031, 24801, -22049, -8665, 28803, -24969, -14193, 34660, -24951, -12223, 38222, -22849, -7986, 35792, -20787, -7264, 26341, -18516, -9276, 17167, -12114, -10128, 14125, -3330, -9175, 14529, 2669, -9792, 13063, 160, -10940, 10841, -6860, -8516, 9030, -11721, 2130, 8346, -13323, 14255, 5169, -15824, 20799, -2279, -18755, 22276, -8399, -21364, 22733, -7279, -19727, 24244, -270, -20819, 25897, 7311, -28273, 23210, 10717, -38346, 22967, 11843, -46092, 27926, 16039, -45833, 31877, 16668, -42182, 34197, 13848, -41980, 26495, 11660, -37928, 18054, 10589, -33077, 15830, 18094, -28980, 12722, 23010, -26214]
564b6214L8436O410n0951M4926K175m7496M6645o964l3489N1102k2942k4032N0235
577B7841l0465j1950L9170l8548p40M0510m1134k232M0933l5166q41M3767m3560
590a2415o796N8828m8519j7865O4711n5890j1220P6650p0863j1614Q6238o9807
602a8562o931P7255p5698J110P6484p5169p822O9944n9216n801O3082n8280j0159
615b9763P4447n0810k2841O9100m9510j5577P1355o4755j6305P7355o0153o988
627b4445O2786o6139J3720O1632p0884J0194M9282n7731J9038L3505o4049K1756
639a1335M5208n6704R979M0631n2444K2210M5662p3113J7270N7064p1336K0044
651f864M2485q1043M2600M8455q9033L7935M2254p1898M8661K2812q1613N2676
$$ y = [-26214, 12222, 18632, -32319, 12607, 14782, -32714, 13931, 6967, -26522, 24580, 1638, -22394, 27841, -2624, -14574, 24596, -13952, -14692, 25818, -15316, -17548, 23385, -11781, -12622, 31145, -12415, -19211, 39617, -8902, -26767, 37944, -17946, -29166, 47484, -23379, -34993, 51245, -18562, -25493, 51762, -23936, -22826, 53658, -21511, -29333, 40611, -18605, -24406, 38676, -19604, -29763, 44684, -6126, -28967, 40133, -9377, -24954, 46401, -18354, -34659, 42696, -17457, -24445, 38341, -27798, -14078, 47554, -23330, -13136, 36146, -21585, -2547, 30958, -33091, -11335, 33873, -22831, -12852, 27779, -24665, -2455, 43207, -29906, -12636, 44428, -26908, -6864, 35621, -45422, -2822, 45633, -43400, -5465, 36789, -35109, 13552, 36364, -45249, 7427]
663G427L1820p4040L5831K1703o2996M9812K5810q1050M4831M2545p4961M3253
675I985K5823q6974O5203L3600j02600N7354L1775q4316P0169J3081r2940P7391
687A7551K6521q5429N3236J4486o8111O0459J4462q3486M8714L5350o6713L8868
699E908J9031o8213N9698K6027q2791M5728J9977n9710N7337r362o5301P2056
711B0385j51n3562N3887j9629l0457P0446l1127m9143O2309j3073l6306N3756
723B7335l3413l9727Q2922k0927o2446P3035j6850m6165Q5634m3899o4710J02499
735D3288k7494o3452Q0812l9714l9242R7577m6035n7749Q6056k0037m2631O3685
747C5064l7744m1611Q2941k2265o3562O3751r439l8756O9439l5127n0831Q5188
$$ y = [7427, 39247, -34793, 1038, 22741, -40255, 9557, 35367, -45683, -852, 41693, -33268, 9985, 35808, -51166, 14037, 47637, -54963, 2391, 34166, -50150, 20019, 33100, -59840, 17551, 44072, -41357, 11879, 26365, -41746, 18713, 33175, -50311, -1597, 33753, -32960, 5908, 24939, -43274, 16424, 42451, -40340, 5388, 25365, -34345, 22992, 13630, -51671, 20385, 20234, -33328, 20559, 930, -29527, 40919, 9792, -39351, 22958, 9885, -26421, 27335, -6078, -45805, 37117, 16190, -46256, 26779, 9929, -36236, 49398, 5499, -59211, 43288, 15794, -47658, 33154, -6560, -45802, 51775, 5740, -52009, 34047, 14010, -28621, 35064, -2680, -44291, 38650, 16385, -47177, 16574, 7135, -31621, 37818, 2691, -48140, 37048]
759C7048j8265n0013N6782l4931j9198P1338m9822l2042O2008k5249p441L7483
771B7698m8088J895N8192l9858k0573L6842k9256N017M3127n9475p265O9296m2689
784e137j0696M7598n9969J7475O8289q2117n399O7285n7389J2702M4468p8195
796d1085K1688P0790o5085q117M9627m4007J1249M8655o9215q087P3200m3455
808c842j9414M7467m9074R688O5927o7445j2648O1760l9250M638K8898n9859K1281
821a1873M8160m9192k301K3883k3390K4656J5659m9129J1917L7388k6775j030
833b027Q157l3209L1653K6750n7228J1926L1412l1349L0900O45n8138N1429K3116
846C4037n7007K5359J747l3001N3398n840o0245M1897K4858l7281K1555j3m1317
$$ y = [37048, 18783, -31230, 25552, -9379, -28577, 42761, -7061, -39103, 22905, -2344, -9785, 27698, -20390, -18495, 39697, -161, -20734, 16108, -13148, -8131, 34996, -24479, -31744, 37552, -5137, -15833, 31765, -28204, -10729, 57560, -24557, -29956, 37329, -20060, -7358, 37110, -41085, -19397, 51393, -13692, -21809, 27818, -16189, -4940, 43715, -25500, -33587, 39613, -3842, -23256, 24211, -24863, -15175, 50752, -16693, -29341, 32419, -6831, -2193, 26705, -33154, -11873, 36287, -12905, -15206, 8677, -14713, 9943, 25602, -23527, -11610, 25778, -997, -2027, 6130, -27079, 4574, 31324, -25904, -13978, 17434, -13915, 16985, 17630, -40508, 10921, 34037, -22970, 2389, 4136, -28865, 24533, 18693, -41552, 345, 25203, -12078, 9477, 9464, -31853]
859c1853M7116K1655o8884J8929L4528l9977K8195Q587o0755M6615L5301n8434
871a8977J4943J4861k8304L6731j527m9643K4823K4605j9844K395m845j1350K9672
884A3540P831l4775M083J7151p146J2789j5343k8006L9433Q316l1667J6468j0159
897g485m289M4266k9077l2112M0205l360j1653J6562k9751l458M4099j4722k9622
910b0397J9312M017l417K0928k2926k5102M3154L351l4264J6374q581n946M1666
923B8169k7150l1335M1066j050j1386J5552k7926n48L9614j7795k6021J4108M580
936a22J680J1568j9273j5424L3995P561k8338N299J92k256K5148j9883k5261K7719
950B605N076n559K495k0219J0876K5428j6849j0294J211J470J6499n308k3139
$$ y = [-31853, 15263, 36918, -31966, -13037, 21491, -18486, 9709, 18296, -42459, 4156, 39457, -18977, -4034, 10827, -17477, 19254, 17727, -31916, -7093, 17512, -2332, 63, -4782, -16132, 13540, 21371, -13404, -9321, 7830, 684, 13473, -1870, -29876, 9557, 17873, -13794, 2674, -7485, -11774, 32492, 3415, -28697, 11508, 8148, -3505, 13057, -16694, -20152, 23947, 9225, -20397, -1085, 2932, -485, 20443, -2483, -27585, 15569, 18920, -15344, 1030, -7551, -13497, 28169, 1019, -30316, 10750, 9700, -1686, 13866, -14060, -14608, 25006, 7211, -18810, -4702, -122, 1558, 13126, -6147, -21571, 12424, 19985, -8353, -3054, -2862, -5118, 20030, 147, -25114, 2605, 7681, 2122, 4617, -15602, -4726, 20702, 3853, -6441, -5230, -3760, 12739, 7431, -15708]
963a5708N487J8185m11p990m382n863J6095J6273k8341r685K4281o362J778L649
977G006l0224J7991K9337k8430m753J0896p944J8537J378l0490O741K2428o545
990E928j0277j016l950J1202J5614k1631j3697K5363J009o883L283j9465R297
1003e223K4920k0842j0464Q710n4J3427l528j9545P510J3566L05p689j1007N445
1017d469J1254M61j1099q251J1017R234k872p426q968J3624J1948j5526l496L12
1031d257l32J9142j2356k0377J9802M038m461N716j5853K52K3132o955j6269L453
1045e325O574J148L489p538j3265J7053J4027k1374l38P733p184J6458m114k4996
1059a7652J6667J0978j1319K625p667j443J7469k979j2743R5P995N695m911o215
$$ y = [-15708, -10221, 7964, 7553, -437, -4819, -10682, 5413, 21686, -6655, -16340, 7941, 1579, 3357, 7006, -23218, -5227, 24110, -4320, -9073, 1823, -6121, 12416, 13794, -16696, -9955, 12473, 5928, -4349, -5365, -9315, 1887, 17501, -4130, -17827, 7536, 8545, 1662, 4945, -14520, -5223, 19697, -1145, -11609, -2899, -2953, 10474, 6946, -12599, -5089, 8477, 8782, 1093, -9914, -4469, 6785, 7246, -3853, -12104, -1087, 8147, 5275, -2151, -11119, 2505, 14453, -1073, -4569, -4257, -4589, 14553, 2197, -18180, 1622, 5660, 1199, 6915, -8938, -8686, 14446, 7491, -8778, -5325, 1249, 2397, 5886, -1652, -14917, 2136, 16163, -5211, -5549, 2184, -5000, 11458, 7344, -17652, -985, 9993, -1326, 1299, -6368, -7811, 9658, 6679, -6064, -5969, 2026, 7721, 2810, -3405]
1073c405l789P073R807j0610p278O461K162P330n403j2806J1664M500l766K032
1087C972j3665N200J6570j3266m441N645m865J1211K038j7464M111J2195l755
1100C486m605q4m092L685J2554j2395j2124J9313j831p454J1878j5871o69K5044
1114A6835j6994j0058J5008q235L632R405j7585l60J6703m100p629L097j058l91
1128a730R756o698j3131J4990K723j0216P663p683k055J7774j1194o916J0573
1141C856o590N616L934j5787O987P573p684M034l256n292J1353R13j0854K543
1155b654O175m459K642K878j4313Q124J4052j9598L161J1895j7799J3351Q929
1168A2384k7219J4330J3367k1789J0645M659j8259J5095P451k0199N517J2108
$$ y = [-3405, -7194, -121, 9686, -924, -8202, -1741, 421, 7751, 2348, -10458, 1206, 5706, 1940, 3972, -9693, -4493, 12077, -1189, -5630, 15, -4850, 6361, 8399, -9065, -4954, 7241, 3486, -1119, -1203, -5295, -1610, 10944, -1451, -13575, 5738, 3907, -3547, 8331, -7540, -8209, 16835, -159, -10217, 4791, -3444, 188, 9593, -7992, -8352, 8351, 4251, -3378, -281, -1339, -1730, 8026, 1328, -11803, 3187, 5910, -4306, 3357, -4326, -6381, 11393, 199, -6717, 3856, -2734, 2882, 6816, -8971, -1984, 5589, -2095, 1939, -1317, -6609, 4744, 5657, -5197, -2654, 3521, -938, 1704, 4582, -9731, -1607, 12445, -7153, -3992, 7903, -9896, 3455, 12384, -14835, -505, 12862, -8927, 1718, 6377, -11882, 3213, 10664, -9535, -4018, 8090]
1180H090j1649K485R269j6459M198J7958j9054j783J6750j6754O120J2045k2900
1193a1684R091J3784j8390P911M279j4060J4011J336j4141Q724K002o949P455
1206C369j672r284R887M215j2890O926M381j2992J3445J668k0274J8167K765k0311
1220a2600K0228m127j8655K6287o103j9572K3375o015j3410K0789p555j5063K0231
1233G810k114j7071J6186N9j7407J9449R14k3376K1832L225k4265K3095j970k3294
1247a6927K7510m253k2542K5415n898j5763K2684q073j3924K0539m633j3304J4915
1260E746k667j2070J5015k114j5250J6567m38j5732J8430m760j4326K3108j0173
1273A336j2916K3431j3725p251K2079j8383l493K1730j8645r78J9184j8039m19
$$ y = [8090, -3559, -1074, 8195, -8264, -4066, 13892, -5162, -6945, 9805, -6949, -829, 11216, -11684, -2593, 11191, -7199, 712, 4991, -9069, 4942, 6278, -7863, 861, 2863, -4086, 3369, 1697, -7587, 2300, 6515, -6375, 551, 4932, -8060, 5385, 7053, -13221, 4946, 7711, -12600, 7628, 3501, -15154, 11133, 5030, -14542, 8833, 2818, -10592, 10197, 2642, -12421, 7810, 5696, -11375, 4811, 4870, -12537, 6912, 7826, -15550, 6282, 9507, -14758, 8337, 6367, -16927, 10583, 6330, -16212, 9203, 3305, -12458, 10226, 2153, -11771, 8768, 4135, -9169, 5746, 3079, -8991, 6024, 3910, -11340, 5227, 4789, -10943, 7487, 2727, -11599, 11509, 1336, -11580, 11851, -1874, -9125, 12954, -5429, -8922, 12808, -5837, -6815, 12369, -5670, -6089]
1286f089J8900j7036l967K0849j6243p054K4578j7817r387K9749k0234r942L2493
1299A8800k3336q341L2913k6034o518L1084k5531m452K6950k1969l518K4213j8390
1312d129m978K1533j3976p447K0661j2814q776K1282j3459q213K2407j6277m273
1325h459K1729j9300P05J9027k2108N680J5470k3112R477J1470k1867J1285R835
1338I832k0678J1221J0597k0966R275J3278k2627P817J6522k6420Q216J9981k9844
1351a3796R581K1692l2495J2665K0351l3102J4571J7097l1203J4318J3950k7155
1363a3526J2882J2164k3034J0246J2328k0535P684J3964k0902P069J4140k2750
1375a0270Q721J3146k4457J2625J1572k5395J7151P776k4846K0077K888k2635
$$ y = [-6089, 12811, -4225, -8192, 12657, -3586, -10640, 13938, -3879, -13266, 16483, -3751, -13693, 18800, -4536, -12877, 20036, -5998, -12516, 18568, -6963, -11415, 15535, -6434, -9952, 14261, -4129, -9107, 12426, -1550, -8997, 11664, -1150, -9926, 11356, -2103, -10316, 12091, -4186, -8459, 13270, -6030, -5325, 13702, -8406, -2726, 12744, -10368, -891, 10579, -11288, -3, 9832, -10846, 375, 10972, -9994, -719, 12559, -10068, -2251, 14271, -12149, -3933, 16048, -13796, -4215, 17477, -15018, -2353, 17998, -15104, -533, 16564, -14639, -321, 13629, -13526, -644, 11520, -11514, -1268, 11060, -9475, -1791, 12173, -8729, -1660, 12480, -10270, -1549, 11597, -12860, -235, 11337, -14058, 3093, 10869, -13977, 6100, 8988, -13647]
1387a3647K0267N83k0667J9758m87j8480J7824J141j8477J6484M477k0613J6197
1400D360O052k3717J7322N945k5016J9729L906k4559K2007J614k2056K2819k724
1413E682j8112K1662n191j4649J8238n483j2039J6586m929j1895J6704k891j3535
1426i852J7789l497j6296K1866n707j8644K4981p803j8485K7805j0969j6451K8942
1439A3679j2229j4856K6252j1600j2651K2550r906j3251J9930n328j4266J7481
1451E805k269j4381J8271j905j6734J8397k396j4548J7654p231j0427J8552j0325
1464a537o281J5620j1582Q2J3026j4399K325J1553j3377K860R010j3793K935J2153
1478H595j4308l50J5943j4483j409J9685j9291k114K3625k2008k982K3420k2170
$$ y = [-13647, 6620, 7203, -13464, 6294, 5807, -12673, 5151, 6292, -12185, 4299, 8776, -11837, 4360, 10412, -13305, 4017, 9962, -15054, 4675, 8581, -15978, 6029, 7643, -14413, 8406, 5682, -12430, 9232, 4041, -10608, 7630, 2147, -9892, 6694, 1765, -10130, 6574, 3683, -9852, 7937, 4440, -11856, 10010, 4303, -14341, 10640, 2837, -15648, 12157, 1188, -15263, 13679, 1450, -13406, 12846, 1246, -11405, 11145, 1239, -12012, 7918, 2590, -11676, 5805, 3536, -10845, 7426, 5521, -11213, 7184, 4788, -9760, 7894, 663, -9764, 8788, -1537, -7818, 7802, -3780, -3698, 9328, -5071, -2746, 8807, -4570, -1710, 7300, -6493, -3558, 8595, -5713, -6063, 9880, -4603, -6012, 13673, -5618, -7732, 15893, -6115, -9097, 14323, -7847]
1491g847J52K2707k3464L93K1691j7764j655J6727j4798j732J5694j1740o993
1504h629J5028o511p399J4230p929o551J7005q803o272J3112r736K61R806j3895
1518f283L966P697j0878P050J304r934J1069J109j0864Q295Q65p988P527J186
1532D121j2327Q505O829j4241O247P943j5680J0801Q692k2099J1405J0216j9996
1545i584J1500N014j9062J4371N664j6925Q568O575j0972O359M556j1979M849
1558a066Q772j1137m22Q497r500L462Q850j4285M392R624j0778M905K281r641
1572f046R686L24r829O449q57k420P064n350l484P733o72l536K281j569k241O298
1588C831j976q690P764J865p671R061l677q054J5408m365j0852J2664n197n042
$$ y = [-7847, -7695, 15012, -8452, -8059, 13632, -4132, -5787, 10940, -3858, -5590, 10104, -1636, -8629, 6399, -112, -7511, 6719, -1210, -7761, 9244, 441, -5831, 7281, -2455, -2194, 7612, -6283, -2317, 5380, -5498, 1552, 2856, -7078, 3991, 5100, -5764, 2531, 3396, -4592, 2935, 4121, -8206, 299, 7128, -7113, -866, 7077, -8603, 2198, 10890, -11209, 196, 10412, -9584, 1916, 6930, -12132, 2239, 7903, -9022, -454, 6121, -4851, 1508, 6064, -5915, -1066, 7706, -3431, -3853, 4644, -4856, -1394, 7456, -6829, -2437, 7187, -3591, 1314, 3595, -6046, 3640, 3964, -5865, 584, -273, -2693, 4371, -979, -4463, 3270, 2598, -938, 1343, -226, -2467, 3831, 1855, -6835, 929, 2794, -4877, 4184, 507, -7547, 7861, 3496, -7356, 5308, 111, -4931]
1602d931J2369r564n881J2616l076n390O079l010k467Q542k210r174O990L953
1616D846r098N793n98q708J2246Q4j1631R159q86l722Q671p203m275R482k979
1631A181k969J753l316K984L274l121k533K526K657j320r3k173j827P072k975
1646A120n931N774k640O37O979j0083M71J0012p547J323K943q690O534M721r609
1661c986J187M170k291J913J190n426J323Q216m970n526O708l517j098Q349j0526
$$ y = [-4931, 7438, -2126, -8007, 4609, 1533, -3857, 2222, -788, -3255, 5287, 3077, -6097, 893, 4846, -4252, 1541, 943, -7765, 4481, 4565, -7066, 2093, 1207, -2515, 6156, -1047, -5322, 4160, 1181, -1788, -35, -3351, -367, 2907, -214, -2747, -221, 2436, 1116, 1023, -1150, -2977, 4095, 1120, -4811, 963, -1677, -1040, 5939, -4144, -3673, 6339, -1208, 115, 3058, -5632, 902, 5623, -3986, -2799, 1371, -920, 993, 2183, -3243, -1920, 6296, 1326, -4200, 2508, -1009, -2107, 6242, -4284]
$$ [...]
8191A72
##END NTUPLES=NMR FID
##END=
