##TITLE=1H_76-2022
 CDCl3
 8 sc, 
 19.09.2022
##JCAMPDX= 6.0         $$ Bruker NMR JCAMP-DX V2.0
##DATA TYPE= NMR SPECTRUM
##DATA CLASS= NTUPLES
##ORIGIN= UXNMR, Bruker Analytische Messtechnik GmbH
##OWNER= root
$$ XWIN-NMR		Version 3.5
$$ Mon Sep 19 13:51:47 2022 Russian Standard Time (UT+4h)  she@DPX200
##.OBSERVE FREQUENCY= 200.1313499994
##.OBSERVE NUCLEUS= ^1H
##.ACQUISITION MODE= SIMULTANEOUS
##.ACQUISITION SCHEME= undefined
##.AVERAGES= 8
##.DIGITISER RES= 18
##SPECTROMETER/DATA SYSTEM= spect
##.PULSE SEQUENCE= zg30
##.SOLVENT NAME= CDCl3
##.SHIFT REFERENCE= (INTERNAL, CDCl3, 0, 15.7359)
##AUDIT TRAIL= $$ (NUMBER, WHEN, WHO, WHERE, WHAT)
$$ ##TITLE= Audit trail, XWIN-NMR		Version 3.5
$$ ##JCAMPDX= 5.01
$$ ##ORIGIN= Bruker BioSpin GmbH
$$ ##OWNER= she
$$ F:/spectra/data/she/nmr/H-F/1/pdata/1/auditp.txt
$$ ##AUDIT TRAIL=  $$ (NUMBER, WHEN, WHO, WHERE, WHAT)
(   1,<2022-09-19 13:50:30.43 +0400>,<she>,<DPX200>,
      <created by zg, POWCHK disabled, PULCHK disabled
       configuration hash MD5:
       00 E9 B6 7A A2 85 ED C7 34 08 36 98 17 FE 4E 26
       data hash MD5: 16K
       02 28 8A 9D 78 C3 43 9D FE E0 F0 9C BC BC 4B 9C>)
(   2,<2022-09-19 13:50:32.84 +0400>,<she>,<DPX200>,
      <Start of raw data processing
       efp BC_mod = 2 LB = 0.24 FT_mod = 6 PKNL = 1 PHC0 = -18025.48 PHC1 = -3.99931 SI = 16K 
       data hash MD5: 16K
       6A 03 27 A3 8C E8 F3 D1 45 10 B8 6A B2 FB 80 9C>)
(   3,<2022-09-19 13:50:54.56 +0400>,<she>,<DPX200>,
      <pk PHC0 = -9.02624 PHC1 = 11.4 
       data hash MD5: 16K
       E4 CC A2 17 27 0B 85 B2 EB DE A5 25 ED EB CA AE>)
(   4,<2022-09-19 13:50:57.70 +0400>,<she>,<DPX200>,
      <abs ABSG = 5 
       data hash MD5: 16K
       C0 C8 13 B6 8A D1 BD 80 F8 A6 E8 0F C2 4B 3A 72>)
$$ ##END=
$$ 
$$ hash MD5
$$ DA E6 0C 98 07 A6 52 FC CE 93 39 8C BD 53 2A C7
##$RELAX= 
##$RELAX= 
##$RELAX= 
##$RELAX= 
##$RELAX= 
##$RELAX= 
$$ Bruker specific parameters
$$ --------------------------
##$DU= <F:/spectra>
##$EXPNO= 1
##$NAME= <H-F>
##$PROCNO= 1
##$TYPE= <nmr>
##$USER= <she>
##$AMP= (0..31)
100 100 100 100 100 100 100 100 100 100 100 100 100 100 100 100 100 100 
100 100 100 100 100 100 100 100 100 100 100 100 100 100 
##$AQSEQ= 0
##$AQ_mod= 1
##$AUNM= <au_zg>
##$AUTOPOS= <>
##$BF1= 200.13
##$BF2= 200.13
##$BF3= 200.13
##$BF4= 200.13
##$BF5= 200.13
##$BF6= 200.13
##$BF7= 200.13
##$BF8= 200.13
##$BYTORDA= 1
##$CFDGTYP= 0
##$CFRGTYP= 5
##$CHEMSTR= <none>
##$CNST= (0..31)
1 1 145 1 1 1 1 1 1 1 1 1 1 1 1 1 1 1 1 1 1 1 1 1 1 1 1 1 1 1 1 1 
##$CPDPRG= <>
##$CPDPRG1= <>
##$CPDPRG2= <>
##$CPDPRG3= <>
##$CPDPRG4= <mlev>
##$CPDPRG5= <mlev>
##$CPDPRG6= <mlev>
##$CPDPRG7= <mlev>
##$CPDPRG8= <mlev>
##$CPDPRGB= <>
##$CPDPRGT= <>
##$D= (0..31)
0 1.2 0 0 0 0 0 0 0 0.06 0 0.03 0 0 0 0 0.0002 0 0 0 0 0 0 0 0 0 0 0 0 
0 0 0 
##$DATE= 1663581029
##$DBL= (0..7)
120 120 120 120 120 120 120 120 
##$DBP= (0..7)
150 150 150 150 150 150 150 150 
##$DBP07= 0
##$DBPNAM0= <>
##$DBPNAM1= <>
##$DBPNAM2= <>
##$DBPNAM3= <>
##$DBPNAM4= <>
$$ [...]
##$SUBNAM3= <"">
##$SUBNAM4= <"">
##$SUBNAM5= <"">
##$SUBNAM6= <"">
##$SUBNAM7= <"">
##$SUBNAM8= <"">
##$SUBNAM9= <"">
##$SW= 18.0517283424941
##$SWIBOX= (0..15)
0 0 2 0 0 0 0 0 0 0 0 0 0 0 0 0 
##$SW_h= 3612.71676300578
##$TD= 16384
##$TD0= 1
##$TE= 0
##$TE2= 300
##$TE3= 300
##$TEG= 300
##$TL= (0..7)
0 120 120 120 120 120 120 120 
##$TP= (0..7)
150 150 150 150 150 150 150 150 
##$TP07= 0
##$TPNAME0= <>
##$TPNAME1= <>
##$TPNAME2= <>
##$TPNAME3= <>
##$TPNAME4= <>
##$TPNAME5= <>
##$TPNAME6= <>
##$TPNAME7= <>
##$TPOAL= (0..7)
0.5 0.5 0.5 0.5 0.5 0.5 0.5 0.5 
##$TPOFFS= (0..7)
0 0 0 0 0 0 0 0 
##$TUNHIN= 0
##$TUNHOUT= 0
##$TUNXOUT= 0
##$USERA1= <user>
##$USERA2= <user>
##$USERA3= <user>
##$USERA4= <user>
##$USERA5= <user>
##$V9= 5
##$VALIST= <valist>
##$VCLIST= <CCCCCCCCCCCCCCC>
##$VD= 0
##$VDLIST= <DDDDDDDDDDDDDDD>
##$VPLIST= <PPPPPPPPPPPPPPP>
##$VTLIST= <TTTTTTTTTTTTTTT>
##$WBST= 1024
##$WBSW= 4
##$XGAIN= (0..3)
0 0 0 0 
##$XL= 0
##$YL= 0
##$YMAX_a= 354867
##$YMIN_a= -275715
##$ZGOPTNS= <>
##$ZL1= 120
##$ZL2= 120
##$ZL3= 120
##$ZL4= 120
##$ABSF1= 15.7502
##$ABSF2= -2.301649
##$ABSG= 5
##$ABSL= 3
##$ALPHA= 0
##$AQORDER= 0
##$ASSFAC= 0
##$ASSFACI= 0
##$ASSFACX= 0
##$ASSWID= 0
##$AUNMP= <proc_1d>
##$AZFE= 0.1
##$AZFW= 0.1
##$BCFW= 0
##$BC_mod= 2
##$BYTORDP= 0
##$COROFFS= 0
##$CY= -3
##$DATMOD= 1
##$DC= 0
##$DFILT= <>
##$DTYPP= 0
##$F1P= 0
##$F2P= 0
##$FCOR= 1
##$FTSIZE= 16384
##$FT_mod= 6
##$GAMMA= 0
##$GB= 0
##$INTBC= 1
##$INTSCL= 3.70164e-10
##$ISEN= 128
##$LB= 0.24
##$LEV0= 0
##$LPBIN= 0
##$MAXI= 10000
##$MC2= 0
##$MEAN= 0
##$ME_mod= 0
##$MI= 1.114404
##$NCOEF= 0
##$NC_proc= -7
##$NLEV= 6
##$NOISF1= 3.799351
##$NOISF2= 2.8
##$NSP= 0
##$NTH_PI= 0
##$NZP= 0
##$OFFSET= 15.73587
##$PC= 1
##$PHC0= -18034.51
##$PHC1= 7.40069
##$PH_mod= 1
##$PKNL= yes
##$PPARMOD= 0
##$PSCAL= 0
##$PSIGN= 0
##$REVERSE= no
##$SF= 200.130007137976
##$SI= 16384
##$SIGF1= 3
##$SIGF2= 2
##$SINO= 5.538805
##$SIOLD= 16384
##$SREGLST= <1H.CDCl3>
##$SSB= 0
##$STSI= 16384
##$STSR= 0
##$SW_p= 3612.71676300578
##$SYMM= 0
##$S_DEV= 0
##$TDeff= 16384
##$TDoff= 0
##$TI= <>
##$TILT= no
##$TM1= 0
##$TM2= 0
##$TOPLEV= 0
##$USERP1= <user>
##$USERP2= <user>
##$USERP3= <user>
##$USERP4= <user>
##$USERP5= <user>
##$WDW= 1
##$XDIM= 16384
##$YMAX_p= 400719690
##$YMIN_p= -1032691
$$ End of Bruker specific parameters
$$ ---------------------------------
##NTUPLES= NMR SPECTRUM
##VAR_NAME=  FREQUENCY,     SPECTRUM/REAL,   SPECTRUM/IMAG
##SYMBOL=    X,             R,               I
##VAR_TYPE=  INDEPENDENT,   DEPENDENT,       DEPENDENT
##VAR_FORM=  AFFN,          ASDF,            ASDF
##VAR_DIM=   16384,         16384,           16384
##UNITS=     HZ,            ARBITRARY UNITS, ARBITRARY UNITS
##FACTOR=    0.220516191357247, 1,           1
##FIRST=     3149.21984773486, 0,            0
##LAST=      -463.496915270917, 0,           0
##MIN=       -463.496915270917, -1032691,    0
##MAX=       3149.21984773486, 400719690,    0
$$ Real data points
##PAGE= N=1
##DATA TABLE= (X++(R..R)), XYDATA
$$ [...]
11411 -104705 -45145 276207 141459 23297 32024 -135316 -332110 -183425 28417 -291834
11401 -291834 -54348 -80696 -254937 -100905 27918 -130271 -39385 -118872 -86600 -115801
11391 -115801 3598 -48335 4810 -178880 -169217 -63748 -68021 21961 62378 165026 262903
11380 262903 479648 79800 -35293 -77663 -210720 -71840 -5974 -99960 -124745 167632
11370 167632 50843 -242490 -284714 -158423 -207524 -435432 -228918 21793 160209 118248
11360 118248 225008 233871 201261 -99313 179895 511254 130715 103426 6077 -101254
11350 -101254 104165 247951 -118874 -206116 1960 183392 222171 123772 160919 92623
11340 92623 160987 365108 288717 -23285 3393 258628 244826 184400 -46413 -122834 -72589
11329 -72589 -85707 133331 379870 525676 472985 510808 150051 -123820 241593 248716 19494
11318 19494 -8551 -256763 -322008 -160040 -194162 -14901 -64147 -82729 -17114 -155907 32063
11307 32063 -386566 -409439 38165 254748 -68799 175689 13498 -172998 45719 -289785
11297 -289785 -77951 -193112 -277569 16293 126840 42676 -60236 -10453 -49200 5197
11287 5197 176665 250064 56648 -186458 -287201 -82566 -35655 324253 37011 153812
11277 153812 195588 267615 104458 114515 133298 24870 143510 210670 396909 331071 397805
11266 397805 350098 313725 397995 373249 -48205 -197306 -164880 -147133 -192555 -118835 -79085
11255 -79085 -11768 104105 153966 -14728 70827 329272 229833 -108172 67704 -43249
11245 -43249 -6168 -17860 -21478 80625 170658 85860 -172924 222738 342021 176265 227081
11234 227081 -9707 88046 -207316 -186732 -147421 -49124 91224 320854 119879 18192
11224 18192 132016 299329 39672 416979 253995 -39583 179765 388522 344383 -40773
11214 -40773 139788 -39679 -9542 -123203 -246821 107726 157173 120118 215597 137224 966
11203 966 238834 146623 403231 321211 73175 185220 195639 126729 -108442 53988 233607
11192 233607 10898 314841 405431 164535 -58181 -89081 -158868 227431 440845 538485
11182 538485 372282 148768 145137 -2879 181272 -49654 -433122 -651318 -352313 -221945
11172 -221945 -72583 -179774 -36347 -328497 -72856 72751 108531 85415 -80854 -241715
11162 -241715 -156543 -205917 44442 251433 356494 295503 116875 -38423 -216600 41054
11152 41054 54870 -318166 -157611 -237324 -177924 -292652 -98100 -221943 -434318 -54944
11142 -54944 -131297 -150524 110828 4360 -191312 -25873 287884 59707 63622 -46509
11132 -46509 -16766 57204 93467 202424 306803 225466 -49075 -92129 45933 53928 127511
11121 127511 289554 231815 178831 159026 -5853 212734 263016 -91729 -35917 130570
11111 130570 300489 55554 -81448 -93462 102734 160239 106614 89838 8743 -279696
11101 -279696 -282704 -183042 -148266 -233248 -92615 184651 77670 47805 491461 264141 -128840
11090 -128840 -51616 -18540 -190209 -135860 476731 560126 365655 152845 485178 238172
11080 238172 -22989 -89013 -196903 155669 35469 30113 -40875 -82021 -101334 20354 -72978
11069 -72978 94368 86643 333918 531252 450067 385094 533639 50936 82329 137060 118133
11058 118133 -41147 95528 201845 148202 73750 -33637 -149961 37926 346328 417343
11048 417343 595932 494172 405025 282075 115716 -155241 101912 139827 29120 3545
11038 3545 373872 265031 320027 393357 -101818 97109 188803 96530 71986 89329 213405
11027 213405 213716 7906 -344821 -319928 -117300 -7502 -62013 359904 574718 186592
11017 186592 180406 -58622 191777 156852 -112530 -222672 136179 250703 -56527 -1882
11007 -1882 72733 164058 300677 202425 33174 186877 207403 255827 185293 245668 103941
10996 103941 88573 182386 298214 143367 65375 -18119 -26416 10614 189316 296153 282601
10985 282601 188843 193487 128876 -32415 141703 42528 65694 186237 25590 174005 481339
10974 481339 542617 317545 125775 153113 223665 -64633 -84215 12691 -211349 -216117 -77713
10963 -77713 -73012 742 96419 244803 249896 127074 -43233 -82784 -17504 -47620 23860
10952 23860 338218 262973 136122 92784 40039 76149 -120199 258817 369151 106685
10942 106685 -175153 -29764 155122 16943 202633 82954 76824 -64049 89714 566254
10932 566254 292036 -156058 -381996 87131 22916 -8203 139847 21493 204517 321575
10922 321575 305916 232654 214319 96049 219786 3294 31588 138792 330875 118504
10912 118504 -22038 123086 70709 161858 29995 97107 353967 414828 232923 261386
10902 261386 173883 -75430 -399480 -207860 -298888 80030 121971 -121400 17143 -90818
10892 -90818 -176753 -280447 -260924 -54386 -113357 173574 305714 -201491 -160582 -24476
10882 -24476 326705 263986 541526 319830 65757 131687 325487 299045 541067 307061
10872 307061 163064 235044 13358 -92447 67855 202204 37886 -6620 16044 128697
10862 128697 -140035 -55816 21028 325330 175955 145317 323001 293101 231902 -44561
10852 -44561 147510 271069 164520 145351 228841 542840 356597 21273 -29017 -115757
10842 -115757 -18831 28431 -43239 347943 393800 92615 157645 186387 47607 -128678 37493
10831 37493 206798 -188512 -40457 109715 -38713 -263647 6572 323223 227794 94712
10821 94712 -72354 25858 168186 369410 264192 397004 352531 132673 193267 36206
10811 36206 -224641 -202950 -5304 385336 371135 103921 256421 -5310 -46883 -142996
10801 -142996 -270133 -225332 -138214 63188 322628 119413 84662 -80722 55784 303492
10791 303492 238792 -34361 -14608 412273 449815 149863 69831 211663 149198 -239993
10781 -239993 -29139 145469 35252 80372 150020 227760 119413 32155 84414 -98438
10771 -98438 153778 399718 453824 314028 63852 334585 108515 1270 -36085 116062
10761 116062 276884 95541 32152 48969 14987 12859 275614 59483 75424 128620 235595
10750 235595 147878 4176 236995 49292 307089 66224 91307 91200 -60403 -46563 28497
10739 28497 -262182 -159495 -54426 -37290 211302 65010 -431570 -253580 -81356 131980
10729 131980 167502 298122 481379 272148 365920 323252 215403 131351 238560 227472
10719 227472 -124059 14131 3201 179156 361341 291235 213065 289341 304787 389068 54419
10708 54419 -168883 25403 179416 378378 35413 31619 227553 269266 369533 94705
10698 94705 -53692 239039 332581 402138 512912 592807 464809 316700 407218 17680
10688 17680 60923 324061 463595 130923 -101972 161436 68562 -66128 125584 -10754
10678 -10754 60921 -7149 228328 -11936 -27377 223086 -30120 19342 -82200 -22454 -226321
10667 -226321 -195818 -231829 -7133 355647 287169 248342 383112 31425 119197 -134304
10657 -134304 450820 357554 218885 134553 288321 384508 356495 291939 168999 96971 182678
10646 182678 249416 429391 460314 289097 141134 -255944 -35340 -178132 88629 -79945
10636 -79945 -22066 649344 474939 67667 -288738 -264142 45101 157470 153049 -156770
10626 -156770 -4253 -114825 -416082 34911 132511 245403 360870 584932 492556 78148
10616 78148 30738 59972 -85867 -37141 122821 87757 92523 -22587 -14187 177938 -188428
10605 -188428 -214886 -163541 74165 154326 -14660 -16746 171999 60902 -8637 -17670 70197
10594 70197 112932 254598 207039 -201573 -277778 -117719 145887 158716 198547 -7992 313379
10583 313379 492811 349296 141314 -202864 51655 575775 395853 366513 282476 418782
10573 418782 554211 426215 133052 269330 -8971 198406 320215 258453 387708 233531
10563 233531 279774 -33812 17044 155659 191182 351027 235979 -69640 108458 70850
10553 70850 -4557 -79397 155579 567550 310720 303202 45981 -173089 -177958 155403 122806
10542 122806 -13650 189247 172613 168212 177382 265248 315312 86605 250945 341735 296742
10531 296742 458273 408564 456161 425282 112242 269784 85279 34620 150514 -48485
10521 -48485 -51721 8221 -8933 164271 301428 341900 467567 358445 195233 254722 103247
10510 103247 79387 126027 -200469 217292 357300 348333 212880 83348 161968 153903 254684
10499 254684 197654 260437 58276 -10177 144423 69387 -245186 73573 152780 180609 318041
10488 318041 -77233 -9170 31313 -182136 -333963 -131560 98038 248617 546290 428536
10478 428536 196641 -30335 -76408 -2521 57472 -74453 -105895 218882 294324 295641 -73117
10467 -73117 4968 172363 468481 156889 -70846 -46278 85165 284732 207166 206325 144654
10456 144654 215778 275465 433341 375259 223039 -121666 -246880 112739 -127638 -48639
10446 -48639 239218 486172 739952 539711 266745 61769 156268 231347 86210 196714
10436 196714 34687 38189 -360138 -220417 -69275 207300 605767 362487 321472 472925
10426 472925 269795 253323 360575 68686 107469 319839 464162 356690 296800 68281
10416 68281 278106 79811 123066 161472 205199 184455 196839 300453 -104797 54630 262424
10405 262424 422975 368332 413783 484542 421947 449976 415272 354307 254349 304655 387337
10394 387337 352291 263247 206799 296727 178486 74396 400289 418823 390072 395567 171284
10383 171284 122068 -166876 -113638 -36514 14026 -39563 -3124 259096 216421 178612 508242
10372 508242 418854 397398 528115 446113 504622 512330 383351 300774 599480 282850 382500
10361 382500 716668 964505 930377 578156 457540 392870 114619 129007 -83023 46296
10351 46296 296622 425409 430505 111617 439410 155176 -74970 114890 9537 -140156
10341 -140156 -158951 132462 381794 180598 33677 98463 229725 205371 29225 263546
10331 263546 -23313 12296 184469 140025 563002 367002 130425 119947 160822 90794
10321 90794 -111919 2634 -185055 -64519 -122109 179605 179949 131787 87485 416510 465989
10310 465989 430147 367392 445678 457838 234145 458103 366564 358166 161140 417162 328412
10299 328412 314588 344906 308357 528854 430060 185353 329170 343709 196004 256148 370717
10288 370717 393763 279008 353894 414501 434141 487491 635189 541503 340345 333461 422507
10277 422507 409430 379226 410182 316317 40437 61924 170152 338378 262984 309663 370233
10266 370233 459327 339471 506848 566172 332919 383214 386956 416718 324706 569881 386274
10255 386274 405990 175768 210748 184239 424746 538458 472732 334207 159851 143039
10245 143039 56436 -4891 -179829 -262809 43936 120548 340415 173006 103982 317267
10235 317267 122032 280576 366182 580666 365107 158894 -26308 198490 232196 158870
10225 158870 245929 265933 293895 60026 80295 329447 512139 29182 172568 43441
10215 43441 3834 62740 354446 383417 206442 300397 612660 601714 464908 421066 223367
10204 223367 -213112 62888 312553 143449 150041 141902 110274 39036 110959 -16480 -23555
10193 -23555 -242930 99839 430801 447517 390374 123459 499816 611113 656481 679147
10183 679147 233561 282470 174376 329295 201765 345808 617346 560891 324997 55875
10173 55875 265573 338381 282647 117640 186173 284870 221286 420522 387302 350020 337482
10162 337482 454891 171317 2816 241728 417034 452301 526434 682319 436696 218447
10152 218447 245335 413945 77835 -21550 113153 86143 23606 -83384 124210 378072
10142 378072 346608 325668 492731 485633 461958 -105522 66012 263647 126901 200099 342423
10131 342423 151601 287102 117007 470945 647805 549752 664066 628681 617492 345401
10121 345401 227058 480401 468047 327142 376247 409273 313479 489572 736596 261418
10111 261418 310867 431656 377550 280119 487529 654609 762709 642658 663534 559133
10101 559133 373187 424710 196113 45402 -11831 312536 318314 265019 379312 399396 422613
10090 422613 605843 282334 336021 267352 125498 317584 270633 344327 451552 601675
10080 601675 528520 510691 489675 685995 574809 355895 252174 488109 272179 483427
10070 483427 689966 337697 364722 434748 456150 570044 561789 438629 628853 566479 669135
10059 669135 472861 394795 74893 250764 408873 141662 75704 217829 604947 696530
10049 696530 510581 359831 508320 424674 473027 536318 419517 94905 281457 221860
10039 221860 157231 649819 915798 674434 905692 782579 469799 161332 303701 368103
10029 368103 419753 418924 311261 194222 191005 569299 520883 356040 292635 121898 256327
10018 256327 371670 579557 310252 358429 382568 404058 400437 248094 132511 216781 375257
10007 375257 393156 357893 382731 520702 432641 567694 441384 293671 -6667 140220
9997 140220 135786 331723 371310 229527 411819 295757 373044 349679 626678 245721 516373
9986 516373 713033 675168 710910 507370 324603 327829 684610 217135 324869 181101
9976 181101 44148 207218 424546 366450 294708 297290 239282 307229 274171 494258 603099
9965 603099 569367 474188 418339 306090 -26127 -64087 304775 343940 269491 473791 259875
9954 259875 323609 377630 757149 759833 504263 279351 232381 573806 668950 324347 110389
9943 110389 -233130 -12569 474073 442691 391016 637527 420553 429801 474434 533352 440016
9932 440016 295953 562200 817405 860483 778419 982385 629648 421800 620075 817098
9922 817098 943200 636161 395565 381916 261685 349017 480730 251874 342493 610419
9912 610419 702789 444078 442736 629842 472096 503650 453233 425575 434066 365642 298497
9901 298497 386301 541509 542501 443313 570180 603485 748844 783087 401552 226623 277517
9890 277517 729767 609593 682004 1177292 992131 541586 454039 576708 509428 844819
9880 844819 639530 545839 917979 903983 1107559 688239 373766 553908 454972 220639
9870 220639 465115 232529 128614 424291 312745 606351 712758 575683 659481 1014741
9860 1014741 470939 661299 496447 660465 669432 532672 712528 808599 689999 599694
9850 599694 483964 483682 343718 427915 546602 680666 767856 807114 1093442 838125 942457
9839 942457 892213 876662 1099017 948202 628765 365427 338511 625445 567122 651722 732643
9828 732643 935664 1116519 1141973 1157436 848983 509563 774150 526821 754468 858714
9818 858714 566214 434866 565485 557143 352370 317226 371324 490831 524073 636306 572316
9807 572316 606635 656693 611037 627307 781490 673141 513123 789240 926270 824469
9797 824469 616483 447955 804002 763938 567902 657073 514011 324893 907190 905217
9787 905217 640597 770147 450865 365741 378568 377695 836768 958550 769604 659287 632310
9776 632310 795368 1151897 799324 681421 805553 538280 649723 681552 784873 692528
9766 692528 802501 1018039 948222 647695 387956 576420 762255 664037 458911 646010
9756 646010 823516 707070 773913 772574 605737 319539 447551 670439 794796 810596
9746 810596 1171561 984709 502348 580584 793148 1073033 1119481 1139447 1038486 866615
9736 866615 935157 698527 685355 564720 349065 246694 516688 879802 867835 633255
9726 633255 416004 739691 745696 828507 332444 358924 744797 718265 746254 1004821 926701
9715 926701 404035 474040 917140 860690 905919 1086990 999820 925444 964423 729795 811559
9704 811559 973815 830248 834467 550435 537647 791364 713396 822816 807406 768012 1087775
9693 1087775 1013223 898615 979398 890867 1006048 919875 859861 662811 893654 1229156
9683 1229156 950252 1021263 621014 605805 634897 1048475 739830 716675 805578 769383 905949
9672 905949 867183 966068 754362 634032 986983 878607 625196 922939 1177983 1119277
9662 1119277 703506 635857 857882 1069897 1088406 1374918 1138783 1130478 1217969 785909
9652 785909 639264 747751 905651 847820 1116603 1219239 1154045 916346 1003505 1352160
9642 1352160 1612250 1746576 1235375 1205942 1124550 915068 1246580 1206145 616720 925234
9632 925234 851096 657398 928022 1033216 1442756 1011371 1198159 1085718 857136 720446
9622 720446 772700 1370226 1211735 1213837 1377061 1180044 993229 1072019 1079950 1262134 1313993
9611 1313993 1426535 1035402 1094841 1311870 1155151 971334 753468 800333 969930 1260245
9601 1260245 1216456 1221630 1165855 1380241 1459901 1016002 1082534 1245136 1259417 1485501 1398365
9590 1398365 1218486 1104246 1167443 1565673 1529897 1616688 1565420 1555254 1615586 1693351 1554912
9579 1554912 1258943 1543394 1914626 2223317 1976175 2061749 1724335 1428405 1391295 1534602
9569 1534602 1583115 1596114 1356667 1558985 1801641 1567214 1803059 1267983 1326992 1547451
9559 1547451 1740388 1541475 1655502 1775264 2016710 1692196 1686308 1644072 1815081 2089205
9549 2089205 2347229 2573031 2592149 2539608 2456066 2309576 2365703 2549539 2779482 2681939
9539 2681939 2349831 2593261 2655542 2643078 2570602 2822842 3043890 2829304 2580402 2490483
9529 2490483 2393904 2465317 2857252 3016981 2586268 2575888 2769713 2751542 2291553 2564011
9519 2564011 2828865 2856055 2817489 2546417 2610095 2947999 2842292 2674355 2675160 3403683 3430683
9508 3430683 2829639 2583028 2553977 2915088 2981515 3201187 3171077 2993172 3090357 3194416
9498 3194416 3261123 3400146 3445077 3229539 2959431 2940415 3099472 2822581 2639199 2838799
9488 2838799 2843612 2713982 3111447 2908939 2933645 2744834 2795014 2793670 2947830 2841056 2650750
9477 2650750 2592618 2675340 2745628 2668636 2675590 2547426 2853226 2798125 2828400 2672406 2752435
9466 2752435 2866129 3122348 3293993 3192345 2759003 2794761 2750370 2465877 2362081 2675948
9456 2675948 3030832 3221538 2931607 2705093 2955324 3008737 3147213 2951816 2499764 2542023
9446 2542023 2687893 2513510 2409085 2186670 2415703 2775241 3002539 2621950 2356596 2494024
9436 2494024 2590964 2616227 2867623 2564900 2251724 2095720 2070898 2069213 2209288 2141523 1990430
9425 1990430 2389042 2397317 2510578 2327702 2484871 2154361 2047514 2472821 2544875 2459489
9415 2459489 2481097 2460445 2639420 2552858 2660411 2934048 2895928 2788249 2821348 2875446 2886240
9404 2886240 2588841 2618743 2555755 2755888 2836783 2678149 2741166 2760461 2919293 2795735
9394 2795735 2903933 3235771 3301213 3433586 3508962 3165745 2816158 2757867 2839290 2881525
9384 2881525 3221740 3108283 3204803 3075625 2839934 2796143 2920117 3058733 3310049 3584930
9374 3584930 3235483 3052087 3389492 3553342 3427749 3469550 3580124 3638524 3930946 4097174
9364 4097174 3767112 3406892 3484783 3661129 3842608 3846814 4107672 4336924 4059786 3968137
9354 3968137 4298510 4352382 3923840 4141541 4144339 4306796 4635362 4453235 4273550 4424938
9344 4424938 4310247 4525816 4935443 4699624 4740825 4877190 5161830 5105021 5038143 5189744
9334 5189744 5293332 5221495 5517913 5622681 5437882 5415084 5227672 5629361 5661757 5740741
9324 5740741 5608538 5493942 5883356 6215491 6224019 6176859 6193285 6096499 6173234 6544799 6636813
9313 6636813 6527858 6584901 6422161 6650921 6922318 7134151 7168369 7403709 7286176 7444980
9303 7444980 7639146 7697239 7812127 7996304 8280760 8321974 8331870 8251778 8394283 8505686
9293 8505686 8438567 8507249 8867508 9053525 9018535 8796305 8940152 8984816 9031131 9272484
9283 9272484 9462908 9616778 9328769 9359938 9849912 10283881 10571306 10784599 10879760 11110194
9273 11110194 11463116 11781275 12279249 12399048 12585530 13011928 13262300 13695053 14005768
9264 14005768 14189885 14379108 14362434 14647490 15033078 15262529 15285145 15268078 15461775 15749324
9254 15749324 15637811 15944179 16315934 16478573 16786683 16982229 17449364 17699082 17764339 18490536
9244 18490536 18792984 19346776 19745068 20107602 20941727 21496637 21856470 22378098 23067409
9235 23067409 23828188 24573305 24924847 25283295 25941283 26435544 26939952 27557383 28180001
9226 28180001 28610763 29222507 30083934 30656070 31310671 32044045 32745947 33710511 34722468
9217 34722468 36016479 36878222 37695664 38916463 39882614 41238614 42781897 44427164 45885092
9208 45885092 47536168 49241593 51094333 53211801 54907211 56839555 59634490 62273270
9200 62273270 65002861 67917044 71466928 74613608 78363838 82301445 86609838 91487380
9192 91487380 96469847 101969360 108428620 114972689 121822117 129532537 137555503 145762019
9184 145762019 154309206 162180023 170008999 177083767 183484896 189127683 193570990 197026881
9176 197026881 199228591 200520932 200830623 200096935 198148118 195710921 193360447 191142758
9168 191142758 188655197 186316787 183841413 182483265 181444089 180854129 181402593 182770493
9160 182770493 184823179 187738963 191312884 195898961 201393048 207423194 214146172 221405110
9152 221405110 229534686 237786203 245687273 253597091 261261052 268288700 274653287 279658063
9144 279658063 283846551 287190564 289925009 292334633 293101278 293181378 292319295 290926100 288817484
9135 288817484 286363376 284410444 282172599 280165062 278073565 276088560 273913859 271337470
9127 271337470 268268670 264723609 260152718 254765709 249184609 242676026 235612270 228984642
9119 228984642 222207420 215260778 208847326 203189003 197897631 193301760 190009771 187261971
9111 187261971 184992958 183720931 183663923 183725186 184892934 186475615 189032152 192321466 195784545
9102 195784545 199629115 203741856 208202093 212732389 216542846 219624638 221505795 222093564
9094 222093564 221497764 219634861 216815088 212700955 207125683 200781461 193010060 183838737
9086 183838737 173971810 163504093 152889841 142435900 132399708 122809438 114392771
9079 114392771 106682296 99298727 92566786 86766521 82116805 77661510 73640359 70070158
9071 70070158 66265499 63456636 60660090 58074391 56017812 53941969 51950840 49735661
9063 49735661 48113104 46510847 44654400 43012922 41875846 40845585 40012282 38952702
9055 38952702 37928543 36777430 35895471 35149460 34286481 33114653 32522728 31896249 31444249
9046 31444249 31163687 30703396 30151041 29525803 29148431 28870249 28587091 28108862 27926143
9037 27926143 27511706 27302129 27151316 26742774 26674778 26623774 26488190 26159228 25568208 25249636
9027 25249636 25068788 25493177 25205029 24760088 24644712 24968617 24986865 25253081 25400239 25484925
9017 25484925 25472440 25506926 25393413 25564408 25843699 25958624 26214739 26586470 26913970 27275249
9007 27275249 27370742 27743122 27935875 28273213 29076848 29922052 30326242 30613716 31341032 31927039
8997 31927039 32644359 33630245 34629887 35438869 36402603 37745065 39070918 40812895 42333543
8988 42333543 43969427 45839877 48186307 50922962 53785127 57242137 60547030 63787208
8980 63787208 67187389 70627976 73858128 76869610 80013336 82262080 83764939 84912462
8972 84912462 85770331 86173396 86495348 86620928 86538187 86022673 85851400 85747216 85823384 86649749
8962 86649749 87520229 88881363 90673485 92671894 94853916 97682531 101076550 104352518
8954 104352518 108068600 112711117 117618566 123325599 130366444 138986324 148081669 158730198
8946 158730198 169581465 180947202 192588580 202679715 211094873 217181345 219904463
8939 219904463 219114414 215308072 209649506 203450330 196975569 190847989 186610793 183258550
8931 183258550 181346234 180645726 180900006 181899326 183397048 186108193 189355134 193531492
8923 193531492 199485119 206499718 215173875 225449629 236669515 248312083 260846437
8916 260846437 273936055 285961844 297919568 308857286 318106197 326047626 332250842
8909 332250842 336487446 338996867 340408997 340442984 340105837 339586355 339563933 340210420 341357975
8900 341357975 343993476 347890229 352530257 358345734 365014553 371512302 377584635 382797899
8892 382797899 386950159 389626009 391089605 391610924 390981597 389363557 386234172 382167777
8884 382167777 376603462 369231886 360552820 350713729 340036261 329332084 319614641 310912290
8876 310912290 303730742 298416413 294569080 292687429 292686908 294393178 297657872 302492245 307937967
8867 307937967 314567040 322153126 330504222 339309332 347744950 355889135 363041124 368466276
8859 368466276 371976459 373395862 372761167 369706848 365090141 359641608 352466218 344352737
8851 344352737 335105059 324616471 312289089 298794953 284437991 269932513 255510961
8844 255510961 241712578 228869205 216891376 206765708 198155348 190284175 183888800
8837 183888800 178547904 174586369 171092695 168390003 166465406 165007392 163737587 162271619
8829 162271619 160790092 158949523 157152335 155429086 153569541 151506450 149467024 146855048
8821 146855048 143601710 139961530 135373235 130311967 124810454 119273432 113813607 108458110
8813 108458110 102879885 97201538 91436085 86426126 81434899 76719172 71796876 67496049
8805 67496049 63193207 59169889 56015428 53035728 50698987 48389680 46174515 43844183
8797 43844183 42023870 40173431 38278312 36706222 35619456 34046326 32828731 31495805
8789 31495805 30133603 29043951 28121291 27393393 26262487 25312056 24888923 24201964 23506179
8780 23506179 23100559 22557753 21723465 21093623 20440376 20012601 19638499 19350598 18756827
8771 18756827 18309072 18078926 17479126 16827164 16643516 16267877 16060087 15871869 15112998
8762 15112998 14692807 14390799 14393671 14132473 13913579 13885106 13646391 12905851 12326272 12234317
8752 12234317 12109419 11849050 11574959 11320175 10946152 11133214 11333132 10865545 10722886
8743 10722886 10519357 10387638 10211619 9637401 9462364 9547429 9306786 9405544 9274743 9119608
8733 9119608 9143541 8961908 9085520 9109471 9092015 9019021 9072764 9047898 9452306 9564257 9236342
8722 9236342 9397096 9484903 9402641 9484750 9804920 9948773 10364334 10470951 10642682 11022933
8712 11022933 11262777 12077110 12943793 13937655 15390546 16845820 18963510 21481637 25078172
8703 25078172 29835722 35331980 41994162 47527816 46831690 38961238 30610044 24108843
8695 24108843 19558397 16757118 14620019 12850094 11306952 10440673 10088735 9174782 8375436
8686 8375436 8329654 8057121 7464350 6777542 6207333 6064491 5723295 5440199 5377364 4978487
8676 4978487 4950630 5165203 5197634 4905429 4698239 4247716 4414218 4464323 4238620 4450081
8666 4450081 4310382 4219951 3929773 3886552 4015767 4000575 3516872 3483889 3623481 3393044
8656 3393044 3421016 3018775 2988745 2949346 2959383 2911710 2962257 3448579 3121170 2949565 2967663
8645 2967663 2906040 2910513 2484640 2314544 2606220 2333903 2401956 2643431 2765537 2373282
8635 2373282 2302743 2336767 2195672 2173339 2223092 2293532 1967464 1932055 2137445 2067584 2102569
8624 2102569 1997424 2195336 2078657 1983660 2431409 2483188 2375243 2300693 2285446 2172570
8614 2172570 1892595 2005539 2224595 2331566 2290846 2146443 2258913 2385615 2316484 2424066
8604 2424066 2478012 2366092 2325270 2284401 1928456 2072883 2457432 2274202 2182863 1983696
8594 1983696 2119087 2219452 2413486 2210308 2216015 2122084 1961354 1838080 1538510 1654961
8584 1654961 1668636 1850099 1707335 1490083 1442414 1507106 1462804 1377815 1253066 1227132 1808194
8573 1808194 1484559 1572782 1663226 2017530 1918619 1921037 1992892 1797901 1850844 2008207 1968966
8562 1968966 1544878 1519542 1447931 1598936 1722266 1508082 1487694 1420721 1217186 1130478
8552 1130478 1676503 1535881 1488326 1284552 987498 1319438 1402919 1417021 1035362 937422
8542 937422 797198 960886 1019500 1206313 1628302 1697478 1653229 1471361 1576646 1498132
8532 1498132 1605085 1716585 1620360 1507538 1590285 1893887 1813274 1743535 1830168 1727430
8522 1727430 1973306 1802850 1609030 1868824 1680689 1993708 1827969 1450239 1375122 1359402
8512 1359402 1264907 1219267 1472447 1421231 1533602 1552857 1636439 1424009 1540713 1699896
8502 1699896 1925064 1926212 1834533 2043395 1864235 2076866 2342291 2447344 2240937 1772710
8492 1772710 1755649 2136706 2049795 2051270 1860872 1988898 2004321 2136888 1906079 1851996 1799566
8481 1799566 1506546 1357216 1469303 1539242 1442755 1181633 854974 509809 780891 1123520
8471 1123520 1154934 1094930 1187535 1111365 685519 741883 1080921 1126959 919691 390642 393991
8460 393991 799285 636122 476883 440680 838090 954417 989201 1039796 931553 754228
8450 754228 876766 752985 619226 449246 620052 556093 409923 693575 551331 494778
8440 494778 238214 49196 182987 106176 264817 246891 200217 431882 314141 318395 440445
8429 440445 426051 223826 -104811 -355954 -150541 134614 -93221 -336723 -88128 -5451
8419 -5451 -394686 -93897 -31954 -281809 96250 38596 -191499 -260962 -84304 -115445 196710
8408 196710 199009 145778 -252391 -153792 -188754 -176563 -78712 35551 31231 -337716 -380040
8397 -380040 -66372 -8070 -50824 -136095 -315708 -147879 -521417 -584909 -452524 -110072
8387 -110072 -370173 -163287 -83743 -90478 -76087 92444 129011 197277 20821 42858 -33343
8376 -33343 28851 -49549 -520921 -253034 -131252 -282077 -321959 -263820 -250232 -297695 -174747
8365 -174747 -242519 -465104 -276129 -537213 -534122 -323163 -44769 -77112 -310801 66351
8355 66351 -40397 -336350 -354872 -189530 -344440 -283401 -481836 -855896 -527067 -515653
8345 -515653 -621997 -335078 -403379 -229507 26892 -243519 -441371 -319380 -331050 -369425
8335 -369425 -544919 -575756 -133388 -106239 -132079 38582 -230270 -317276 -337200 -195757 -495552
8324 -495552 -548502 -220727 -439968 -628422 -684168 -601293 -306727 -60522 -257505 -165923
8314 -165923 63155 -204141 -516265 -551028 -532178 -477048 -384762 -295903 -524765 -346911 -413036
8303 -413036 -326058 -308794 -230897 -277784 -544851 -387246 -178605 -248049 -212916 -350268 -330029
8292 -330029 -489325 -659098 -418526 -471779 -291364 -83241 -169156 -473312 -198036 -252553
8282 -252553 -346084 -209835 -425828 -77201 -22232 -239852 -363838 -516636 -578387 -430600
8272 -430600 -443200 -512366 -13724 -106947 -478638 -669952 -588355 -693691 -669885 -570695 -284522
8261 -284522 -389400 -681651 -530745 -531739 -579495 -497760 -298749 -200893 -288141 -420161 -8662
8250 -8662 -10404 -519979 -424011 -654106 -779118 -258649 -131546 35149 -193693 -375408 -554472
8239 -554472 -915399 -812048 -748571 -827339 -920269 -606009 -261725 -338415 -357867 -533125 -177739
8228 -177739 -115692 -130031 -31434 59114 -236618 -446869 -155075 -154691 -186082 -247130 -224357
8217 -224357 -168388 -69585 -60361 26015 -290384 -680935 -885628 -542008 -248107 52279 -38939
8206 -38939 -228493 183231 31670 -151956 -186033 6359 -339870 -41727 -131279 -163017
8196 -163017 -230338 49438 256651 690695 1050893 -324291 -652150 -563016 -676450 -675257
8186 -675257 -413995 -428366 -836925 -662521 -85602 -53229 -265125 -449291 -314321 -386484
8176 -386484 -470731 -544741 -495195 -460409 -675368 -433681 -327954 -451350 -302902 -579266
8166 -579266 -727888 -456565 -356118 -396701 -500666 -277725 -261691 -400191 -268733 -348601
8156 -348601 -117816 -248779 -632830 -849700 -804973 -963130 -1024416 -722879 -563240 -531802
8146 -531802 -686178 -433712 -388356 -758917 -604056 -564432 -660155 -394499 -343439 -597061
8136 -597061 -149204 81510 -14951 47274 -273010 -202512 -246027 -212506 -106260 -106846 -553978
8125 -553978 -406016 -323092 -403583 -455188 -428207 -36401 -28971 -347131 -184753 -106612 -107037
8114 -107037 64807 39042 -113747 55204 -235462 -374071 -415132 -558387 -494040 -523728
8104 -523728 -267138 8485 -161030 -594384 -704667 -749084 -581032 -651652 -319809 -289845
8094 -289845 -453051 -378356 -410663 -350157 -661585 -912696 -515209 -19111 -247747 -529688
8084 -529688 -676628 -572740 -98176 -341414 -353801 -581218 -348884 -287303 -62858 -236390
8074 -236390 -592944 -475422 -322047 -378705 -505605 -555545 -226806 -121168 -158962 -235368
8064 -235368 -341397 -362935 -598431 -562342 -847302 -741552 -585322 -499872 -219655 -500596
8054 -500596 -287048 -228094 -335101 -236701 -86600 -119559 -326488 -217312 -360274 -5345
8044 -5345 -40044 -294276 -151390 -97267 -368560 -334059 -416140 -736663 -379292 -67265 -174925
8033 -174925 -331890 -146395 -243057 -247759 -325220 -355487 -401570 -426712 -394819 -702679 -612427
8022 -612427 -533929 -130749 56734 -197182 -474263 -210492 -10280 -334778 -394631 -345356
8012 -345356 -550786 -706829 -518984 -497735 -416770 3772 -143853 -355317 -864582 -808931
8002 -808931 -622314 -583037 -278438 -350474 -606738 -591866 -334170 -435650 -473086 -447166 -574799
7991 -574799 -441297 -286059 -7253 25782 74731 -256778 -289558 -442948 -1032691 -674656
7981 -674656 -165374 -153025 -189357 -322617 -114942 -239173 -497120 -320925 -154333 -206854
7971 -206854 -165455 -212246 -291115 -297363 -374496 -677614 -747166 -330690 -330321 -223848 -358025
7960 -358025 -397904 -504850 -612041 -364578 -292953 -82238 -173461 -65635 -242548 -488540
7950 -488540 -299743 51075 -240446 -125248 -112837 -387122 -511150 -650658 -317993 -405198
7940 -405198 -435306 -13806 -16281 89360 -193206 -181270 -13796 -34534 51093 -251040 -62034
7929 -62034 -47743 -91851 -311500 -70619 34393 105784 65920 102886 183681 120135 210840
7918 210840 -385154 -186248 -215640 -243007 78979 -86040 -140835 -293308 303794 45566
7908 45566 -107640 46415 9051 -109409 -369574 -352121 -208510 -184883 -191504 -463185 -662564
7897 -662564 -568073 -162890 -71556 4657 -220799 -359906 -143317 184549 -119321 -477152
7887 -477152 -535604 -375800 -395163 -400670 -409217 -293755 -378358 151024 121733 51521 167354
7876 167354 -96843 -446103 -564517 -398261 -293676 16803 -68523 -20143 -202864 51189
7866 51189 39836 -108704 -266915 59940 -56711 -158114 -228709 -132524 42357 -293139
7856 -293139 -447502 -403430 -305669 -502146 -329989 -258664 -413685 -366714 -172829 -89012 -38433
7845 -38433 -215608 48158 -37316 -209630 -287743 -178145 113664 -74958 -101029 -85159 125457
7834 125457 200387 298774 -102771 -2288 182484 -3694 172740 40196 75627 166020
7824 166020 200143 284435 -301 -114907 -188066 -375806 -551123 -293765 166467 120844
7814 120844 6583 284717 317773 186963 406654 -7749 -316538 -12641 -3640 130671
7804 130671 162389 339028 127540 -207138 -270074 -149925 -180830 -70669 -244088 -391747
7794 -391747 -327882 -341926 -216803 -11591 -203770 -339770 -100511 153797 59206 143475
7784 143475 -92938 -15781 -118338 -39396 90174 41886 -323632 -491244 -221570 140839
7774 140839 148802 -12932 283696 250799 -26669 177942 -100477 -287394 88912 -55520
7764 -55520 78028 -44439 -14162 -78683 222877 179483 99217 -194333 -239832 -21466 -94477
7753 -94477 -72630 -125155 -234553 -52671 -269956 -180830 -317814 -217465 343428 -84828
7743 -84828 152211 151803 -55335 -317453 -214328 64432 206762 282762 1151 75746 152550
7732 152550 -155845 104013 229253 94243 47187 -246921 -76233 43378 192005 127296
7722 127296 80008 31152 -24780 -122407 295630 176797 -93503 127763 75577 51350 110259
7711 110259 67190 216825 140923 276829 41925 230486 299613 72538 15939 255879
7701 255879 432508 280796 360604 108278 49296 55216 -3341 260627 379633 369776 166442
7690 166442 -35195 201938 91372 -60116 85361 -50914 -54267 235695 367970 658866
7680 658866 576582 571561 130237 -178701 37960 359738 173929 120943 136026 74556 147351
7669 147351 26919 106511 213984 458216 159199 101050 212140 129775 168674 21663
7659 21663 -27431 135894 376047 194386 527048 414986 288044 347375 -31541 151367
7649 151367 -18536 -316556 -167824 -36038 240349 376557 497614 247800 302679 425472
7639 425472 538923 590802 473095 424415 200832 -69181 199261 467302 316165 569634
7629 569634 477979 460264 258935 430708 617760 186855 19622 521379 377137 169976
7619 169976 459044 421331 233365 423784 427039 621879 363305 450523 222932 424398
7609 424398 444522 411438 285495 265816 354014 299279 342311 344449 765387 837721 822576
7598 822576 695213 579152 274628 398659 745151 870603 773843 558327 350218 449311
7588 449311 351699 461055 112599 375742 415405 523288 480239 609253 472303 599868
7578 599868 910110 869406 765457 604094 626540 553123 356980 355967 515748 187919 134132
7567 134132 265442 457633 339760 229407 318828 370360 624603 374020 573738 340347
7557 340347 302544 608266 360865 296493 262565 522622 807832 854783 512638 598374 850410
7546 850410 731299 837757 586692 567038 616718 871486 939887 622961 755336 562383
7536 562383 509303 549375 721578 691431 715673 683295 780972 573047 436731 335470 365245
7525 365245 848160 656947 615875 668627 760707 883754 924376 916945 1114686 1026337 707169
7514 707169 741076 598723 549672 634335 812170 811781 900741 1111883 1123652 940937 1010754
7503 1010754 901067 877727 965100 1078976 1126637 1124732 844731 776800 820158 893120 975204
7492 975204 1233796 1436509 1126701 1176210 1566985 1383070 1557257 1486664 1284733 1309117
7482 1309117 1283211 1468943 1609730 1617542 1223535 1238538 1257656 1344924 1421770 1363354 1337571
7471 1337571 1428623 1469894 1699484 1626427 1680197 1546141 1581937 1847068 1880224 1946866 1701212
7460 1701212 1364888 1221407 1562558 1760411 1544188 1445539 1720932 1876211 1835254 1709458
7450 1709458 1978908 2176946 2058033 2009353 2073738 2100323 1906280 2019461 2093352 2032688
7440 2032688 2077903 2287664 2247848 2393671 2326850 2179578 2254443 2609216 2616362 2691204 2605143
7429 2605143 2240680 2617775 3027801 3115856 2787558 2752170 2743770 2487736 2472429 2663776
7419 2663776 2818856 2939090 3267425 3388629 3202894 3367137 3094398 3277673 3522379 3345340
7409 3345340 3550752 3701703 3176748 3092681 3104860 3434732 3616867 3773773 3923898 3873130
7399 3873130 3965449 4242548 4300710 4257930 4131170 4361233 4658846 4528675 4641184 4839323
7389 4839323 4872381 4612976 4991541 5092599 5105862 5039495 5227331 5330004 5470489 5514097
7379 5514097 5416064 5539708 5614745 5735677 6006144 6037038 6153285 6410962 6635575 6601697
7369 6601697 6940256 6960310 6703069 6676626 7166815 7411267 7564052 7580249 7890545 8172433
7359 8172433 8581614 8928451 8869707 9129252 9115184 9376041 9456173 9535104 9803869 10316318
7349 10316318 10333238 10590294 10721909 10953523 11272051 11558073 12016665 12399209 12542254 13186007
7339 13186007 13283287 13570477 13855231 13990515 14561663 15182262 15292197 15382605 15621289 15708573
7329 15708573 15962566 16435058 16977133 17359486 17589922 17857894 18169147 18613085 19341028
7320 19341028 19668449 19913128 20131219 20624830 21106344 21648343 22017497 22265265 22981487
7311 22981487 23896921 24247819 24845687 25449041 26053466 26640162 27321499 27830770 28349986
7302 28349986 29369200 30552364 31141180 32168888 33106634 33775112 34898699 36015239 36960222
7293 36960222 38046995 39269855 40791692 41832591 43099388 44549053 46235594 47877980
7285 47877980 49447621 51019803 52548288 54754782 56949208 59432190 61498437 63744363
7277 63744363 66496516 68757043 71322210 74230628 77311499 80415468 83072515 86241091
7269 86241091 89492703 92788692 95937540 98925979 101694646 104022783 106529146 109114855
7261 109114855 111363976 113390831 115355039 117515066 119173202 120678661 122308665 123873332
7253 123873332 124727604 125224062 125606052 125916214 126043436 125507999 124457307 123453321 122358624
7244 122358624 120850343 119126061 117277485 115439307 113309173 110934237 108662076 106322417
7236 106322417 104512386 103116699 101567517 99987374 98602275 97227036 96257378 95521115
7228 95521115 94772404 94263867 93632651 93268698 92544861 92020634 91345911 90667230 90174069
7219 90174069 89384186 88510310 87134429 86004487 84956717 83670489 82542853 80776776
7211 80776776 79160556 77419463 75769435 74306435 72442493 70711049 68892832 67313951
7203 67313951 65929425 64401518 62812364 61508845 59753537 58355994 56771059 55667003
7195 55667003 54344050 52821649 51539267 50185485 48945133 47381696 46019368 44447639
7187 44447639 42866403 41802318 40653745 39218527 37823656 36747301 35679143 34302683
7179 34302683 33087427 31924699 31117188 30146166 28977379 27984144 27155873 26386931 25807611
7170 25807611 25010795 24465662 24069451 23123092 22729233 21888843 21366181 21110749 20763200
7161 20763200 20525089 19859069 19036583 18733868 18552530 18321361 17940118 17460496 17237624
7152 17237624 16938477 16851200 16134418 16022099 15650170 15216386 14848165 14630728 14632138 14522022
7142 14522022 14064665 14063922 13821783 13609705 13426523 13356672 13434139 12955712 12435396 12166217
7132 12166217 12055741 11666086 11489675 11468745 11272248 11031799 11068104 10858342 10452806 10483290
7122 10483290 10217070 10045909 10106695 9517535 9435674 9399640 9560474 9615581 9418893 9112694
7112 9112694 8685405 8475453 8547853 8314713 8279141 8028416 7693777 7328730 7361594 7462644
7102 7462644 7246464 7051148 6923939 6708513 7053950 7082218 7004371 6908175 6394817 6502444
7092 6502444 6718559 6548835 6226269 6039290 6011856 6269708 6226078 6141489 5912039 5852859
7082 5852859 5931870 5943910 5733204 5756574 5811340 5753340 5675102 5453411 5216663 5177264 5149058
7071 5149058 5098633 4965125 5191858 5292814 4848591 4530561 4475831 4704625 4731138 4463730
7061 4463730 4711127 4479551 4236589 4368500 4226022 4127028 3982481 3784399 3918106 3714825
7051 3714825 3744111 4008460 3783551 3430610 3238511 3090005 3369218 3512761 3533462 3524750
7041 3524750 3240160 3368560 3186121 2741437 2920570 3095414 3150004 3052250 2586925 2632135
7031 2632135 2826241 2832066 2973394 2755534 2615238 2639009 2547442 2669464 2860046 2771051
7021 2771051 2304198 2262012 2048142 2401390 2219539 1756512 2090883 2387311 2117917 2206691
7011 2206691 2393581 2259830 1954795 1930119 2212304 1765922 1727039 1830217 2079854 2000594
7001 2000594 2007693 1671388 1472853 1598124 1375659 1227291 1191351 1444382 1516629 1430582
6991 1430582 1439895 1263936 1226823 1417211 1367972 1551342 1209464 1124187 1184636 1198950 1136644
6980 1136644 1056900 1170347 1348962 1417932 1893306 1737383 1154739 1119659 726610 691725
6970 691725 749116 1071687 1149370 1052364 1397624 1614563 1345840 866188 751664 721052
6960 721052 948899 818869 950252 1081106 1056150 1065003 1148396 1074096 1017023 787623 704889
6949 704889 709610 615039 974950 1008435 736454 996449 1046687 775406 636340 664162 1002972
6938 1002972 997518 1173790 1154430 862972 685967 852787 902867 798622 932983 1112772
6928 1112772 1229704 878264 523765 436282 583799 671177 872511 857565 766385 651306
6918 651306 701931 747038 929655 736910 200292 483597 621739 598035 493557 225276
6908 225276 166255 572564 367853 558930 577267 334295 493673 647956 349724 293964
6898 293964 395171 679242 524333 656190 557711 466353 512397 543867 202391 299752 428827
6887 428827 199788 252712 313360 550596 189551 107234 229481 393482 477500 624750
6877 624750 678166 327381 547673 420986 90258 308902 120084 244229 -295120 447
6867 447 592396 370804 157423 382275 319223 307958 16479 159871 397933 117153 265117
6856 265117 279822 36596 84806 417044 324722 64101 -286431 -15232 14335 -217297
6846 -217297 139039 147108 269734 499203 372881 209221 -144532 18978 -16103 154577
6836 154577 668742 458597 357359 285854 129387 277147 35122 8736 -136309 -150072
6826 -150072 206701 150292 89590 -87846 -174474 -210152 -34013 220115 308196 76975 303313
6815 303313 422118 351344 372726 327840 314749 -4133 95029 -90223 -189945 -7317 170415
6804 170415 200162 113159 409888 566049 380359 275814 112106 104388 100748 230634 209042
6793 209042 74352 185232 512199 524736 373976 200384 -8307 51504 184340 289517
6783 289517 335171 525912 583833 545431 345810 366738 479062 84539 119966 255678 16267
6772 16267 259830 456658 528191 193326 256147 198824 -99490 145797 314398 318701 23483
6761 23483 126614 247164 -73662 281475 83453 192119 10822 -50856 106628 207153
6751 207153 86901 -218223 -184433 -197205 178104 258846 317446 266801 128535 428104 236007
6740 236007 211370 118018 124802 181171 88557 173495 -39783 -3963 55649 89616 441449
6729 441449 315305 57349 -3427 62957 -67657 -32638 207696 -59308 -58872 76726 22616
6718 22616 85676 423521 322528 274864 83807 278929 -221499 -32734 -39260 -190712 214455
6707 214455 334695 236197 197141 24183 12711 298376 385081 292168 206862 22241 136683
6696 136683 7052 188722 231385 284203 172346 118424 113535 -25083 14866 -114373 -25451
6685 -25451 17447 278598 170709 78880 159432 2051 -318262 1812 215865 53230
6675 53230 21151 1509 -140046 -106831 28080 89335 -221191 22694 296760 248458 112764
6664 112764 15006 305968 7996 -79659 144924 -198567 -380365 -478019 -63734 -71271 -115744
6653 -115744 -308096 -107280 -292971 -370265 -201155 -108706 107809 37155 101269 -76916
6643 -76916 246031 62974 52848 118818 44377 62343 -164433 -301830 -357914 -503654 -53091
6632 -53091 -43769 -45830 560094 578044 356359 128227 97904 80510 236084 185607 376266
6621 376266 -29889 153890 140302 438415 683318 502275 287899 11344 150721 -368937
6611 -368937 -435332 -168773 301283 304589 -133818 -154487 202035 382449 346622 255360 404123
6600 404123 393700 295145 113670 168885 528986 419284 135365 -142388 -108638 186145
6590 186145 216616 319928 473584 388396 -81522 -31533 -294919 -232661 -316454 -402866 -202148
6579 -202148 28336 404288 152505 376833 769512 773331 981484 667493 132285 282131
6569 282131 581477 510401 468097 447144 286560 33530 84828 290640 339914 538656 456987
6558 456987 387687 -35923 297142 407654 -77409 75146 223279 241267 456964 675940
6548 675940 399721 425641 195813 320359 469239 247903 372507 549285 366155 343655
6538 343655 696942 323450 358692 516328 323958 322406 269793 231970 196761 53452 179803
6527 179803 252898 89907 209641 336110 531982 243728 138498 179599 189091 628870
6517 628870 247480 115798 222685 557436 543519 179509 161487 102306 158454 253688 607068
6506 607068 528909 738725 681023 438273 379046 251265 204082 -48656 464684 857762
6496 857762 584048 548671 662865 706506 550282 491153 522237 318190 363217 612323 615286
6485 615286 518936 579986 562356 530664 536143 436509 537286 597182 726978 636649 728711
6474 728711 1074030 1073969 880394 657051 840539 1071055 1138021 1213035 1295091 1300485 1349962
6463 1349962 1714923 1829289 1843895 1719238 1624255 1502154 1645052 1902930 1746403 1805071
6453 1805071 2070049 2059795 2065513 2235360 2175434 2126747 2445460 2496604 2465066 2333533 1885226
6442 1885226 1733116 1440945 1434934 1390260 1166711 959648 1097229 732264 1026090 1221615
6432 1221615 1278434 1320974 868146 943902 1017506 967054 990940 1098981 1315489 1169775 1033381
6421 1033381 1050327 1371059 1249915 1116535 1092744 1088566 1389407 1359582 1041271 878883
6411 878883 1025230 1146352 1248416 1072962 761686 721208 898268 1154736 1310311 829416
6401 829416 579011 596012 729562 1015111 1072801 1022568 1182457 1060033 1143952 1245889
6391 1245889 1558233 1416095 1051648 1114115 966052 1061736 970557 962315 1114428 915932
6381 915932 911071 901341 888491 919233 928412 1089394 1354186 1662503 1529623 1173915 995167
6370 995167 1082928 1156986 1312788 1365512 1324315 1495660 1172519 1203764 1418055 1341687 1420343
6359 1420343 1671120 1616002 1404543 1382968 1435978 1460948 1629126 1420888 1601735 1613819
6349 1613819 1474218 1622216 1417418 1526303 1397177 1323597 1492750 1449143 1569066 1068339
6339 1068339 1473894 1731924 1501206 1431677 1508047 1701240 1380742 1671720 1659604 1490623
6329 1490623 1380405 1393341 1701503 1952750 1665501 1345143 1201148 1513564 2028088 2070164
6319 2070164 2016173 2152702 1961676 1743307 1919788 2245455 2233341 1967014 2169554 2145746
6309 2145746 2279789 2200909 2412427 2527656 2560121 2719073 2460869 2302753 2429454 2364859
6299 2364859 2167546 2215098 2216937 2447163 2595955 2587220 2628196 2737422 2907552 2644401 2861924
6288 2861924 3066604 3111596 3231921 2737634 2695788 2677256 2782081 2546598 3017323 3126718
6278 3126718 3045465 3248211 3323316 3316606 3702360 3711302 3528384 3518005 3372378 3280635 3519617
6267 3519617 3618759 3798548 3869298 3717234 4086334 3876175 4000641 4261736 4276460 4386749
6257 4386749 4197871 4384829 4575486 4539640 4589158 4826467 5273294 5036594 4835843 4773282
6247 4773282 4939212 4926024 4964153 5367444 5583530 5761637 5749641 6000515 6166720 6159674
6237 6159674 6493240 6757466 6287195 6167050 6571502 6811553 6963359 7058454 7426641 7482442
6227 7482442 7295781 7398454 7794694 7425170 7417851 7887767 8127929 8033621 8292372 8281828
6217 8281828 8605292 9014225 9052291 9452420 9777333 9911777 9632889 9866484 10246234 11025943
6207 11025943 11450284 11618847 11922667 12320935 12412638 12727114 13589489 14096953 14223411 14813304
6197 14813304 15141350 15686056 16601738 16957987 17176017 17705113 18307808 18635900 19262497
6188 19262497 19815492 20263443 21013471 21837455 22626187 23307389 23740688 24415573 25127945
6179 25127945 25916942 27058493 27981383 28702667 29887988 30660070 31761577 32899194 33952183
6170 33952183 35067471 36333686 37725434 39169122 40470212 42033736 43692719 45284784
6162 45284784 46945821 48917197 51016226 53088071 55342623 57649953 60564805 63176415
6154 63176415 66035536 69472608 72884176 76603860 81062831 85451487 90087279 95619253
6146 95619253 101720397 108025488 115360449 123031198 131865999 141895888 152743483 165053045
6138 165053045 179198014 194988157 212322842 232027674 253486525 276934958 301927432
6131 301927432 327360336 351440357 372780428 389719394 399442282 400719690 393404398
6124 393404398 378044549 356336443 330644868 303340137 275942526 250598331 226706462
6117 226706462 205014153 186199533 169452914 154721746 141806829 130448206 120433821
6110 120433821 111264916 103370301 96353736 90084207 84467047 79292219 75038943 70719030
6102 70719030 66707770 63463664 60564770 57676891 54997878 52335287 49763353 47684742
6094 47684742 45462984 43603707 41580723 39717757 38407478 36545132 35247279 33754993
6086 33754993 32443193 31349264 30005287 28784615 27965471 26628503 25483786 24738927
6078 24738927 23874306 23279659 22431545 21768112 21017353 20352684 20097984 19449726 18595302
6069 18595302 18210463 17882279 17671738 17147629 16211591 15683348 14883112 14211338 13999484
6060 13999484 13546803 13202973 12545002 12358949 11789349 11532788 11438115 10986345 10677078 10607325
6050 10607325 10433960 9701157 9497591 9073756 8944240 8623779 8580699 8283258 8113001 8031309
6040 8031309 7830150 7679161 7517161 7332247 7074667 6793846 6407814 6070155 5760381 5910376
6030 5910376 5695951 5647729 5791413 5649053 5202209 4967978 4632100 4588611 5014766 4975968
6020 4975968 4532347 4487567 4447375 4167914 3956487 3897169 3589022 3216105 3199916 3344222
6010 3344222 3411496 3536701 3552774 3366660 3055326 2684356 2812623 3023314 3192287 2854111
6000 2854111 2875206 2786966 2756071 2797731 2855069 2818012 2883421 2768827 2514487 2523751 2424371
5989 2424371 2301814 2336833 2045895 1689467 2001763 1896745 1973238 2281509 2183272 1889413
5979 1889413 1837238 1808708 1843839 1868436 1602193 1833219 2078983 1868542 1747132 1606097
5969 1606097 1583518 1524454 1522690 1404704 1288143 1315668 1015682 1218776 1265419 1215152 1493545
5958 1493545 1351302 1186983 1089236 1027793 1081615 931626 995554 1084953 641299 842205
5948 842205 716902 678814 1016772 927640 898588 879540 856920 1113715 1172873 1267267 834462
5937 834462 832869 1094533 1114002 997912 956330 1075633 796963 725593 730265 556043 526914
5926 526914 838566 676016 657986 784273 877573 738522 962484 553570 526072 679461
5916 679461 299535 537537 600900 495562 233682 205811 201058 379718 140287 221012 144707
5905 144707 -47863 217195 248754 160684 150034 92464 45283 494420 613579 7987 -153994
5894 -153994 324413 623719 581003 446428 471312 323730 342121 581176 580302 771731 624267
5883 624267 361956 503298 530413 604762 388965 298108 94458 505363 348660 175518
5873 175518 56956 85817 130977 232443 509675 193514 13927 -113005 -75806 56483
5863 56483 203217 84991 49620 178535 280911 409847 381854 -70195 314500 581884
5853 581884 568214 238081 -135980 -66845 65765 -86022 234953 148018 -353284 -323848
5843 -323848 26196 173285 390773 455173 264529 121878 112279 481640 450171 305109
5833 305109 401134 377718 308802 389344 505579 318857 120625 445870 718731 670803 615824
5822 615824 697397 915414 776941 629910 492243 340023 599870 741488 867886 929568
5812 929568 1024261 758349 977607 1426258 1318012 1243783 1569792 1772254 1820783 2001653
5802 2001653 2129439 1894987 1780760 1813353 1908137 2021290 1768062 1583459 1406912 1269490
5792 1269490 1069638 756827 613738 651647 591140 453820 535317 380341 458875 189911
5782 189911 37778 -44680 100384 15184 -65814 -11405 171661 38318 -65888 375752
5772 375752 347889 266392 -58640 -228349 -72927 -29413 -26255 195092 160934 168100 97978
5761 97978 51015 -148701 -58399 -52637 -200207 -188663 -140357 -163925 24185 122882 -27865
5750 -27865 71145 -61559 69480 -187562 -192063 -60700 -140260 -41928 -86550 -64769 -134624
5739 -134624 -121488 -240894 153477 265602 11324 -47758 -84236 -175488 -300129 -296835 -227363
5728 -227363 -151657 -102179 -42571 -264343 -163202 -78101 -226906 -462841 -213259 -182616 -234144
5717 -234144 -196609 25575 -15301 70478 198751 -112355 -433180 -615151 -114739 22024
5707 22024 -429100 -356625 158269 -48422 -183438 -172303 16081 -318725 -426294 -220086
5697 -220086 -185005 8259 8272 -140393 -80189 291761 214625 -106367 -85613 -115117 -16968
5686 -16968 71510 -13512 -85962 -311184 -717141 -497955 -258972 -51761 -86854 -146710 -224901
5675 -224901 -317768 -232964 -245206 -218768 -143087 -415580 -318179 -252840 -61762 -40200 30061
5664 30061 102725 79555 363427 48343 -42763 -162713 -129373 -363695 -364597 -308827 -324649
5653 -324649 -425598 -215699 321364 365737 436109 197592 -277548 -94092 -302164 -338667
5643 -338667 -354196 -208142 -162427 -437471 -355239 -244485 -399214 -114506 10621 -259203
5633 -259203 -321883 -572603 -662954 -386930 -326921 -348370 -186282 -179556 -139287 72508 -150257
5622 -150257 -28110 -103105 -56504 269273 -41678 -236594 -311084 -582827 -717127 -499411
5612 -499411 -564330 -185395 -158415 -308490 -77327 -60838 -260930 -445299 -413080 -225789
5602 -225789 -293062 -155233 189201 22422 -33291 74246 264888 497854 27327 -120982
5592 -120982 -353912 -344829 -343940 -226149 -398982 -385105 -621429 -572748 -467969 -413180 -110292
5581 -110292 -43498 -154614 -461233 -283366 -282637 -303336 -199091 -165931 -598709 -617482 -276973
5570 -276973 -66730 -180730 -111258 201034 -143767 -38211 -62201 100998 311465 -198698
5560 -198698 -500884 -406917 -350429 -708436 -741072 -317229 154245 -431940 -478087 -161127
5550 -161127 -439599 -596963 -587961 -660153 -440788 -507885 -459430 -330078 -15922 194203 -78588
5539 -78588 -15574 142052 -84025 -198019 -205413 -105549 45253 -114735 75597 204196 -55885
5528 -55885 134505 -48517 -362116 -332673 -448869 -528225 -189925 -265108 -251820 -170083 -130623
5517 -130623 -21276 -331048 -188128 -293583 -405599 -346551 -386328 -387595 -130380 248245
5507 248245 -80396 12639 -212169 -117266 -310312 -325713 -156175 -496523 -384616 -193967
5497 -193967 -382804 -332723 -229681 -182985 -99702 47314 171583 -93997 -253403 28260
5487 28260 -218376 -319725 12972 -157551 -34840 -111730 -40455 64159 277132 315336
5477 315336 32645 -244590 -264646 -292700 -107576 201997 216305 135915 24956 76711 90840
5466 90840 -141475 -136274 15111 228380 6116 -353873 -249678 -66064 -297525 -330966
5456 -330966 -360899 -278809 -277631 -94794 -118042 -142047 -121112 -340644 -333803 -253258 -577383
5445 -577383 -521121 -524761 -262850 -180823 -161153 -189449 89849 -391492 -185098 143358 34428
5434 34428 37922 -134589 66889 -85417 -135742 -10185 -33529 225277 327745 182361 -126156
5423 -126156 -263576 -121576 -303279 -262252 -441905 -184132 45401 -47140 194005 146386
5413 146386 -22574 -168689 -35317 103430 -103038 -191518 -55467 14342 227011 284126
5403 284126 322644 289725 -71578 -59289 -260010 -119281 -428675 -193705 -56895 -161246
5393 -161246 -251282 -282196 149399 211665 -129134 -262078 19021 199337 -357815 -372465
5383 -372465 -138390 -178766 -297126 -139116 -358019 -609312 -227604 -261770 -106835 -288826
5373 -288826 -386031 -132855 -167437 -14847 268775 346166 268666 24622 -205825 -50129
5363 -50129 17405 -105013 -300198 -62962 227932 384742 398713 281101 165253 337881
5353 337881 28138 -109507 -241093 -245451 41865 169291 286356 185125 -47930 -68124
5343 -68124 -23454 213170 75500 35676 -83844 -32071 -87961 151461 257878 281978 55518
5332 55518 -91852 271000 -27860 -115166 -213770 -220313 -330326 -296653 -294869 -520954 -439625
5321 -439625 -359708 -367176 -254646 -170515 -135023 -70157 220466 39041 88225 193751 -217634
5310 -217634 -526490 -556113 -353868 -196115 -165349 -100564 -61955 -214862 -208724 132372 -170208
5299 -170208 -39791 -180866 -297694 -208936 22960 -197696 165130 198708 -944 -223128
5289 -223128 -176938 288351 294027 428790 331135 451053 627135 223152 312365 382314 97716
5278 97716 337077 310447 -72767 -129186 2357 -140172 86240 -118319 -202192 -136483 -117515
5267 -117515 -31777 -45026 5422 37640 314603 -113464 -245995 -167093 -133355 -166209 -41938
5256 -41938 43203 -245584 -10236 -99970 12524 39167 111041 -75940 -174429 104074 -269271
5245 -269271 -285576 -215326 -172193 137517 148732 68778 2627 -62622 -203444 -151350 -268205
5234 -268205 -174842 -234510 -231596 -411792 -419165 -416633 -185206 74439 -80839 189154 133728
5223 133728 -169475 -225949 161451 329621 176027 -43872 -23392 58403 205756 6917
5213 6917 42663 45459 -254219 -263439 -318833 -274413 -9344 -165471 -288176 -296980 -126770 -53292
5201 -53292 -202290 -208828 -361466 -201354 1141 61478 -274740 -86017 -212203 -52738
5191 -52738 48125 -28042 -50678 -26453 69143 160519 -89939 13221 19425 -252073 -288179
5180 -288179 -93638 -21931 -164021 -77348 126512 275246 -34319 -210710 -602827 -462411
5170 -462411 -140910 -311771 -197823 -180850 -602377 205683 450090 395472 178074 168822
5160 168822 -80564 9441 -58863 -125492 -164610 -91043 30765 -166728 -215755 -19494 -27364
5149 -27364 -376897 -173560 16301 -163731 -383207 -321022 -92029 134498 -78224 -299595
5139 -299595 -413577 -397980 -274642 -114043 -218014 -495721 -397082 -585294 -640387 -328252
5129 -328252 -146591 -129287 -170692 -10312 313538 83255 -579102 -375331 -388628 -134431
5119 -134431 -142054 -240621 14625 162324 -166004 -510724 -420469 -364606 -341876 3481 -5229
5108 -5229 -71597 -86036 -273906 -464017 -207017 -551708 -323406 61809 234656 32457
5098 32457 -81760 -140884 -181463 -129919 -358411 -283391 -176167 -47808 -77973 -185252 62903
5087 62903 219644 157226 -110796 -138710 48888 -131997 -323026 -544327 -482983 -270332
5077 -270332 -313185 -412411 -507343 -607383 -580170 -503877 -310668 -245886 -21583 70812 -64661
5066 -64661 -58390 -75216 -676710 -551820 -150165 -96452 -359687 -272544 -224376 -463510 -286274
5055 -286274 172585 270326 -226948 -465592 -172532 -138022 -40805 -346647 -341018 -180023 -383112
5044 -383112 -316752 -262214 -269951 142551 108550 -497145 -379439 -144148 -136641 -331151 -352856
5033 -352856 -435991 -413444 -440837 -462064 -317320 -309721 -154467 -41495 122712 -253237 -302769
5022 -302769 95608 -61828 -33754 -281135 -268773 -323979 -245689 -335728 -469239 -317486 -340235
5011 -340235 -105842 -118211 -350495 -248953 90579 -347496 22113 164028 154424 316125
5001 316125 107686 -23262 -165572 64948 -142025 -379985 -207870 -71121 -377599 -201736
4991 -201736 -164582 33702 180753 -115007 109240 360406 179783 -34453 376642 358270
4981 358270 218584 7729 -135090 -277128 -72460 258234 -226444 -403219 -182544 -588622
4971 -588622 -301182 -285829 -202453 -271425 -368970 -291383 -508371 -530791 -484836 -527402 -457954
4960 -457954 -286857 -54129 190751 -198289 -392297 -310649 -145916 127045 188686 -102121
4950 -102121 -280280 -235256 -22325 -201323 -295392 -15831 -185213 -512759 77712 502964
4940 502964 252779 183352 -185872 -227636 -152079 -366863 -213986 -95602 -43082 -302333
4930 -302333 -181226 -5181 -212972 -255572 -418164 -265481 -199263 -248485 9290 32777
4920 32777 -257082 -143963 -350642 -740344 -501660 -123130 -166704 -350524 -242236 -242966 -76776
4909 -76776 -101125 -50649 -272096 122208 -52206 -39252 31827 177397 -77632 -366747 -530477
4898 -530477 -198027 36145 58562 -235207 -227466 259077 323484 117549 -48638 -303754
4888 -303754 -559380 -241396 -189339 -262684 7618 -8924 -2262 -107528 -28468 -22035 -49147
4877 -49147 102921 -43039 -201588 -307300 -409772 -390802 -292850 -328454 -25537 -54257 -296168
4866 -296168 -336275 -276526 -380882 -121228 148918 145180 -25333 211945 -114950 -280237
4856 -280237 -328154 -365382 -170387 -3800 -368937 -281717 -213282 40761 -77539 -28351 132713
4845 132713 186371 88229 311515 68288 -10369 24783 48266 -110398 -48422 -180625 -194047
4834 -194047 -281882 -440774 -501034 -17585 718194 165902 31183 -276506 -393587 -197238
4824 -197238 146657 77654 -126086 -263874 -277116 -333768 -428125 -455804 -269817 -132086 -20299
4813 -20299 95289 46012 4409 123993 -52216 19966 84485 -154114 -137684 51129 -311557
4802 -311557 -293083 -146245 -124823 -263139 85995 196770 -77580 -359692 -361611 -331302 -50633
4791 -50633 -1477 -571749 -561947 -321154 33041 65257 148277 289329 20447 -41498 206377
4780 206377 96481 -8255 -74453 168913 45231 126456 118594 -100745 -90454 -110411 -57992
4769 -57992 -172158 -408222 -182589 -145474 -186376 -291809 -405956 -228265 61337 368482
4759 368482 147764 -144807 -95310 239303 74389 -110880 -145553 36083 -191947 -191535 50903
4748 50903 -125072 -220144 -218633 -203040 -183682 -106943 82672 -93247 -242620 128202 110604
4737 110604 89053 -189573 -94732 -87910 -625602 -564257 -443440 -333256 -687955 -675924 -275968
4726 -275968 -278574 -440026 -203872 -115061 -36539 -285260 -446372 -232758 -382364 -269940
4716 -269940 -58026 32613 111285 -239603 -293835 -282585 -51381 361499 537173 59136
4706 59136 -306178 -99799 -157998 161307 129355 -57149 -258974 -7330 186735 92972
4696 92972 -119642 10111 -118129 1630 -140409 -152794 -167267 -209463 -156485 -203710 -408915
4685 -408915 -612521 -498155 25223 201843 338241 481304 101883 -66545 -237584 -27612
4675 -27612 94535 200949 242724 -17086 -30571 -82842 -498552 -567864 -391091 -321955 -326887
4664 -326887 67132 175745 -29773 -107801 173754 -5011 -151237 -21017 -94743 172616
4654 172616 -274 21199 -246714 -210742 57943 -105570 3895 -257746 -28227 152617
4644 152617 -130791 -102282 -382817 -443006 -359827 -27587 -70655 -196632 -74986 -303215
4634 -303215 -364753 -267235 119237 -129671 -291920 -286594 64330 -258586 -242296 -113108 -26392
4623 -26392 -194616 -312622 -116077 -136452 -212158 -355699 -439 49354 -132197 158477
4613 158477 142446 202178 -95524 63430 62299 -41011 4504 26801 -95904 -76354 93943
4602 93943 -106863 83817 -749818 -712838 -317596 -111821 34807 -436323 -455237 -137583
4592 -137583 -37587 22060 -36026 -46919 -39324 63111 74301 96759 273583 474227 126259
4581 126259 -146570 -205204 -313897 -28757 316618 -228898 -99584 -112945 -254724 -378278
4571 -378278 -523246 -264543 -167920 -123183 -123889 -80410 -255965 -384537 -118236 127779 62166
4560 62166 -176847 -348768 -398708 -145937 66844 -6952 48561 313153 277494 -12042 -159881
4549 -159881 197082 459402 268408 190668 94724 213237 63780 208495 77557 8436
4539 8436 25471 -198271 222783 191970 -24599 237330 184637 115079 186257 192282 283924
4528 283924 319374 -8400 -129363 -298258 -214589 28101 200151 87886 213248 156199
4518 156199 54844 -80681 -167413 40325 -14706 331715 185534 75601 268750 29764
4508 29764 -240960 9802 -92927 -236928 130238 489040 262926 -96644 -246097 -295685
4498 -295685 155167 371545 227253 -130732 -352689 -335927 -201511 -30906 -49304 -79472
4488 -79472 -4294 143598 -50055 196301 212807 356094 499610 410976 99778 203378
4478 203378 438471 415112 395924 288312 620478 534153 609409 393237 510161 982997
4468 982997 704194 846131 867169 1313127 1316234 1516309 1975825 1809453 1753384 1589751
4458 1589751 1517945 1200549 1128226 833840 867866 746176 652048 587511 957512 724496
4448 724496 238593 274890 440495 342463 399825 595283 237742 311632 485865 597928
4438 597928 394231 391397 334402 242376 -171890 168265 768228 414184 -27675 -296738
4428 -296738 -339719 -151459 248619 117787 -41878 58919 35850 -1636 -35204 165823
4418 165823 195257 217217 161045 139041 503576 264925 343631 410391 268094 211247 166790
4407 166790 84495 40656 -52499 301586 361824 -119243 -223488 -108128 -416030 -281973
4397 -281973 -4328 -123212 -81162 46267 -461413 -452955 -134745 -296952 -234391 54441
4387 54441 317670 98942 9156 122005 118846 226611 287913 155806 60670 -46925 64066
4376 64066 210850 273684 179224 -12854 -49350 20263 -126435 -307217 -391212 -429772 -599145
4365 -599145 -291680 8892 -7671 205590 195765 176205 519510 442935 386762 -207311 -165241
4354 -165241 -46010 -50303 -131100 21324 218203 178206 200764 -275196 -139824 -227475 -19762
4343 -19762 216875 203850 346956 256189 304927 454191 12631 -187245 -22882 71407 -38905
4332 -38905 88727 177080 240227 104634 131180 171094 -11945 -135539 96750 436372 172150
4321 172150 126419 -71895 -87916 -34966 -113246 -182840 -248872 -435010 -355154 -151427 303604
4310 303604 272038 330196 203273 43933 -313638 -125360 -455124 -529805 -281728 -242500
4300 -242500 101693 -229142 944 -202543 -417222 -106158 -243662 -234157 6827 140481
4290 140481 56751 142475 -51740 -59153 11017 -155481 49517 -144115 54168 323153 199791
4279 199791 9011 -212469 -136877 -53256 221828 159505 -27205 -172276 -211463 133250
4269 133250 207791 192952 112040 120179 306124 277945 250256 172031 -188606 -49492 195394
4258 195394 117834 119040 289806 -71403 -105216 -9306 109457 294349 393191 59341 102101
4247 102101 -4552 -230401 -327881 22303 74333 9221 59348 -44380 111167 299813
4237 299813 287021 -144984 -122379 27003 147297 280584 133304 -3732 300316 341487
4227 341487 206531 274832 234406 87167 85651 253735 28217 302900 282321 173290 -24026
4216 -24026 -356532 -560422 -357337 -37697 -113355 19385 -112854 -177186 -93753 -151957 -27882
4205 -27882 -121913 9885 124260 72117 205025 -7833 -238421 -44006 101581 420796
4195 420796 401513 36514 -105000 31914 153079 -112668 -50310 2510 305222 412019
4185 412019 288675 432922 219543 -31977 53637 180201 235315 273832 259419 163169 -19609
4174 -19609 -70999 -75393 48176 129154 -2346 -223718 -311324 42750 -92568 7452 12548
4163 12548 185747 332387 227307 350804 99764 -70235 93771 214598 -1238 355559
4153 355559 440546 415680 310586 178286 259531 156937 217269 222797 328899 72890 112860
4142 112860 -36267 155094 268325 403156 402519 125489 -180830 -94965 39587 -61136
4132 -61136 -511447 98843 151329 -162220 3945 148072 54920 19727 -268306 -70039
4122 -70039 201946 37291 -103656 -58998 -167637 149338 186280 -36568 -4278 90029 88364
4111 88364 11633 195778 -83893 309 -32847 155425 27030 -128809 202068 174014 82775
4100 82775 -60236 -108362 240 -17190 173192 4046 -48708 -214025 -50669 -89789 -125233
4089 -125233 312646 346842 -168368 -80197 -126310 98534 371776 409324 319551 356440 83003
4078 83003 -76205 11388 32449 -10751 209712 73804 109559 217305 317771 93088 296875
4067 296875 254551 103112 272653 34693 142271 188205 173385 182336 458561 874540 519628
4056 519628 226820 23696 44560 149538 -96024 -374657 -95309 79472 267225 181701
4046 181701 51787 406384 561223 514293 154244 196888 182010 44414 181746 337890
4036 337890 314978 102068 -52254 -135295 45238 84104 41172 98848 248975 325999 22090
4025 22090 -189932 -356229 23552 398618 420022 178680 286758 414307 474803 329537
4015 329537 444237 126939 221275 59995 236166 285123 169073 201343 248557 386977
4005 386977 365184 -146529 -98269 183731 409965 536509 125596 -52974 76369 342659
3995 342659 247141 221194 304128 516241 325891 222501 121881 27051 182293 272131 -41786
3984 -41786 -77736 201263 556545 466737 530678 540793 233872 119326 -41951 88597 296215
3973 296215 196551 18600 139787 257026 132913 161919 113124 -96769 3175 153890
3963 153890 350292 20972 -22012 185559 166100 232473 53841 347175 549932 378788
3953 378788 284256 43969 113551 313476 337027 395369 633245 363423 307177 50052 27676
3942 27676 202518 8274 -15902 -104058 -237457 42397 -43676 -81888 -27996 -79684 28383
3931 28383 -158115 -211172 -153684 -142451 -52511 -184881 -126468 28268 -71879 -35581 -20453
3920 -20453 418748 -20586 -154343 85677 -61607 -168887 -184303 67032 267490 211251
3910 211251 267008 26575 115409 -10850 51251 14622 93496 50691 -286570 -149748 -125175
3899 -125175 -149082 -64107 150581 252154 79941 159343 -178070 -376917 -313067 96104
3889 96104 78571 -234071 -221611 -235156 -321213 -268760 171210 302969 202824 -238751 -46496
3878 -46496 -201833 -274620 -170752 -150527 -464896 -363075 -3485 105931 30912 -304438
3868 -304438 -260492 -298895 51563 140575 201765 -199870 -356575 -149402 -309872 -294920 -153440
3857 -153440 -33988 -152590 -247779 -154678 -87804 91906 223059 136944 -83940 43486
3847 43486 433681 230521 90260 -80796 -99476 -282480 -51905 35283 -111236 -287377
3837 -287377 104276 84788 -46341 -48057 -252535 -101602 -270225 -343210 -222049 -183671 55155
3826 55155 25413 112805 74778 132223 73564 -130925 -142738 104292 76333 64680 38076
3815 38076 -56355 401363 318962 314463 144377 168185 101578 97354 70591 -56652 -333083
3804 -333083 -181848 -338840 -175120 132271 211263 326951 -70492 -273589 -332865 -48956
3794 -48956 249932 -87229 -191700 160437 119781 140295 64153 -40445 423644 368594 -6495
3783 -6495 154273 253427 130869 -11902 -13290 -19407 175715 323536 -62317 -47696 17333
3772 17333 227561 105743 234339 474062 255695 371890 232795 -68765 -93196 -35068
3762 -35068 -150641 16303 -306815 -217856 81079 266142 548491 -79848 -463268 -484866
3752 -484866 -355930 -85114 -109372 -176455 -169732 -7521 129905 580466 738951 343498
3742 343498 381122 232995 9891 -133356 -180292 -248597 -473924 -104949 168937 39921
3732 39921 87249 115039 29991 -119682 -309915 -205393 -165698 -116530 -184423 -116523 -404744
3721 -404744 -344549 -279882 -95415 6027 -4074 92860 -51345 -25691 342500 344508 255197
3710 255197 -213527 -313705 -153533 -185803 -4444 48044 -344425 -163674 142751 -52999
3700 -52999 288909 268259 241679 293647 250100 -189012 -128527 108366 194125 76258 316805
3689 316805 269620 357823 393884 376909 241254 -36178 182385 404207 345100 147710 131859
3678 131859 60296 165173 239462 667419 658390 223477 -112695 33759 262411 149513
3668 149513 566394 787336 237776 135042 294095 401318 331862 72014 43339 23505
3658 23505 331590 -54869 -45464 -5233 35149 121945 -7514 -53708 34976 455496 396485
3647 396485 368111 273536 -106207 147642 697949 590429 309804 558312 472737 278028
3637 278028 -52450 -238901 -5895 113377 115375 1562 63590 136737 -10249 211095
3627 211095 62264 -64303 -140064 -213869 -69000 9989 115072 -128972 -31974 170483
3617 170483 358137 95895 55388 121741 174609 346960 338567 386333 212143 -10358 32211
3606 32211 -77875 -408765 -220507 -140820 93551 357331 151728 -14587 5245 159933
3596 159933 166667 231160 345544 249651 325137 375757 -49977 -1126 -49075 -26661 201011
3585 201011 179349 327781 375356 726637 570603 233560 227041 73912 130014 229146 205093
3574 205093 -7635 -228728 -203189 -148999 85229 305443 210853 12272 -141087 169217
3564 169217 -30740 134891 79988 36942 -36500 -300618 -158967 54822 183544 275641
3554 275641 -67337 -166262 241960 224871 182337 113862 160827 313376 230683 164356 309922
3543 309922 386222 50190 133349 113898 104665 -89387 73299 -18609 -32321 20900 465786
3532 465786 444755 -27377 116660 -144060 -176612 -133124 232689 174740 157626 82290 -38459
3521 -38459 -72381 151032 34970 -82875 -129761 2619 -115849 87123 -1635 -340399
3511 -340399 -138503 -185086 -111252 30684 129300 119834 208023 462013 358398 309525 268741
3500 268741 457610 183354 -51933 54746 25030 256390 317879 291354 237718 393812
3490 393812 124218 28749 468498 497170 321152 245206 264847 152776 -130057 7344
3480 7344 152419 379685 43211 32747 63186 -50605 114106 31160 181263 -129317 44384
3469 44384 432624 367479 117017 221688 30082 265512 112079 32043 290588 246159
3459 246159 477677 330767 426399 283304 36199 159135 215216 216452 167835 95693 305880
3448 305880 361514 418273 509339 403294 252307 156199 316655 452921 233215 205251 359368
3437 359368 553260 555326 218427 321027 429453 247713 290147 123292 164416 63885
3427 63885 43941 -52443 173896 648904 389616 396466 492073 346296 562079 626599 384831
3416 384831 144838 138426 432752 169976 335179 377678 532020 653950 370490 -109768
3406 -109768 -128984 417108 490627 157739 227293 176792 -32302 227129 462973 286329
3396 286329 239216 327453 452267 597533 212843 145335 107196 82750 315918 344575 272631
3385 272631 358110 313156 253035 342198 60934 352089 180203 71882 158440 30695 460495
3374 460495 347753 59906 210232 197585 -74864 169869 466830 336699 147827 216113
3364 216113 52789 -144603 522 119136 -144658 361637 336557 -84583 -210316 148707
3354 148707 148980 207631 291179 248799 371597 19807 105764 204458 142221 201062 228172 -35325
3342 -35325 182158 355101 268269 196041 230472 -72420 61347 201986 -169934 205635
3332 205635 153965 290838 197583 -223586 -177464 191433 285823 256172 179822 1203 -186604
3321 -186604 -187583 -211398 111816 -72210 -80933 -168543 -329927 43497 287659 308863 380161
3310 380161 427703 334766 179938 17782 -25140 254265 530666 338773 113634 150347
3300 150347 109135 132594 -46146 132237 338198 338458 334447 283242 149764 -65280 129536
3289 129536 3565 70102 -81284 138123 344966 412207 -83815 -195416 -59447 297937
3279 297937 21221 34966 350759 107491 120442 486457 333448 204302 153959 354715
3269 354715 377945 283832 418663 545166 281547 72285 109630 3087 22001 129080
3259 129080 390492 321965 235992 476540 448717 486507 632603 392088 542561 411501
3249 411501 198536 273036 208594 369315 724416 795759 534585 449850 646913 671084 355690
3238 355690 573624 705223 369167 299220 58076 110112 45619 18873 253465 326061 304641
3227 304641 160276 212534 99146 128029 428124 365885 141288 155651 201378 172814 198590
3216 198590 353531 312491 -65515 -48065 100164 18876 -79106 101833 102276 165962 342413
3205 342413 583221 589894 258866 -88372 -71796 25400 -142223 -306609 -123115 31139
3195 31139 139432 376268 87652 73598 -200264 -357709 -50485 -99181 49225 -75751
3185 -75751 -101792 -196962 -7083 26644 40312 267026 397102 87554 36040 -58798 -107312
3174 -107312 147191 -40609 -185717 -182368 -342455 -289828 54235 -4106 -1748 151888 132201
3163 132201 40020 222251 68038 56616 45189 -34362 74620 171215 177160 276468 -31020
3152 -31020 -158358 130565 170918 22549 286047 333085 63223 31273 -148399 -2051
3142 -2051 -134858 -422111 -352404 -46986 81254 -161315 75911 135018 -219705 -55928
3132 -55928 -12451 60308 -14853 99410 164927 174362 -148523 -91339 173792 -71452 -107901
3121 -107901 -8952 285524 -117985 -126129 196459 145826 118487 -183554 -186771 -9861 -104967
3110 -104967 -387240 -7887 183304 20672 42246 61515 87327 203968 372176 176111
3100 176111 -8096 -113415 -326141 -375270 -166826 -85594 9528 -189269 118372 73847
3090 73847 3668 -11090 -30172 -48157 -20684 -8879 -387228 109840 188034 298742 216841
3079 216841 196916 318977 -13802 98230 -97575 88261 155598 116432 84576 -196587
3069 -196587 -113579 107129 286182 68763 -104100 -48223 -110576 -49452 153601 107967 118352
3058 118352 -14325 17089 103906 245240 467728 208369 340669 70676 -187997 -159524
3048 -159524 -98932 4663 -206069 -262228 -19250 91101 -152483 -206564 -260657 -449713
3038 -449713 -244864 25835 -39790 182023 232825 18452 -379775 -325291 -116348 -76095
3028 -76095 99911 192524 87835 -15377 13401 -40505 -80093 153921 272398 221145 -36182
3017 -36182 -64209 -380520 -332221 -4738 -150308 247536 136066 -34298 266731 432225
3007 432225 54595 -7960 -116612 -8736 62474 -93810 -133981 4423 -111160 -72268
2997 -72268 -26976 87556 133369 99417 182196 292478 195278 -112316 -124366 86474 129653
2986 129653 12944 -186711 100968 423775 160219 202343 259603 -72008 -62423 487489
2976 487489 175390 215629 195590 190190 61407 -189449 -89441 -33366 -41462 292992 -173458
2965 -173458 -422107 -115817 -248870 -76024 189334 103135 238177 106307 211914 252121
2955 252121 -12387 35933 -177860 -362426 -392379 -131887 -247252 104220 443720 413223
2945 413223 598102 409107 225282 -19801 -141577 293088 341076 134199 67215 170355
2935 170355 402821 298135 310118 429454 -18017 -104474 -57297 -56765 90124 105278 -178181
2924 -178181 -385543 -341247 -155269 -274553 -397069 -350972 -314454 43595 -212897 -147209
2914 -147209 251037 53337 -138279 -35205 30930 407330 346465 199903 399132 61393
2904 61393 72589 -139520 229352 204361 88937 113035 95475 405761 157549 48619 179434
2893 179434 -43498 -362040 -282917 -184153 -149056 -290096 28455 -85628 56620 12299
2883 12299 -46911 170961 -261973 -37446 320488 4736 -173154 -362923 -410126 -310494
2873 -310494 -251141 102870 32408 144886 68866 10038 96709 182878 -118833 -362282 -13510
2862 -13510 -52522 23086 27737 -264400 -345518 -330612 -324515 -229114 -409098 -437481 15718 212164
2850 212164 138650 129568 9653 -85469 117454 122875 -139874 -211874 -586806 -566846 -494505
2839 -494505 -551009 -369430 -431385 -226009 -286985 -240948 -136602 -238465 -119174 118013
2829 118013 187119 -172835 -260843 -385218 -266383 -252711 -201663 145191 -133296 -134231 123312
2818 123312 99570 -130692 -265631 -160752 -306682 -356994 -58631 68046 24817 225253
2808 225253 301351 332380 253759 67264 -132627 39222 -310924 -358133 -218906 -181805 -459334
2797 -459334 -456185 -44653 -145647 -367975 -344637 81449 -52037 -118783 112885 33030 92648
2786 92648 140181 9046 105826 58426 -203746 -298748 -130323 -126074 -323018 -283818 -193255
2775 -193255 -215214 -5858 325952 28741 -77503 -229025 -105984 33984 -66552 171535
2765 171535 200557 232287 3614 237039 32270 -364453 -763867 -472167 -178100 13338
2755 13338 -3012 24248 -245926 -47820 -46206 -46797 60122 21090 -83569 -20964 -112868 -2860
2743 -2860 40123 -179571 -144068 104773 170440 -155365 -134012 -95417 -71661 -51550 39597
2732 39597 -114683 41079 -343176 -75850 201690 -106502 -312242 -70813 14560 32176
2722 32176 -63058 -44287 153161 124358 34577 19957 156682 43602 -460311 -452057 -215759
2711 -215759 -130994 -55128 16464 1466 -109245 -44360 -48222 -173892 13352 321813 89346
2700 89346 -225471 -174163 -203219 -268750 -159929 -694225 -766400 -475592 -182662 -20058 -15443
2689 -15443 320721 366495 26717 -231471 -175299 -216874 -285942 -147138 -89247 94776 354679
2678 354679 -46851 -137011 117149 -74034 121495 334081 37759 -98394 -75564 -215708
2668 -215708 -315106 -369133 -336572 -136354 100513 -72565 -77486 -172459 -95098 -99604 1896
2657 1896 172921 -25142 21801 258564 194213 -92814 -58208 1784 20534 -238927 -236744
2646 -236744 -58697 -73045 -321108 -373735 -636442 -574842 -256552 11848 212673 -171472
2636 -171472 -269845 -9768 -69984 89614 46764 -40259 -27722 220572 121908 -109359 -232516
2625 -232516 66428 222500 425925 48772 -269496 -139368 -484320 -415267 -247507 -212630
2615 -212630 -72834 -56068 -19764 -174739 -245781 -81719 -127213 2582 -47176 28056 -82217
2604 -82217 -180647 -11784 -278355 -85300 376755 -50096 70887 -30564 -255037 31761
2594 31761 -176662 -208268 -162608 -182964 -204799 -316446 -119680 -41144 -46660 -63372 -212962
2583 -212962 -238317 33539 35441 -161103 -429011 -273099 264693 335524 26213 -313524
2573 -313524 -70779 155018 -122496 -431278 -294494 -396697 -445965 -168085 44258 -70530
2563 -70530 -275197 -158664 -180963 -130492 -230726 -94917 -94283 -69625 -48945 16052 19490 -4361
2551 -4361 130604 228849 302466 230866 -117127 -156270 -150663 -19408 -13240 -150333 84951
2540 84951 101322 27984 89111 47329 126466 160802 147605 47579 17785 90419 21150 -18834
2528 -18834 -49895 25178 146455 -235798 -301284 -151119 -168109 -268721 -71365 -223760 -20250
2517 -20250 -11585 -88444 78046 -44394 -292637 -252296 47157 -242614 -281718 269969 428335
2506 428335 167867 107440 65422 232414 345407 197840 38154 170175 133499 -4466
2496 -4466 45740 367875 129792 -135436 -251279 122420 77482 -459303 -420412 -46783 -76614
2485 -76614 8319 205083 64242 11312 316777 6544 -141389 -234088 -550591 -119558
2475 -119558 191930 -4235 -42225 280337 423074 423330 290627 -151625 -305476 -342566 -347047
2464 -347047 -132250 220620 154467 106426 184367 -144496 -160752 -186979 -61276 16952 76758
2453 76758 167840 386073 288453 25705 -7423 325811 309002 -164036 -168082 17870 -111170
2442 -111170 -144413 -338970 -397594 -144314 -36561 -33251 -19985 338112 426055 194298 38746
2431 38746 358807 462062 255504 59453 -1141 -104872 -191316 -148059 -230739 85860 12056
2420 12056 -93346 -293167 -358238 -78703 -103324 49311 58631 81367 68025 5305 203781
2409 203781 -13680 53235 197607 -24040 89091 -55162 -189117 -386436 -144774 25986
2399 25986 254006 -28757 107123 276590 -42144 82050 174056 169514 19450 -13481 2290
2388 2290 85161 -16666 -104701 24320 25425 317571 398061 222960 207045 228436 223288 512207
2376 512207 591220 581729 759447 610515 581272 750530 749921 575926 644022 757878 954508
2365 954508 502327 194102 188639 228921 196709 219661 294702 220863 178206 235596 82375
2354 82375 183492 168383 -43292 127002 -80316 -69274 59394 173653 54875 296739
2344 296739 156861 86579 -837 53088 430145 348816 9554 202993 459504 225526
2334 225526 202651 205484 -89105 165556 181337 419957 404546 207998 373657 224405 251136
2323 251136 191831 325115 352676 399938 272307 451283 527947 433911 154604 173060 236360
2312 236360 330024 411502 126454 34096 435292 186925 -123798 -279067 -37289 -33694 -39267
2301 -39267 73070 17246 162925 129550 32732 -284715 59979 459014 523171 322031 90499
2290 90499 359222 348344 431508 256726 256280 81500 361269 307736 445639 380423 581113
2279 581113 413424 100985 -1780 155507 280164 390845 316147 205611 84251 379275
2269 379275 270640 175515 297081 345956 571848 497770 411812 422220 521415 500641 569347
2258 569347 499580 713812 585749 628416 448044 398678 505353 670559 596880 451966
2248 451966 609288 446691 246305 309590 237187 646631 573827 501242 724470 737166 684083
2237 684083 636671 475240 517658 642748 770970 449082 483698 519340 588963 667190 735518
2226 735518 858687 564156 462396 592133 519475 457694 431021 735846 637766 802763
2216 802763 686676 654358 729655 805718 336427 664003 925287 957111 956075 941940 944782
2205 944782 1173358 925852 891204 777602 968628 1179631 1070434 1212896 892059 948962
2195 948962 842498 880477 1242298 1467634 1405865 1337235 1616752 1731758 1474999 1438629
2185 1438629 1361607 1325763 1713552 1702977 1714622 1798502 1857767 2160398 2257083 2453485 2307036
2174 2307036 2097551 2120785 2216021 2078059 2565533 2840682 2764742 3158103 3244410 2881277
2164 2881277 3026744 3165464 3345228 3179157 3379211 3516978 3937559 4025260 3691048 3946571
2154 3946571 4239837 4480594 4472608 4623337 4950287 4901449 5045826 5451789 5429728 5444508
2144 5444508 5347782 5709649 5806988 6343410 6914831 7317435 7311991 7482784 8028872 8376384
2134 8376384 8656316 9083048 9527127 9694567 10210450 10583429 11053619 11602491 12449705 13612173
2124 13612173 14639020 15503178 16714125 17846202 19202917 20810747 22557064 24370354
2116 24370354 25578186 26670346 28578225 30845550 34471070 38959037 44530720 50893539
2108 50893539 59259127 70593332 85418231 103350516 125592213 147843272 158094865
2101 158094865 138871132 108510336 83809418 65273775 53347855 44230058 37494425
2094 37494425 32421084 29021152 25862913 23719102 22314084 21197909 19669920 18704274
2086 18704274 16951065 15376545 14185481 12988694 12016318 11301790 10572499 10000953 9512210
2077 9512210 8967542 8597698 8399407 7576673 7286228 7073446 6451787 6399171 6193976 5615796
2067 5615796 5457981 5084515 4833057 4579538 4339563 4176484 3983169 4017676 3890683 3751210
2057 3751210 3603363 3183796 3256496 3004896 3231963 3317124 3160200 2802735 2837651 2656143
2047 2656143 2586282 2711339 2635020 2636828 2659742 2707141 2649572 2088296 1944845 1812671 1744388
2036 1744388 1529874 1643379 1701287 1897068 1680109 1247599 1026402 1316980 1227372 1276948
2026 1276948 1543380 1418891 1312980 1209558 1183861 1023795 936127 1048412 1081588 948205
2016 948205 699006 760633 453699 351335 469605 777277 443415 231012 368752 345528
2006 345528 512119 302086 268704 363165 796790 701232 562866 409032 621585 819220
1996 819220 725351 505053 597786 680646 383107 176647 143004 236061 377542 253383 297872
1985 297872 -72199 136680 48850 -182432 -108341 155668 193350 285862 688350 893042
1975 893042 520417 295558 601913 407003 367752 215177 258299 356492 142080 215229
1965 215229 355566 252821 147194 372010 89417 -116326 113032 515555 445058 312129
1955 312129 -141683 -444005 -206466 -235357 307756 351181 290437 353116 125762 231039
1945 231039 -126338 146475 142511 246016 184884 -37053 -57671 -234925 -40884 -43718 -129375
1934 -129375 -3656 -24877 -209256 -183920 -154725 -62378 154191 103601 81414 -339866 -251192
1923 -251192 -183856 -212360 -461663 -268031 -369296 -165372 314449 224944 121997 -16199
1913 -16199 6807 220090 297168 845 7642 128469 486126 216375 264287 262816 -92461
1902 -92461 134736 94477 -238382 -221089 38494 204461 130019 325731 4969 -99432
1892 -99432 -342657 -258343 -260410 51542 63640 -262773 -224317 411152 245657 -74027 -108307
1881 -108307 70771 13156 219399 96677 -39471 43202 -418733 -112209 -7416 -86025
1871 -86025 -429584 -450252 -479415 -181241 176243 78706 123171 250373 72439 225845 120840
1860 120840 -158826 -23740 -89570 -76083 75629 -69795 -207342 -176674 -51425 -238320
1850 -238320 -375909 -489494 -552986 -326994 -141241 35517 -24829 29608 76839 245664
1840 245664 311587 49369 -188664 36841 275044 248448 413355 509656 308353 427673
1830 427673 468731 297455 164168 390850 265723 -61711 -179532 -49084 64659 -147080
1820 -147080 -4786 238793 214814 -54611 250245 425714 192198 -63119 171091 301429
1810 301429 363519 151858 197958 -140500 -116060 121792 51137 91498 -71781 -219777 -6581
1799 -6581 236859 19660 109158 70997 -225677 9529 78690 86316 137268 268003 50387
1788 50387 91 77937 43450 -21037 -37003 257381 162389 130537 243019 106190 107005 166073
1776 166073 21773 -19734 -146121 -143123 -80705 -108584 -67445 -231964 -220182 106118 -226219
1765 -226219 -390524 -174690 154889 34325 -53090 55423 -119266 -57388 11358 -264322
1755 -264322 -364740 -72583 -7400 -37305 -14912 -324188 -277459 -258912 -38353 5320 -195301
1744 -195301 -230726 -330330 -349960 -318449 -358781 -286842 -133920 -159606 -305182 -170483 -224494
1733 -224494 -123656 325835 89977 -105701 32253 -31196 -29054 -281326 -205781 -379336
1723 -379336 -312604 -310885 41634 -174350 -110654 -127492 80603 -54905 -292046 81126 226996
1712 226996 8067 57463 258881 -323118 35333 356306 -103300 -508291 -348005 -392729
1702 -392729 -509162 -426330 -233999 -297691 -358412 -152409 -123318 -240324 -142039 -319780 -114375
1691 -114375 -277410 -243736 129427 -116001 -470074 -332570 -325985 -97738 -440947 -174208
1681 -174208 -83730 -35686 -29500 -98539 -249212 -237303 -93125 -369453 -439544 -360898 -163467
1670 -163467 -354999 -146706 -150835 -68333 -163456 -50032 35881 -116826 -447367 -306992 -15843
1659 -15843 -335821 -179327 42845 -142334 -301239 -310465 -310846 -277094 -476993 -449349 -103680
1648 -103680 361403 146729 -318141 -498166 -198048 81814 146270 155196 165489 197539 167479
1637 167479 43627 41644 -168383 -92042 -32623 -1211 107244 65462 -452642 -257776 47240
1626 47240 -54774 -211761 -402478 -219129 -16944 -367223 -410100 -680501 -367586 -168122
1616 -168122 -364557 -104974 -69844 -172770 -168450 -44278 -15202 -110717 -376806 -665618 -642087
1605 -642087 -429836 -707908 -434659 -194826 -137669 -555680 -302731 -193593 -377783 -366815
1595 -366815 -59500 -313304 -332333 -492327 -153735 -366461 -292775 -89903 -47542 100366
1585 100366 53168 261388 377562 60645 -526443 -508452 -243474 121475 141014 -47041
1575 -47041 -160322 -408066 -437725 -438301 -135664 -269057 101894 297656 418778 213801 -12476
1564 -12476 287935 9365 122993 122639 133982 165804 192463 -65591 -212820 -416684 -3427
1553 -3427 99474 -88323 -208772 -63454 -126874 47842 258435 -4382 -59829 136910
1543 136910 3152 -201511 -282626 -210019 -226830 -215531 -87847 46287 -182223 -15599
1533 -15599 215986 -85580 -149832 -190277 -330701 -203982 -85480 -212116 168992 283974
1523 283974 62470 -116999 -184081 -364072 -200307 -300056 -433570 -107629 29541 -240565
1513 -240565 -258236 36978 52224 -96909 -348379 -110443 54372 16834 -73095 54080
1503 54080 301993 -21730 -234822 -215095 -100624 -201697 -161427 204589 20062 59034
1493 59034 245697 -121306 214431 -29466 -84880 54305 -20008 -68528 -152391 -297109 -261349
1482 -261349 -506893 -549887 -289097 -151264 -13472 -242621 -210045 -203267 -237769 -268721 -190365
1471 -190365 -141299 -81542 -190583 -90437 -41649 -332007 -216522 -344827 -527742 -223462
1461 -223462 -418990 -468523 -378589 -327765 -293573 13863 -166447 -445274 -548965 -438618
1451 -438618 -392761 -339344 20186 107790 -1320 76257 61250 -139944 -287104 -252561 -450973
1440 -450973 -415039 -265057 -316806 -362107 -135094 152153 -200737 -59843 4409 -239456
1430 -239456 -282611 177782 110976 -137048 5964 -69745 28831 -57729 86679 -137820 -138207
1419 -138207 -106287 -238132 -9186 284211 -208452 47966 196053 -240902 -320598 -47682
1409 -47682 56462 -184303 -151651 -14228 -88468 -317742 -370506 -43858 -209284 -24816
1399 -24816 -511910 -510706 66668 -107510 -129555 -185704 -131201 -206752 -249755 -505913 -239145
1388 -239145 -24282 -25796 -241499 -18193 67091 400463 124284 -25157 -88622 35180
1378 35180 -199846 -267224 -113591 -113256 -29538 -159401 -267621 -398724 -474765 -537237 -521855
1367 -521855 -277612 3895 -262385 -176125 -171998 -69768 -22831 -5102 201545 81752 169332
1356 169332 157525 50192 26828 -144316 -245029 -325820 13503 163618 35451 57278
1346 57278 -7739 329133 39997 -19428 153928 11323 143322 -94713 171784 104118
1336 104118 -40314 -69682 -142583 -163563 -46213 140884 32911 -239163 -504972 -250764
1326 -250764 -394107 -63890 -189086 -131397 -137677 -211335 -371010 -296030 159218 130846 -398670
1315 -398670 -165838 -149132 -81553 135310 253113 532668 94061 -394101 -460864 -152613
1305 -152613 109003 50884 11156 241984 34330 85672 -196390 -298212 -35097 -97554
1295 -97554 9187 124367 -198249 -302920 -168541 299644 195140 48340 21987 20894
1285 20894 125980 9361 96552 328651 240801 -277422 -295066 263898 -29708 25405 -78141
1274 -78141 69125 60012 -314038 -32300 100533 148067 169312 44204 -238911 -147092 49021
1263 49021 88124 162611 58535 39946 -78360 258714 85674 -154204 -34014 -571427
1253 -571427 -381169 -186326 -531150 -106883 -9995 24600 -218552 -290241 -113179 -56553
1243 -56553 -114028 -473885 81710 565 -19622 -128623 50135 90857 199212 162745 -56087
1232 -56087 -243584 -152907 230570 98605 -34998 -173998 3738 306923 234066 -41406
1222 -41406 298924 86031 -28129 -39238 213576 284023 -58645 -129601 -254527 -330035 -170652
1211 -170652 95484 -3470 -164471 -15876 76837 84282 199012 -102654 -315619 -222230 -20956
1200 -20956 -283755 -291458 -24958 122488 -188226 -29014 -35518 -408156 -331217 -190095 -170587
1189 -170587 -47210 27410 -323776 -102862 54546 -301698 -352489 -126276 25800 121336
1179 121336 -39993 38911 -51911 174878 425621 199767 8284 -260934 -375767 -77385
1169 -77385 -199580 -148384 -164298 -14632 -180675 -100386 -17371 -135130 -12900 -259432 -456941
1158 -456941 -545798 -196777 -298313 -370826 -195378 -131043 -354418 -117531 -110734 98878 -3925
1147 -3925 -91030 317846 -7032 -352994 -664216 -250044 124999 16491 -456844 -233888
1137 -233888 -204888 -248562 -257542 -233405 -127523 -626695 -354482 -314610 -554652 -420026 -242015
1126 -242015 -117513 98679 204629 404415 242077 313561 -8245 -17897 129952 209936
1116 209936 37196 10214 39148 138577 216355 88336 67015 347618 413848 -89874 -156280
1105 -156280 -164232 55854 287383 64793 33716 106589 70653 -252865 -388396 -140998 33711
1094 33711 -65698 -109793 -60800 -244296 -90725 190299 237312 -178214 -295602 -362336 -91279
1083 -91279 82021 -162532 -249938 -86707 23439 105026 -41589 206192 172446 160507 195987
1072 195987 226165 72203 -176450 -131201 -179639 108255 161390 -4551 -46030 122293 4318
1061 4318 -506133 -242957 47400 -59742 -167248 -166043 -103208 217130 406059 149397 148784
1050 148784 4596 -109493 -91343 -297297 -355584 -17863 -42193 3102 86313 109517 -168227
1039 -168227 -306694 -477662 -418845 -37765 -211162 -247108 -183952 -247730 -258099 -81876 110057
1028 110057 148403 6708 -181564 -152285 -84102 -427122 -297744 319368 338493 -134129
1018 -134129 -106549 -38822 -256295 -108756 -151251 -223187 -186874 119769 391543 463432 190442
1007 190442 138795 -228481 -168724 -456754 -348261 -138623 156815 220863 -111836 -174788
997 -174788 44257 87630 -68763 53554 123135 -80316 -43229 -1872 -179694 211882 210799
986 210799 -286069 -178933 -55869 -371027 -210903 -156876 34818 -386074 -197118 -37441
976 -37441 -265366 -249517 -279396 -291812 -304054 -312352 -70208 -367218 -468118 -510338 -409467
965 -409467 -157367 78446 2122 187876 28 93345 -2646 -53381 -201597 -147935 -120760
954 -120760 28149 -135247 -69605 -365752 -427150 -180656 14025 107422 8735 -31109 -22557
943 -22557 -194189 -44999 174052 86744 288105 469961 164549 151176 450460 124456
933 124456 81764 -125120 -237191 -309105 -194053 -393836 -258439 -258037 192541 83799 184376
922 184376 267226 -14958 -125578 -103109 -272592 -43072 163764 15947 -18996 176792
912 176792 -174889 -253415 20444 -115808 -180431 360549 69093 3645 -51239 139333 118583
901 118583 131887 181352 51536 90376 167437 -119828 68403 205089 30459 -112444 -158277
890 -158277 -558940 -668364 -87451 70307 -375621 -522183 -723560 -243917 50401 -387235
880 -387235 48296 -73085 -44146 -283636 -171056 -88492 -208863 -160081 127022 38125 -68159
869 -68159 9309 20119 -147247 -248665 130673 114769 4016 -131780 -307561 -349396 -333978
858 -333978 -62601 -264045 -252723 -288286 -102535 39940 -25320 -253260 -22535 -169042
848 -169042 10308 432565 247752 -117291 206146 125321 92325 -55396 -160542 177488
838 177488 -158393 -101606 52842 221841 -30001 -155895 -192932 58343 140452 -165053
828 -165053 61649 143896 -144930 -170073 27926 164238 -13720 237280 327634 369721 406650
817 406650 452378 -44109 -60955 398824 359036 108732 -214311 -52445 -13450 -46715 -137249
806 -137249 162507 202625 106136 183083 102719 87439 251871 197105 354219 241661 97321
795 97321 65509 124513 141431 56564 -59121 386048 208796 -95697 -339360 2337 323600
784 323600 -59948 -345516 -26041 58109 -124143 -49262 -48231 -4725 -133334 -380559 105147
773 105147 174779 20885 160278 298768 372322 10101 43841 123068 -64802 -394923 41282
762 41282 -168308 -256445 -96487 -157756 -273371 -46376 -46746 -64754 97320 174440 85904
751 85904 409852 247834 -189780 -100128 112523 -53083 -70824 -237237 -45656 -169209
741 -169209 -46892 76977 348531 549787 99145 417705 213855 203034 166087 177088
731 177088 263538 -139546 -103911 -15946 -158992 -6565 58511 99340 -71731 40824 157706
720 157706 253910 21566 -190307 -442807 -544369 -250419 136629 -94285 -533162 -356441
710 -356441 -406052 232366 251080 104083 -11899 381278 369985 104575 -89684 -121511 267933
699 267933 422992 -32379 -303743 10614 47270 161838 -1846 -68686 8579 46513 -159776
688 -159776 -321300 -106047 20999 -100956 -191512 -463607 -209995 -107723 -116507 -22142 -15449
677 -15449 48232 -4607 87067 53794 155397 163301 -19025 -606 129257 355235 430144
666 430144 378970 290914 209857 -124996 -59946 260720 457636 295083 412485 442818 588228
655 588228 370484 -32665 8997 2379 132378 -59486 -214841 -111201 41667 57387 -157937
644 -157937 -101388 90216 -35867 171205 108665 -46109 -136249 -19155 233855 317034 71485
633 71485 -315174 -291194 88875 9558 -91004 -25198 -41010 183285 292118 226843 274163
622 274163 548859 498534 294667 425606 442364 8246 183608 1870 36319 -26744 257706
611 257706 206580 102373 298240 141576 111305 48376 -125880 -101056 84703 -67204 -160219
600 -160219 -184313 -119098 -49566 -123456 -211041 -228270 -87100 357248 464537 217651 114217
589 114217 66446 -203296 -144601 -117089 -194315 48276 -33902 -327022 -173519 -89240 -67130
$$ [...]
##END NTUPLES=NMR SPECTRUM
##END=
