##TITLE=1H_75-2024
 CDCl3
 8 sc, 
 11.9.2024
##JCAMPDX= 6.0         $$ Bruker NMR JCAMP-DX V2.0
##DATA TYPE= NMR FID
##DATA CLASS= NTUPLES
##ORIGIN= UXNMR, Bruker Analytische Messtechnik GmbH
##OWNER= root
$$ XWIN-NMR		Version 3.5
$$ Wed Sep 11 14:06:53 2024 Russian Standard Time (UT+4h)  she@DPX200
##.OBSERVE FREQUENCY= 200.1318
##.OBSERVE NUCLEUS= ^1H
##.DELAY= (6, 6)
##.ACQUISITION MODE= SIMULTANEOUS
##.ACQUISITION SCHEME= undefined
##.AVERAGES= 8
##.DIGITISER RES= 18
##SPECTROMETER/DATA SYSTEM= spect
##.PULSE SEQUENCE= zg30
##.SOLVENT NAME= CDCl3
##.SHIFT REFERENCE= (INTERNAL, CDCl3, 0, 15.7039)
##AUDIT TRAIL= $$ (NUMBER, WHEN, WHO, WHERE, WHAT)
$$ ##TITLE= Audit trail, XWIN-NMR		Version 3.5
$$ ##JCAMPDX= 5.01
$$ ##ORIGIN= Bruker BioSpin GmbH
$$ ##OWNER= she
$$ F:/spectra/data/she/nmr/H-F/1/audita.txt
$$ ##AUDIT TRAIL=  $$ (NUMBER, WHEN, WHO, WHERE, WHAT)
(   1,<2024-09-11 14:05:44.50 +0400>,<she>,<DPX200>,
      <created by zg, POWCHK disabled, PULCHK disabled
       configuration hash MD5:
       00 E9 B6 7A A2 85 ED C7 34 08 36 98 17 FE 4E 26
       data hash MD5: 16K
       E4 12 35 F8 84 6C 30 A7 88 5F 7F 4F 6A C2 DF 95>)
$$ ##END=
$$ 
$$ hash MD5
$$ AC 5B EA 37 78 3A D6 02 D6 41 59 37 81 0C DA 47
##$RELAX= 
##$RELAX= 
##$RELAX= 
##$RELAX= 
##$RELAX= 
##$RELAX= 
$$ Bruker specific parameters
$$ --------------------------
##$DU= <F:/spectra>
##$EXPNO= 1
##$NAME= <H-F>
##$PROCNO= 1
##$TYPE= <nmr>
##$USER= <she>
##$AMP= (0..31)
100 100 100 100 100 100 100 100 100 100 100 100 100 100 100 100 100 100 
100 100 100 100 100 100 100 100 100 100 100 100 100 100 
##$AQSEQ= 0
##$AQ_mod= 1
##$AUNM= <au_zg>
##$AUTOPOS= <>
##$BF1= 200.13
##$BF2= 200.13
##$BF3= 200.13
##$BF4= 200.13
##$BF5= 200.13
##$BF6= 200.13
##$BF7= 200.13
##$BF8= 200.13
##$BYTORDA= 1
##$CFDGTYP= 0
##$CFRGTYP= 5
##$CHEMSTR= <none>
##$CNST= (0..31)
1 1 145 1 1 1 1 1 1 1 1 1 1 1 1 1 1 1 1 1 1 1 1 1 1 1 1 1 1 1 1 1 
##$CPDPRG= <>
##$CPDPRG1= <>
##$CPDPRG2= <>
##$CPDPRG3= <>
##$CPDPRG4= <mlev>
##$CPDPRG5= <mlev>
##$CPDPRG6= <mlev>
##$CPDPRG7= <mlev>
##$CPDPRG8= <mlev>
##$CPDPRGB= <>
##$CPDPRGT= <>
##$D= (0..31)
0 1.2 0 0 0 0 0 0 0 0.06 0 0.03 0 0 0 0 0.0002 0 0 0 0 0 0 0 0 0 0 0 0 
0 0 0 
##$DATE= 1726049143
##$DBL= (0..7)
120 120 120 120 120 120 120 120 
##$DBP= (0..7)
150 150 150 150 150 150 150 150 
##$DBP07= 0
##$DBPNAM0= <>
##$DBPNAM1= <>
##$DBPNAM2= <>
##$DBPNAM3= <>
##$DBPNAM4= <>
##$DBPNAM5= <>
##$DBPNAM6= <>
##$DBPNAM7= <>
##$DBPOAL= (0..7)
0.5 0.5 0.5 0.5 0.5 0.5 0.5 0.5 
##$DBPOFFS= (0..7)
0 0 0 0 0 0 0 0 
##$DE= 6
##$DECBNUC= <off>
##$DECIM= 24
##$DECNUC= <off>
##$DECSTAT= 4
##$DIGMOD= 1
##$DIGTYP= 9
##$DL= (0..7)
0 120 120 120 120 120 120 120 
##$DP= (0..7)
150 150 150 150 150 150 150 150 
##$DP07= 0
##$DPNAME0= <>
##$DPNAME1= <>
##$DPNAME2= <>
##$DPNAME3= <>
##$DPNAME4= <>
##$DPNAME5= <>
##$DPNAME6= <>
##$DPNAME7= <>
##$DPOAL= (0..7)
0.5 0.5 0.5 0.5 0.5 0.5 0.5 0.5 
##$DPOFFS= (0..7)
0 0 0 0 0 0 0 0 
##$DQDMODE= 0
##$DR= 18
##$DS= 0
##$DSLIST= <SSSSSSSSSSSSSSS>
$$ [...]
##$SUBNAM2= <"">
##$SUBNAM3= <"">
##$SUBNAM4= <"">
##$SUBNAM5= <"">
##$SUBNAM6= <"">
##$SUBNAM7= <"">
##$SUBNAM8= <"">
##$SUBNAM9= <"">
##$SW= 24.0689170037331
##$SWIBOX= (0..15)
0 0 2 0 0 0 0 0 0 0 0 0 0 0 0 0 
##$SW_h= 4816.95568400771
##$TD= 16384
##$TD0= 1
##$TE= 0
##$TE2= 300
##$TE3= 300
##$TEG= 300
##$TL= (0..7)
0 120 120 120 120 120 120 120 
##$TP= (0..7)
150 150 150 150 150 150 150 150 
##$TP07= 0
##$TPNAME0= <>
##$TPNAME1= <>
##$TPNAME2= <>
##$TPNAME3= <>
##$TPNAME4= <>
##$TPNAME5= <>
##$TPNAME6= <>
##$TPNAME7= <>
##$TPOAL= (0..7)
0.5 0.5 0.5 0.5 0.5 0.5 0.5 0.5 
##$TPOFFS= (0..7)
0 0 0 0 0 0 0 0 
##$TUNHIN= 0
##$TUNHOUT= 0
##$TUNXOUT= 0
##$USERA1= <user>
##$USERA2= <user>
##$USERA3= <user>
##$USERA4= <user>
##$USERA5= <user>
##$V9= 5
##$VALIST= <valist>
##$VCLIST= <CCCCCCCCCCCCCCC>
##$VD= 0
##$VDLIST= <DDDDDDDDDDDDDDD>
##$VPLIST= <PPPPPPPPPPPPPPP>
##$VTLIST= <TTTTTTTTTTTTTTT>
##$WBST= 1024
##$WBSW= 4
##$XGAIN= (0..3)
0 0 0 0 
##$XL= 0
##$YL= 0
##$YMAX_a= 360547
##$YMIN_a= -369061
##$ZGOPTNS= <>
##$ZL1= 120
##$ZL2= 120
##$ZL3= 120
##$ZL4= 120
##$ABSF1= 10
##$ABSF2= 0
##$ABSG= 5
##$ABSL= 3
##$ALPHA= 0
##$AQORDER= 0
##$ASSFAC= 0
##$ASSFACI= 0
##$ASSFACX= 0
##$ASSWID= 0
##$AUNMP= <proc_1d>
##$AZFE= 0.1
##$AZFW= 0.1
##$BCFW= 1
##$BC_mod= 2
##$BYTORDP= 1
##$COROFFS= 0
##$CY= 11.3945322036743
##$DATMOD= 1
##$DC= 2
##$DFILT= <>
##$DTYPP= 0
##$F1P= 15.6554695791079
##$F2P= 12.8336369535428
##$FCOR= 0.5
##$FTSIZE= 0
##$FT_mod= 4
##$GAMMA= 1
##$GB= 0.15
##$INTBC= 1
##$INTSCL= 1
##$ISEN= 128
##$LB= 0.24
##$LEV0= 0
##$LPBIN= 0
##$MAXI= 10000
##$MC2= 0
##$MEAN= 0
##$ME_mod= 0
##$MI= 1.114404
##$NCOEF= 0
##$NC_proc= 0
##$NLEV= 6
##$NOISF1= 3.799351
##$NOISF2= 2.8
##$NSP= 1
##$NTH_PI= 0
##$NZP= 0
##$OFFSET= 15.70392
##$PC= 1
##$PHC0= -25996.46
##$PHC1= 14.78748
##$PH_mod= 1
##$PKNL= yes
##$PPARMOD= 0
##$PSCAL= 0
##$PSIGN= 0
##$REVERSE= no
##$SF= 200.130013532006
##$SI= 16384
##$SIGF1= 3
##$SIGF2= 2
##$SINO= 400
##$SIOLD= 16384
##$SREGLST= <1H.CDCl3>
##$SSB= 0
##$STSI= 0
##$STSR= 0
##$SW_p= 3612.71676300578
##$SYMM= 0
##$S_DEV= 0
##$TDeff= 0
##$TDoff= 0
##$TI= <>
##$TILT= no
##$TM1= 0
##$TM2= 0
##$TOPLEV= 0
##$USERP1= <user>
##$USERP2= <user>
##$USERP3= <user>
##$USERP4= <user>
##$USERP5= <user>
##$WDW= 1
##$XDIM= 8192
##$YMAX_p= 0
##$YMIN_p= 0
$$ End of Bruker specific parameters
$$ ---------------------------------
##NTUPLES= NMR FID
##VAR_NAME=  TIME,          FID/REAL,        FID/IMAG
##SYMBOL=    X,             R,               I
##VAR_TYPE=  INDEPENDENT,   DEPENDENT,       DEPENDENT
##VAR_FORM=  AFFN,          ASDF,            ASDF
##VAR_DIM=   8192,          8192,            8192
##UNITS=     SECONDS,       ARBITRARY UNITS, ARBITRARY UNITS
##FACTOR=    0.0002076,     1,               1
##FIRST=     0,             0,               0
##LAST=      1.7004516,     0,               0
##MIN=       0,             -369061,         0
##MAX=       1.7004516,     360547,          0
$$ Real data points
##PAGE= N=1
##DATA TABLE= (X++(R..R)), XYDATA
$$ [...]
2221a173K391k230R87J151k295K146k89j314J835j586N6P51j719J742q46n6J210
2238G61j815J437Q13k105K559j363j366K270k070K04J422k333J411P76j274J775
2254A102r37o51J463j715J249k45j232J507j151LJ319j709J691j03j281J991j442
2271a41k51K025k634Q81P61k041J836m73j187K257j282M12J162j903J271j00j050
2288d57J068j186J50N90j416J928o69o51J717j752J013Q89k220J774l41k017K542
2305I62j232p27K170k032Q80P27j297J409q61l06J472j939R24p2j568K152j344
2322f82J8J945k128J627O3j919J717l20j442J971j471m18J865j916J045M73r90
2339e62J806j128o4R01j598J101m10j231J757j696N88J377j846J577K9j450K413
$$ y = [-1173, 1218, -1012, -25, 1126, -1169, 977, 688, -626, 1209, -377, -321, 430, -1289, 453, -393, -449, 761, -1054, 383, 1196, -909, 1650, 287, -1079, 1191, -879, -675, 747, -1586, -175, 601, -673, 1102, 165, -486, 977, -738, 511, 266, -966, 541, -610, -607, 712, -997, 694, 591, -690, 1301, -141, -392, 1633, -1001, -120, 641, -1400, 436, -37, -1224, 1033, -249, 163, 1325, -578, 693, 593, -457, 611, -575, -425, 165, -1251, 677, 8, -643, 1074, -678, 335, 1224, -996, 778, 437, -1580, 962, -270, -997, 1173, -859, 21, 748, -549, 860, -1, -307, 1165, -774, 150, 78, -1490, 662, -682, -664, 1281, -847, 780, 843, -1076, 641, 321, -1121, 850, -621, -1039, 826, -1090, -45, 428, -562, 1244, 116, 52, 953, -645, 456, 46, -1185, 572, -1124, -536, 841, -1005, 572, 601, -849, 1564]
2356A564j370r14K111k316O21J119k117J200O9m49J079q74Q59K73j378J210r00
2373b13p9J214k218J056N56j646K266n97j317K293j558q3J410j866R29J67j413
2390a099J355p40j43J428j120N22N50j282J538j126M6P35j502J206k62j774K422
2407G54j199l95K272k111J095Q51k245J795l63j216J560j429k59R34p36R65J2
2424B85n56J059j347J140J42j783J846q53j052K166j997L59J932k394J572N29
2440A048j955J888p60q29R52q36J7Q67j196J126o62J45O30r64J318n45r63J374
2458F55j301m65J921k036R68J083k345K100j40j536K560j247m35J084j445K26
2474c53N97j139J211p86L20O55j072J352p20p89K067k143N53J489k659J742j39
$$ y = [1564, 194, -720, 1391, -925, -304, 815, -1302, -102, -33, -482, 597, -277, 582, 855, -523, 687, -213, -292, 922, -1296, -240, 316, -1330, 936, 339, -978, 1315, -243, -326, 1084, -782, 147, 314, -1099, 256, -484, -627, 801, -319, 203, 753, -529, 1009, -117, -71, 664, -838, 368, 106, -1668, 754, -445, -840, 1432, -679, 416, 1267, -978, 817, 454, -762, 798, -631, -890, 44, -692, 273, 285, -271, 788, -559, 581, 723, -1060, 786, -67, -1119, 1047, -950, -591, 1341, -1053, 519, 1048, -907, 981, 221, -608, 344, -492, -475, 392, -804, 322, -340, -195, 435, -529, 789, 244, -719, 655, -646, -1111, 810, -1226, -258, 825, -1520, 580, 440, -1096, 1464, 217, -218, 866, -579, -353, 244, -895, 316, -470, -150, 505, -567, 785, 65, -724, 1343, -800, -247, 1242, -1417, 325, 186]
2491A86j956K699o96j365K592j608J67J003j368N01q9o60N95m94L48K42p99J489
2509G87r37j06J860k162J046O58k844K321l51j720K197j448j96K023j913J278
2525D93O06j519J056m02p05P17j010O39j02n51J532j112O21M83j768K128o00j633
2543a127K398j696p39K412k330N11J703j960J026M51j112J053k88j43L99j214
2559f56Q21n94k30J447j664J144N09j830K084p30j108K148j894j9J832k354J085
2576iL81j871K244n92q10J424n39j67K53p02R56r01j93R12j407J102K60j185J992
2595A148j103l69J863k716J050J363k683J653M59k086J874n01n65J365p66L63
2611C49l6o55R03j170O22J84j309J730q88p51K256j807N09J520k665J647M92k153
$$ y = [186, -1770, 929, 233, -1132, 1460, -148, 19, 1022, -346, 155, 66, -594, 1, -493, -145, 97, -702, 787, -150, -256, 1604, -558, 488, 1146, -1698, 623, 272, -1448, 749, -699, -895, 1128, -785, 493, 1099, -420, 636, 234, -471, 246, -764, -125, -227, -778, 754, -358, 263, 746, -1022, 1106, 506, -1127, 1271, -425, -1164, 1248, -1082, -571, 1132, -828, 198, 649, -463, 590, 302, 159, 558, -656, 165, -429, -659, 788, -876, 268, 777, -1053, 1031, 301, -807, 1341, -553, -572, 1260, -1094, -9, 372, -1499, 745, 153, -657, 767, 228, 61, 314, -388, 568, -333, -526, 386, -1021, 81, 341, -844, 1148, 45, -324, 1539, -1177, -127, 1236, -1447, 206, 665, -1421, 453, -48, -613, 752, -14, 349, 313, -342, 561, -609, 13, 197, -1112, 618, -270, -1021, 1235, -572, -63, 1457, -1208, 439, 931, -1222]
2629a222K129j144r40K123j295M4Q75j205J056k7n72Q67r55P29l08r76J465r44
2647c00m02J623k158J125J470k266J857l65j605K176j371p13J616j843P60Q71
2663D75r58M47N9k09J093j210R38n01n23J055j615Q57O93j937J898J46j667K301
2681A342j161j144K098j521k2J348k029J059O12j407J327p09k4N80n32Q41o74
2698a6m1Q23j309M87R92k217J681n13j067K386j535MJ567j706M82J040k105J365
2716C18l18p21J142q86K51P58r85J200r17M4J066j665J214l62r63J476j105m58
2734i11J921j524K33J239j794J293K54j603J539q38m08Q95r22O32j4o59J321r62
2752c08N40O13j590J359m39j352K195j629j43J555j905Q89R06j466J472l38q95
$$ y = [-1222, 907, -237, -1177, 946, -349, -305, 570, -635, 421, 394, -178, 689, -266, 463, 155, -821, 644, -300, -702, 921, -1237, -112, 1358, -908, 949, 584, -1021, 1155, -216, -929, 687, -1156, -396, 475, -483, -36, 23, -186, 907, -303, 635, 134, -389, 666, -949, -92, 601, -1336, 562, 708, -959, 1342, 181, -963, 1135, -386, -408, 940, -1089, -30, 582, -825, 502, -207, -231, 349, -183, 658, -16, -57, 766, -543, -56, 936, -1281, 400, -113, -1180, 1206, -329, -325, 1242, -464, 18, 1058, -1047, 318, 0, -721, 421, -465, -214, 544, -441, 759, -158, -114, 952, -713, 501, 139, -824, 652, -453, -911, 1010, -514, -281, 958, -836, 457, 711, -892, 647, -191, -599, 296, -626, 6, -8, -667, 654, -308, 232, 845, -745, 614, 175, -1177, 1018, -611, -754, 801, -1104, -215, 691, -775, 697, 359, -536]
2769e36J555j351K54P88j730J121j10o56J031j190J105L57j093J503j185l51J317
2786H29j713N51R63k056J720J12j695K038o37k19J179j482P39j26p67R64r96K26
2804c70M82p86J193k95j141J933r64j10O42j346Q46L57j724J818o42o54J413j129
2822d77J65J536j723R49l33m80Q44r80K35N73j153J256l49m93J297j229P21N87
2840I46j645J341m52j161J563q62l94J413j446O76Q67j934J793k16o74J050j123
2857b58L01k99l10J078q34m9J202j385N44P76j677J851o40j145J524j263M42M44
2875C02j274J047O05j388J508j090K88M66r69R71n56m72J001r56L36P22j415J231
2893C57M8j170J716j314j10J190j715R19M65j497J473n02n97J508j023L1O95r37
$$ y = [-536, 1019, -332, -78, 710, -1020, 101, -9, -665, 366, -824, 281, 638, -455, 1048, -137, -488, 829, -884, -333, 630, -1426, 294, 406, -1289, 749, 112, -107, 1072, -410, 329, 203, -564, 400, -596, -370, 112, -674, 519, 224, -917, 1016, 52, -58, 584, -762, 84, 441, -1283, 535, -107, -761, 652, -477, -312, 1224, -499, 450, 117, -363, 481, -499, -264, 309, -844, 412, 63, -430, 867, -362, 359, 946, -699, 642, 190, -971, 592, -270, -664, 749, -697, -21, 846, -1088, 705, 489, -185, 865, -258, 43, -256, -566, 512, -322, -371, 831, -554, -10, 766, -911, 940, 300, -845, 679, -584, -142, 302, -972, 75, 680, -708, 800, -290, -2, 464, -505, 466, -90, -562, 439, -517, -181, 541, -874, 357, 405, -765, 951, -363, -473, 717, -998, -79, 386, -1111, 362, -140, -737, 771, -252, -221, 474, -463]
2911d63J246o01o19P91r70P75K44j396J558q40m63J859j266J53Q92j479O80L43
2929D44j377J086o50L6J005j065O35J25p88J250q67m0J009j480Q66k58j026J547
2947D52n94l52J453j358L54R94j425Q68r0r11J310j499Q13L97r06P66P1p06J076
2966G13q83J64N24j141J179m94r21J684j224l0J075j327J236J15j223J510j007
2983e0k37Q98j221O59K76j039J163o85j15J400j410Q67M69j330Q58o95l99J289
3001F98j193R5J150j762J592j49j016J476r85R8O83j260Q68K3j394J682r89J19
3019b64Q11j056J118m15p02J283p87l08R62j517Q07N5r70J473p39k38J202j060
3037c45P12K04j290J413o99l84M84p39M15J47j022J357K8o54J256j215M06M02
$$ y = [-463, 783, 182, -437, 354, -616, 159, 403, -993, 565, -275, -738, 1121, -145, 8, 900, -579, 101, 444, -933, 153, -497, -461, 544, -521, 114, 239, -549, 701, -166, -206, 803, -677, 189, -69, -1095, 452, -142, -494, 959, -399, -45, 949, -476, 392, 302, -609, 701, -798, 15, 412, -494, 272, 343, -363, 713, -170, -6, 518, -623, 556, 62, -859, 825, -399, -429, 646, -681, 555, 670, -553, 957, -50, -287, 611, -610, 49, 325, -714, 449, -236, -351, 1049, -361, 506, 975, -355, 503, -192, -591, 698, -495, -400, 750, -1012, 580, 431, -585, 891, -94, 4, 687, -573, 295, 318, -1076, 606, -383, -264, 547, -509, 609, 194, -508, 775, -12, -320, 642, -875, -68, -13, -983, 490, -249, -487, 715, -345, 367, 571, -719, 694, -5, -389, 95, -644, -229, -82, -1104, 253, 281, -373, 883, -332, 74, 476]
3055D76j529J280R5j442J624r66qR39j087J187J16j145Q99q20l5R14j256J088
3073C30k50m16P54q53K38P46j157J082M22j351Q28k17n24Q64r90K68R46j431J457
3092G46o08k89Q80r68j7O28p37P45j13o45Q28j075M49O99j314J453m57o24J198
3111G79r37j5P23j569J007J13q74J322l20n31R64p87N12l6q56J096r67q1Q11j198
3131h44O45N00j183J690p35m62J283j233J37Q26j357J252m05r33J291o47p8P17
3149D64o03N57n5q39J054r78L05M92j301J358n30o41J211r84M6J285j320N28M72
3168E21j205J209q56m89J355j061J69N94o11O86k31l04Q97j305Q63J61j240J309
3186D62m15p76J283j239L11J163j064O26k4q22J145q03k91Q24r06M40J9l47P87
$$ y = [476, -1053, 227, 322, -1120, 504, -462, -470, 469, -618, 569, 685, -460, 439, -381, -416, 498, -758, 330, 80, -336, 418, -435, -197, 549, -608, 474, 896, -455, 373, 156, -368, 496, -494, -226, 720, -711, 746, 138, -151, 729, -239, -256, 372, -365, 380, 267, -378, 450, -625, -176, 523, -791, 662, 205, -419, 779, -158, -173, 550, -1019, -12, 101, -773, 549, 229, -302, 662, -125, 387, 351, -505, 591, -376, -457, 354, -844, -199, 301, -882, 808, 73, -389, 894, -339, -202, 624, -733, 519, 114, -819, 472, -175, -253, 464, -139, 418, 363, -476, 578, -400, -95, 397, -904, 454, -76, -717, 494, -490, -444, 841, -479, 49, 521, -684, 525, -331, -820, 535, -526, -357, 237, -374, 312, 81, -223, 674, -631, 232, 393, -847, 462, 47, -729, 554, -685, -374, 789, -275, 351, 327, -495, 650, -153, -444, 380, -526, -86, -67, -414, 373]
3205C73p03M98O80j206P86m03m21R83r03l2Q87j176P61o5j032J744o74m17J112
3224G92j163J61M75j008R00rn38P73n71K77M08p86P61l74l83P86r80K38P63j518
3244i96J154j24j053J761p48o43J460j155L01R02j220O06k67k61O51p74M96Q1
3262A71m66J012q76R4Q39j407R44J16j241J319o99o40J477q72K1P29p58N54K21
3281E38p46R48q60l43O51p52Q23n63k08Q63q31O45M43j235J028l23r77J381q90
3300d08j10J073j222O50M78r22O45K42n79N54o60K88O8n35O69p16K26N11p90N91
3320E3M98q02Q46m95m50R74j236L75Q46j106M21K55o25R71n89J9O06o63K61j39
3340B0m36L26k14J09K87p39J008m4o09R87o61k94R24j161L35M43r87Q52k99m86
$$ y = [373, -330, 168, 848, -358, 428, 25, -396, 587, -316, -348, 539, -637, 124, 59, -973, 771, 97, -320, 792, -371, -210, 265, -743, 157, 148, -390, 383, -188, 89, 497, -289, 472, 98, -285, 501, -479, -241, 522, -996, 158, 34, -1019, 742, -6, -649, 811, -344, -43, 859, -361, 245, -22, -283, 368, -406, 90, 171, -295, 717, -159, -65, 774, -633, 311, 427, -814, 505, -194, -834, 643, -229, -208, 521, -237, 317, 538, -208, 740, -120, -463, 188, -564, 259, -304, -512, 351, -480, 165, 608, -627, 401, 78, -899, 482, -408, -518, 555, -667, -17, 461, -461, 184, 426, -153, 401, -259, 29, 97, -438, 231, -485, -259, 252, -538, 53, 551, -251, 595, 100, -350, 624, -612, -237, 609, -497, -76, 179, -446, 525, -64, -45, 561, -102, 159, 20, -416, -90, -304, -195, 92, -647, 361, 317, -292, 695, 34, -260, 664, -497, -162, 281, -706, 146, -153, -639]
3360f39J091l24m73R90q02L79l0l32M09p52J75M43p66O20J01n40J268j353N14
3379b1O29j030P62K7j193J391q80j27P05p08M61L12n96O56l79J41L07q77O83L3
3399B96q81R76o21j70Q86q54N84K50q09P87k71p89J235r87J69M21o72N85l0j85
3419h0L64k43o8K03l22N03n84k53Q66p25K44L11j076J369n1q18R72o37j61Q92
3439G06j249K74N12p10M82J09n02Q69q44K49j9l26Q00k10l30N81q18O4M14o37
3459e85N22N4n27J224o93J2O63j077M89J34n41Q20q81o4P19l99O39k10o04Q86
3479E81o91N5M88j134R79K5j059J101m52l68R85q12M55O74j308R98l55l75O08
3498C95o33p1O40j124Q21j59K4N33p68M15L62o90N82m42k47M93o17K63P53j029
$$ y = [-639, 452, 128, -345, 645, -157, 222, 192, -140, 269, -483, -308, 135, -631, -11, 90, -450, 818, -535, -21, 608, -422, 340, 367, -826, 565, -315, -442, 263, -445, 16, 328, -268, 388, 9, 150, 457, -420, 263, 296, -585, 391, -230, -400, 486, -368, 216, 466, -343, 444, 173, -616, 619, -368, -199, 222, -450, 135, 105, -80, 284, 41, -27, 176, -146, 357, -227, -480, 386, -339, -95, 216, -860, 509, 458, -360, 612, -25, -186, 706, -543, -269, 243, -467, 15, 124, -378, 491, -353, -104, -123, -449, 351, 141, -189, 392, -426, -362, 52, -585, -63, -9, -536, 688, -5, 7, 670, -407, 82, 216, -325, 495, -386, -450, 269, -130, 509, 299, -305, 581, -110, -55, 433, -701, 278, 303, -756, 345, -107, -475, 510, -302, 153, 827, -481, 517, 162, -213, 395, -238, -309, 331, -793, 28, -131, -107, 426, -342, 73, 435, -255, 327, -115, -362, 131, -486, -223, 530, -499]
3518d99O63M45j048J092n92qJ90q05L84K52m60N96k74j31Q88j145R80j07p05O32
3538C48l69j40N96q87L46N41r38N48j2l60P42l97l88J042r59O14j91o21O99q09
3558e95L59L31o00Q80j02o33R08p84K4N70p78N27p3m42P54l90m3M68q82M25L74
3579B98o22P16l68j63J66m38N54j96j71L19r0l57P96n54M21J62r09N94l16m2O70
3600D70p82J31N60o09L54l9n70J012n22k06L68n50N46k12r7L25k66j98J147j091
3620b29K42L53n83P26p48j02R30j058K61O37j042Q52j43j44N47q57N99j43m03
3639c05O86k57p76Q98n22K1P92p25J90m4j0L97l17j66O77j205P14J9m66P48k88
3660F1k01N47m42R6L59r07Q94m97j59N30p00M18K43q08J069m27O5N18j031J87
$$ y = [-499, 164, 609, -439, 653, 61, 53, 243, -562, -178, 74, -386, 210, -64, -195, 693, -452, 528, 421, -284, 348, -21, -161, 435, -452, -106, 435, -503, 45, 33, -327, 415, 18, -370, 672, -287, 327, 136, -485, 214, -595, -236, 95, -505, 375, 273, -360, 548, -236, -212, 358, -420, 107, 34, -408, 346, -44, -87, 381, -501, -76, 298, -324, 392, 24, -139, 27, -411, 143, -53, -224, 95, 5, -352, 444, -110, 311, 473, -436, 158, -158, -200, 470, -312, -181, 379, -230, 124, 85, -485, 527, 5, -201, 167, -383, 163, -49, -146, 179, -87, -285, 862, -229, 13, 366, -217, 509, -239, -341, 589, -469, -208, 429, -613, 239, 96, -48, 499, -358, 241, 98, -305, 381, 124, -652, 246, -276, -255, 537, -188, 2, -42, -52, 345, 28, -138, 539, -666, 48, 67, -399, 349, 61, -140, 407, -35, 61, 420, -487, 407, -90, -249, 281, -419, -1, 242, -566, 503, 76, 141, 659, -372, -185]
3680a85N54o32M14j82k42N56o84K64N10o72L56L13r02J082q34k64P26n65M04k71
3700b54K2P82o15J03N14r56N30K20n59O82l24l18L40n08L39J39n45O53j28j84
3720f7L76k73j18J68n05M00j10j71M55n14L53N85q38O77l65j02M23n95K30L57
3740C66q52O97K5m97M19k92K26L3n75P21k47j69J39K15o13O29p36M09L54m68P86
3761E70p10Q9O80o89P0J12m95N04j99j70N74o39M83J70o50N18l27j22O31m53p
3782f0j26n19Q91j19n56R01m77j17P21n84J59L39p83M20L3k99K66m54M45l2m55
3803d06P95l64m07Q96q79L25J57m31M60j95k68N87p36J97M19n62R61n42o4K74
3823B17m67L13O1o46L25K75n83R26o33j66P80q75N73J84p35P97p24K98M30q38
$$ y = [-185, 369, -263, 151, -31, -273, 283, -401, -137, 373, -299, 57, 370, -532, 550, -284, -548, 178, -387, 17, -254, -232, 550, -65, 38, 552, -404, 126, 346, -213, 469, 145, -173, 167, -341, -2, 137, -408, 245, 117, -67, 309, 36, -82, 86, -419, -19, -129, -300, 155, -359, -6, 579, -259, 418, 53, -49, 374, -221, 9, 366, -486, 211, 236, -261, 158, -134, 92, 125, -450, 271, 24, -145, -6, 209, -404, 225, -511, -102, 252, -216, 570, -140, -51, 629, -60, 10, 122, -373, 131, -68, -238, 336, -303, 180, 350, -300, 218, -109, -231, 400, -53, -60, -186, -705, 186, 67, -489, 412, -65, -182, 539, -45, 114, 453, -330, 90, 123, -176, 90, -364, 81, 49, -406, 389, 25, -382, 514, -365, -40, 117, -314, 146, -49, -317, 270, -466, -269, 150, -412, 549, 7, -57, 217, -250, 63, 124, -522, -197, 78, -505, 421, -212, -378, 402, -473, 100, 284, -451, 346, -378, -80, 350, -488]
3843d88L94L28m78N29k29m75O57k33L33p6m97L39l08J84L12q94N60L49n68P02
3863D41n16k98Q01p14L05J04o15K41M34n59P04n04j37P04k71M0o3m22O82n22j05
3884b70L98m99O54n27j12P38m47j18P26j035O10J94r71J048n95j04K83m73N91
3903I1K05p13O77j28k77L80p05M72N95r51L13j61R7K91j87P6K98n13K61o0m12
3924c51R31p10l88R12o76K10K38m2J64m41L40J09n30N75j78n43O44n06q9Q22r78
3945d87L42J46k71M06l8k54J58m03K44M35o16N82m67p2O02k65J80K62p86M52j31
3966A9j09L72p07L61J84o88P64O2m98N35l87k2N14q95O34k13m32M72m1R7L64n11
3988a25L52K81q40M94k96m5L60n46M34L06j051R64j78m84N76k34J59J63l52M08
$$ y = [-488, -94, 234, -244, 285, 56, -419, 238, 5, 338, 262, -235, 104, -204, -20, 292, -602, -42, 307, -261, 441, -75, -373, 428, -286, 19, 123, -492, -251, 183, -376, 328, -176, -313, 391, 120, 160, 97, -325, 357, -165, -270, 128, -371, 283, -244, -356, 382, -65, -183, 543, -492, 118, 312, -659, 389, -206, -310, -27, -500, 91, 296, -417, 260, 132, -145, 235, -470, 2, 597, -354, -41, -202, -105, 186, -1, 75, 373, -140, 121, 61, -351, 580, -130, -518, 394, -282, -72, 166, 124, 288, -153, 187, 296, -234, 341, 163, -380, 264, -242, -331, 491, -487, -145, 1, -270, 136, 98, -156, 2, -401, -157, 278, -338, 244, -223, -295, 307, 42, 222, 484, -302, 150, 19, -90, 282, -425, -64, 120, -568, 196, 258, -240, 295, -92, -114, 400, -495, 139, -74, -506, -34, -75, 22, 386, -125, 227, 508, -332, 162, -134, -179, 181, -365, 69, 375, -676, 288, 110, -374, 202, -32, 127, 290, -62, 346]
4008C46r5k68K25o07L57ok63L19J89l39O14o86K9K45n45N93m8l45N69l29l81N04
4030G8k57K94L38o41M43K6m60N70m99K87j97n37O93l94J1K68p9K42O6o30O65j02
4052A85m81M63j99k68M49n03O63k19k85O93o87j59N79k51k13J67l41N06j56j62
4072b19O95o94O05k10l25L61j70R6K01p18L61k2m68P90q1l06P70p51J27N38q62
4093b82M17j50m06Q06p47K72L03k79J47J0l73P08o09L17K78q58Q8M11m33M56R6
4114A72o93R95o72L43Lk18L64N8m51M06l75J8O4n3L88p78K70M17l75K41K02q55
4136e29P14l36n0N93o82L6J31j51M01k95j4M19n01R8L00m46N71k71j91M91m52
4157a64j66P96n64J05K48n01M97l78k55O50q97M54M80n24L32J11n34O38n11J89
$$ y = [346, 251, -17, 208, -399, -42, -48, -311, 8, 197, -142, 472, -214, -185, 60, -485, 108, 60, -285, 284, -45, -426, 78, -179, 115, 453, -188, 255, 281, -179, 391, -108, 179, -18, -555, 138, -256, -245, 23, -56, 186, 252, -378, 287, 185, -296, 167, -32, -300, 149, -354, 309, 90, -195, 498, -189, -348, 231, -20, -233, -66, -407, 99, -57, -219, 476, -218, 387, 177, -148, 213, 43, 139, 340, -378, -17, -39, -507, 283, 202, -104, 666, -85, 42, 580, -282, 135, -15, -421, 385, -362, -90, 213, -66, 81, 91, -282, 426, -183, 134, 412, -446, -358, 53, -380, 76, 172, -521, 474, -198, 145, 148, -70, 294, 352, -99, 307, -68, -50, 14, -39, 349, -429, -159, 258, -117, 124, 326, -529, 185, -151, -201, 392, -290, -254, -123, -274, 127, -168, -182, 237, -264, -166, 134, -312, 259, -12, -203, 288, -164, -330, 466, -98, 7, 255, -246, 251, -127, -382, 268, -629, -175, 305, -219, 113, 224, -310, 328, -183, 6]
4177FN6m24N96k03o24P37m88M23M2n78N76r9PM28l52k23P01j011M43M15o85K42
4199a5j53L0N34o13M02J13o81N22l75N5M15l39j5M53r61Q10j0m11P27m44J09M94
4221F47q80J72K35n05O13m22K26O8m54M56J49l07M26m21j43M09p40O16j99n55
4241f09J031p05K56N11o95K6L76m36N41n92R8L71m19J97L15m83M03k24r2N13n24
4262a41K05J6j68J45l19k48Q50m22j53O22n53L94l97M7K16%j33L47p57P29o4m85
4284b69N59m39K40K63l91J94Mm29N00j27j58L72n86n2P17o19O50o6n46P00n82
4305f5j08M90l03L98n46l22O25m93M80J14o99J157n61k25N22q79K73L81n37M89
4325A91m74J47L12j91O9O5j37J71Rl53O74o08k2L61n12L65pl28M84m95J95J15
$$ y = [6, 62, -362, 234, 31, -593, 144, -344, 79, 121, -457, 119, 20, 27, 455, 103, -120, 581, -430, 13, 428, -257, -15, -168, -138, 396, -217, 185, 298, -383, 139, -236, -181, 234, -105, -120, 333, -628, 182, 172, -239, 488, 44, 153, 647, -233, -61, 174, -331, 282, -140, 86, 154, -300, 156, 305, -2, 424, 3, -140, 269, -471, 145, -54, -609, 422, -283, -27, 484, -211, -185, 191, -245, 296, -296, -198, 173, -246, -49, 266, -217, 186, -38, -130, 383, -141, 64, 80, -88, 57, -262, -510, 340, -82, -235, 387, -166, 228, -169, -122, 94, 94, -39, 308, -449, 280, 216, -269, 290, -149, 91, 354, -37, 157, 161, -268, 232, 105, -53, 319, -267, -319, 398, -221, 429, 363, -183, 517, -65, -173, 317, 14, 412, -134, -456, 169, -324, 156, 270, -429, 728, 167, -58, 464, -415, -142, 239, -298, 191, -283, -136, 176, -15, 54, 119, -18, 153, 162, -191, 483, -125, -147, 214, -298, 67, 60, -268, 216, -279, -84, 31]
4347C1m06M01J98m83K69n7k9O0j70RP59o73R3o6j07N85m40J34p1m91K64L28l01
4370a63M10j82m2M59p33K31R5n97M97j9j69N16n90M01l8m01P98m20j46L73m81
4391b01J78N45p14M02l38N0M55m06j33K96j74M3k78L44J98n91M9N18l74j03M07
4412A73m86O47o76J72O13m55p1J23m40O34j86k68M45m24K56J63m86M35k79K5M48
4433C63m34k11M04m85L64m5m0J33l44K98K54m87L90N4m31N62o45K40M95o77K80
4454C8mm16K68K42k74M69o51N64J10o46N45l59M6K16l54L00J49l13N51l89n48
4475d56R10m42L38m90j46N62m72L8L43l87L83l0n27M39r3mK21l51J31J77o60P23
4497B07k47p2O10q20M96K79p28N17p4l66N76n89M2j10O4M19k28l60M95k75L50
$$ y = [31, -375, 26, 224, -259, 10, -47, -76, -16, -186, -177, 582, -91, 2, -64, -171, 414, -26, 108, 37, -454, -190, 138, -163, 247, 65, 23, 482, -251, -20, 75, -522, -25, -44, -213, 303, -287, 114, 76, -325, 473, 53, -93, 280, -201, -23, 522, -192, 210, -128, -78, 377, -29, -162, 134, -40, 3, -275, 69, 267, -324, -275, 243, -131, -234, 173, -313, 334, -342, -170, 443, -12, -83, 40, -400, 234, 48, -220, 225, -199, 57, 220, -266, 169, -110, -85, 363, -71, -282, 122, -363, 1, -44, -84, 49, -295, 3, 257, -230, 160, 214, -217, 345, -300, -60, 435, -242, 38, 34, -382, -114, 128, -146, 323, -328, 236, 346, -300, 245, -114, -68, 148, -206, 94, 243, -70, 481, 92, -456, 454, 12, 350, -140, -286, 276, -196, -158, 185, -202, 181, 151, -376, 63, -30, -34, 187, -164, -33, 144, -516, 207, -40, -112, 498, -322, 174, 453, -275, 242, 168, -198, 378, -211, -169, -279, -215, 204, -24, -384, 111, -164, 186]
4518A86p6m89M64k06M8j31oJ30K74m21nM00l97N56n60J5L98j59%n9o3L4K03k97
4542a61O9J30OL51o46O70l42m70M09J45l56K27l33lM95l99J96M0m49R22o73L87
4564B15k84j07K26K23p07J085p26p8P23o52L90l93O4L53m14J17j13l01L70k3k06
4585b38L58K95k16p5l33M70j35k61N14l82o0j26k50L78l7n7L35n9k49K46J64r2
4607A90l88J29O2k84K90L55p05M24K98j72j79j15j92R88o22k48oj98N57j98k10
4628b24K00j26K46K03n74N18j49m39Q09n33j46L04j24j85L82k24K82l04k37N30
4648B09p5k96J14n76M73m3R3K36n26N85k34j2K42J1m62N86j98j37J13m77N95k57
4670c6l96P21k95p9O9m27L77J07n09O74l37j4L33l80R9J65k12M99k40M5M17r96
$$ y = [186, 110, -379, 85, -121, -73, -204, -210, -80, 194, -227, -232, 168, -229, 327, -233, -218, 180, 21, 21, -38, -101, -67, 136, -161, -92, 38, 44, 395, -251, 419, 77, -393, 16, 161, -195, 32, -301, -304, 191, -208, -12, 28, -421, 501, -172, 215, -69, -176, 50, 273, -434, 651, -75, -153, 570, -82, 308, -85, -21, 332, -82, 35, -78, -379, -9, -32, -238, 120, 415, 199, 124, -209, 261, 126, -135, 379, -3, -63, -189, -439, -61, -98, -155, 180, 121, -128, 118, 282, 190, -198, -69, -7, -291, -1, 354, -351, 73, 371, 199, 20, -95, -287, 701, 79, -169, -175, -373, 184, -14, -224, -24, -150, 96, 299, -275, 243, 94, -345, 464, -69, -215, 89, -35, -220, 162, -62, 220, -84, -321, 209, 134, -162, -48, -624, -151, -194, -101, 135, -391, 194, -40, -52, 190, 201, -261, 325, 127, -10, 103, -374, 221, -36, -432, 289, -6, -85, -16, -443, -66, 41, -468, 206, -131, -145, 188, -192, -93, 72, -140, 359, 119, 164, 581, -415]
4692d15K45J54k78N51m35P2K77k89K93j31k37N70n90M4N91p44K41M2k11N36j15
4713A71k59K20r4M5J47k89J84K5k99L07n0j75Q9j5N8J82l98M28Lj60N1m77L44
4736C8J49n13L04k23j03N79n36K46J57k78P65l90j81N5j25N8J19m26M02J77k98
4757b4L23l15k9L44m45L42r1j68J14j27J12j31j37L65K63l52K59o07M37k5j2K36
4779C32k72k03M40m35L4K67j98j16K37k34J04Q0k43M64k08l67N06k95o0k18K40
4800a45J83q5J05N6j85M33l51j86L64l00J32o3l3O6J3K2p7L63l95L35L1j52J18
4823B49l97L20p7k64L93n41N32O1n11P22o84J34J24r3j9J98j05L00k94m4o2l29
4845c87M23Q7J27m6l62J40K70n58K56K16l46K80j7k31N44m77R3J19j94j23L93
$$ y = [-415, -170, -16, -294, 257, -178, -106, 171, -118, 175, 44, -193, 377, -213, -169, 422, -322, -81, -39, -250, 286, 171, -88, 132, 38, 83, 230, -59, 125, 150, -149, 158, 108, -67, 22, 7, 65, 247, -151, 277, 280, 120, 171, -306, 38, 187, -326, -22, -245, -348, 231, -305, -59, 98, -180, 585, 195, 14, 69, -56, 2, 121, -305, 97, 274, -24, 299, -16, -45, 299, -146, 196, 105, -63, 51, -76, 36, -95, -232, 133, 396, 44, 303, -304, 133, 108, 96, 332, 60, -143, 297, -138, -104, 163, -35, -151, 86, -148, -44, 36, -207, 257, 49, -318, 188, -107, -167, -385, -145, 38, -47, 58, 114, -71, 362, 11, -175, 189, -111, 21, -42, -75, -9, 4, 26, -51, 312, -83, 252, 283, 131, 249, -148, 172, 95, -169, 224, -317, 215, 276, -235, 487, -197, -63, 61, -32, -51, 147, 42, 342, 48, 4, -58, -387, 36, 123, 250, 204, -158, -18, 252, -306, -50, 166, -180, 100, 83, -148, 396, -81, 12, 131, -63, -186, 207]
4866B07l15n7J61J97q7j86K59q1l12J36r4o0M09l62M01L2p33K87K54j73N75m06
4888E2k94J21j14K71j31j62L44n3p8J41p4q3Q2k10K79J33k89J57n42J32L85k67
4910b00J26N6j06o1j12O54J0m74N1J32k35J97k95K82j20P0J50j83k17L56j82L01
4932B00J10l44o4J62k96O93o07J90J2m29N90J61l25K67j22j02K33q7j42K26n92
4953b66J45J11J83n0l22L67R3n45N88j51m00K14k82K73L40o27N29j45k00K94k46
4974i7N7O6k37K71K76l85J27j57o6K9k79O56l28j40J21K7R3L33m36Q4J67m90K93
4997a5J5R2L4k34J66K16l66K60j20J03n4k45J67L0K2j0l62L22K99n03M0N33l96
5020fj95J89J05l52K11K46M2n21M15m0q3K30k80OK07k59K25K09m04L63m33L1J74
$$ y = [207, -108, -165, -4, 193, 106, -80, 179, 98, -214, -78, -172, -232, 177, -185, 216, 248, -485, -198, 56, -117, 458, 52, -242, -121, -235, 36, -95, -257, 87, 34, -44, 97, 23, -60, 22, -188, 91, 224, -65, 92, -450, -318, 67, -200, -74, -18, -124, -185, -297, 357, 367, -107, -56, 76, -159, 38, -257, 25, -95, -25, 125, -58, -275, 81, -101, 200, 310, -34, -98, 64, -232, 461, -146, 44, 56, -373, 217, 378, 53, 320, 198, 96, 329, 242, 100, 326, -266, -121, -10, 173, 123, -199, 168, 261, -284, 304, 153, -247, -33, -315, -42, 298, -329, 200, 55, -145, 149, -97, -40, 26, -211, 60, 336, -49, 78, -79, -145, -116, -395, 261, -67, -207, -86, -59, 34, 367, -69, 15, 182, -308, -15, 0, 92, 126, -108, 58, 274, -92, 168, 48, 151, 97, -148, 19, 49, 71, 61, -301, 21, 320, -183, -143, 390, -6, -201, -12, 93, -259, -48, 198, 240, -281, 134, 94, 11, 241, -39, -33, 174, -85, 140, 349, -55, 308, -125, -94, 80]
5043H0K10j59j1o1MJ31k35J11n07N52l0m70M01K88j40R2m10K87k47J75j5j30p9
5066a63L21j67n5M89l00p9J77l75K73l1j94K57k85K69l78J05J44Kk1M09n87K31
5088D2Mk86M38p3L2k02j60K62j78J46J53p6nJ90l95K67J47k42%q5k53N82o81L32
5112d1Q7p6L49j03q0j18J3j91J04j52K78p3J12P6m22L28J06m31M72n7k45o8l2
5135a64p4M71m56J81O3K2K87j71j44j26J60k41j8J67K29j66n2K20r6o39L88J41
5157a8J52m0m62L05l1J15Q6l33m1L11l94N27L6J1j89L4k75N93p08K90M2l2J28
5180A07o4j03M89n59J35K83m70L64l41J8L58m15M20n6n25N19k48n3m13L93K54
5201I3j05l5J24r4l6J67m23K77J63l05M57j02k29j7K45k23j59J35L30k28q0O9
$$ y = [80, 290, 131, 120, 59, 63, 194, -41, 70, -437, 115, 85, -385, 16, 304, 164, 256, -154, 133, -114, 61, 46, -84, -163, 158, -9, -64, 425, 125, 46, 223, -152, 121, 90, -104, 153, -132, 137, -241, -136, 8, 10, -11, 398, -189, 42, 46, -240, 198, 125, 157, -45, -205, 57, -121, 25, 178, 102, 97, 287, -108, 159, 306, 64, 64, -21, -274, 308, -373, -41, 46, -30, 319, 216, 136, 18, 31, -160, -56, -208, 70, -3, 109, 185, -237, 91, 197, -234, 238, 181, -64, -132, -164, -238, 233, -223, -42, 21, 43, 330, 159, 15, -111, 49, -192, -210, -43, 186, 20, -32, 188, 92, -547, -159, -18, 134, 94, -368, -63, -94, 21, 107, -226, -267, 44, -350, 177, 213, 224, 35, 69, -206, 387, -321, -31, 11, -21, 107, 43, -60, 429, -130, 5, 288, -182, 182, -159, -141, 217, -198, 222, 166, -359, 160, -88, -141, -554, -161, 93, -12, -47, 77, -17, -53, 114, -309, -32, 131, -174, 283, 181, -48, -65, 180, -43, -202, -67, 263, 35, -45, 24]
5223B4l74K08K08m83K24L01k77L63m05J54n5O0k01K62j08J68p1o4K12p8K00m58
5245a90q8L12J36m82L78k39J42N2j03J54k4j18K69k15Q0J21n37M39j39l6J5q0
5267a53K49K39l87L61j41k49L64l30J79N9m13J91J73N5j17k83J89J37l58M47Q1
5288B93m33R6j0J44k1p07P64J74m82N94l71k97R51p70K66Rm58L78j64k26N86n76
5310b60L66P4k54J49p7P7J93n33K56n9k95L53J74k45K81l44J52j07o1JK20k43
5332a82K56k62o2N83m64K19J13n72N90N8k58O9L8j01m1j48K98j46j19J24J15j84
5354g6M72n21J49qp9o6P7K41n24Q4J76J48j5l2m5k72O30n80K05K91k87k09j69
5377d10M67L5q6l52L06j69M90k86qK38k30O5K2n2p1K26m62L86l06K23J49M8n8
$$ y = [24, -350, -142, 66, -417, -193, 108, -169, 194, -211, -57, -112, -52, -253, 9, -99, 69, -2, -66, 146, 68, 268, -190, -278, 34, 170, -312, 66, -173, -31, 21, -82, 72, 48, -70, 199, -16, 64, 185, -352, 87, -52, -88, -73, -153, 96, 335, -52, 309, 168, -81, 283, -47, 132, 191, -222, -31, 142, 197, 80, -203, -14, 123, -235, 212, 293, -140, -44, -54, 90, 69, -638, 126, 300, -182, 412, 41, -256, 695, -75, 191, 200, -258, 120, -44, -270, 316, -260, 106, 180, -74, 75, -2, 75, 268, -265, -9, -68, -363, -10, 164, -81, 200, -144, 8, -99, -160, -159, 61, -182, 74, -188, -250, 333, -131, 88, 201, -371, 219, 277, 19, 88, 126, 25, -16, -164, 134, -12, -131, -7, 108, -76, 396, -125, 24, 16, -63, -129, -52, 189, -335, -251, -75, 73, 58, 26, -19, -291, 339, -241, -36, 255, -32, -241, -410, 57, 92, 6, -346, -40, -209, 281, -5, -13, 225, -5, 60, 82, 30, -41, 185, -277, 109, -197, 26, 175, 223, 165]
5400A65p0J34l21j75J21J33j65J75J2j29K54k1n4P1J41qm43J94M6k07L16j9k54
5423a04J87j08r1L39l47P5J32k59K69R7m54L99k04P3lN5L6k71J2J37J0j75K61
5446F6j2l12K88k69M8K58l15N49k73J8L87m36j57R5P4K9K08k02P0j34K31p7j3
5469A21l0L0m25O11p05K78n6j61P24o09K09L42n11K88k89r5K87P7k98L63r7j06
5491e2j19J11M4J00J34p7k18MK1m9P1q8%n8O6n9J23j92N9kJ82L6j01N8O4k42M05
5518B21j42l86M88Nk94m4P4L04o3k80N97p85J32L07j67L11l32M9j26K35k03o1
5540a60J11J18L74p01M32P3m67L44j96R4K5l23L99j37K33r8l67L13P9k22j69M91
5562B46k87K26O7l07K95l23k0L13M3q2k15J99m3k44L27no85N17J20m21M70j75
$$ y = [165, 95, 229, -92, -267, -146, -13, -178, -3, 9, -120, 134, 113, 59, 130, 271, 263, -180, 14, 60, -147, 169, 150, -104, 83, -25, -116, 223, -124, -49, 83, -176, 93, 190, -264, 135, -69, 4, 1, 56, 92, -179, -167, -30, -20, -195, 66, 54, -258, 30, -239, -191, 67, -248, 301, 28, 46, 433, -3, -160, -65, 9, 38, 246, 44, 114, -20, 211, 134, 121, 91, 121, -304, 307, -398, -120, -176, -337, 387, -222, -13, 329, -182, 106, -183, -278, 9, 86, -212, 151, 54, -52, -171, -60, -16, 84, 218, 141, -77, -73, -52, -101, -30, -118, -118, -176, -110, -169, -46, -238, -179, -181, 1, 37, -64, -6, 58, -184, 221, 79, -307, 181, 186, -108, -152, -78, 226, 163, -117, 480, -305, -173, 134, -33, 278, -54, -5, -131, 104, -99, -160, -49, 69, 443, -258, 174, 247, -220, 124, -72, 22, 47, -276, 123, -14, 219, 121, -246, 67, 146, -76, -245, 246, -41, 185, 252, -55, 240, -83, -103, 210, 253, 171, -44, 155, 112, -132, 195, 190, -495, 22, 142, -279, 191, 16]
5584A6J28o7q5m1J56k86M04j79j53J26k55L12J17k06J71m0j03J31m21J68J3J25
5606C1L09r3l43J44j28K95l20R7p3Q2kL39k72J5k04l4P1K19l80L22j32r3R1m3
5630a02J51R3j67K31j39rl4q4K01r1Q5j36j27M1L93m14J65K8k96K98k58n1J01
5653a21M7J23q9l3N4Q7l04M36l83J21j4R1K16rm28K53%k86O88o66L02j63k16K75
5677a9k51K49M0k83K62p8q4j8j79J76N40k70PJ87l23L66j38q09O48j85M04n0j83
5700IJ1N9n2J32k17K58k08Q1L1Jm60M35j11J38j61j0M38o39J19L87l85j20N87
5723C23o68N52M4m39J69n2Q4K97n11lL69l86K52J73j75J00k74J64J16k55K20l8
5745F2k42k1L84l36o0J65J87p6ooj56k9P2k45L26k93K73Q7k99J60L4O0L68l07
$$ y = [16, 144, 77, -8, -49, 107, -179, 225, 46, -107, 19, -236, 76, 193, -13, 158, 118, 15, 146, -275, -107, -94, 31, 340, 247, -96, 48, -80, 215, -105, -8, -81, 1, -1, 338, 66, 81, -123, -157, -86, 133, -247, 75, -57, -150, -59, -102, 49, 142, -25, 206, 67, 58, 24, -60, 141, 50, 135, -1, -128, -87, 306, -108, 57, 85, -211, 87, -171, -222, -121, -74, 49, -40, -73, -19, 68, -236, 200, -183, -62, -76, 15, 231, 222, -206, 47, 47, -239, 449, -217, 85, -78, -294, -19, -270, -21, 19, -264, -2, -80, -164, -182, -361, -185, 355, 85, 92, 279, -44, 322, 184, -625, 23, -162, 242, 192, 9, 20, 79, 27, 159, -58, 200, -8, 73, 104, 105, -355, 80, -31, 107, -54, -64, 374, -265, -146, 241, -144, -264, 323, -345, 207, 251, -188, -19, -71, 13, 310, -201, -204, 165, -221, 31, 204, 29, 129, -145, 19, 135, -120, 100, 62, -180, -201, 183, -153, -213, -48, 139, 63, 57, 51, -105, -134, -62, -307, 19, -274, -1, 86, -213, -53, -19, 41, 409, 102]
5769A02p9k09L58k7N3r8l48N37n39R8J40l85K95L39l61J88J1j5n9p4L85n88J65
5792a11J66l92L00n0P4K31k2k40Ko1PJ39j44P6Q8j13K22l59j09K53J7p5N0O3j59
5817a47j7K89l33l9L84k83J98m1Q7p1J23m12L14O3l45K03j88L00p1p6K02l37M47
5840B50R6n21K9J77j43K33Kk59K00j30N9j08L2K81k19p9R5L8k06K79k00J40P5
5863A21Qj6k39O6Q1L66n07rR0K27k21j27O4j7P0J71m73J90J33j16L54q2j75K65
5887B24m25K56J11k96K01l3K47m21OJ21j4l9k9j60J06M49m64O8L19m94M24J07
5909B64k64K12l37k35M53k70L55j89J4M87o11L63k57m9O5L98l87ML1O8K29l59
5931a5R4Q3k67j7J59j5J42k27J77L1L0K66n23J54j62j69L67K48n52L27q4k98K72
$$ y = [102, 23, -186, 172, 145, 198, 100, -248, 289, -250, -152, -12, -397, -102, 237, -124, 64, 75, 60, 1, -73, 312, -276, -111, 55, -337, -37, -87, -13, 218, 196, -44, -42, -103, -96, 43, -101, -25, 63, -50, 172, -187, -296, -43, -26, -101, -51, 12, -147, -164, 125, -208, -247, 137, -146, 52, 11, 98, 27, 150, -262, 52, 115, -230, -27, -215, 85, 14, -62, 140, -197, 250, 346, -175, -146, 31, -112, 121, 123, -136, 64, -66, -7, -115, -83, 198, -21, -100, -5, 33, -173, 106, -94, 46, 121, 129, 113, -126, -60, 21, 387, -120, -129, -39, 188, -33, -160, -96, -113, -43, 128, -345, -155, -22, -138, 216, 134, -41, 224, -201, 55, 166, -130, 71, 38, 285, -136, -130, -9, -23, -62, -91, -251, -145, 304, -160, -92, 227, -267, 157, 264, 0, 212, -125, -360, 93, -177, 178, -11, 3, 490, -121, 242, -15, -64, 1, 399, 12, 16, 47, 115, 344, -15, 79, 162, -105, -122, 37, 22, 164, -63, 114, 145, 175, 441, -82, 72, -90, -259, 108, 356, -196, 131, 47, -251, 21]
5954B1k17L51p3k5J41k38j65N93k88j79K04j17J25j94m32N78j34lN34n11L09l60
5976h0M4Q9J28k25L52l66Q5q0J53O1n3j5J40n70M40l34r6L42j60R8K44m7j49J21
6000A22jq6l1j62M57n16j0L43l35M27R9j73K07n45kN18m09J31r1J67r2j38rN20
6024C91n45K78l93Q9N10j11k95K22j51J43J4l98M64m20l8M32j25J51J46n51J94
6045Gq4J99n5l08N4M00m11J5K09n8L89l17n7J48n10M07L3J45j08m86K22P5l87
6068d78N83r7J64R4n10M24l53j61K69J66l97L27K6J2L00m27l7L22p61L17L98m13
6090b32L40l2j05M16l97J56Rm38L27l02L92k81K14k85J70L00j1k03j7j00k25K87
6112a7j66P9K58j60K03K9m16J86j6k19K10J04j5l2q0jK53l96K94j78n8J4k78M05
$$ y = [21, -196, 155, 82, 57, 198, -40, -205, 388, 100, -79, 125, 8, 133, -61, -493, 85, -49, -52, 482, -29, 280, -80, -36, 53, 181, -44, 308, -58, 27, -53, 100, 161, 108, 93, 233, -337, 103, -231, -327, 15, -145, -47, 197, 150, 1, 122, 121, 35, 4, -158, 299, -217, -227, 116, -219, 208, 307, 134, 341, -204, -206, 312, -97, 34, -57, 110, 18, -120, -129, 391, -154, 124, -269, -180, 330, 219, -76, 146, -5, 138, 152, -246, 218, -202, -240, 192, 67, 218, 364, -187, 7, -77, 122, 67, -241, -187, 213, -198, -183, 26, -32, 357, 40, -17, 131, -379, 28, 61, 206, 98, -388, -166, -91, -478, 105, 8, 172, 266, -244, 180, -173, -334, -65, 101, -296, 31, 57, 69, 369, -58, -95, 227, -534, -217, 181, -232, 108, 76, -29, 387, -10, 146, 155, -283, 44, -258, 134, -147, 67, -218, -48, 252, 241, 38, 21, -79, -304, -17, -183, -104, 154, -6, 197, 226, -190, -4, -20, -239, -29, 75, 60, 28, -52, -53, 200, -196, 98, -80, -138, -124, -402, 3]
6136CJ0m40O04k51P1J33R4l06j22J26j02J26j30J03j18L17n0k37K42K1k38K92
6158A48l63N20n94J32J3J5J83l0k59J45L6J23j83L27m39K90l24K99J6j86Q3j17
6180a65n8L01l7l22L75j61J08j06J59j1j3k9J24k5j60o0K9J34K06j16K32q04K64
6203a35J80Q2l6J23q2N2k59mJ62R9j97J0J77j76L61l93J01j10l67M68l16J67J2
6226h1j69N28n36J63R6jj89L24l88N18k94n9K02k95J35J3l1k3j79K41j73l4K60
6249B8n8K19j79o3R7J81l88R3K85l9l08L99l08J32j79J05J38j99O32l20k79N29
6271E18n08r9K66m26J91k8J40J10l12J82J52k48j7K26m36M91l3o0j76q6L74l20
6293i9J31j87M46k34J87m55M64k85J20j40P0j21J01o3m2L50j87j63L2o0O0J26
$$ y = [3, 13, -427, 177, -74, -3, 130, 224, -82, -204, -78, -180, -54, -184, -81, -199, 118, 68, -169, 73, 94, -144, 148, -215, 305, -289, -157, -144, -129, 54, 24, -235, -90, -54, 69, -114, 213, -226, 64, -260, 39, 55, -131, -48, -165, -223, 78, 41, -281, 94, -67, 41, -65, 94, 83, 70, 41, 165, 140, -20, -80, -51, 83, 289, 173, 405, -399, -135, 45, 127, 91, 214, 132, 184, -75, -79, 83, 182, -15, -5, 172, -4, 357, -36, 65, -45, -412, 56, -260, -93, -81, -250, 278, -258, -95, 1, 0, -189, 135, -253, 265, -29, -88, 114, -181, -46, -33, -64, -87, -266, -25, -198, -232, 28, -30, 189, 10, -53, 44, 225, -163, -70, 215, 176, -132, 267, -41, 91, -88, 17, 155, -44, 588, 268, -11, 518, 10, -89, 177, -249, -58, -86, 54, 164, -148, 34, 186, -62, -79, 147, -289, 202, 169, 109, -67, -153, 221, -99, 32, -155, 291, 57, 244, -211, 253, -32, 88, -52, 18, -103, -2, -65, -107, 243, 56, -107, -75, -135, -75, 51]
6315E1K74j95j23J04m2q8J54p8N2J88m06J38J5p0O7l5N3K7m07M51k40K25N7k01
6339b9l98O08k24J23j49J31K57q3m98L69L4k74K67l47J11M0RL74m53o0M03m44
6361b33L96j72k93M04J7j52J32k78L58j73j77J50P5r7J04l44K75R7j59j12MJK18
6384D1m02L24J97l41K22k16L6L29r4k92K84j64J3p4P7M39k49K41k35k60K02k59
6406a81K31K87m75N6N37m09j24L28l89J87Jk16o5K68J20k32r9N66l36J64m90p
6428b78M70%l00j94P0K81j09r6M26l50j16J86k29J35M69l97l2J19M8r8N0k94J15
6451a24J96k73K74L0L60k70j50J7j22m2L15m31M10m3j1M2j47j45J48j48N3K89
6473B28p38L74L05jk96oQ6J30j50M44j74k81J17rP8J35p32K98K68j36K55qk59
$$ y = [51, 325, 130, 7, 111, 69, -19, 135, 57, 109, 297, -109, 29, 44, -26, 41, 6, 59, 86, -321, 130, -110, 115, 172, -29, -427, 181, -43, 80, -69, 62, 319, 236, -262, 107, 141, -133, 134, -213, -102, -62, -53, 321, -132, -192, 211, -233, 163, -9, -302, 102, 119, -33, 99, -179, 179, 6, -171, -21, 54, -43, 61, -283, -8, 89, -70, -182, -178, -177, 41, -361, -37, 160, -181, 41, -175, -139, 190, 96, -196, 88, -76, -63, -137, -60, 379, 130, 371, 136, -124, 78, -181, 50, 337, -138, -82, 455, 46, -78, 250, -139, 48, 49, -167, -232, 36, 156, -76, -175, 391, 55, 219, -271, -278, 192, 192, -108, -302, -232, 49, -60, -156, 270, -80, -196, -10, -239, -104, 365, -32, -64, 55, 103, 5, 55, -239, -124, 72, -201, 73, 103, 463, 193, 43, 60, -62, -104, 211, -220, 190, 147, 136, 178, 31, -114, 34, -114, -61, 228, -510, -136, 169, 168, -128, -134, -48, 82, -68, 376, 202, -79, 38, 29, 107, 242, -490, -192, 76, -60, 195, 187, -72]
6496g2J23k01L70J97p31O82n22r6J82l66M23J97o22L93j9m7K09R8k56J86qjj15
6519Dj08M52m63K00J50k28K41l86K2N1J06l8p8L3L3m3r7J55p4J64R0j33m6L01
6543C08j57k17q0J9j50J28j3P0r2J20K00l47J28J53k4Nk03K01q4k06L81j78K65
6566B27k75P4L29n66p0J67R1J4q3rK87j50j06O04n42N8j86kNK72k99K39L6k65
6590a50K10j43L0k0q9N32p48J46K06j49L9L74p28O33l15j09N16m85M18r6J91q7
6612A76l27R5J90m97N92o0j78q2L00l09J03jJ95Jl38N02k37J04k07r3J73K30k97
6635C5K16m41q9M37r0P0L53l46k77L18m25L3K48nk39mJ54l58K29oL46k87lJ35
6659DK2j64o6J59k8J1J89nP0m87K58o8j58K42N9J97n43L54j83M14l51J09j45J50
$$ y = [-72, 51, -150, 220, 417, -314, 368, -154, -250, -68, -434, -11, 186, -436, -43, -62, -109, 100, 198, -58, 128, 120, 119, 4, -104, 348, -115, 85, 235, 7, 248, -138, -116, -65, 41, 3, -75, -42, -9, -52, -149, 6, -68, 96, 186, 53, 7, 308, 151, -66, -146, -127, -277, -149, -162, -92, -184, -64, 136, -211, -83, 70, 46, 51, -152, 49, -35, -241, 140, -38, 227, -48, 26, 355, -211, -281, -114, -23, -9, -92, -101, 186, 36, -70, 534, -8, 50, -136, -138, -133, 139, -160, 79, 115, -150, 60, -83, -53, -73, -162, 370, -378, -232, -26, -175, -136, 238, -490, 143, -172, -281, 235, -250, 168, 72, 263, 176, -151, -56, 134, -363, 229, 169, -9, -91, 209, -100, 3, 2, 197, 198, -140, 362, 125, 229, 22, -71, 102, 332, 35, 251, -190, -279, 158, 68, 138, 491, 145, -132, 186, -239, -206, 42, 37, -202, -206, -52, -410, -181, -187, 159, -128, -131, 4, 26, -138, -204, -45, -73, -62, 127, 122, 192, -295, -37, -105, -263, -21, 38, 235, -308, 46, -137, 277, -74, 35, -110, 40]
6683D0J06mj99o6j74K00Q5r0R3J89n71K14q2p1O06j20r2J34j45j2q0j74K40J66
6707A93m92N53j59J28k61rj19L52k78J94L3l23J30J77k68M01k57K27K6k75N2j02
6729g7N6J97j45k01L13l19K48m21N02k03l18L79k9k22K46K50l54j5m7K44j97P4
6751c9J35j64J25k41K11J37j70k66K25J05k31o7K59J01m11L71J4Jj52J94M9m20
6773b34L54j69N9p5n5M9j75J49J65j31j02K65k83J84k33J94K41o85N98k42L92
6794B66r7n8k84K60j66j30L31J53l67j93J23L69k85m2J58K9o5O9RQ3l20N4J50
6817D7r5j82J17R7J38l74K19Q3l26K57J23j6k41j96M70j43k95K32L71l73M78n74
6839a83M66j29k31M81n95J00J60k73J60K19j59j07M0j85m7K40J45r9j35J50j33
$$ y = [40, 146, 142, -57, -123, -297, -97, -12, -102, -9, 180, -391, -177, -259, -330, 276, 156, 64, 198, 53, 41, -39, -213, 27, 193, -299, 254, 95, 223, -38, -47, -166, 186, -92, 102, 135, -188, -58, 119, -149, 252, -5, 222, 248, -27, 25, -77, -21, 176, 31, -170, 143, -176, 72, -349, 153, -50, -368, 11, -18, -240, 6, 256, -98, -113, -160, 84, -113, -39, 96, -68, 57, -184, 27, 164, -6, -272, -47, 58, -173, -240, 19, 120, -291, 80, 94, 95, -57, 137, 186, -234, 120, -49, 10, -65, -120, -71, -246, -97, 68, -63, -165, 100, -183, 1, -232, -38, 203, -482, 116, -126, 266, 169, 111, -173, 87, -79, -209, 122, 275, -92, -285, -162, 207, -78, -120, 38, 67, 2, 71, 80, 163, -157, -103, 47, -48, -230, -113, -16, 122, -252, -33, 50, -276, -19, 104, 88, -153, -349, 121, -22, -317, -85, 286, -87, 391, -183, 283, 154, -77, 404, -191, -91, 69, -204, -44, 175, 16, -91, -51, -236, -283, -43, 102, 3, -132, 18, -115]
6860a15j14M24l40J96R7m28K73L64o53K08J01j03K18j98O8K1J19J15o6j69K55
6881B73m81L31j33L4J64n0m20L14r0J45J62n69L99j34J49n0k25L88j57m17K94
6902g3J04k78l1L65k27L92m55K12p4L60J40m70J70j92l46J75J97p4L04k17n4j90
6924b62J84J37l44J5N03k75r9M41k57Q6J0n72N06j05J62K16p4j01q1k03J12R4
6946I3k09J46j98J52L3j10K90k08o6j38M1R9m5M6r0J90O2Q0l8Q4JN3m09K41l01
6971b01J96k19J38K89q9j97K70n41O65Jm86L98l40K17j24L9k44K38k94L29O2l50
6993b43N89l9j65j0j4J59k13k19L24l56K84p3o8K53k34K18k25k99L33L2O4J87
7015B85k79m8L88l28P8J28J0n32L80k31O43n22L00m49J01j74J49K80l5m79L55
$$ y = [-115, -229, 195, -145, 51, 148, -280, -7, 357, -296, -88, 13, -90, 128, -70, -2, 19, 138, 253, 187, 18, 273, -208, 123, -10, 24, 188, 138, -282, 32, -58, 87, 249, -320, 79, -55, 94, 44, -181, 207, 50, -367, -73, 31, -247, -278, 87, -140, 252, -203, 9, -65, 295, 435, -35, 135, -57, -403, -228, -31, -105, 199, -18, -72, -262, -78, 59, -285, -270, 233, -42, -141, 300, 43, 129, 139, -433, 73, -32, 130, 346, 272, 171, 90, -113, -1, 93, -116, 30, -168, -16, 17, -93, 197, -11, -77, -215, -174, -75, -120, -74, -164, 26, 88, 168, 130, 214, 215, 268, -141, 100, -201, -5, -224, -86, 203, 114, -83, 187, -354, 311, 312, -174, 224, -116, 101, -23, 16, -228, 10, -284, 45, 107, -243, 346, 307, 142, 132, 118, 277, 64, -155, 169, -187, 97, 24, -44, 209, -25, 193, -32, -331, 2, 34, 98, 285, 6, -42, 346, 18, 96, 224, 234, -298, 82, -149, 494, -28, 272, -177, -76, -250, -101, 179, 144, -335, 20]
7036B0O5l16O22n48N6K86k06j18J10k83M43M3m65K02J41o6J16k94J78k30J38p
7058a13M6K5R6m2J80q8l01L84k15J8k03j14K85M5r6L42j42K7j39J36l64N17k33
7081E1j7l7m2K52k02j20L46j51k8l43J8M93J80l05R4k83R3r6l6L29q6l48K26M1
7105B9m5Q1k15K79k75k7N97m97L6K93j76l3M74n45K70l87p8K81k46J64oj0j2l0
7129g8L21k25M2j44K27m39L58j85K01Q0p8J98j65j46J09k21J19k0k18L12O7Pj45
7152b3n1M2P5r3K28rm18K24jP8q2k13J04L18n08N42m32J3N55l10l40M85n45M30
7176F9K79k80K22n62N02j64n6J10l79L38j1o4P5o4j20M51n47lK35K42l5j43k03
7199a08J11j95O4Q7J46k77N7Q1P4M0k02nK07r9j48r0K50n5l10L47J07j83M47k71
$$ y = [20, 85, -231, 391, -157, -101, 185, -21, -139, -29, -312, 131, 174, -291, -89, 52, -14, 102, -192, -14, -244, -106, -113, -67, -42, 54, 12, 192, 104, -197, 187, -28, -10, -213, -327, -42, 3, -93, 249, 107, 134, -5, 131, -233, 284, 51, 34, -3, -45, 207, 5, -115, 231, 80, 52, -291, -273, 220, 400, 95, 189, -94, -1, -97, -133, 196, 110, -238, -12, 29, -16, 65, -150, 129, -146, -173, 424, -73, -37, 256, 80, 47, 521, -24, 246, -141, -219, 62, -184, -20, -26, -36, -48, -78, 243, 18, 60, -84, 143, -296, 62, -123, 78, 158, 80, 278, 113, -33, 76, -145, -26, -46, -264, 48, 115, 122, -23, -74, -32, 43, -50, 178, 169, -249, -25, -26, 52, -30, -243, -139, 179, -329, 213, -219, -206, 349, 39, -301, 184, -361, 69, 348, 68, 290, -272, 230, 66, 10, 120, -259, 79, 68, 4, 79, 15, -105, 346, -201, -204, 31, 273, 238, 95, -108, 3, -192, -128, -41, 105, -172, -115, -34, 40, 80, -122, -127, 80, -19, -167, -257, -7, -62, -372, -25, 82, -101, 346, 75]
7223G5J50k43N0J48j05m40M35l48O3L08j18j06M54o90J90L92J41k77k36P2k47
7244c32M35j83J41K5K8L6J63k26r9k73N2K29K34l71J85L0j22J11p9j99J22N6q1
7267a18J27J3k23N8l15K79J09j46K20j72K73l32L75j57j23N3K53l77M62m00l6
7288a77K74k6O5p8K09m54M45j14N2j17k5J03l50NPm7L83Qj52qj88P2K45l45L92
7313A79j20l00K13k86J26K39l0k5L03m34K73m41L53J01n36L06K15j49J50l75L36
7334I8J93k69K19j0m99L18j23k89K10J07k9J76Q6k19J6o0K83k91m1J52m3j56J47
7357b4L6Q8p7O1K5m86J80R2J04l1l6n7L01l04J3R9q3J38J5j64K71q0k3J2j15k3
7383f8j07J99K8k7r3N3K9L97j85R3k77mK76k94l95M39k80jO36n20r9L90q0j61
$$ y = [75, 225, -18, 32, 180, 75, -365, 70, -278, -215, 93, -25, -131, 323, -367, -177, 215, 356, 79, -157, -85, -332, 103, -80, 61, 86, 114, 150, 313, 87, -12, -285, -233, -4, 230, -141, 44, 74, -48, 63, -16, -215, -93, -37, -118, 9, 22, -201, -143, -458, -179, -70, -216, 4, -168, 105, -227, 148, -9, -132, -79, 174, -203, 259, -141, -177, 97, 71, 136, 58, 267, -187, 258, 144, 196, 79, 54, 157, -193, -188, -181, -228, 155, 163, 11, 3, -185, -113, 132, -213, 179, 59, -241, -28, -314, -188, 51, 21, -4, 299, -135, 138, -303, 50, 151, -385, -79, 136, -13, 137, -238, 98, 291, 22, 241, 231, -268, 50, -73, -362, -152, -45, -74, 102, 188, -31, -15, -75, 208, -83, -124, 28, -15, -171, -24, 12, 100, 23, 84, 109, -377, -197, -105, -1, -32, -68, -125, 176, -128, -115, -16, -99, 39, 54, -110, 161, 81, 58, 70, -45, -68, -175, 24, 52, 25, -68, -15, 14, 411, 226, 319, 42, 38, 314, 20, -375, 64, -216, -217, 419, -101, -200, 190, 110, -51]
7407e1O0m59P10l12j61M16k01j7J09j05L68n54J66K68l45J42m2L14m50J21J02
7428G9q7l75L63K8m6O7N1l2J68j37O7n1k11k99O30l41K15j40J08R3l86K81k42
7451a97l1J59j86L39J25o77L28M47l86K02j67J41k44K72J40k87k09Q6J85M1J7
7472I8j98j2K04j11j03J6q0L66k57J47J24k57K55j18l68O81m79M6k59M03o4rp6
7495e1L26k4m95P4K23j42L7k87j7M11P2j3l36M2J71J42j39N0Jj07mr7L75m35L56
7520A33k7l28K55k47L04l3j04K49J56o63L52l15Q6K13J15R4l0m39L88l22K08J19
7542A64l97K26K90o62L98k25J59L59p02M01R4l31M12j19k94K50q7o6Q5j04K95
7563A46j72j26K15k94K9K05j10j68M36o30M50J57l67L42M7L3o8j77L91j00l56
$$ y = [-51, 9, -450, 260, -52, -213, 203, 2, -15, 94, -11, 357, -197, -31, 237, -108, 34, -8, 306, -144, -23, 79, -8, -383, -20, 8, -38, 29, 80, 48, 216, 79, 146, 95, -116, -415, 215, -126, 89, -51, 57, 150, -236, 45, -197, -228, -69, -255, 84, 209, -468, -140, 307, -79, 123, -44, 97, -147, 125, 265, -22, -231, -145, 40, 81, 98, -100, -112, 92, -19, -122, -106, -186, 180, -77, 70, 194, -63, 192, 74, -294, 387, -92, -46, -305, 98, 34, 25, -51, 275, 251, -244, -170, 53, -89, -52, -339, -356, 55, 127, 114, -222, -180, -9, 133, -6, 44, 45, -62, -66, -163, 212, -223, 133, 106, -222, 33, -214, 90, 57, -47, 202, 358, -305, 47, -268, -182, 31, 146, 240, 210, -229, 159, -163, 45, 164, -233, -7, 283, -379, 19, -206, -47, 312, -390, 11, 105, -226, 186, 67, -227, 23, -64, -130, -45, -149, 146, -26, -152, 63, -231, -202, 3, -107, -275, 161, -469, -19, 138, -229, 113, 160, 193, 125, -52, 339, 239, -117]
7584a17K58j63k90M49r4j11K64k50J49m10J99K72l82K84K0l18K21j41k00N72k60
7605d8J60L2l86P79n94M50n72J9K61j31k71P91n11J4N03r79N13L08k16n07N68
7626A83l03q3J44L57m67J5K15l15J80J7p9L39j07l2m8J45p8K07n19K77J45o15
7648d22P03j00k31K05k47j11NK11k32Q9M06k99l34J10M42k88K69j51l84L50K43
7669B34j31j32k27M73j08LJ28l26l7O9l0o7K21k22K43j04k79n8L21M4m6q4L37
7692B22j97o7J70k53K42jk46J75N8o8P2k30L05o9k86J28p1j70M09l44J80J21j31
7715e1o5P0M04m59L94k47L50j48p8K47n80j49J47J04K8Mj35L47K4J07k78L37j30
7738B43l36J94J75m14PJ61m8J4j95J30J96j5j02K35m96J8O6k45M63m5M0l33l0
$$ y = [-117, 141, -22, -312, 137, 43, -68, 196, -54, 95, -315, -116, 156, -226, 58, 78, -240, -19, -160, -360, 212, -48, 112, 144, -242, 537, -57, 393, -179, -160, 101, -30, -301, 490, -21, -7, 496, -483, 30, 338, 122, -385, 183, -120, -203, -59, 298, -169, -154, 61, -254, -74, -57, -136, 203, 96, 64, 16, 161, 83, 290, -229, 48, 193, -422, 281, 181, -50, 155, -92, -203, -198, 13, -219, -130, 276, -23, -357, -247, 195, -93, 176, 25, -359, -9, 234, 103, -29, -256, 217, 109, 112, 240, -86, -123, -54, -84, -151, 70, -152, 91, -13, -292, -350, -29, 15, -31, -115, 222, 25, -42, 128, -125, 117, 116, -130, 45, 103, 35, 107, -123, 182, 113, -173, -45, -116, -286, 123, -221, -41, 80, -51, -116, -46, 358, -101, 293, 46, 396, 248, 170, 417, -163, -312, -165, -61, -33, -29, -164, 183, 207, 314, 36, 373, 243, -93, 101, 276, -138, -131, 30, -18, -4, -199, -69, 127, 112, 10, 245, -251, -233, -167, -412, 51, 6, 46, -287, -317]
7761c17M46k18J00L62k99Q9j88j19J11J26J21q7o2J59l70K44J21l98L25o0J7j29
7783b6l49R0L34q3n0J2j94K82NO6N8k47j3k6k4K60j81jM2J73PR7j47k49J73m03
7809c94J82M35k00j14pL4Q2k26R2j21k72P83k50m4l49K75K7l2n0L60k14k28J62
7832f9K27j05k7j29J01J08O5k63K28j65N5lO7O0l32L88k80K39N1l46L6R1l50P30
7856C77m02K75l14j65L46J59l72K41o6J12L1m44J87K9k15L34j67m2J42k5l12M54
7878A63l85K40J45l14J55j52L29M4j85o5Q6j73m1k6j44L34l0J73j14M9K20l00
7900Ij43K25k98J21K44k10K34k72K62r8l57L86j30j49L68j05o3l8o9J99K43q05
7922d46O80M4n91M00j89j70M97m22K28k4L1N4r4p3Q4k81J99N2l62M11J96l17K05
$$ y = [-317, 129, -89, 11, 373, 74, 163, -25, -144, -33, 93, 214, 127, 65, 224, -146, 98, 219, -179, 146, 86, 103, -26, -375, -285, 49, -34, -84, -72, -266, 16, 21, 87, 145, -102, -115, -141, -165, 95, -86, -87, -45, 128, 135, 232, 85, -164, 9, -394, -212, 223, 23, -91, -98, -64, 18, -208, -116, -237, -509, 274, 24, -20, -369, -94, -67, -99, -149, 211, -3, -231, -69, 158, 53, 26, -103, -2, 106, 171, -92, 136, -29, 26, 23, 90, 150, -182, 206, -74, 165, 216, -130, -94, -3, -353, 377, -25, 250, -64, -229, 117, 276, -96, 145, 79, 191, 222, -222, -35, -6, -221, 113, -54, -96, 46, 21, -291, 163, -222, 18, 163, -151, 4, -148, 181, 225, 40, -25, 61, -112, -153, -179, -323, 11, -19, 154, 40, 89, 309, 9, -134, 91, -207, -86, 158, -52, 182, -90, 172, 74, -283, 103, -27, -176, 192, 87, 24, -14, -83, 116, 359, -446, 234, 278, -313, 87, -102, -272, 225, -197, 31, 7, 38, 92, -2, -75, 9, -272, -73, -21, -383, 28, 224, -93, 112]
7945A12l6n4L37k55L09l52l7K6k66p4K26j99M39j66J06J57j80R7Q0m02K07J9m20
7968c26M64l2k49J95r3J32J4N2N5l30K40J24n56J33L30j81K12n02K7L70l22J53
7990i0L20l38L98k78k05M89l50M8J83m12K44J32k56M33j08j6k01l32M22K29m65
8011a53R7l6K02K8l58K96j26j79J38L4J81j57m7J81j46l2Mm3q5J61j46L37j37
8034A4l03L68j57l7L02j46J05j15P5l16J59j74L25l47K77J12l29L25k3j58J5J0
8056a8r9L75l06N7J02l80M06k41P1K90l08L78k58j93J96j29J89P7l25P8M36l46
8078E2J6j49k5K27l53J76J84j16j79M82m24L56o01K66Q1j29K57N8j65L19l29j
8100CQ6J1j50MJ26J24j28k66L86k62%L2q8J38j81J5J36k26M22l63L45L06o39J74
$$ y = [112, 76, 22, 359, 104, 413, 61, 24, 50, -216, -290, -64, -263, 176, 10, 116, 273, 93, 190, 270, -132, 75, 94, -326, 138, 106, -143, 52, -41, 91, 105, 157, 212, -118, 122, 246, -310, -177, 153, -28, 184, -318, -291, 79, -243, -90, 230, -108, 290, 12, -193, 296, -54, -6, 177, -235, 9, 141, -115, 318, 210, 194, -7, -339, 83, 312, -153, -56, -92, 110, 138, -220, 76, -50, -229, -91, -57, 124, -33, -80, 101, -45, -77, -73, -116, -201, -40, -186, 151, 14, -289, 79, -78, -115, 187, 41, 146, 31, 106, -210, -51, -225, 100, -247, 30, 142, -187, 138, 115, -43, -28, -18, -117, 258, -48, 9, 111, -269, 137, -104, -33, 257, -51, 327, 69, -124, 72, -57, 132, 209, -116, -38, 398, 52, 68, -81, -106, 121, -232, -56, 128, 12, -167, 315, -109, 247, -354, -88, -7, -136, 121, 179, 14, 333, 4, 3, 89, 100, -50, -46, 80, 204, 76, -190, 196, -66, -66, -34, -122, 16, -165, -150, -14, -240, 182, -181, 164, 470, -169, 5]
8124Ej18j47K77L29m51M83j57o04K87J88M5j06j15P3N9p1J33l88K19n8K17r4J70
8147A76m61K98K1M2n4q9LK57k33q5K09Q8Q1k28j4O3k07J79K0n8J14m50L39Q5J45
8172B41n5j08l0K89m55j20K31J00j50o2K15J76n95L74o2j58j21N10R3
$$ y = [5, -113, -260, 17, 346, -105, 378, 221, -383, -96, 92, 137, 31, -84, -11, 48, -23, 110, -278, -59, -117, 100, 6, 176, -285, 13, 34, 76, 22, -67, -64, 193, -40, -125, 84, 172, 253, 25, 11, 74, -133, 46, 66, 8, 122, -328, 11, 96, 241, 186, 78, 48, 337, -118, -238, -7, 93, -57, -119, 96, 272, -323, 51, -11, -169, -290, 220, 313]
8191C13
$$ Imaginary data points
##PAGE= N=2
##DATA TABLE= (X++(I..I)), XYDATA
0@%%%%Qj6J6j6K4m0N6o7P5r5J19j44J76k08K43k86L39l99M63n31O07o95P97r09
28d83J030j163J309j472J649j843K062k300K557k841L153l494L868m284M744n250
44b758N815o449P162p972Q899r972J1231j2735J4571j6863J9815k3781K9418l8099
58b1718N3250q6794K73672j04025m83446O64242j96712l87523M97560p6816m47731
69c16041M39380N6408m08476K30008J58693l23635J61595J46884k88531Q9985
79e3730J87337k08807K8278R1289r3899N7281K1805n4538L6229k8139O1088Q741
91E2935j26836J07787K8688j38500J31210k1438j57446J91578R888k08606J60830
102C0090N5559k04214J56325P8027k80509J59095J82999l32582J03003K30773
$$ y = [0, 0, 0, 0, 0, 8, -8, 8, -8, 16, -24, 32, -35, 40, -55, 64, -80, 96, -112, 131, -155, 184, -215, 248, -283, 324, -371, 426, -483, 547, -616, 693, -779, 870, -973, 1089, -1211, 1346, -1495, 1658, -1836, 2032, -2252, 2492, -2758, 3057, -3392, 3770, -4202, 4697, -5275, 5956, -6779, 7792, -9071, 10744, -13037, 16381, -21718, 31532, -55262, 218410, 114385, -369061, 295181, 98469, -289054, 208506, 131690, -316041, 123339, 179747, -228729, 1279, 159972, -163663, -2068, 144816, -143715, -53730, 133607, -75200, -46922, 44367, -49532, 7749, 29554, -24984, 11245, -16894, 44194, 52935, -73901, 33886, 62574, -75926, 55284, 33846, -123600, 67978, 77866, -130740, 30090, 85649, -118565, 37760, 115787, -164722, -5627, 177372, -155210, -52207, 178566]
112A78566l37827J18412K59750l84978Q9083L07760l38228L0097K57751k79689
122i9303K9137K43462k44210l8994K37247j42832o9061J79711j19670n5647J94932
133A14772j19498q8552J73986r1795m2684J32576j31363j278J39435j18810L512
144b9699P8104q7702N3136L5651r1243M2917K0960l8054L3745k7384k5685O1496
156B6242j4461m2362M9390j2265m2114Q6823l1119j00877J28810p976j29649J42393
168E2835k8174j36372J90972l4286j64722J83709j5986j38610J56795l2103j33065
179i9007J50299L744j42172J00336L6023j19116R0292M1136j46474R3723P7210
190H5994j55492P0062O2843j38686R3275M4200j45858Q5623N0890j00408N6773
$$ y = [178566, -159261, -40849, 218901, -166077, -76994, 230766, -107462, -77365, 180386, -99303, -70166, 173296, -70914, -109908, 127339, -15493, -84554, 95157, -24513, -80160, 114772, -4726, -93278, 80708, -11087, -53771, 78805, -52558, -53836, 85599, -33211, -29699, 48405, -39297, 13839, 49490, -41753, 1164, 22124, -15930, 17815, -9569, -35254, 26242, 11781, -30581, 18809, 6544, -35570, 51253, 20134, -80743, 48067, 40091, -89558, 52835, 24661, -111711, 79261, 44975, -119747, 63962, 47976, -90634, 66161, 34058, -99007, 51292, 55036, -87136, 13200, 49223, -69893, 20399, 61535, -84939, 8784, 85994, -69498, 564, 63407, -75279, 17996, 62196, -83662, 1961, 52851, -47557, 9216]
201I216J6958o2968N2196J6242n0362P697K4108j0211r098N382r967N344J7621
214A2158j6773M736j576o289L9530l6356k4512O5541m9300j1387O9860q1485O267
227b9586Q8582q7015L707P1987p4416J6912N9999p6095Q30O5577m9437k1118N9887
240B9814l9673k8824Q6267m4439n8525J04194l5746o2721J01265n1607n6290J08797
252E2512m6552o0563Q3560k1146l8426N2165j1312l5337L3291K0120m2186m64
264a4338L6377k9599m447K8990l2935M812K7753k0403K312q36M210J6301k9824
277a1627J2120J3262l6747L3928K188m7061M2953M650l4430L2857o467j9220K8407
290A4813n549k0466J1111Q713j6923L154J7704l1457J0960L7711n1027J2410M4528
$$ y = [9216, 26174, -36794, 15402, 31644, -18718, -11021, 13087, 2876, -6222, -840, -10807, -5463, 12158, -4615, 121, -1455, -7744, 31786, -4570, -29082, 36459, -12841, -24228, 45632, -35853, -29586, 58996, -28019, -24312, 47675, -26741, -9829, 50170, -25925, -25095, 40482, -8955, -30073, 29814, -9859, -38683, 47584, 3145, -55380, 48814, 13068, -49653, 51612, 5, -56285, 52512, 5960, -54603, 28957, 7811, -30615, 21550, 10238, -25099, 8192, 28312, -13874, -14338, 22039, -7560, -12007, 16983, -15952, -11140, 16613, -3790, -1478, -2314, 1896, 18197, -11627, 493, 13755, -22992, 10936, 13124, -33937, 9016, 13666, -20764, 12093, 5626, -13594, 14813, 9264, -11202, -91, 8622, -8301, -5147, 12557, -18900, -7940, 29771, -21256, -8846, 35682]
303C5682o0546K2991M0083p0639K4547M1621n7342J1440L1996l2417R26L0260
315A8602j4876k4749L3931Q033m3762K7483J3110m2936L1675P206l8690K6958
327A985P601j6428J0332m604N406L66p976J3774j7944J41K2186k6122L316J6316
341H349j7923J3068K914j4144J3618j911k787J135n751O109p545M458L981k0361
355a6790K4079J154k7683L4700p958k7453M1045j5402k7060L5022r660j9786J9465
368C673J515j4687M352J9801j6646j1786L4293j8593j8729L7231k3968j4526L5129
381A7059k2206q183K1922j2707L446M256l864M881o720Q086k393j3373J6268p920
395a448p490J6304j5620M709J3625j7583J0404L829j1272J1289o123l355L966
$$ y = [35682, -24864, -1873, 38210, -32429, -7882, 33739, -23603, -12163, 19833, -12584, -11658, 18602, 3726, -21023, 12908, 20941, -22821, 4662, 17772, -25164, 6511, 13717, -24973, 1985, 9586, -6842, 3490, -1114, 4292, 4658, -3318, 10456, -7488, -7347, 14839, -11283, -7967, 8349, -9574, 3494, 6408, -7736, 5882, 3971, 1184, 2319, -3432, 2677, -4868, -410, 3571, -16790, 7289, 8443, -19240, 15460, 7502, -19951, 21094, 5692, -21368, 13654, 3994, -15792, 3673, 5188, -9499, -5147, 14654, -1992, -13778, 20515, 1922, -16807, 20424, -3544, -18070, 17059, -5147, -13330, 8592, -4115, -669, 3587, -277, 4604, -2116, 5970, 3577, -9796, 6472, -1448, -8938, 7366, -8254, -3545, 10080, -7503, 2901, 6730, -4542, 6747, 624, -2731, 1235]
408A235o535R724j0211k090J9723k0766N144K0802k7722J0597J6716k7072R046
421a409J0210j4985J721O007Q9r241O748J3040k2109R810J6548k8827J3805J2660
435A4067k8714J6607M437j8809J5039k038n746Q941m341L853k094j873P425j1440
449d686N572K573j3545J4703m907j0141J9483j1520k755J6350j4404L012P038
462F773r689M991n056K133L713j3537J4697r54j5085K2679p696j2622K1383j0046
476A684p828J1751o698j960J99L564l69r191J5929m354j3226K3385j0799j1942
490i855K3585j7014m555J7806j7657L175R873j1578O950J358l181L945k262L688
504D278n226o66P909j4208O439P534j7941J4669K685j6216J8356m015r318J3990
$$ y = [1235, -5300, 4424, -5787, -7877, 11846, -8920, -3776, 17026, -10696, -99, 16617, -10455, -1409, 8801, -6184, -4463, 1544, 1633, -7608, -860, 12180, -9929, -119, 16429, -12398, 1407, 14067, -14647, 1960, 6397, -12412, 2627, 589, -5157, 3784, -557, 3296, 1202, -671, 6754, -4686, 886, 3459, -10086, 4617, -290, -10431, 9052, -2468, -5223, 11127, -3277, -265, 6773, -2916, 2075, -2981, -848, 2865, -10672, 4025, 3071, -12014, 10665, 2969, -9653, 11730, 1684, -6144, 5607, -1091, -3051, -2852, 712, 343, -8848, 7081, 2727, -10499, 12886, 2087, -9855, 13730, -3284, -7839, 9967, -7690, -4515, 5358, -6220, 730, 2088, -1093, 2852, 590, 4278, -948, -1614, 6295, -7913, -1474, 6060, -11881, 2788, 5473, -10743, 7613, 3598, -5720, 8270]
518H270r049n3M422r224Q247m777l992J1920j1551L840J0262j2995O912L452q042
533b358M827l580J486k004l496J0193j0775R47J5042j7899P347J2616k2716J4794
547D424M537k0898J7146j913j4553J5802m739o767J0117q86l631J091O429n807
561C52n392J4148j2360o236K0550j8522j006K0595k1274O178J5546k0842J1000
574B737N609j5143J1664l046p816Q603m829l33K825j866K445j122M015k626l623
589b506R667r058j609J0760j6003P402Q105j8530J5410R05j4774K1117r476j0096
603h686K1908j5505m798J7289j6325p83J4790j1580l571J2806j906j1468J3222
616E393L691k1477J8270O144l0176K3020N195k9538K6883n65k4362K7953n134
$$ y = [8270, -779, -832, 3590, -5634, 2613, -2164, -6156, 5764, -5787, -1947, 8315, -4680, 2232, 5684, -2358, 2469, -1111, 375, -1629, -5125, 5068, -5707, -4760, 10282, -7617, -270, 12346, -10370, 4424, 8961, -11937, 5209, 3296, -11257, 4545, -194, -6961, 3156, 2270, -1361, -270, 6159, 352, -5040, 9108, -3252, -9488, 11062, -7460, -8466, 12129, -9145, -2967, 12579, -8263, 2737, 8346, -6797, 4867, 1821, -5995, 2608, -2221, -2554, 271, -1595, 850, -272, 3743, 1117, -2506, 7161, -1897, -3506, 7254, -8749, -1347, 6758, -11772, 3638, 4543, -10231, 10886, 1410, -8686, 13222, -2283, -7081, 10208, -6117, -6900, 7890, -3690, -7261, 5545, 3639, -7829, 5393, 9084, -12393, 5877, 12021, -18155, 4865, 10060, -19478, 7405, 6840, -17522, 10431, 5297]
629E297j5555K0054q830o027J2459r362k548O439l127k340M140P29o433R224K309
644F429j4915J4765O3j7566K0607q257j6541K6885j3092j0667K4636j8236K85
657e604K0454k2167M683J4426j9047O732Q177j6273M487J2366j3190l465J8808
670A0387j1412q898K5862j6914j3610L4208k1729j3865L3748k4971o247L1384
682A7943k6885l44K4176k0871M556J1535j6583P038O897j2732J943O932q308J101
696c602J1429j4182J26K1486k0258k190K5249k7800M113K5778l5520Q023K4918
709A7570l1803J1458J5863k6323J4501J0844k0408R011O051j0840M921L124j1289
722g320M320J0299j4059K937J3607j8901J0020J4546l0071J5830J5083l3027K0424
$$ y = [5297, -10258, 9796, 966, -5061, 7398, -1964, -4512, 1927, -1200, -3540, 600, 1329, -5104, 4120, 6429, -8486, 6279, 6342, -11224, 9383, 1126, -15415, 11470, -1622, -12289, 12347, -5889, -5604, 14850, -7317, -2634, 11792, -7255, -523, 7654, -8619, -4132, 8234, -4956, -8421, 10387, -1025, -9923, 15939, -975, -14585, 19623, -2106, -15971, 17777, -7194, -13441, 17943, -8942, -9286, 14890, -5981, -1425, 10110, -6473, 565, 7462, -5270, -3327, 3605, -4703, -3602, 7827, -6355, -6229, 15257, -5001, -7191, 18058, -9742, -5629, 20149, -15371, -7348, 17570, -14233, -2775, 13088, -13235, 1266, 12110, -8298, 713, 6764, -4076, 845, 3969, -7320, -3000, 7299, -6760, -3823, 9784, -9117, 903, 15449, -14622, 1208, 16291, -16736, 3688]
735C688P416l2010K7811L372k8583K4398J184j8590J9840k253j7087J5456L216
748G858j7070Q856O682j8047J2990R435k6308J7730J2946l0189K1350N846l0801
761a8722K8237J583l1177K6827j218j9912K2973o725j3382J9528k813j0520Q922
774C601j271o307P426k46j3154J1366L692j4896J5050k110j5617K5920q746j9761
788a5053K9522j4287j2598K8864k2143q735K9475j9033o060K0958j4308k179J7427
801A1850j1878r048J6910m092j3438J5541m439j5547K4384p117j9019K7924r575
814B456j3394K6730j8960q090K6807j9800m170J7966j7406L850J3673j5817J911
827d244J1344o466l062Q429o815m733J4119q704j0747J7539p422p197J8619j6080
$$ y = [3688, 11104, -20906, 6905, 10277, -18306, 6092, 7276, -11314, 8526, 6273, -10814, 4642, 7858, -9212, -356, 6326, -11721, 1269, 10704, -15604, 2126, 15072, -15117, 6233, 12079, -18722, 9515, 11098, -20079, 6748, 5530, -14382, 8591, 1866, -11516, 8012, 5199, -5321, 3601, 2330, -3977, 3449, 3203, -9951, 1415, 5107, -9789, 5261, 3151, -12466, 13454, 4708, -15053, 14469, 182, -12416, 16448, -5695, -14430, 15045, -3988, -10048, 10910, -3398, -5577, 11850, -28, -9076, 7834, 3742, -9696, 5845, 1406, -14141, 10243, 3126, -15893, 12031, 2456, -10938, 15792, -3168, -11258, 15549, -4251, -8421, 9545, -7861, -4011, 9662, -6155, -4244, 7100, 634, -2428, 6001, -814, -5547, 8572, -132, -10879, 6660, -762, -7959, 10660, -5420]
841e420j575K1678j9496J610J3547j9379J1056P101k1211J1863N545j2943J0176
854B552J197j1318R870O334j2754R43J1945j2417n62J4614j9777J886K2164k2757
868h080K018J8961k1962R320J2794k3244J0331Q271j4917P586L37q538Q778J455
882C110o563J891M615k381k64M519q590J091J1413j3850M85J0861j4436Q704P120
897G725j8145J3132M098j2195J1195n178o754J3510p914m557P526n414J510N344
911C883n421j950O703J663q560M864L256j1425J0930J562j8777J6080L545j6868
925a0515J5898l003j1273J7703n645r864J1102m054k341L927m247p59K641K542
939B112l019j590N511l794K446L481j1305P461M409j2003Q733k662p438J3951
$$ y = [-5420, -6995, 14683, -4813, -3203, 10344, -9035, 2021, 9122, -12089, -226, 5319, -7624, 2552, 3749, -7569, 2301, 8635, -4119, -3176, 8769, -3648, -4210, 10404, -9373, -7487, 14677, -8080, -6062, 12899, -9063, 257, 13051, -10193, 138, 8409, -6508, 1078, 1415, -7123, 1655, 3110, -3453, -1562, 3053, 672, 408, 4927, -3663, -2572, 8841, -5009, -4524, 6337, -8099, 605, 7725, -10420, 2712, 6810, -5385, 5810, 632, -6122, 7388, -526, -5083, 2443, -2971, -1461, 3883, -1538, -3488, 3215, 4878, -3682, 1182, 4438, -6987, 3943, 5505, -13272, 2808, 6353, -10515, 5383, 2380, -8893, 8810, 3165, -6699, 4403, 349, -1992, 1935, -2312, -3071, -430, 2112, -907, -2497, 3014, -780, 1666, 5147, -6158, 1303, 5712, -6291, 2442, -220, -7658, 6293]
953F293o130n933J0700n871J752M204q941M307J571l473K366l748J102L283j408
968G4L9k397L828K007n417N127m302l779J2457j0223n107J3978j0316J398J0023
983G390j3033M327Q533r088J768J807l044J769k19p78l036K976M361p441L836
998A28K841o401Q946l499p634J0214n454k091P299r654L020O601p722M319K50
1013A163k649N727l552j107J274k671M300l621k492M636l018K812J030n246O461
1028C047j827j631M406q234M163M832j0444O521j4o871J0546l691n283Q313l171
1043F62p41K493l721Q01j4J350j260m554P231j986l799P971o734P88Q899j0340
1059b954K148M767q108N882o39o532O975j723q58K960l797L657l7j739K118m657
$$ y = [6293, 163, -5770, 4930, -941, 811, 5015, -3926, 381, 1952, -1521, 845, -2903, -1801, 1482, 74, 113, -2284, 1544, 3551, -1866, 3261, -1041, -4820, 7637, -2586, -7693, 6285, -4031, -2633, 7390, -5643, -1316, 7217, -1871, -103, 1704, -1340, 429, 210, -568, -3604, -628, 3733, -3708, 128, 2969, -3432, 5514, 2015, -5619, 4595, -859, -2950, 4349, -5305, -2285, 4316, -3406, 913, 1163, -1486, 4241, 689, -418, 856, -1815, 2485, -1136, -3628, 1008, -2010, 802, 1832, -3414, 3047, 1220, -411, 3995, -4239, -76, 4756, -5688, 833, 819, -6052, 4494, 803, -4480, 3833, 662, -79, 2414, -1307, -506, -520, 830, -430, -4984, 2247, 261, -3538, 4433, -2301, -1513, 7386, -2954, -806, 3961, -4147, 1735, 1096, -5436, 1539, -184, -1042, 1918, -1879, 1778, 1741, 2, 2120, -2537]
1075b537K526K075n833M593j780k548P057m691q5M391n009M863j510n395P550
1090C667m940j280O098q140L361M984o796L943M50k618M259k701m07k65r29L569
1106B255n395J478M292o886O166R64q197R622j609o331P910n279j865O434o053
1121b494R75K035k316L208k182P32J792k757L964k435l207N806n033N37L653o543
1137d265M842J102m293N806l389n48N174o572K520J519n728N762k232l657O002
1152B043l055L78L313l837K462l28o74J069l764L115j75m082N998m438j178Q329
1168E176p715J067O717q282M155K657p700N027j47l857L244j869J194Q85j129
1183e77L241m348K673K795o742M235j37n283O845l768k274O583n388K222K952
$$ y = [-2537, -11, 2064, -3769, 824, -956, -3504, 3553, -1138, -1223, 3168, -1841, 3022, 1512, -3883, 3667, -1273, -2553, 3545, -4595, -1234, 3750, -3046, 897, 1347, -1271, 2988, 287, -120, -385, -1314, 2255, -3140, -1662, 2630, -4256, 1910, 2874, -5323, 4299, 2690, -3641, 4269, -1010, -2875, 3559, -2494, -1519, 516, -1800, 1408, -774, -42, 1750, -1007, 2957, 522, -2685, 3121, -1912, -1375, 2278, -4265, 577, 1679, -2614, 3192, -197, -745, 4429, -2143, 377, 1896, -3832, 1930, -302, -3959, 2043, -1012, -634, 2679, -1158, 1304, 976, 302, 1371, -2393, 722, 547, -3535, 2463, -1975, -3153, 5176, -2539, -1472, 5245, -3037, 1118, 3775, -3925, 1102, 955, -2902, 342, -1527, -333, 552, -577, 2664, -1684, 989, 3784, -2958, 1277, 1140, -4143, 2702, -1066, -3340, 3243, -2145, 77, 3029]
1198C029n537M923j104l516N016m365J67L396n329L345J80k525M349k369M85J919
1214B064l130L501k664j845M815n738K013L502p107N548J677o580P537k147m161
1229b715O415m101r73K503k665J527r59m9K006l135M500j313l206O323m504j552
1245a898N575o850K111L504o878N078L79m283O296k972j152M284m039J760m25
1260D90k230L102l412Q96K208l990M572j089k792N700l988K15L626n834L168P36
1276A378n209N423k703j540N584m690J439L555n029L231K32k902K739k760R68
1291b84Pk310M499l651N83N145o461L473K831p661O455q33o094O926l546k310
1307c231N572m114Q57K870k640J934p59J51N06k856L356k669j437N490n664J308
$$ y = [3029, -2508, 2415, 1311, -2205, 2811, -1554, -1387, 2009, -3320, 25, 205, -2320, 2029, -340, 145, 2064, -1066, 2435, -229, -2074, 2741, -2997, -984, 2518, -4589, 959, 2636, -3944, 3593, 1446, -2715, 3700, -401, -1374, 1129, -1536, -9, -968, -1017, 989, -2146, 2354, 1041, -2165, 4158, -346, -1898, 3677, -3173, -1062, 2442, -4436, 642, 1021, -3262, 3034, 62, -1090, 3194, -845, 915, 490, -1740, 1362, -2050, -1154, 1054, -2936, 1636, 547, -2245, 3455, -533, -318, 3308, -2526, 642, 1378, -3831, 1592, -1111, -2651, 2933, -1757, -318, 3237, -1792, 1439, 1671, -1231, 1508, -1252, -284, -277, -2587, 1912, -1739, -1156, 3989, -2472, 1001, 3832, -3829, 2626, 1793, -4301, 2625, -921, -3231, 2341, -1773, -916, 1954, -686, 1248, 489, 640, 1146, -1710, 1646, -1023, -2460, 3030, -2634, -1326]
1323a326M860o712L828K983o457N376r93m116M644l297j66K721l802L018J72k300
1339a567L472k054L54J786k712J798j689o53K889n207L934J543o169O427p40m546
1355c134P851m422k464O492o328O75L681n321K637J186k474K505j133J030m41
1370C40k62K001m048K423J581o563O229p25o405R128l154m693R472o020j160O037
1386D181n800O21L051l788J633l59k72O96j422L298j839n36L448m433K560J383
1402B422n401M874k065l464O913m989p45O277o416K736L991o831L964M68m800
1417c066M477j978j404K477j131M44l57J196M07k643M510k611k820O728o546j086
1433c403Q013q861K510O507r234M985L537p726N454J041m871K888k90j420J55
$$ y = [-1326, 3534, -3178, 650, 3633, -2824, 2552, 1559, -2557, 2087, -1210, -1376, 1345, -2457, 561, 733, -1567, 1905, -149, 205, 1991, -721, 1077, -612, -1265, 1624, -3583, 351, 1894, -4275, 2152, 1412, -3134, 4717, 295, -2169, 4323, -2005, -1330, 2351, -2970, -333, 853, -1621, 884, -249, 781, 340, 78, 2079, -1969, 454, 2035, -4528, 1701, 976, -5429, 3699, 545, -4148, 5324, -696, -1856, 4181, -1619, -998, 2053, -1735, -102, -461, -733, -37, -1459, 1839, 0, -536, 2912, -1521, 1039, 2422, -2979, 1895, -170, -3634, 3279, -1710, -2455, 3822, -2594, 142, 4133, -2698, 1266, 1734, -3066, 1411, -567, -1971, 506, -625, -181, -538, 658, 1065, -1578, 2932, 321, -2499, 4229, -2317, -3403, 4610, -4251, -1741, 4766, -4468, 517, 4054, -3672, 1782, 2823, -2048, 840, 550, -870, -715]
1448g15P79N30k825L164M10l649N205j886l381O234n150p44M901o460L267K275
1464A955o117N997o56m169O547l771j397M615l927O1J695k031J034p36J264j195
1480h31k25M083m653J529M073p137M079K434q639O802M20p319P992k360l972P256
1496C532l606j131L840k614m02R44m64j247r8K287k372o68M608m116J494L775
1512C762o524M053J483o581O040j976l729O155m488l88M967m786K469K004m037
1527a576L007p86j314J245j402P36j395J178J700l711L328J011m783N715k031
1542I22m274P102m684k045O460o285J311M107n752L504J648l392K860r19j006
1557d43J393j063M27k020J418Q52l364M020m31l816O783l536k689O481n236l63
$$ y = [-715, 64, 594, -2231, 933, 1343, -2306, 2899, 1013, -2368, 3866, -1284, -2028, 2873, -3587, -320, 1955, -4162, 1835, 1179, -2990, 3557, -214, -1611, 3004, -923, -862, 833, -1198, -164, -900, 364, -831, -1056, 3027, -1626, -97, 3976, -3161, 918, 3352, -5287, 1515, 1935, -5384, 2608, 248, -3724, 3532, -74, -1205, 2635, 21, -381, 563, 99, -1148, -1246, 1041, -1331, -1999, 2609, -1507, -13, 3762, -2762, 1291, 2774, -3807, 2233, 257, -3472, 2683, -1805, -2193, 2774, -2012, 457, 2461, -1576, 1431, 645, -669, 576, -826, -90, -1485, -307, 1393, -2318, 1010, 2021, -2762, 2953, 922, -3352, 3750, -934, -2979, 3481, -2804, -1493, 2614, -3138, 366, 2014, -1378, 1482, 563, -443, 950, -113, 314, -1706, -288, 564, -2800, 1220, 789, -3027, 3756, 220, -2469, 4012, -1224, -1587]
1573a587M644n874K176K073m232L367o33r43L030k380Q25O10j934K130j573n93
1589h94J063k623L392j473j579M799l968R33M068o400L359K217o200M475m70m246
1605c547N237k011j501L563k197J290M75j219P46j540J183m37j880L316k759j32
1621a413L920n055K137M146o538M216P02n186M992j350l362M178k618M69J422
1636F60k023K112l83j68J451k846K306n7k813L268k609l17L105l663K416Q66l587
1653b282N066j896k947M950l717m37L376m625J984J653l044K494q98k02K049j974
1669d50J474j138o61K682l604J320J399m324M862j006l438N621k852j257N020
1684C648n033L62L122m019K143j69j444J832j100R74K19j354L056k226m94K533
$$ y = [-1587, 3057, -2817, -641, 1432, -2800, 567, -66, -1009, 2021, -359, 466, 1076, -858, 1272, -301, -894, 169, -2454, 938, -535, -2114, 2685, -1283, -350, 3718, -2682, 677, 2894, -3306, 1169, 699, -3547, 1690, -321, -1822, 1741, -456, 834, 1309, 90, 836, -704, 479, 42, -1838, 1478, -1281, -1413, 2507, -2548, -411, 3735, -2803, 1413, 2115, -3071, 1921, 571, -2791, 1387, -1231, -762, 660, -1363, 749, 366, 198, 1649, -1197, 1109, 1052, -1761, 1507, -1102, -1419, 1686, -1977, 439, 1305, -2282, 2784, 888, -2059, 2891, -826, -1263, 2113, -2512, -528, 1125, -1919, 575, -323, -525, 1524, -450, 1024, -114, -775, 1907, -1697, -377, 1022, -3302, 1560, 554, -2884, 2737, -115, -1372, 3648, -1385, -1023, 2099, -1920, 223, 54, -1390, 442, -658, 316, 535, -819, 2237, 11, -483, 2050]
1700B050l527J715J154m396L730q39j989M106l336J005L213m423K460N64l464
1715a977L785j584k314K774j858M51J582j732K159j557Q94O12l036K933o30k958
1731b456M115l256j68M609n133K285K370m278L560M9l716L463j507r42J632j829
1747a202P68k4m2J381k262K288O39l183L747j812k363M339m108M03L096m198K918
1764C85P88l508M272j448j134K521k815N57J739k858J625l61o77J908k015J365
1780C44k82m95L134l456K29K945m667K587Q79m692M827r86k718M465k770l76L519
1797B487l009J60J675k075R59l42m81K70p38K458j973l76L370l544J442K252n502
1814b967L852M86m098L864j163k026M135k937L02K518k965K011n32j094J592j604
$$ y = [2050, -1477, 238, 1392, -3004, 726, -113, -2102, 2004, -1332, -327, 2886, -1537, 923, 1487, -1977, 1808, 224, -2090, 684, -1174, -723, 859, -873, 1286, -271, 623, 1235, -1801, 1132, 502, -2456, 1659, -1597, -1765, 2844, -2289, -4, 2366, -1912, 1648, 1697, -2019, 1444, -63, -1005, 627, -1202, -434, -458, -500, 881, -1381, 907, 1546, -1637, 2110, 298, -2065, 2274, -1834, -1431, 1665, -2533, 385, 1173, -2335, 1937, 489, -645, 1876, -939, -382, 1357, -1501, 124, -237, -914, 994, -1021, 344, 62, -433, 2701, -755, -526, 2419, -2248, 339, 1218, -3474, 1353, 367, -2351, 2114, -656, -1032, 2487, -522, -362, 1313, -762, 197, -145, -626, -356, -1094, 1364, -609, -985, 2385, -1159, 283, 2535, -2967, 885, 1371, -2727, 1137, -26, -2052, 2083, -854, -552, 1966, -999, 1012, 480, -614, 978, -626]
1830f26O64J78j553J563m37n28J720k593K795N15l920M591k615j835M862m647
1846a866J62L906m322J944K103l661K691L03j791J330j056K61m66j71J050k622
1862b205K296J138l416L891o61l042M970k978j537L867l884O12K491l594K214
1877A62O37k199K505q61k87J390j659Q78m41p81J460k273J231L95j725L223j869
1894b14r59L772l615J059K575n154L016R80m001L382n54j996L162j323j43R83
1910I70r80J240j463j22O64j565J667o46j317L086k524J61L337l872J752J967
1926B355m244L107n55l018L604j763j390K737j796P41J169j023J233j142N33r8
1942D50j625K002j421o79K425k748J132K377l706K525O67k999L437j469k262L597
$$ y = [-626, 38, 216, -1337, 226, -211, -739, 981, -1612, 1183, 1698, -2222, 2369, -246, -2081, 2781, -1866, -1704, 2202, -2120, -176, 1927, -1734, 957, 1260, -531, 799, -257, 4, -462, -633, 417, -2205, 91, 1229, -2187, 1704, 1043, -1999, 2971, -7, -1544, 2323, -1561, -949, 1542, -2052, 162, 799, -1400, 1105, 244, -43, 1347, -312, 566, 125, -656, 804, -1469, -238, 157, -1568, 1655, -214, -1173, 2599, -1016, 43, 2618, -2536, 480, 1460, -2541, 841, 287, -1709, 1453, 130, -13, 970, -10, 1230, -233, -355, 309, -1256, 411, -235, -1552, 1534, -990, -829, 2508, -1364, 388, 2355, -1889, 1218, 663, -2355, 1249, -514, -1904, 833, -963, -222, 947, -76, 1157, 15, 548, 450, -1175, 827, -594, -1273, 1152, -1596, -464, 1913, -1793, 732, 1399, -1600, 1837, 368, -1894, 1703]
1958A703k827M20J625k628J840L19j078J454q26O61q5j159J558j853K51J750k927
1975a802J807J138l418L775r31j987M033k487j160L332l511O12J620k238J009
1990b08K73m04J391j424J416q36o99K088k606P98J595l209K069L24k570L502j692
2007a92r79L126k528P32J512l081K029l42j782K223j478M7J116j295J750p18m0
2024A00J486k310J543J11k835L036j294j695L062j931l81K907k948J693J058k804
2040a202K463p65j835J955j209J62L51r18J953j634J052P65k010J663J64k504
2056a549K930j794j141K926k720L91K231k582K122j87j407K058j339k01J277k114
2072a099J309k66j097K141j847Q59J275k090K086n09j964K903k134q26K717k962
$$ y = [1703, -1124, -704, 921, -1707, 133, 452, -626, 828, 2, 663, 578, -581, 977, -876, -625, 1125, -1802, 5, 1143, -2275, 1500, 569, -1418, 2615, 128, -1032, 2300, -1211, -599, 1021, -1217, -208, 65, -339, 1052, -372, 1044, 208, -491, 1597, -1009, -211, 1384, -1825, 244, 568, -2002, 1500, -192, -1171, 1955, -573, 159, 1671, -1410, 619, 277, -1505, 718, -760, -713, 403, -892, 858, 140, 100, 1586, -724, 819, 930, -1905, 1131, -163, -1858, 1204, -727, -1108, 1799, -1149, 544, 1602, -1202, 1261, 496, -1339, 616, -593, -431, -80, -998, 955, -679, 373, 1138, -872, 791, 955, -1549, 1381, -413, -1554, 1372, -1348, -957, 1274, -1308, 814, 627, -780, 1278, -61, -262, 1015, -1099, 210, -56, -1153, 988, -859, 0, 1275, -815, 1271, 762, -1202, 1701, -433, -1259, 1458, -1504]
2088a504J261J262k897K443k18j230K073j330J10J000j832J423r25m01J417k013
2104a361J151P90j684K399j303m97K454k409O9J848l151K048M9k177K538q23o25
2121f84J834j396Q82M58j426J267j443L4R39j975J512O2j411K835j846p0K510
2138B082l049J392Q07k564K046q86j198K024j335M0J694j670J537n78n61J119
2154I00j462O40P70k129J793q76j010K303j758P58J694k852K176J29k381K725
2170A420j719o81J761k216Q46J120j751K015n22j96J074j703J212k76j303J864
2186I45k059K12J969k630J667Q62k512K666m17j657K859k435OJ336k006J425k27
2203Dr31J418j090N54J160j855J573n75p43J835k319M24J542k784K189M5j623
$$ y = [-1504, -243, 1019, -1878, 565, 347, -883, 1190, -140, -30, 970, -862, 561, -364, -765, 652, -1361, -210, 580, -1104, 1295, -8, -505, 1949, -460, -391, 1457, -1694, 354, 403, -1774, 764, -59, -684, 1150, -246, 636, 1094, -332, 935, -508, -474, 465, -1510, 2, 64, -1347, 1488, -358, -428, 2082, -967, 425, 1232, -1332, 714, -172, -1370, 654, -681, -641, 1053, -617, 920, 342, -219, 900, -562, 78, 848, -1281, 512, -364, -1374, 929, -829, -71, 1623, -1229, 947, 1076, -1305, 1420, -299, -980, 781, -1435, -589, 531, -1220, 795, 273, 77, 1151, -552, 660, 384, -919, 945, -1114, -902, 1067, -1563, 104, 966, -1546, 1120, 703, -954, 1905, -530, -524, 812, -1194, 231, 4, -927, 491, -599, -45, 1115, -740, 833, 258, -485, 1350, -969, -545, 997, -1787, 402, 447, -1176]
2220a176K371j195m64K164k211N09J107k197J395k13j018J244q74P36M60j022
2236c84R41o64k52J403j956R91O71k437J920o41j210K825j899K92J949k343J539
2253G45J94j584J439j286r4R81j586J108J95p72J356q63M44J260k438J435k69
2270B65j733K489j468o72K066j989P84J347k095J861l34j155J740j368kR57j392
2287f99O70J04p26J186q21N56M29j418K243j620p89K230k174j4J924k430J492
2304A43N76k064K513n39r49J435j356N17j09j204J480j018r5J404j906J272P39
2321H39j633K003j151n93J941k071L65P95j918J887m47j218K167j292O8J535j766
2338d89J064r0j190J372j262o6Q95j074J031j80q09J797j081L61J191k179J141
$$ y = [-1176, 1195, 0, -464, 1700, -511, -2, 1105, -1092, 303, 90, -928, 316, -558, 178, 638, -384, 557, -107, -359, 1044, -912, 79, 750, -1687, 233, -408, -1618, 1207, -692, -400, 1549, -794, 745, 939, -645, 794, -492, -586, 395, -1191, -83, 112, -660, 696, -167, 277, 1537, -901, 534, 265, -1468, 1021, -447, -1119, 947, -1042, -258, 1089, -1006, 855, 521, -634, 1106, -262, -264, 693, -699, -29, 75, -651, 535, -286, 270, 699, -719, 1524, -96, -885, 1345, -829, -843, 1081, -1349, 143, 719, -1345, 1168, 629, -320, 1115, -241, 276, 167, -1037, 443, -575, -670, 734, -1172, 100, 839, -794, 1209, 58, -535, 1406, -665, -300, 495, -1423, 464, 17, -1201, 966, -326, -258, 1277, -489, 575, 485, -705, 667, -595, -661, 234, -840, 191, 11, -798, 999, -82, 279, 1470, -709, 432]
2355D32J24j741J867j025r88K352j770M34J262j257P79n3p09J041r36L30r4j346
2373a298J894r06n49K041j867P58J432k612K160o38j265J750j398o83J860j823
2389a144J147O63j310J852j166j43J096j362R22l89r49J405j322K43J503k259
2405a213J715L68j838K226j056j175K746k908Q92R60j973J113L85j159J339n59
2421a37M10K13j039J129q55j60R96j454O89L83j818K325m06j084K199j520n36
2438f65K267k691J244K94j297J228k89j246J725q03J85P40j132J480j117O9J013
2455A005j928J139j03j626K496j436n21K407k149R11J346k810J918R5j614J413
2471E43j123j83J513j507P74L76r96J358p47M11K99j838J724j053n73K143k095
$$ y = [432, 556, -1185, 682, -343, -1331, 1021, -749, -315, 947, -310, 469, 416, -293, 748, -188, 142, 48, -1298, 596, -310, -859, 1182, -685, 73, 1505, -1107, 1053, 415, -850, 900, -498, -1181, 679, -1144, 3, 666, -644, 1208, 42, -101, 995, -367, 555, 166, -783, 622, -700, -457, 1046, -1213, 502, 870, -968, 1258, 202, -973, 1773, -1135, -243, 717, -1256, -143, 242, -917, 422, -137, 273, 486, -553, 576, -279, -439, 557, -897, -208, 175, -1643, 682, 276, -808, 1391, -129, -665, 1602, -1089, 155, 449, -848, 380, 91, -1155, 570, -233, -48, 692, -440, 1040, -77, -8, 1005, -923, 216, 113, -1513, 983, -453, -974, 1433, -716, 195, 1541, -1269, 649, 744, -870, 543, -580, -763, 750, -757, 17, 393, -603, 755, 8, 419, 718, -1120, 604, -449, -1022, 1121, -974]
2488i74L13K231k837J669Q54k285J909q22q32J509j526M71K72o34Q72n26k8Q53
2506D89j029J025L63j382J726j587l07J831k637J343J385k744J687L99j612K263
2522A213p72j116J896j711M53M63j343J000k37J20M31n87J060p28m90J343j477
2539d82M13J169k422J280O99k158K424j114j149K776j567j74J299j682P92L94
2555D98j072R33r18L95L0p62J955j433J47J663k191R20J038k611J877n44j645
2572a720K773j382n87K301k312J022J203k181J529l38o74R26r44K78k11l28J255
2589F10j070N62Q22j681J426J66j667J855j130j057K303k020L3J665k001J359
2605A75P54j772J833q80j81M13m79K27k00p46J150j229J098R8j117J718r27r34
$$ y = [-974, -661, 1570, -1267, 402, 1256, -1029, 880, 58, -774, 735, -791, -320, -48, -682, 190, -336, -364, 489, -540, 485, 848, -534, 1192, -395, -702, 1129, -1508, -165, 1220, -1524, 163, 562, -1050, 1213, 441, -675, 1221, -490, -37, 426, -917, 83, -154, -34, 397, -190, 870, 142, -348, 995, -482, -69, 1100, -1322, -42, 657, -1501, 923, -191, -1340, 1436, -131, -305, 994, -688, 104, 498, -574, 359, -559, -164, -134, -896, 1059, -374, -227, 1436, -755, 165, 1203, -1408, 469, -75, -1720, 1053, -329, -916, 1385, -927, 95, 1298, -883, 646, 308, -366, 560, -384, -106, -317, -645, 610, -460, 102, 924, -757, 669, 835, -832, 1023, -107, -1164, 1139, -881, -848, 817, -1184, 175, 929, -843, 990, 110, -71, 342, -137, 90, -110, -856, 294, -935, 163, 261, -856, 862, -65, -999]
2623i99K387k093Q9J598k194O65J171j588J582l27j000J715r38j88N87j029O78
2640A16k52n77R42j198J016N9p55J637j305j34J991k324R10R58k517K050j06k030
2658a519K145p86m56J606j158K08O47j034O61k98k27N42j371J118k61n59J822
2675A080j800L29J572k123J073P04j955J700o51r85J825j559O5J606j452N71L79
2692C79p55P60o83M97j9o46Q20m49o90J549j563O97J347k250J481M94j780J962
2710A151j441n23J786j997L44J260j612J381k87o52Q76m66O36k00r89R71r86K34
2728e14Q87j348J201J00j445K255o42j097J951j884J83J013j464Q46L61j323J114
2745A94o61K88O59j052J107n86j76R66j146L08P07j160R56j85j403K293j665J47
$$ y = [-999, 1388, -705, -616, 982, -1212, -547, 624, -964, 618, 291, -709, 1006, 68, -120, 467, -562, 116, -136, -713, 229, -969, 47, 106, -649, 988, -317, -451, 1540, -784, 126, 1084, -1433, 617, 511, -1519, 626, -160, -616, 990, -168, 40, 687, -347, 314, 16, -211, 331, -1040, 78, -183, -742, 1080, -720, -391, 1181, -942, 131, 835, -1120, 580, -71, -1056, 769, -790, -725, 881, -571, 0, 379, -376, 384, -299, 198, 179, -467, 353, -96, -786, 763, -800, -103, 1244, -1006, 475, 969, -811, 1151, -290, -813, 973, -1024, -680, 580, -1032, 349, 62, -590, 286, -180, 456, 256, -733, 238, -748, -514, 373, -975, 226, 326, -1119, 1136, 494, -603, 1348, -536, -353, 660, -804, 42, 403, -920, 194, -467, -179, 480, -572, 535, -51, -227, 739, -407, -99, 608, -552, 404, 219, -1184, 1109, -556, -409]
2763d09J567j356M23M33j220J008n74o10J017q32M30P25j077P43k06l48J124j531
2781f93J277j57j335J370p47o52J885j521P25R69k046J556J65j532J358q70l74
2798f22J099j025M38K49q23J203o03J37N34q83Q12j51j142J480j214l34J487j635
2816i93O78P64j346J575l74r77J529r00j85P11q94M36l04n81J444r03J57N34n75
2835b04Q96Rj311J299j451L07J074j785J357K62j375J908p41p93J593j296O53
2852D02J28j223J025p65j48R26j407J163M55j173J671j333r9J389j790O26N01
2869C48j271J314n44p29J573j374Q95P10j011N09J88j184J166r48M0P16j016Q77
2887B59O1n87R49j026M31Q59j626J211k5j227J388j011l63J435j453P25O88j193
$$ y = [-409, 1158, -198, 225, 658, -562, 446, -128, -738, 279, -553, -123, 602, -475, 268, 62, -286, 838, -693, 584, 427, -908, 462, -285, -937, 948, -573, 152, 1121, -925, 631, 796, -736, 622, -248, -622, 477, -548, -110, 139, -684, 519, -84, 53, 587, -296, 516, 365, -777, 703, -511, -845, 642, -993, -315, 449, -897, 678, 304, -673, 856, -44, -229, 482, -412, 24, -280, -861, 583, -320, -163, 371, -204, 692, 701, -610, 689, -762, -455, 619, -1166, 191, 453, -922, 986, 245, -548, 1045, -251, 402, 530, -693, 332, -433, -581, 345, -1062, 101, 556, -617, 1054, -279, -378, 1011, -779, -153, 348, -923, 391, -153, -882, 691, -683, 212, 922, -89, 420, 608, -576, 590, -358, -318, 398, -618, 259, 320, -267, 682, -344, 87, 946, -680, 531, 506, -721, 667, -344, -707, 728, -725, 0, 688, -505]
2905e05J097k36n05R80j162J44P08j414J308n99m44J434j282P07N53j484J200
2922E00k43p46J214j460L43Q78r30R28m20r21J754p60m94R07j075O07J84j019
2940g53J477j381J69J031j197P40L17r19J381q46k72J020j187M31L27j363J205
2957A80q7r04J330j037M80M48q62R44k04p56J300j194o1Q65j259J132j48o89J140
2976F18p70J0J213j649Q75l9q83Q68o32j2J080j116N22K74o79J057o35o01J053
2995E54j189N50R0j107J686q08l27J135j117O91Q67j546J250o39o04R55q27k30
3013f16R18r65Q82j5q62J340p21j8J041j458O52m0r92J276p68L8R22j219Q40L43
3033E78j069J110m28o40J137j353O31M91j310R86k87j77J045j187P68L40j118
$$ y = [-505, 592, 356, -149, 831, -331, -187, 521, -893, 415, -184, -628, 806, -476, 231, 784, -700, 500, 257, -489, 725, -735, -392, 486, -444, 484, 64, -857, 897, 137, -357, 550, -525, 82, 266, -753, 724, -657, -488, 543, -654, 86, 403, -516, 865, 19, -253, 767, -420, 11, 338, -1025, 180, 93, -811, 519, -518, -38, 410, -452, 492, 288, -468, 832, -362, -423, 442, -817, 315, 167, -522, 618, -152, -142, 1071, -578, 297, 258, -625, 243, -389, -401, 679, -437, 85, 359, -320, 737, 102, -499, 554, -635, -85, 5, -1102, 584, -224, -551, 584, -533, 158, 1025, -521, 729, 90, -514, 441, -386, -616, 302, -663, 219, 204, -658, 682, -39, -57, 984, -474, 178, 138, -854, 422, -346, -308, 614, -605, 235, 578, -491, 619, 191, -449, 688, -665, -34, 457, -853, 133, -154, -331, 714, -473, 295, 635, -483]
3050d83J166n69r27J379j231K40Q94j568J375O5q54J336j006k3R25j472P97L00
3068C44j439J711j249L16P92r92Q14J11q01J090o10n64R94j093M67M17j183R89
3086A14k70r1R78r91N59L81j335J054l91n40O07q38M34N07r10J035j94q40J486
3105G55j081N74O98j604J219l95j235J475o03n44R24o20O10L19j141J403o64m38
3123c48O69j106P10M31q29Q53o45K8Q78p97L99M89j413J474p27n25J004p65J99
3142b1K60j000J233j09n47P35o58J69K69q27R23m76l55N60l62J12O77j265J236
3161E54l30m18R67j144k1R51q52K80K09j181J033K5l90Q95r36N85L36j128Q34
3180B69n81q9O60q18O46J41r83J096k27n87J113r24L36O01j011Q4N60q61Q18m15
$$ y = [-483, 683, 114, -813, 566, -665, -425, 469, -1099, 276, 341, -513, 823, -183, -206, 719, -753, 44, 344, -1095, 616, -633, -317, 475, -517, 297, 408, -393, 697, 87, -477, 517, -576, -109, 308, -875, 114, -156, -247, 731, -260, 299, 680, -655, 399, 8, -532, 75, -763, -329, 178, -732, 303, 109, -731, 755, -326, 248, 946, -658, 561, 166, -1069, 406, -197, -741, 183, -437, 173, 492, -649, 754, 90, -348, 321, -785, -75, 356, -473, 380, -265, -237, 641, -156, 243, 732, -681, 793, 66, -459, 545, -220, -21, 239, -761, 472, 363, -184, 551, -107, 62, 331, -496, 427, -49, -404, 156, -206, -94, 583, -682, 554, 224, -194, 773, -371, -392, 559, -293, -13, 196, -985, 48, 73, -317, 578, -358, 227, 563, -565, 269, -312, -401, 259, -559, 87, 228, -755, 341, 114, -473, 640, -284, 52, 653, -358, -274, 286, -575, 243, -172]
3200a72q9M67p44Q63J10n82O92j066K43O69j034P19k92l51J366q49l87J259j283
3219d61N05N12j184R75l41p25J314q36k2M02o76R08j24n90P77q85N51K36q11Q05
3239C30n33l88P33p65N11Q36j442J586k86j171J238o93n00Q04o38M6N51q00O86
3258A05l52K46N41n23M58j41p95J134q17m39J083j395R57M75j197J162l52m31
3276b81J290j375L28O66j317N66K26o27Q11k32q2K88o48R00l01n96J241j005j56
3295c04R74j697J267M0p60J175p29l37J258j057K16K08p32O32j86k97M79o38N07
3314A9K04o21J078r21J22Q10r34P7O10p14N76m26j018J670q86nR64q43M93L4j066
3335g77J084j38n84M99m64K70J90l02N40n36J72M53p29O06K0n31N24o95q7J107
$$ y = [-172, -261, 206, -538, 325, 435, -147, 545, -521, -278, 391, -643, 76, -216, -567, 799, -50, -437, 822, -461, 44, 556, -628, 347, 6, -719, 595, -241, -263, 139, -537, 371, 247, -343, 434, -451, 100, 336, -475, 330, -203, -591, 142, -623, -112, 724, -718, 868, 582, -589, 649, -44, -544, 260, -378, -332, 219, -581, 105, -247, -1, 540, 17, 475, 334, -461, 673, -144, -583, 500, -895, 62, 537, -660, 502, 150, -281, 1009, -366, -38, 628, -689, -123, 103, -524, 287, 55, -27, 261, -387, 513, 212, -384, 857, -148, -304, 670, -1027, 240, 280, -480, 695, -34, -371, 887, -170, 46, 254, -478, 154, -32, -329, 150, -488, 19, 223, -398, 680, -241, -119, 691, -243, -166, 444, -270, 306, -120, -1138, 532, -354, -359, 605, -238, 255, 289, -777, 307, 169, -415, 84, -380, -110, 80, -222, 318, -218, -46, 407, -322, 284, 304, -227, 297, -398, -485, 622]
3355F22j226N90O47j392J192o9q09J108n06q0L54r03O50l23K7M00p15M56J38o37
3375d76R03m25m73J149j141p9J024j172O63K83q71J047j46j80N40j065M66J54
3393B01o68Q05p43K43N88r34O92k41n20J325q10l57J084j447R06N69j418Q84r6
3412F3m45O27l41oN79o23P32l37p23J108r65LL93n90Q63m96R5P33r12K89L39j038
3434f52Q37L21r51O49n72j20J261j032L7L52l64O37l01r2M96o26K4L96p40Q51
3454D11n50k47O48p50M48M83r04J141n30m36P07n52l14O94n26J55K01m41Q82o76
3474a56m6O47o41N29j89m64N82m19M3K58o41L73M82r36J084l30n41J227j155J91
3494a02N26j077Q73p6k71M84k42j58N04o91N87m09k58N04p51N89K86p81O66k01
$$ y = [622, -604, -14, 633, -759, 433, 364, -445, 663, 157, 77, 431, -472, 178, -145, -118, 282, -433, 23, 161, -476, 427, 2, -471, 678, -463, -542, 482, -690, -27, 256, -615, 432, 286, 106, 646, -419, 47, 201, -467, 338, -405, -162, 426, -508, 184, -57, -577, 748, -62, -419, 665, -782, 124, 693, -725, 159, 63, -382, 245, -96, -102, 477, -146, 586, 249, -474, 634, -331, -328, 65, -525, 338, -158, -63, 670, -242, 47, 386, -652, 185, 506, -445, 204, -368, -488, 773, -259, -222, 130, -234, 403, 102, 10, 506, -120, -96, 300, -440, 411, -139, -386, 262, -488, -40, 443, -461, 680, 150, -286, 421, -131, -445, 249, -277, -122, 79, -362, 520, -156, -202, 445, -196, 333, 144, -320, 262, -157, -114, 144, -497, -124, 358, -578, 506, 176, -365, 862, -293, -102, 424, -653, 220, 144, -127, 357, 115, -43, 461, -230, 357, -52, -310, 194, -557, 32, 318, -463, 203, 2]
3514Bk88Q17p91O01K15j062P37J8q71J064m08l63Q02o63K64J27m70Q90r23L95
3534I3M53q55L69J26r73Q54k89k58J072q25K56N46p55P09n57l76Q04l85j80N08
3554C37j036P36O1m52M70j66M45m4p00O85l14l07M78o32J93L83k57l9N27q36R79
3575E11k3r92J110p28K76O0o57P67n42o8N07l13J47K32q25J123n81n97J104q05
3595b94M01Pm70O18l18n06J140o68J03M99r38P92l95k51L58l08l83R56n09L57
3615A91J04n04O71n25k03P48j082N84K04q23R34k67l72P50m74K03L08p81K03J06
3635b5m73P35n11J42O69r37N07j58j16Q55q47K1M72q93J067o07l08P35q79L28
3655b23O69q85O48j1o42J018o89R9K06p23N26L62r93Q90m35j74O92m39M04j8m93
$$ y = [2, -286, 531, -260, 341, 556, -506, 231, 249, -622, 442, 34, -329, 473, -190, 74, 201, -269, 621, -302, 93, 546, -309, 60, 186, -787, 67, -222, -480, 592, -233, 23, 569, -186, 523, -34, -410, 394, 9, -171, 337, -699, 37, 98, -354, 116, -50, 395, 351, -349, 336, 22, -285, 193, -439, -246, 137, -120, -159, 368, -468, 511, 488, -504, 606, -122, 154, 214, -443, 324, -218, -286, 221, -92, 55, 287, -538, 585, 4, -593, 511, -294, 107, 114, -356, 262, -56, -562, 578, -90, 13, 512, -426, 366, -29, -280, 78, -230, -613, 343, -166, 191, 295, -209, 462, -63, -266, 482, -600, -16, 188, -635, 299, 32, -340, 410, -64, 139, 447, -334, -131, -25, -498, 237, -274, -132, 537, -400, 107, -51, -167, 688, -159, -138, 334, -559, 508, -99, -407, 328, -551, -223, 446, -439, 209, 198, -444, 574, -115, -16, 190, -533, -7, 355, -638, 252, -183, -357, 335, -104, 300, 282, -211]
3676b11P14l65m25P56q66K81M29q04Q37m23l45Q30o14P10j15n70L65k71p0L33
3696A76l35JL82k84K13Q3o79Q21p24L90M6p57P43Q6p74J134n41k11P86p09lL12
3718A56n27M75J44p96Q67n83L02J7n26P29j45m06Q19j015O03L36j144P80J91p13
3738d36N27l69J34M94n39j7K96l29O92k54n69P93q49K86M9l10O50l89k15P32m60
3759h3K00K98m35L47k06l80M02o26L06J29k72M28J69l43J87j63K22J44p44O91
3779B71j70p92O41m46M90J91l44M96j07m12Q17o60o03J056p85N82l37n52Q46m62
3799b80K16M40p03M04J95p68P82l48j30L62n36K81M80o15L96j73k60Q03n11j04
3819f9L52p29N92l47j4N09p28M02L42m31L49m1m65R25m29l18L49p89L76K76n31
$$ y = [-211, 503, 138, -287, 469, -397, -116, 313, -491, 346, -77, -422, 408, -206, 504, 389, -181, 184, -87, -157, 176, -159, -158, 224, -60, 153, 236, -443, 378, -346, 44, 90, -667, 76, 162, -612, 522, -19, -230, 556, -153, -156, 156, -371, 104, 248, -548, 319, -264, 38, 55, -471, 258, 113, -293, 526, -489, 114, 450, -694, 86, 277, -436, 91, -278, -144, 350, -189, -206, 90, -239, 453, 199, -370, 423, -426, -140, -91, -401, 249, -140, -355, 377, -83, 117, 415, -20, 327, 121, -259, 143, -483, -177, -48, -320, 108, 277, -66, 121, -42, 180, 324, -420, 271, 101, -691, -50, -496, -6, 185, -159, 337, 230, -182, 635, -25, -628, 428, -357, 225, -112, -664, 182, -280, -64, 376, -327, 77, 272, -496, 286, -62, -192, 170, -366, -85, 395, -220, 176, 3, -257, 546, 35, -69, 283, -446, 146, -201, -215, 294, -434, -32, 310, -121, 228, 187, -278, 647, 218, -100, 249, -540, -164, 112, -419]
3840d19O96m44j0Q51j194R63Q8p34L73j94l34N61n36K47M64q79O47r5N9K28p58
3861d20L02K35m03N12j08p52R66o83L56N14o47j2K54j65M53m76n6L00n55N03k82
3882a64n62Q84n22K67N97r18M82J18p79R80l60n42R25q10J11O56p78M68K07k80
3902b0M14o79M77K74r43Q86m89k4L78o04M87q7m39O30l34j14M85n31M12K20o69
3923b70N22k56m48Q32k84j60K75m42L44q9k48N35n85J95M87r59P08J27p73O78
3943A89j37k83P66q29J61N62q14O13m54k18P19n51R3J27j74O31l44l19P25q42
3963c79M49L05p59N71l09m01P16n90J20P32o95P27l50l70L14j65l42M06m95L04
3983b11M12l20O09m41k70O35p03L73J81q75Q56o04K01K62o54O24J69m80M93l19
$$ y = [-419, 277, -167, -177, 674, -520, 443, 531, -203, 170, -24, -358, 203, -333, -86, 378, -501, 146, 51, 110, 338, -420, -118, 117, -286, 226, 118, -634, 332, -351, 5, 519, -128, -140, 114, -51, 402, -74, -130, 170, -385, 118, -164, -726, 158, -364, -97, 500, -418, 64, 182, -597, 383, 23, -519, 406, -404, -293, 363, -415, 53, 260, -20, 394, -285, 192, 466, -477, 409, -80, -104, 274, -330, 157, 70, -369, 261, -73, -187, 298, -233, 179, 399, -270, 252, -4, -452, 380, 96, -64, 211, -231, 113, 24, -224, 311, -274, -79, 408, -551, 157, 284, -489, 189, 52, -231, 535, -294, -133, 429, -385, 228, -226, -444, 275, -276, -183, -56, -230, 401, 57, -262, 463, -379, 70, 375, -384, 187, -122, -523, 193, -397, -277, 455, -240, 487, 137, -233, 81, -84, -426, -20, -515, -211, 201, -119, 490, 49, -221, 414, -289, 84, 265, -610, 246, -358, -157, 105, -549, 75, 244, -236, 257, -62]
4003f2l59O79l53r0K69n57M64k6l68P38j31o53P28j61l3k96j10O54o11n1O81n47
4025a95L36J33m28M10j90l53O48m13r3K83l05L59j70l81O93m19N41k25m00O80
4045E11l65n41R81o04k62N64r15R72m96J48O35o87J24K17l20K7Mj26R6j83jM36
4067B15o35O91k9p24P47J5j62L10o56M70j36n57Q97m56j83Q33n92k40M85n67J76
4088i8K33l16M42k71n6L96o76N59l74l08J140n48j50L51o71N33L33j022Q47m48
4108a04j11K70l98J77K74l33M97m51J3M10m35K86m5l37N24l17Q2j97M2K10l2q7
4130f2J44j7k35L56k55j28N52p74O97l72j91P39l63j34L82m40L25j30m82N08m51
4151c31K08M80o30K73Pk20Q67n58j02K91o23N27R7r29J063n79o2L18k21J63M0
$$ y = [-62, -421, 258, -95, -185, 84, -473, -9, -35, -403, 335, 204, -449, 279, 118, 85, -211, -321, 333, -278, -329, 352, -195, 141, 274, -154, 256, 66, -287, 361, -52, -145, 138, -167, 192, 22, -359, 334, -85, 456, 231, -169, 511, 146, -395, 586, -18, -280, 284, -631, 341, -155, -7, 628, -59, 65, 282, -38, -11, -7, -133, -37, -220, -221, 215, -420, 271, 242, -482, 265, 280, 118, 428, -228, 242, 106, -451, 446, -10, -193, 640, 48, -192, 293, -274, -98, 135, -181, 261, -10, -66, 330, -346, 213, -161, -469, 671, 123, -27, 324, -347, 186, 519, -503, 344, -104, -215, 55, -343, -166, 108, -225, 272, -179, -166, 244, -191, 95, 50, -287, 237, -80, 2, -195, -153, 57, 25, -62, 82, 65, -170, 186, -69, -197, 355, -419, 278, -94, -285, 454, 91, -43, 339, -101, 224, 94, -388, 120, -331, -123, 357, -273, 0, 7, -213, 654, 96, -6, 285, -338, 189, 286, -643, 420, -159, -221, 97, -124, 39, 79]
4172G9l27K93L5k94M41p77O44j89k72O73m95k24P56o51K67M33l48J81q3l54L79
4193A67j38l4J43m23K82L8k08O72o29j13M90m93O58qp29O28o03Q8J35k09L48L23
4215C85o21O24l84l29R84q35k1L45p41N98J39l50O63o25j33N20n05M07l39K4J06
4236h8j59J3O12o58L51J64m48M42n01K67M96r37L06K14n34N94l31Q5M28k57O1
4257A20K71n81M71k68l11P98p55K99Q6o12N98l17L3M40k24J48N1o98O07j74l10
4278c28L84k88l7N18l47J95l3l54P66l92m15M12m41N77j15m91M30k55O4M90m42
4299a02p2M75k86K83m05k95P68m11o6J17j09M72m29K82Q7n10K52J83m4j50k58
4320b18j5O08p35L50K04o24O97L5l65M68j85l76M82q16L86J50k25J19M7j28L55
$$ y = [79, -248, 45, 80, -214, 227, -550, 94, -95, -367, 306, -189, -413, 343, -308, -41, 392, 44, 225, 142, -212, 167, 29, -5, 138, -285, -3, 35, -173, 499, -130, -243, 247, -246, 412, 404, -325, 303, -300, -212, -77, -286, 62, 385, -236, 388, 4, -325, 659, -176, -197, 148, -593, 5, 144, -206, 457, -168, -301, 219, -286, 121, -218, -194, -88, -247, -234, 378, -280, 71, 235, -213, 229, -272, -5, 491, -446, -140, 74, -460, 134, -197, -112, 316, 59, 120, 391, -190, 281, 13, -298, 500, -255, 44, 130, -482, 116, -201, -168, 272, 48, 196, 247, -451, 156, -18, -328, 56, -232, -269, 249, -98, 97, 64, -290, 476, 84, -331, 81, -360, 217, 102, -389, 41, -214, -150, 340, -102, -174, 301, 15, 298, -107, -402, 366, -45, -111, 6, -103, 369, -60, 222, 309, -201, 51, 234, 190, 40, -218, -233, 375, -360, -10, 194, -430, 267, 302, -63, 405, 220, -156, 326, -490, -104, 46, -179, -60, -13, -141, 214]
4341B14j10J89k14m32N92j20k34J61l61K45K10m15N28j25n81Q83l99L6J26o57
4361d64O47k59m50M21j25J33L46n10O30m24p3L14k17m1M15p52O95K7p23M94j68
4382h4K6K72l00j2M15m34K95P1m59O16o23K64K24o38O66k67l94P60o16j6K76l39
4404b97Q37m89m40M08j89J26M33n27L8L8k09M71l82k78N97m04K36L29n31M79k44
4425Bj76M41L3j17Ll65N21n64j99P38o14J40L77m43K49K0j17M11n15K62L0l17
4447b00n8K42k10N18m96K7M23n05N91q6l18K92k67k30M98m84L50P4k50J64l47
4468b72J48L97n65L41L44r54P11l0k48L72m43J95M02p48M18L6k87M18k01j17K4
4489e9J61r9j09k32M52k23r6J52l8L40j75l73N66m70K20L92n10k6O7j85P40m41
$$ y = [214, 104, 293, 79, -353, 239, 119, -115, 46, -315, -70, 140, -275, 253, 128, -453, 430, 31, 67, 193, -464, 183, -76, -526, -105, -230, -97, 249, -261, 369, -55, -128, 186, -31, -72, 343, -409, 286, 313, -410, 84, -84, -58, 214, -86, -98, 317, -117, 178, 249, -210, 406, -217, 47, 271, -367, 299, 32, -362, 398, -218, -234, 42, -297, 540, 51, -389, 19, -170, -44, 389, -138, -100, -62, -271, 200, -182, -460, 137, -267, -31, 298, -233, 246, 2, -174, 267, 300, 183, 186, -179, 342, -222, -421, 317, -297, -157, 220, -223, 26, 46, -71, 340, -175, 87, 117, -200, -258, -16, -226, 292, -204, -177, 246, -259, 332, 246, -72, 220, -47, -277, 221, -263, 87, 161, -89, 75, -272, -124, 273, -292, 49, 393, -561, 150, 120, -128, 244, -199, -4, 398, -350, 68, 104, -183, 235, 34, -83, -59, 102, 3, -106, -338, 114, -109, -205, -53, -91, 249, 74, -299, 267, -203, 17, 409, -101, -127, -60, -245, 495, 54]
4511E4j69M09o71M69m5k66K58r9k2O06q62L04j4k71O71l92K5K09m90L14J60k57
4533g9PJ27l47M24l32J59L69n59N33l2n76P24q02M58J20m33J59O6k01O60l34j74
4555f3M35n23M86k99k11M31n64J10K86k71q0N01o63P43k27j34R0j49J77m2j11
4576g8K28kl69N64m26O4J19j98M01k02k41K10k16L8J52j58M9J17k45N85m79J08
4598B1N5l21M24n0k55L10k65R2J77l77j18O40j91J79l78J80K09k62O5P3n70M10
4620D8j98r4M78m66N09o7l67M40k50j8L75n54K10J00n51L52N0k61O66l83k74N16
4642B61n91L01J08j09K11J76n03L07j31j54M08p02O58k81K5N39n20K1K08o30K70
4663a28L69n37N79k27N5R5n01M97K93n40L35n27j67P3P2K84J30o49L43J36j0K04
$$ y = [54, -115, 294, -377, 92, 47, -219, 39, -60, -82, 524, -338, -34, -48, -319, 352, -40, -15, 194, -296, 18, 178, -79, -72, 55, -292, 132, -200, -41, 328, -231, 302, 270, -306, 418, -384, 74, 194, -239, -80, -14, -215, 445, 111, -63, 372, -151, 335, 36, -175, 256, -308, -198, 88, -183, -263, 238, -425, 318, 91, -43, 47, -102, 75, 33, -78, 150, 148, -221, 343, -83, -19, 100, -98, 303, 101, -140, 70, -146, -108, 44, -114, -65, 52, -193, 392, -87, 21, 76, -245, 179, 129, -126, 184, -81, 11, 188, -189, -307, 333, 142, 321, -57, 123, 332, 70, 135, 208, -362, 48, -150, -244, 234, -232, 277, 210, -157, 283, 33, 15, 390, -164, 46, 146, -405, -53, -3, -264, 402, 19, -255, 261, -330, -29, 79, -30, 181, 357, -146, 161, 30, -124, 284, -418, 240, -41, -16, 523, 3, 24, 232, -398, -128, 241, -296, 283, 56, 111, 206, -295, 202, 495, -45, 290, -237, -404, -331, -259, 25, 155, -494, -151, -15, -25, 179]
4685A79k26M7P4k06M13n26k97J056o71J10K67m37L97q0l45O87l64j2j76k92K93
4706a09K16l19K05M0N2m7k27L72l37J1J67%j4R1k24J26J49j55L18j64l46N35m91
4729a51L09rj12pn1k0k8L8k28L34j32p7P3PM37n40j06K86j63N07n89O3L86k16
4753A1J3q3m01P32rm02K90j28n56O37m24M56j66q7L93o1l2l1k95K68l1j31M24
4776C87p11k4N42k17p4M61n52L36n4j30K39p09M23K83k29Q2j10p5K28P9J76k23
4798A28k93L13j70j06O8m2J23K43n42O27p3m93M33m72j2M30l62J64O8j50O8j34
4820a84J30L37m66O8J45r4L93k77m16N55l48K93J34m20L43k23k39M22J2K19k77
4841A07o07O56j80j47K14j41J97J24n17J97L9o0L72j68l38L87l00K04j15k03L44
$$ y = [179, -47, 0, 74, -132, 281, -245, -542, 514, -157, -47, 220, -217, 180, 100, -245, 442, 78, 66, -110, -402, -109, 107, -212, -7, 33, 85, 38, -189, 183, -154, -143, 24, 24, 10, 101, -123, 3, 152, -3, 315, 151, -195, 340, -151, 158, 149, 37, 30, -21, -41, -69, -31, -259, 75, -57, -134, -61, -54, 383, -157, -263, 23, -140, 367, -222, -159, 227, 11, 24, -59, -460, 272, 263, -139, 151, 23, -533, 104, -320, 136, -30, -117, 276, 215, 183, 152, -143, 125, 94, -37, 387, -324, -348, 194, -23, -97, 364, -188, 148, 94, -36, 203, -506, -83, 200, -29, 53, -57, -132, 96, 175, 351, 128, -165, 148, -22, -128, -60, -102, 21, 264, -278, 349, 276, -217, 216, -256, -268, 162, -200, -36, 32, -118, -50, -184, -54, 283, -183, -115, 30, -64, 329, 52, -364, 191, -157, 136, 270, -150, 193, -30, -269, 153, 165, 384, 107, -500, 156, -24, -171, 43, -98, 99, 223, -294, -97, -58, -118, 254, 86, -252, 135, -165, 39, -76, -279, 65]
4862F5l31l6N16k24JL83k29l85J94K7M07n08J09K42k95K86l66R4K81n40N02K26
4884D19m24q2q1O7K25j71LJ17j44jJ76j79L43j16q7j81J57k60K32k26J05K92m22
4907b38L78k37K9K90l28K88k63L62j94m62M37p2qj8J58j83J66o7J42l14r9N45
4929C12k89l50M57m12J17L53j47j07j50J6M48o87L50K50k11J6j19o4N57l41m2
4950d3L94o55L26J76k05J28J08m1k18k75J81K80r8J73k04j55K11k54J06J76l05
4971a94J61j03k38K81o4O2K15k16L30n19L01j3j29J13q2J38Q1j38j98K40n8m01
4993d31N02k8J10N7m29K72p9k2j76j47L3N76l56J18J0j58K59l88L22k5j25J87
5015H2j96j02M95k09l61N15l1l14K29m91M34J05k99O6m61P94l16n5M41m41J4L47
$$ y = [65, -266, -302, 214, -10, -9, 374, 145, -240, -46, -19, 388, -120, -11, 231, -64, 222, -144, -50, 231, -309, 193, 419, -5, -87, -168, -101, 124, -47, -44, 73, -71, -72, 104, -75, 268, 152, 65, -116, 41, -219, 13, -213, -108, 184, -238, 140, -97, -68, 222, -106, 182, -81, 281, 87, -375, 62, -10, -18, -36, 122, -61, 105, 38, 180, -134, -233, 312, 23, -327, 130, -282, -165, 188, 41, -66, -216, -200, 248, -439, -89, 161, -50, -34, -153, -217, 340, -1, -43, 351, -304, 22, 198, -7, 121, 229, 188, -30, -305, -124, 156, 58, 231, 27, -128, 83, -171, -65, 111, -194, -33, -136, -374, -93, -157, -95, 120, -96, 234, -285, 16, 3, -126, -13, -95, 43, 124, -14, -212, 28, -30, -431, 71, 43, 153, 210, -219, 53, -26, -48, -224, -371, -338, 238, -118, 0, 10, -148, 111, -277, 45, 20, -105, 82, -114, -216, 279, 70, -291, 224, 193, -121, 108, -383, 51, 156, -143, -77, -538, 256, -60, -115, 326, -115, -101, 246]
$$ [...]
8191e5
##END NTUPLES=NMR FID
##END=
