##TITLE=1H_75-2022
 CDCl3
 8 sc, 
 19.09.2022
##JCAMPDX= 6.0         $$ Bruker NMR JCAMP-DX V2.0
##DATA TYPE= NMR SPECTRUM
##DATA CLASS= NTUPLES
##ORIGIN= UXNMR, Bruker Analytische Messtechnik GmbH
##OWNER= root
$$ XWIN-NMR		Version 3.5
$$ Mon Sep 19 14:00:42 2022 Russian Standard Time (UT+4h)  she@DPX200
##.OBSERVE FREQUENCY= 200.1313499994
##.OBSERVE NUCLEUS= ^1H
##.ACQUISITION MODE= SIMULTANEOUS
##.ACQUISITION SCHEME= undefined
##.AVERAGES= 8
##.DIGITISER RES= 18
##SPECTROMETER/DATA SYSTEM= spect
##.PULSE SEQUENCE= zg30
##.SOLVENT NAME= CDCl3
##.SHIFT REFERENCE= (INTERNAL, CDCl3, 0, 15.7348)
##AUDIT TRAIL= $$ (NUMBER, WHEN, WHO, WHERE, WHAT)
$$ ##TITLE= Audit trail, XWIN-NMR		Version 3.5
$$ ##JCAMPDX= 5.01
$$ ##ORIGIN= Bruker BioSpin GmbH
$$ ##OWNER= she
$$ F:/spectra/data/she/nmr/H-F/1/pdata/1/auditp.txt
$$ ##AUDIT TRAIL=  $$ (NUMBER, WHEN, WHO, WHERE, WHAT)
(   1,<2022-09-19 13:59:32.10 +0400>,<she>,<DPX200>,
      <created by zg, POWCHK disabled, PULCHK disabled
       configuration hash MD5:
       00 E9 B6 7A A2 85 ED C7 34 08 36 98 17 FE 4E 26
       data hash MD5: 16K
       32 FC E4 52 4E C6 51 87 6F B6 65 64 51 E0 A0 59>)
(   2,<2022-09-19 13:59:36.04 +0400>,<she>,<DPX200>,
      <Start of raw data processing
       efp BC_mod = 2 LB = 0.24 FT_mod = 6 PKNL = 1 PHC0 = -18034.51 PHC1 = 7.400691 SI = 16K 
       data hash MD5: 16K
       2E DB C9 77 95 A3 F9 6C DD 93 2C 47 0E 94 00 A4>)
(   3,<2022-09-19 13:59:56.04 +0400>,<she>,<DPX200>,
      <pk PHC0 = 0.6373414 PHC1 = -0.2 
       data hash MD5: 16K
       77 9E F4 B6 1E 20 56 A1 0E D4 D6 3A BB 8C 78 E1>)
(   4,<2022-09-19 13:59:59.67 +0400>,<she>,<DPX200>,
      <abs ABSG = 5 
       data hash MD5: 16K
       17 A9 6C 11 18 3A 34 41 41 B1 6C 14 9C D2 94 5A>)
$$ ##END=
$$ 
$$ hash MD5
$$ 14 EB B8 C9 C6 A2 CF D3 30 9E 30 BD 32 BF C0 DC
##$RELAX= 
##$RELAX= 
##$RELAX= 
##$RELAX= 
##$RELAX= 
##$RELAX= 
$$ Bruker specific parameters
$$ --------------------------
##$DU= <F:/spectra>
##$EXPNO= 1
##$NAME= <H-F>
##$PROCNO= 1
##$TYPE= <nmr>
##$USER= <she>
##$AMP= (0..31)
100 100 100 100 100 100 100 100 100 100 100 100 100 100 100 100 100 100 
100 100 100 100 100 100 100 100 100 100 100 100 100 100 
##$AQSEQ= 0
##$AQ_mod= 1
##$AUNM= <au_zg>
##$AUTOPOS= <>
##$BF1= 200.13
##$BF2= 200.13
##$BF3= 200.13
##$BF4= 200.13
##$BF5= 200.13
##$BF6= 200.13
##$BF7= 200.13
##$BF8= 200.13
##$BYTORDA= 1
##$CFDGTYP= 0
##$CFRGTYP= 5
##$CHEMSTR= <none>
##$CNST= (0..31)
1 1 145 1 1 1 1 1 1 1 1 1 1 1 1 1 1 1 1 1 1 1 1 1 1 1 1 1 1 1 1 1 
##$CPDPRG= <>
##$CPDPRG1= <>
##$CPDPRG2= <>
##$CPDPRG3= <>
##$CPDPRG4= <mlev>
##$CPDPRG5= <mlev>
##$CPDPRG6= <mlev>
##$CPDPRG7= <mlev>
##$CPDPRG8= <mlev>
##$CPDPRGB= <>
##$CPDPRGT= <>
##$D= (0..31)
0 1.2 0 0 0 0 0 0 0 0.06 0 0.03 0 0 0 0 0.0002 0 0 0 0 0 0 0 0 0 0 0 0 
0 0 0 
##$DATE= 1663581571
##$DBL= (0..7)
120 120 120 120 120 120 120 120 
##$DBP= (0..7)
150 150 150 150 150 150 150 150 
##$DBP07= 0
##$DBPNAM0= <>
##$DBPNAM1= <>
##$DBPNAM2= <>
##$DBPNAM3= <>
##$DBPNAM4= <>
$$ [...]
##$SUBNAM3= <"">
##$SUBNAM4= <"">
##$SUBNAM5= <"">
##$SUBNAM6= <"">
##$SUBNAM7= <"">
##$SUBNAM8= <"">
##$SUBNAM9= <"">
##$SW= 18.0517283424941
##$SWIBOX= (0..15)
0 0 2 0 0 0 0 0 0 0 0 0 0 0 0 0 
##$SW_h= 3612.71676300578
##$TD= 16384
##$TD0= 1
##$TE= 0
##$TE2= 300
##$TE3= 300
##$TEG= 300
##$TL= (0..7)
0 120 120 120 120 120 120 120 
##$TP= (0..7)
150 150 150 150 150 150 150 150 
##$TP07= 0
##$TPNAME0= <>
##$TPNAME1= <>
##$TPNAME2= <>
##$TPNAME3= <>
##$TPNAME4= <>
##$TPNAME5= <>
##$TPNAME6= <>
##$TPNAME7= <>
##$TPOAL= (0..7)
0.5 0.5 0.5 0.5 0.5 0.5 0.5 0.5 
##$TPOFFS= (0..7)
0 0 0 0 0 0 0 0 
##$TUNHIN= 0
##$TUNHOUT= 0
##$TUNXOUT= 0
##$USERA1= <user>
##$USERA2= <user>
##$USERA3= <user>
##$USERA4= <user>
##$USERA5= <user>
##$V9= 5
##$VALIST= <valist>
##$VCLIST= <CCCCCCCCCCCCCCC>
##$VD= 0
##$VDLIST= <DDDDDDDDDDDDDDD>
##$VPLIST= <PPPPPPPPPPPPPPP>
##$VTLIST= <TTTTTTTTTTTTTTT>
##$WBST= 1024
##$WBSW= 4
##$XGAIN= (0..3)
0 0 0 0 
##$XL= 0
##$YL= 0
##$YMAX_a= 483726
##$YMIN_a= -406032
##$ZGOPTNS= <>
##$ZL1= 120
##$ZL2= 120
##$ZL3= 120
##$ZL4= 120
##$ABSF1= 15.73587
##$ABSF2= -2.315979
##$ABSG= 5
##$ABSL= 3
##$ALPHA= 0
##$AQORDER= 0
##$ASSFAC= 0
##$ASSFACI= 0
##$ASSFACX= 0
##$ASSWID= 0
##$AUNMP= <proc_1d>
##$AZFE= 0.1
##$AZFW= 0.1
##$BCFW= 0
##$BC_mod= 2
##$BYTORDP= 0
##$COROFFS= 0
##$CY= -3
##$DATMOD= 1
##$DC= 0
##$DFILT= <>
##$DTYPP= 0
##$F1P= 0
##$F2P= 0
##$FCOR= 1
##$FTSIZE= 16384
##$FT_mod= 6
##$GAMMA= 0
##$GB= 0
##$INTBC= 1
##$INTSCL= 3.70164e-10
##$ISEN= 128
##$LB= 0.24
##$LEV0= 0
##$LPBIN= 0
##$MAXI= 10000
##$MC2= 0
##$MEAN= 0
##$ME_mod= 0
##$MI= 1.114404
##$NCOEF= 0
##$NC_proc= -6
##$NLEV= 6
##$NOISF1= 3.799351
##$NOISF2= 2.8
##$NSP= 0
##$NTH_PI= 0
##$NZP= 0
##$OFFSET= 15.73477
##$PC= 1
##$PHC0= -18033.87
##$PHC1= 7.200691
##$PH_mod= 1
##$PKNL= yes
##$PPARMOD= 0
##$PSCAL= 0
##$PSIGN= 0
##$REVERSE= no
##$SF= 200.130007358306
##$SI= 16384
##$SIGF1= 3
##$SIGF2= 2
##$SINO= 5.538805
##$SIOLD= 16384
##$SREGLST= <1H.CDCl3>
##$SSB= 0
##$STSI= 16384
##$STSR= 0
##$SW_p= 3612.71676300578
##$SYMM= 0
##$S_DEV= 0
##$TDeff= 16384
##$TDoff= 0
##$TI= <>
##$TILT= no
##$TM1= 0
##$TM2= 0
##$TOPLEV= 0
##$USERP1= <user>
##$USERP2= <user>
##$USERP3= <user>
##$USERP4= <user>
##$USERP5= <user>
##$WDW= 1
##$XDIM= 16384
##$YMAX_p= 291654971
##$YMIN_p= -1215661
$$ End of Bruker specific parameters
$$ ---------------------------------
##NTUPLES= NMR SPECTRUM
##VAR_NAME=  FREQUENCY,     SPECTRUM/REAL,   SPECTRUM/IMAG
##SYMBOL=    X,             R,               I
##VAR_TYPE=  INDEPENDENT,   DEPENDENT,       DEPENDENT
##VAR_FORM=  AFFN,          ASDF,            ASDF
##VAR_DIM=   16384,         16384,           16384
##UNITS=     HZ,            ARBITRARY UNITS, ARBITRARY UNITS
##FACTOR=    0.220516191357247, 1,           1
##FIRST=     3148.9996000914, 0,             0
##LAST=      -463.717162914379, 0,           0
##MIN=       -463.717162914379, -1215661,    0
##MAX=       3148.9996000914, 291654971,     0
$$ Real data points
##PAGE= N=1
##DATA TABLE= (X++(R..R)), XYDATA
$$ [...]
$$ plain form
11986 -298016 -191070 -218215 -46275 100112 -50012 -85096 -129952 -139260 -252677 102525
11976 102525 184975 -42978 -357154 -333655 -220461 -167780 -372284 -149870 -18448 -55047
11966 -55047 30124 -34155 -15177 -14055 69838 -55746 -189250 -184404 -14158 -123089 -103660
11955 -103660 -105487 -41503 42245 144061 32664 53359 -61915 -68332 -47429 -218492 -237684
11944 -237684 -78187 152374 -15839 67345 21165 -17229 -6555 -32555 48003 9400 11514
11933 11514 -142048 -41744 -146947 -276185 -323720 -286866 -225868 -151379 -121523 -49523 55507
11922 55507 -6854 -25253 10127 -52317 34764 50813 11528 -3625 30412 28010 42947 -52158
11910 -52158 -81754 -123442 -104135 -36341 35151 87461 -100854 -195316 -65461 -96298 -229484
$$ packed form
11986b98016J06946k7145J71940J46387j50124l5084m4856r308j13417L55202
11976A02525Q2450k27953l14176K3499J13194N2681k04504K22414J31422l6599
11966e5047Q5171o4279J8978J122Q3893j25584j33504M846J70246j08931J9429
11955a03660j827O3984Q3748J01816j11397K0695j15274o417K0903j71063j9192
11944b37684J59497K30561j68213Q3184m6180l8394J0674k6000Q0558l8603K114
11933A1514j53562J00304j05203j29238m7535L6854O0998P4489K9856P2000J05030
11922E5507o2361j8399L5380o2444Q7081J6049l9285j5153L4037k402J4937r5105
11910e2158k9596m1688J9307O7794P1492N2310j88315r4462J29855l0837j33186
$$ plain form
11899 -229484 -126510 35398 216899 194814 234159 98682 180472 62062 -30982 -10528
11889 -10528 -67653 -28331 83664 22894 -128940 -122776 33100 139461 233402 216599 -86616
11878 -86616 -94509 -51687 30560 5575 -180160 -170218 -71518 -133241 -238483 -168758 5003
11867 5003 29092 -32855 -78622 -173684 -221794 -252717 -183956 -203295 -203955 -123271 -90129 -32670
11855 -32670 37384 -30737 -44249 -13600 57448 104482 -84054 -65742 17121 -38573 -108747
11844 -108747 -55878 -53638 -79817 -27120 -128902 -50267 88894 249426 118800 96664 117933
11833 117933 106707 54805 -14176 110707 -88447 9625 -44486 -100463 -99704 -162604 -234972
11822 -234972 -305911 -240029 -219766 -86157 -157531 115434 33990 -33181 96424 -29978 -153359
$$ packed form
11899b29484J02974J61908J81501k2085L9345j35477Q1790j18410r3044K0454
11889a0528n7125L9322J11995o0770j51834O164J55876J06361R3941j6803l03215
11878h6616p893M2822Q2247k4985j85735R942R8700o1723j05242O9725J73761
11867E003K4089o1947m5767r5062m8110l0923O8761j9339o60Q0684L3142N7459
11855c2670P0054o8121j3512L0649P1048M7034j88536J8312Q2863n5694p0174
11844a08747N2869K240k6179N2697j01782P8635J39161J60532j30626k2136K1269
11833A17933j1226n1902o8981J24883j99154R8072n4111n5977P59o2900p2368
11822b34972p0939O5882K0263J33609p1374K72965q1444o7171J29605j26402j23381
$$ plain form
11811 -153359 -224193 -156290 -233863 -95251 102773 19384 -281147 -82795 110905 7414
11801 7414 107825 36640 -127080 -51851 -150651 -79477 -125808 -46854 -47103 64825 135594 92205
11789 92205 -64649 -117221 -100769 -12752 -96568 -174432 -108260 -313425 -243726 -46783 60326
11778 60326 41679 28735 -86140 -21364 -61541 35645 106745 62436 -7873 -49859 -226177
11767 -226177 -325200 -229615 -6863 -9037 -179634 -265350 -77768 -41036 -10596 93954 69500
11756 69500 58397 57827 244055 236720 19111 -194144 -59078 -104133 -57458 -114881 -179467
11745 -179467 -86436 -12038 164456 171662 -20640 17410 35346 28884 63646 -63323 -51310
11734 -51310 -95312 -148803 -140471 29682 141134 651 15694 92687 88054 -17560 -20945
$$ packed form
11811a53359p0834O7903p7573J38612J98024q3389l00531J98352J93700j03491
11801G414J00411p1185j63720P5229r8800P1174m6331P8954k49J11928P0769m3389
11789I2205j56854n2572J6452Q8017q3816p7864O6172k05165O9699J96943J07109
11778F0326j8647j2944j14875O4776m0177R7186P1100m4309p0309m1986j76318
11767b26177r9023R5585K22752k174j70597q5716J87582L6732L0440J04550k4454
11756F9500j1103n70J86228p335k17609k13255J35066m5055M6675n7423o4586
11745a79467R3031P4398J76494P206j92302L8050J7936o462L4762j26969J2013
11734e1310m4002n3491Q332J70153J11452j40483J5043P6993m633j05614l385
$$ plain form
11723 -20945 -62764 -27449 19335 6308 -52594 -175354 2249 225765 157476 153389 101264
11712 101264 -17091 -61023 -49980 101032 -56359 -105367 114554 67708 -14508 76035 -73080
11701 -73080 -41798 42029 -58480 -89056 -52573 7294 86712 121686 97404 -86684 -22735
11690 -22735 36376 -61969 13904 145958 5758 -69037 -158610 -92992 -89729 -86098 -133162 -2880
11678 -2880 -34611 -132167 1437 17206 41467 -111251 -44179 -22562 -33731 -41025 -15459 -25800
11666 -25800 43376 28448 59621 78829 -123113 -200773 -51516 -48994 -59260 -82285 31193
11655 31193 31413 1280 57950 16841 58904 -42836 -96948 -17998 36526 -39012 -1698 -63889
11643 -63889 -91030 -35349 -14053 -99667 -53055 -80254 -43711 33734 88931 50045 -25242 24952
$$ packed form
11723b0945m1819L5315M6784j3027n8902j22760J77603K23516o8289m087n2125
11712A01264j18355m3932J1043J51012j57391m9008K19921m6846q2216R0543j49115
11701g3080L1282Q3827j00509l0576L6483N9867P9418L4974k4282j84088O3949
11690b2735N9111r8345P5873J32054j40200p4795q9573O5618L263L631m7064J30282
11678b880l1731r7556J33604J5769K4261j52718O7072K1617j1169p294K5566j0341
11666b5800O9176j4928L1173J9208k01942p7660J49257K522j0266k3025J13478
11655C1193K20l0133N6670m1109M2063j01740n4112P8950N4524p5538L7314o2191
11643f3889k7141N5681K1296q5614M6612k7199L6543P7445N5197l8886p5287N0194
$$ plain form
11631 24952 -83578 -45680 -104076 24955 143335 20823 24081 209478 113081 -33463 15661
11620 15661 -120674 -121902 -40301 38870 -25970 -18311 7418 -51747 -117987 48363 171348
11609 171348 -22417 -140622 -17925 94268 -16297 -149495 -59868 -54223 -118202 30391
11599 30391 126457 61510 107979 247136 94948 -66506 -107605 23403 24480 -48069 -121874
11588 -121874 -60071 -996 85690 -147159 -153131 52419 -33589 18074 -83001 -146993 -157684
11577 -157684 -74257 32595 184774 129479 -89748 -234169 -266755 14327 19058 88530 175481
11566 175481 95202 160961 9296 -129806 -161579 -88215 95436 -4451 -82156 -172748 -236621
11555 -236621 -345306 -244521 -178928 -218485 -191376 -184200 -145518 -70637 -156292 -44677 11301
$$ packed form
11631B4952j08530L7898n8396J29031J18380j22512L258J85397r6397j46544M9124
11620A5661j36335j228Q1601P9171o4840P659K5729n9165o6240J66350J22985
11609A71348j93765j18205J22697J12193j10565j33198Q9627N645o3979J48593
11599C0391R6066o4947M6469J39157j52188j61454m1099J31008J077p2549p3805
11588a21874O1803N9075Q6686k32849n972K05550q6008N1663j01075o3992j0691
11577a57684Q3427J06852J52179n5295k19227j44421l2586K81082M731O9472Q6951
11566A75481q0279O5759j51665j39102l1773P3364J83651r9887p7705r0592o3873
11555b36621j08685J00785O5593l9557K7109P176L8682P4881q5655J11615N5978
$$ plain form
11544 11301 123762 106996 39750 -64721 -7521 50248 -30935 -178850 -230156 -74438 68599
11533 68599 206338 136485 120341 -130386 -58486 264 14840 -41812 -211868 -82125 -14219
11522 -14219 -13528 -25234 85422 144013 -6909 76775 -18229 -35838 -82341 -134748 -181545 -133124
11510 -133124 -67042 -181322 -118180 -101875 15256 -52365 -82011 -42506 61532 17034 -219354
11499 -219354 -209533 -110877 -47859 29444 -26470 4312 19752 -2581 42928 -46399 -77125 -176640
11487 -176640 126508 7277 -92203 47892 95872 94941 -44950 -26520 37141 -89012 -100892
11476 -100892 -225099 -62495 -63669 -95240 90913 45688 -88089 -104398 -102461 59080 45013
11465 45013 198471 139882 -109915 -118458 -20320 203204 144431 82301 -17744 32121 22632
$$ packed form
11544A1301J12461j6766o7246j04471N7200N7769q1183j47915n1306J55718J43037
11533F8599J37739o9853j6144k50727P1900N8750J4576n6652j70056J29743O7906
11522a4219O91j1706J10656N8591j50922Q3684r5004j7609m6503n2407m6797M8421
11510a33124O6082j14280O3142J6305J17131o7621k9646L9505J04038m4498k36388
11499b19354R821R8656O3018P7303n5914L0782J5440k2333M5509q9327l0726r9515
11487a76640L03148j19231r9480J40095M7980r31j39891J8430O3661j26153j1880
11476a00892j24207J62604j174l1571J86153m5225j33777j6309J937J61541j4067
11465D5013J53458n8589k49797q543R8138K23524n8773o2130j00045M9865r489
$$ plain form
11454 22632 5201 36195 2587 -55737 14190 18661 39031 115586 85222 -48034 -46144 -106441
11442 -106441 -120034 -16621 -73136 -63188 -45179 -153873 -63670 -114039 -235029 -151370 -152330
11431 -152330 -137278 -70877 114623 41443 -76845 -152941 -73906 107428 -5796 -104799 -34477
11420 -34477 -74122 15005 -23393 3793 92823 193348 81812 -172152 -98252 -47234 143402
11409 143402 42013 -32904 -103701 101065 49532 -88081 -37422 -134242 33106 38795 -79475
11398 -79475 -25968 42110 24113 -124847 -119409 -197467 -80575 -100262 -18336 73314 -108368
11387 -108368 -34068 -38110 -107439 -22616 49812 -45544 -47080 100930 -27011 33713 49824
11376 49824 -31068 -110109 -66680 -74868 -26221 -34073 55127 130936 -27164 37523 -53335 -101649
$$ packed form
11454B2632j7431L0994l3608n8324O9927M471K0370P6555l0364j33256J890o0297
11442a06441j3593J03413n6515R948J8009j08694R0203n0369j20990Q3659r60
11431a52330J5052O6401J85500p3180j18288p6096P9035J81334j13224r9003P0322
11420c4477l9645Q9127l8398K7186Q9030J00525j11536k53964P3900N1018J90636
11409A43402j01389p4917p0797K04766n1533j37613N0659r6820J67348N689j18270
11398g9475N3507O8078j7997j48960N438p8058J16892j9687Q1926R1650j81682
11387a08368P4300m042o9329Q4823P2428r5356j536J48010j27941O0724J6111
11376D9824q0892p9041M3429q188M8647p852Q9200P5809j58100O4687r0858m8314
$$ plain form
11364 -101649 -80923 -100739 -42655 -16525 -30254 -24890 -19855 16815 131456 291336 307516
11353 307516 190552 233143 100978 -13586 -23078 3612 16194 -67805 -67125 -53462 -90296
11342 -90296 -48378 -111704 -321688 -134416 -239860 -84511 10226 -94448 7696 -40768
11332 -40768 -64317 -35355 367 61488 97471 89599 112933 178232 86684 -519 118133 140303
11320 140303 -3428 -111994 3899 118043 -140698 -158107 -184146 -17415 18830 -66145
11310 -66145 -104617 -54236 -77345 -63583 -66162 -229649 -172338 -171791 -104537 114777 91556 24788
11298 24788 32957 -23198 139996 -48826 -172127 -141815 -53623 -181369 -69945 -142105 -280746
11287 -280746 -247088 -292623 -85272 -5991 -58307 19512 82548 -5778 -80943 -60806 130521
$$ packed form
11364a01649K0726j9816N8084K6130j3729N364N035L6670J14641J59880J6180
11353C07516j16964M2591j32165j14564r492K6690J2582q3999O80J3663l6834
11342i0296M1918o3326k09984J87272j05444J55349R4737j04674J02144m8464
11332d0768k3549K8962L5722O1121L5983p872K3334O5299r1548q7203J18652K2170
11320A40303j43731j08566J15893J14144k58741j7409k6039J66731L6245q4975
11310f6145l8472N0381k3109J3762k579j63487N7311N47O7254K19314k3221o6768
11298B4788Q169n6155J63194j88822j23301L0312Q8192j27746J11424p2160j38641
11287b80746L3658m5535K07351P9281n2316P7819O3036q8326p5165K0137J91327
$$ plain form
11276 130521 -46469 138337 270120 158144 115536 26987 -81504 69453 96505 104511
11266 104511 130746 -75041 3015 -164206 -222556 -57853 44706 21940 -6398 -28444 66009
11255 66009 -8122 67814 36320 -39321 -41294 -18030 28819 -31263 107782 -11001 -77475
11244 -77475 -163901 -148255 -73452 -96062 -214955 -124675 82180 30142 -8271 -128589 -70536
11233 -70536 -90254 -168745 -122479 -220146 -153915 -176567 -51237 16279 -4955 -17559 100765
11222 100765 2830 -125323 -123046 13266 5039 -145284 -20685 -50385 4094 -2618 -139067
11211 -139067 -113311 24740 -1386 54629 212986 43008 5732 55826 -41885 -45984 43335
11200 43335 59980 -95630 -175548 -176632 -89958 46741 -24890 -246972 -199044 -146050 -111767
$$ packed form
11276A30521j76990J84806J31783j11976m2608q8549j08491J50957K7052Q006
11266A04511K6235k05787P8056j67221n8350J64703J02559k2766k8338k2046R4453
11255F6009p4131P5936l1494p5641j973K3264M6849o0082J39045j18783o6474
11244g7475q6426J5646P4803k2610j18893R0280K06855n2038l8413j20318N8053
11233g0536j9718p8491M6266r7667O6231k2652J25330O7516k1234j2604J18324
11222A00765r7935j28153K277J36312q227j50323J24599k9700N4479o712j36449
11211a39067K5756J38051k6126N6015J58357j69978l7276N0094r7711m099Q9319
11200D3335J6645j55610p9918j084Q6674J36699p1631k22082M7928N2994L4283
$$ plain form
11189 -111767 -263112 -125140 14749 54733 -148019 -198734 -44639 210453 74344 50876
11179 50876 46466 -20290 -35779 108 -16454 9026 23998 8591 157916 102704 91598 -68365
11167 -68365 5179 -20168 42681 -38156 -25213 -44156 -58499 -32014 -35393 -178103 -174500 -95415
11155 -95415 155845 111747 49940 -35193 -57794 -6 -556 111890 -52991 -126629 -15200
11144 -15200 51830 -22575 -16570 -42196 -5770 -147828 -151437 -65424 2786 119355 120405 -13295
11132 -13295 -5670 92998 14756 -287423 -273840 -220061 23885 120329 -16315 -26446 -81988
11121 -81988 -103906 -80119 -19888 -43461 174843 87718 23906 -30929 75590 3502 -40017
11110 -40017 8962 48329 89511 -14264 -50348 89333 105844 60689 70858 18079 -6044
$$ packed form
11189a11767j51345J37972J39889L9984k02752n0715J54095K55092j36109k3468
11179E0876m410o6756j5489L5887j6562K5480J4972j5407J49325n5212j1106j59963
11167f8365P3544k5347O2849q0837J2943j8943j4343K6485l379j42710L603P9085
11155i5415K51260m4098o1807q5133k2601N7788n50J12446j64881p3638J11429
11144a5200O7030p4405O005k5626L6426j42058l609Q6013O8210J16569J050j33700
11132a3295P625R8668p8242l02179J3583N3779K43946R6444j36644j0131n5542
11121h1988k1918K3787O0231k3573K18304q7125o3812n4835J06519p2088m3519
11110d0017M8979L9367M1182j03775l6084J39681J6511m5155J0169n2779k4123
$$ plain form
11099 -6044 12287 99542 -225250 -114977 -82142 182841 203152 209781 62382 -3634 34475
11088 34475 -41502 -200337 -312191 -87897 -1189 -44616 15615 81909 21938 65604 13093
11077 13093 184341 160992 41178 -23436 -176013 -222176 -81191 24758 -18677 46918 155249
11066 155249 22708 -158764 -41565 223742 153319 73305 -86458 -18602 -7228 31902
11056 31902 -22294 -106396 -43490 27311 91874 11613 -86655 -149244 -180178 -231283 -129532
11045 -129532 -178991 -171505 98036 299956 125770 74128 122036 29770 85495 -32657 -19657
11034 -19657 17012 -45332 -97549 -180861 -261997 -212475 9819 241927 149937 -21765 -81593
11023 -81593 113126 -23296 -44109 -102582 -177806 -85199 60451 42774 -96555 -35853 -21483
$$ packed form
11099f044J8331Q7255l24792J10273L2835K64983K0311O629j47399o6016L8109
11088C4475p5977j58835j11854K24294Q6708m3427O0231O6294n9971M3666n2511
11077A3093J71248k3349j19814o4614j52577m6163J40985J05949m3435O5595J08331
11066A55249j32541j81472J17199K65307p0423q0014j59763O7856J1374L9130
11056C1902n4196q4102O2906P0801O4563q0261r8268o2589l0934n1105J01751
11045a29532m9459P486K69541K01920j74186n1642M7908r2266N5725j18152J3000
11034a9657L6669o2344n2217q3312q1136M9522K22294K32108r1990j71702n9828
11023h1593J94719j36422k0813n8473p5224R2607J45650j7677j39329O0702J4370
$$ plain form
11012 -21483 58527 30457 21390 37994 82601 -25149 -86540 -140006 -212516 -140131 -100561 21672
11000 21672 117731 -12175 -63895 -84721 -164332 -52994 65659 -90567 -91615 -107088 -38323
10989 -38323 -96662 -152367 -54718 -145880 -416449 -122076 -57689 -46544 -112274 -320698 -315155
10978 -315155 -193852 -22437 -2581 -21285 118815 231872 198285 151820 6984 -13031
10968 -13031 6537 -74514 -36934 -52572 -177046 -190158 72943 109423 -60629 34039 -46403
10957 -46403 -10551 33180 1134 82274 93567 149615 113612 -29827 34835 -10094 166537
10946 166537 110415 93580 -79147 -130469 -103566 -4976 81446 22481 -199334 -102581 -132191
10935 -132191 -245682 -85446 23666 107895 63974 117823 129068 57939 -5017 -128722 -93977
$$ packed form
11012b1483Q0010k8070r067J6604M4607j07750o1391n3466p2510P2385L9570J22233
11000B1672R6059j29906n1720k0826p9611J11338J18653j56226j048j5473O8765
10989c8323n8339n5705R7649r1162k70569K94373O4387J1145o5730k08424N543
10978c15155J21303J71415J9856j8704J40100J13057l3587m6465j44836k0015
10968a3031J9568q1051L7580j5638j24474j3112K63101L6480j70052R4668q0442
10957d6403L5852M3731l2046Q1140J1293N6048l6003j43439O4662m4929J76631
10946A66537n6122j6835j72727n1322K6903R8590Q6422n8965k21815R6753k9610
10935a32191j13491J60236J09112Q4229m3921N3849J1245p1129o2956j23705L4745
$$ plain form
10924 -93977 83122 36986 111239 -147841 -225580 -298457 -215877 -175483 -286802 -155505 -52705
10913 -52705 -139619 -130955 -35379 -6649 -124367 -2263 -19770 -29414 -235 -19541 -190313
10902 -190313 -97080 65878 -48059 128105 272826 107444 -19896 -62942 -1796 -174900
10892 -174900 -262178 -170319 -109341 -55401 -169508 -112152 -123379 -145414 -100177 31091 10861
10881 10861 78400 39062 -3244 -59443 36848 53633 48089 95800 193646 143358 10743 -91834
10869 -91834 -100784 -68936 6078 -143506 -200574 -46488 -124131 -72761 -53246 59467 -15260
10858 -15260 1389 -5395 -137368 -80234 191515 189045 -53880 -187771 -197737 -117227 -105753
10847 -105753 141392 135281 -37353 -22676 5192 -24491 -117113 74438 145406 44441 34608
$$ packed form
10924i3977J77099m6136P4253k59080p7739p2877Q2580M0394j11319J31297J02800
10913e2705q6914Q664R5576K8730j17718J22104j7507r644K9179j9306j70772
10902a90313R3233J62958j13937J76164J44721j65382j27340m3046O1146j73104
10892a74900q7278R1859O0978N3940j14107N7356j1227k2035M5237J31268k0230
10881A0861O7539l9338m2306n6199R6291J6785n544M7711R7846n0288j32615j02577
10869i1834q950L1848P5014j49584n7068J54086p7643N1370J9515J12713p4727
10858a5260J6649o784j31973N7134K71749k470k42925j33891r966Q0510J1474
10847a05753K47145o111j72634J4677K7868k9683r2622J91551P0968j00965r833
$$ plain form
10836 34608 -114007 103303 52541 -128249 -128041 -134124 -126590 -89341 -50673 -195049 -43170
10825 -43170 -22177 135878 2618 -6008 43110 -36384 -121308 -28851 -71874 -69430 74212
10814 74212 -53354 -172260 -237682 31545 45342 -133298 -182961 -70064 -5060 -51961 -133822
10803 -133822 -85097 -19353 43648 47789 -45628 -68349 65422 199877 19028 33407 -59070
10792 -59070 -292041 -176952 -150748 -55978 -87340 37178 -7267 -13911 -62126 -53714 -47952 51056
10780 51056 -49062 -160871 -208017 -192097 -251889 -236972 -145663 82743 138034 -5356 80538
10769 80538 163787 154053 84040 82371 21336 49470 -18464 -79325 -148721 -148338 -74281 -5190
10757 -5190 66949 106119 94413 51971 19784 179107 -59813 -124322 2961 -193260 -252105
$$ packed form
10836C4608j48615K17310n0762j80790K08o083P534L7249L8668j44376J51879
10825d3170K0993J58055j33260q626M9118p9494q4924R2457m3023K444J43642
10814G4212j27566j18906o5422K69227J3797j78640m9663J12897O5004m6901q1861
10803a33822M8725O5744O3001M141r3417k2721J33771J34455j80849J4379r2477
10792e9070k32971J15089K6204R4770l1362J24518m4445o644m8215Q412N762R9008
10780E1056j00118j11809m7146J5920n9792J4917R1309K28406N5291j43390Q5894
10769H0538Q3249r734p0013j669o1035K8134o7934o0861o9396L83P4057O9091
10757e190P2139L9170j1706m2442l2187J59323k38920o4509J27283j96221n8845
$$ plain form
10746 -252105 -108825 -75415 -5727 -25658 -2822 -18633 78269 -110180 -92183 35664 57374
10735 57374 105494 159450 144889 19839 -111947 50416 -67845 -207244 -151827 -82223 -26570
10724 -26570 -62025 13326 5534 174447 -14677 -100205 -122616 -193252 -150023 -131191 -111229
10713 -111229 -28168 12292 127554 94174 39710 3516 -118201 72476 16767 129830 31385
10702 31385 33378 67515 46252 74976 26619 50955 18706 45554 -102280 -71575 -98486 94991
10690 94991 13457 -112833 -64635 10987 -56165 -67161 -91113 -80441 19237 -131746 -198716
10679 -198716 -105239 -94589 -172104 -87630 -35217 -39313 21627 -33497 -118793 -166803 -106674 81086
10667 81086 -45322 -68164 104996 119164 26223 246666 103793 24105 123740 12543 95318
$$ packed form
10746b52105J43280L3410O9688j9931K2836j5811R6902j88449J7997J27847K1710
10735E7374M8120N3956j4561j25050j31786J62363j18261j39399N5417O9604N5653
10724b6570l5455P5351p792J68913j89124q5528k2411p0636M3229J8832J9962
10713a11229Q3061M0460J15262l3380n4464l6194j21717J90677n5709J13063r8445
10702C1385J993L4137k1263K8724m8357K4336l2249K6848j47834L0705k6911J93477
10690I4991q1534j26290M8198P5622o7152j0996k3952J0672R9678j50983o6970
10679a98716R3477J0650p7515Q4474N2413m096O0940n5124q5296m8010O0129J87760
10667H1086j26408k2842J73160J4168r2941K20443j42873p9688R9635j11197Q2775
$$ plain form
10656 95318 -3813 131525 40648 -8370 68371 -65575 -17704 -59906 -24404 -31893 -80029
10645 -80029 -192911 -108802 -40521 -237071 -196652 -45067 31142 25857 24952 -107168 -217391
10634 -217391 -114888 117840 59550 63624 29068 186616 84439 -9073 -102367 -149747 -214763
10623 -214763 -188534 2342 -73118 -217561 6517 113583 83328 -68687 -62397 18453 -136929
10612 -136929 40168 63889 16196 -106232 -32907 197255 12045 80465 116929 -12857
10602 -12857 -55833 -267664 -167682 -123789 -152172 -54180 123377 736 87547 -9790 97567
10591 97567 110700 110578 -65946 -79047 130686 300568 243122 103186 118618 87919 6343
10580 6343 83150 178628 281524 274585 -127437 -221239 -34830 -28067 -32865 -100186 -66353 53637
$$ packed form
10656I5318r9131J35338r0877m9018P6741j33946M7871m2202L5502p489m8136
10645h0029j12882Q4109O8281j96550M0419J51585P6209n285r05j32120j10223
10634b17391J02503K32728n8290M074l4556J57548j02177r3512r3294m7380o5016
10623b14763K6229J90876p5460j44443K24078J07066l0255j52015O290Q0850j55382
10612a36929J77097K3721m7693j22428P3325K30162j85210O8420L6464j29786
10602a2857m2976k11831R9982M3893k8383R7992J77557j22641Q6811r7337J07357
10591I7567J3133j22j76524j3101K09733J69882n7446j39936J5432l0699q1576
10580F343P6807R5478J02896o939m02022r3802J86409O763m798o7321L3833J19990
$$ plain form
10568 53637 -21967 -86581 11873 41821 128919 124568 26371 -18123 -70584 40413 -69855
10557 -69855 -109549 14337 -48433 -10982 -28757 21205 172794 8209 -5978 130701 46502
10546 46502 7328 113766 208220 197102 -92781 -56696 153836 280251 265236 71082 -91321
10535 -91321 -107272 -19834 49556 82353 -52954 -44493 4915 -25691 119322 -10216 67279
10524 67279 82953 258034 181102 252003 325416 186554 79348 -28951 -7002 105767 75994
10513 75994 -31312 45484 88100 105148 64017 2102 36953 -10417 37407 119321 90744
10502 90744 -74842 -38868 20825 116229 202205 148521 175607 299224 243844 182969 116326
10491 116326 42919 34097 132226 128556 -84194 -124981 -29638 52768 -70585 38885 -7001
$$ packed form
10568E3637p5604o4614R8454K9948Q7098m351r8197m4494n2461J10997j10268
10557f9855l9694J23886o2770L7451j7775M9962J51589j64585j4187J36679q4199
10546D6502l9174J06438R4454j1118k89883L6085K10532J26415j5015j94154j62403
10535i1321j5951Q7438O9390L2797j35307Q461M9408l0606J45013j29538P7495
10524F7279J5674J75081p6932P0901P3413j38862j07206j08299K1949J12769k9773
10513G5994j07306P6796M2616J7048m1131o1915L4851m7370M7824Q1914k8577
10502I0744j65586L5974N9693R5404Q5976n3684K7086J23617n5380o0875o6643
10491A16326p3407q822R8129l670k12750m0787R5343Q2406j23353J09470m5886
$$ plain form
10480 -7001 41953 177481 171979 89317 33056 -2024 -79888 1779 11406 -4221 69712 76950
10468 76950 4819 33019 34918 117547 -11705 -65125 183085 190909 -29119 34682 110554
10457 110554 71222 158981 104517 -15198 -149705 17117 31771 159884 44890 121837
10447 121837 58872 97884 163946 110962 95505 60284 -23068 132959 176349 216715 190123
10436 190123 23693 193491 156038 41796 -33359 -12554 33081 -41337 -80392 -105180 -22068
10425 -22068 139425 -143561 -208234 -62166 -121980 -225466 -286980 -63489 58962 152306
10415 152306 65691 -92309 -231567 -172843 -121783 -198811 -167213 -69316 -45068 -49602 15428
10404 15428 76660 102318 -87443 -37667 -56555 -43928 19958 -86806 -59312 -59665 -26382 -82007
$$ packed form
10480g001M8954J35528n502q2662n6261l5080p7864Q1667R627j5627P3933P238
10468G6950p2131K8200J899Q2629j29252n3420K48210P824k20028O3801P5872
10457A10554l9332Q7759n4464j19715j34507J66822J4654J28113j14994P6947
10447A21837o2965L9012O6062n2984j5457l5221q3352J56027M3390M0366k6592
10436A90123j66430J69798l7453j14242p5155K0805M5635p4418l9055k4788Q3112
10425b2068J61493k82986o4673J46068n9814j03486o1514K23491J22451R3344
10415A52306q6615j58000j39258N8724N1060p7028L1598R7897K4248m534O5030
10404A5428O1232K5658j89761M9776j8888J2627O3886j06764K7494l53L3283n5625
$$ plain form
10392 -82007 -373259 -230984 100987 772 113696 173257 103866 66558 74298 -1157 -125091
10381 -125091 50327 7089 -110176 -90246 37706 177999 167466 66938 -74146 -45703
10371 -45703 11263 48026 112823 7587 112220 64271 9143 -86017 -72406 -11058 -3340
10360 -3340 -108779 -140676 -181382 98864 215080 -38386 -109778 -97886 -40489 109182 9333
10349 9333 -26287 141551 198820 97805 117242 66900 3770 33590 -896 -40501 207708
10338 207708 212164 105912 50261 110916 211296 97050 202287 86173 21005 308856
10328 308856 227969 97729 81319 17469 80342 -7818 84712 121390 211506 121141 76492
10317 76492 55779 118950 30495 14325 157273 86763 59674 192613 170911 35897 -15318
$$ packed form
10392h2007k91252J42275L31971j00215J12924N9561o9391l7308P740p5455j23934
10381a25091J75418m3238j17265J9930J27952J40293j0533j00528j41084K8443
10371d5703N6966L6763O4797j05236J04633m7949n5128r5160J3611O1348P718
10360c340j05439l1897m0706K80246J16216k53466p1392J1892N7397J49671r9849
10349I333l5620J67838N7269j01015J9437n0342o3130K9820l4486l9605K48209
10338B07708M456j06252n5651O0655J00380j14246J05237j16114o5168K87851
10328C08856q0887j30240j6410o3850O2873q8160R2530L6678R0116r0365m4649
10317G6492k0713O3171q8455j6170J42948p0510k7089J32939k1702j35014n1215
$$ plain form
10306 -15318 -46890 -110828 17930 159237 167482 146158 30236 53587 81461 40026 -16404
10295 -16404 124469 48880 161297 -9488 -109155 25529 170515 200205 185581 201017 226019
10284 226019 148355 9463 16303 -131097 74061 91705 136030 101207 27758 12350 37973
10273 37973 34214 3774 41691 -31694 -23384 3201 -149910 -132264 138631 29360 108668
10262 108668 148838 153003 -34535 -206448 -81716 -15509 55454 18361 -43417 34233 43423
10251 43423 -61876 42828 40800 17395 87306 136477 81189 100338 43555 34407 -33412 111746
10239 111746 97309 126147 72451 58321 -42097 -131975 1884 99117 83079 235313 238669
10228 238669 334897 231614 173000 236268 136360 -11711 90445 51186 -90893 -96206 -76868
$$ packed form
10306a5318l1572o3938J28758J41307Q245k1324j15922K3351K7874m1435n6430
10295a6404J40873p5589J12417j70785r9667J34684J44986K9690j4624J5436K5002
10284B26019p7664j38892O840j47400K05158J7644M4325l4823p3449j5408K5623
10273C7973l759l0440L7917p3385Q310K6585j53111J7646K70895j09271P9308
10262A08668M0170M165j87538j71913J24732O6207P0963l7093o1778P7650R190
10251D3423j05299J04704k028k3405O9911M9171n5288J9149n6783r148o7819J45158
10239A11746j4437K8838n3696j4130j00418q9878J33859R7233j6038J52234L356
10228B38669R6228j03283n8614O3268r9908j48071J02156l9259j42079n313J9338
$$ plain form
10217 -76868 12020 -11602 140897 16711 -37078 8270 -7621 19826 -42219 -55616 38506
10206 38506 48653 -12084 25158 5770 124246 181512 120481 -62369 -65622 126681 158673
10195 158673 152318 12831 151237 185251 302070 47149 134628 143630 85274 -44244 -94904
10184 -94904 -14746 -88623 -74160 -115276 5262 102779 221862 231189 109505 39299 -15508
10173 -15508 -40198 -195721 -159674 -231606 -242580 -112688 89554 126444 83136 10455 88198
10162 88198 34985 -118677 121884 152828 39140 84411 119242 84159 60876 18261 19806
10151 19806 165816 129330 66954 195443 134526 166261 131749 248233 146646 155405 275475
10140 275475 228657 78558 67073 124688 186530 101294 66759 228611 312163 132105 75056
$$ packed form
10217g6868Q8888k3622J52499j24186n3789M5348j5891K7447o2045j3397R4122
10206C8506J0147o0737L7242j9388J18476N7266o1031j82850l253J92303L1992
10195A58673o355j39487J38406L4014J16819k54921Q7479R002n8356j29518n0660
10184i4904Q0158p3877J4463m1116J20538R7517J19083R327j21684p0206n4807
10173a5508k4690j55523L6047p1932j0974J29892K02242L6890m3308p2681P7743
10162H8198n3213j53662K40561L0944j13688M5271L4831l5083k3283m2615J545
10151A9806J46010l6486o2376J28489o0917L1735l4512J16484j01587Q759J20070
10140B75475m6818j50099j1485N7615O1842q5236l4535J61852Q3552j80058n7049
$$ plain form
10129 75056 215889 90465 6759 -12339 26234 57218 110425 71445 55278 -12716 84375
10118 84375 179669 220227 63052 151070 203091 108686 94075 53503 32362 76495 85491 27711
10106 27711 133234 175588 137628 58077 -75724 -119019 -146454 -31016 159555 6716 -138
10095 -138 59529 50429 242654 237878 319893 258063 86313 28668 -2148 -24325 43771 96098
10083 96098 58176 -19640 43407 258053 221705 217763 180862 151293 52221 91221 140285 -24759
10071 -24759 34589 51069 113708 190932 35703 -116097 14351 -20344 -110078 81007 184517
10060 184517 110318 1943 158429 -69014 -88257 2294 133572 166411 174092 174054 269801
10049 269801 309093 318165 219967 71047 213518 320096 156871 156103 210121 151400 87570
$$ packed form
10129G5056J40833j25424q3706j9098L8573L0984N3207l8980j6167o7994R7091
10118H4375R5294M0558j57175Q8018N2021r4405j4611m0572k1141M4133Q996n7780
10106B7711J05523M2354l7960p9551j33801m3295k7435J15438J90571j52839o854
10095a38N9667r100J92225m776Q2015o1830j71750n7645l0816k2177O8096N2327
10083I6098l7922p7816O3047K14646l6348l942l6901k9569r9072L9000M9064j65044
10071b4759N9348J6480O2639P7224j55229j51800J30448l4695q9734J91085J03510
10060A84517p4199j08375J56486k27443j9243R0551J31278L2839P681l8R5747
10049B69801L9292R072r8198j48920J42471J06578j63225p68N4018n8721o3830
$$ plain form
10038 87570 97582 224354 61011 -102577 47411 122131 130181 35249 128878 215842 173962
10027 173962 71509 129717 116441 76947 51192 15787 -31906 -72394 -70329 47978 308601
10016 308601 161480 16228 56015 52483 57906 45484 61278 145483 57477 182434 240943
10005 240943 220686 244693 22091 121130 195207 161144 176414 126117 131403 58827 86685
9994 86685 1027 -107433 -63382 49214 177192 99270 142370 153010 83319 153306 54098
9983 54098 205614 41 -61722 38651 218895 213790 141018 59696 146672 169515 124712
9972 124712 187493 207834 179087 191026 169334 198465 210445 201168 107258 189363 242671 161052
9960 161052 192037 266821 167659 69728 -21979 -132717 62489 222943 222528 120095 81333
$$ packed form
10038H7570J0012J26772j63343j63588J49988P4720Q050r4932R3629Q6964m1880
10027A73962j02453N8208j3276l9494k5755l5405m7693m0488K065J18307K60623
10016C08601j47121j45252L9787l532N423j2422J5794Q4205q8006J24957N8509
10005B40943k0257K4007k22602R9039P4077l4063J5270n0297N286p2576K7858
9994H6685q5658j08460M4051J12596J27978p7922M3100J0640o9691O9987r9208
9983E4098J51516k05573o1763J00373J80244n105p2772q1322Q6976K2843m4803
9972A24712O2781K0341k8747J1939k1692K9131J1980r277r3910Q2105N3308q1619
9960A61052L0985P4784r9162r7931r1707j10738J95206J60454m15j02433l8762
$$ plain form
9949 81333 7702 102458 294461 378223 362177 206736 190457 218241 129517 278579 145170
9938 145170 135364 190002 100970 162 73544 163286 179477 252872 149344 79794 100318
9927 100318 189573 282881 264100 174526 230063 194316 193116 2469 67295 147294 131341 199198
9915 199198 23491 -15661 87994 294552 148648 8782 42122 147439 116004 223224
9905 223224 291827 190972 190931 115415 184339 224611 236608 193085 214831 279027 280290 173094
9893 173094 148625 162392 187088 341108 196026 202933 291725 158524 -22826 66964 -62182
9882 -62182 18147 207645 126818 -7232 -40882 188737 289405 283944 245840 307487 374855
9871 374855 285154 224964 7864 -13197 96910 219776 212451 60398 164007 209242 261177
$$ packed form
9949H1333p3631R4756J92003Q3762j6046j55441j6279K7784q8724J49062j33409
9938A45170r806N4638q9032j00808P3382Q9742J6191P3395j03528o9550K0524
9927A00318Q9255R3308j8781q9574N5537l5747j200j90647O4826P9999j5953O7857
9915A99198j75707l9152J03655K06558j45904j39866L3340J05317l1435J07220
9905B23224O8603j00855m1p5516O8924M0272J1997m3523K1746O4196J263j07196
9893A73094k4469J3767K4696J54020j45082O907Q8792j33201j81350Q9790j29146
9882f2182Q0329J89498q0827j34050l3650K29619J00668n461l8104O1647O7368
9871C74855q9701o0190k17100k1061J10107J22866p325j52053J03609M5235N1935
$$ plain form
9860 261177 237576 325590 215041 165101 71291 11944 53445 102534 87148 12182 235608
9849 235608 211438 274163 265016 185198 13575 -16897 150585 158717 256124 270275 186730 144286
9837 144286 249171 222845 158116 207043 69762 289626 233624 162183 -10148 170226 208813
9826 208813 104903 196674 157012 101678 188787 217479 289992 282868 -20566 138703 309798
9815 309798 135010 156408 225931 207611 256178 222195 136975 53488 114430 14577 233722
9804 233722 385391 308246 293716 237600 23610 117512 109355 112301 210212 265755 226183 187733
9792 187733 87404 85010 209853 188999 121590 156537 104824 339269 344444 381243 375608 293135
9780 293135 118657 195048 220613 167907 313010 221689 188372 248074 183259 211054 423562
$$ packed form
9860B61177k3601Q8014j10549m9940r3810n9347M1501M9089j5386p4966K23426
9849B35608k4170O2725r147p9818j71623l0472J67482Q132R7407J4151q3545m2444
9837A44286J04885k6326o4729M8927j37281K19864n6002p1441j72331J80374L8587
9826B08813j03910R1771l9662n5334Q7109K8692P2513p124l03434J59269J71095
9815C09798j74788K1398O9523j8320M8567l3983q5220q3487O0942r9853K19145
9804B33722J51669p7145j4530n6116k13990R3902q157K946R7911N5543l9572l8450
9792A87733j00329k394J24843k0854o7409L4947n1713K34445N175L6799n635q2473
9780B93135j74478P6391K5565n2706J45103r1321l3317N9702o4815K7795K12508
$$ plain form
9769 423562 498979 469844 310654 237149 321167 297571 201273 309812 282292 160453 262592
9758 262592 323283 310968 387090 262668 69109 226508 355941 255314 114544 243626
9748 243626 189121 186722 253172 252706 263788 271694 446013 318555 356779 463519 546298 294610
9736 294610 331651 250160 329133 358008 329251 392578 523323 510789 377372 352800 186067
9725 186067 272655 353620 125786 137869 370287 368863 247161 195675 173077 299716 163867
9714 163867 131376 192593 182049 208175 123982 281012 377063 335450 382356 502636 531345
9703 531345 492754 460039 329861 316216 337433 365638 590451 395912 236313 240589 304918
9692 304918 317382 405646 501035 500684 395471 353564 352993 289758 390474 390655 463878 415100
$$ packed form
9769D23562P5417k9135j59190p3505Q4018k3596r6298J08539k7520j21839J02139
9758B62592O0691j2315P6122j24422j93559J57399J29433j00627j40770J29082
9748B43626n4505k399O6450m66J1082P906J74319j27458L8224J06740Q2779k51688
9736B94610L7041q1491P8973K8875k8757O3327J30745j2534j33417k4572j66733
9725A86067Q6588Q0965k27834J2083K32418j424j21702n1486k2598J26639j35849
9714A63867l2491O1217j0544K6126q4193J57030R6051m1613M6906J20280K8709
9703E31345l8591l2715j30178j3645K1217K8205K24813j94539j59599M276O4329
9692C04918J2464Q8264R5389l51j05213m1907n71o3235J00716J81P3223m8778
$$ plain form
9680 415100 294922 233706 278968 233659 347363 374954 429731 594214 479666 468414 423711
9669 423711 423520 495137 377867 455479 637656 490199 437144 409029 428224 387176 460214
9658 460214 425358 313316 323609 471855 407126 335955 310790 421985 485376 433482 367741
9647 367741 390981 336815 324304 308729 377434 375778 456130 534446 352918 283208 258306 233272
9635 233272 251993 299470 378027 467761 323911 396107 527320 637475 466850 470765 519299
9624 519299 511398 484315 533011 475639 471027 283866 302908 500129 375527 361851 368615 527256
9612 527256 425907 287886 412242 401971 569664 551073 576478 502887 541515 536736 339485
9601 339485 397768 308739 337130 420395 390606 506659 447113 446546 564727 604276 515305 505537
$$ packed form
9680D15100j20178o1216M5262m5309J13704K7591N4777J64483j14548j1252m4703
9669D23711j91P1617j17270P7612J82177j47457n3055k8115J9195m1048P3038
9658D60214l4856j12042J0293J48246o4729p1171k5165J11195O3391n1894o5741
9647C67741K3240n4166j2511j5575O8705j656Q0352P8316j81528o9710k4902k5034
9635B33272J8721M7477P8557Q9734j43850P2196J31213J10155j70625L915M8534
9624E19299p901k7083M8696n7372m612j87161J9042J97221j24602j3676O764J58641
9612E27256j01349j38021J24356j0271J67693j8591K5405p3591L8628m779j97251
9601C39485N8283q9029K8391Q3265k9789J16053n9546n67J18181L9549q8971r768
$$ plain form
9589 505537 633597 658565 540539 349917 419396 441174 543843 709291 578438 558386
9579 558386 507781 560326 703066 501384 463870 588744 737332 693483 752641 773558 733148
9568 733148 702299 750087 690199 868892 867552 877025 931722 883023 897646 1008310 960435 848653
9556 848653 963263 976525 1022935 1004907 1042891 1186274 1228263 1256839 1205031 1181572 1188902
9545 1188902 1133259 1103889 1159843 1147162 1170043 1273406 1255329 1362408 1151067 1242479 1309517
9534 1309517 1182455 1244757 1128408 1131579 1247872 1114863 1065085 1121096 1080570 1237181 1211698
9523 1211698 1205906 1328553 1475915 1527478 1436061 1348769 1459358 1569526 1653836 1739287 1771795
9512 1771795 1736718 1795124 1664878 1559151 1519265 1564638 1536350 1557873 1629025 1695827 1769182
$$ packed form
9589E05537J28060K4968j18026j90622O9479K1778J02669J65448j30853k0052
9579E58386n0605N2545J42740k01682l7514J24874J48588m3849N9158K0917m0410
9568G33148l0849M7788n9888J78693j340R473N4697m8699J4623J10664m7875j11782
9556H48653J14610J3262M6410j8028L7984J43383M1989K8576n1808k3459P330
9545A188902n5643k9370N5954j2681K2881J03363j8077J07079k11341R1412O7038
9534A309517j27062O2302j16349L171J16293j33009m9778N6011m0526J56611k5483
9523A211698n792J22647J47362N1563r1417q7292J10589J10168Q4310Q5451L2508
9512A771795l5077N8406j30246j05727l9886M5373k8288K1523P1152O6802P3355
$$ plain form
9501 1769182 1647933 1767111 1683421 1635770 1482073 1463524 1392663 1561094 1593128 1553633 1414139
9490 1414139 1288791 1217493 1301341 1493135 1325508 1140576 1300633 1238583 1132505 1209849
9480 1209849 1302070 1284281 1249632 1429860 1243616 1339218 1240783 1370276 1582625 1397870
9470 1397870 1374674 1486453 1528318 1385046 1456474 1538036 1600784 1431322 1300374 1424189
9460 1424189 1544318 1635741 1636748 1558788 1372924 1352158 1330927 1330751 1295981 1295050 1260436 1208368
9448 1208368 1131385 1184675 1293493 1199960 1041946 1071075 1135255 1119378 1089931 1030218 1064354
9437 1064354 1084401 1186956 1189643 1128600 1256731 1220963 1236205 1303392 1182171 1074004 1267012
9426 1267012 1335948 1315164 1344328 1290155 1174666 1162927 1265826 1394059 1407447 1381143 1350016
$$ packed form
9501A769182j21249J19178q3690m7651j53697j8549p0861J68431L2034l9495j39494
9490A414139j25348p1298Q3848J91794j67627j84932J60057o2050j06078P7344
9480A209849R2221j7789l4649J80228j86244R5602r8435J29493K12349j84755
9470A397870k3196J11779M1865j43272P1428Q1562O2748j69462j30948J23815
9460A424189J20129R1423J007p7960j85864k0766k1231j76l4770r31l4614n2068
9448A208368p6983N3290J08818r3533j58014K9129O4180j5877k9447n9713L4136
9437A064354K0047J02555K687o1043J28131l5768J5242O7187j21221j08167J93008
9426A267012O8936k0784K9164n4173j15489j1739J02899J28233J3388k6304l1127
$$ plain form
9415 1350016 1320925 1222612 1305905 1380759 1347170 1528422 1530724 1480091 1426950 1358849 1470340
9404 1470340 1507579 1405247 1473479 1446579 1426462 1571060 1460102 1293207 1469342 1477813 1548715
9393 1548715 1420774 1616385 1501377 1557779 1631551 1694217 1561103 1653758 1803664 1604290
9383 1604290 1644458 1703983 1681872 1578764 1463510 1658298 1676063 1670522 1738613 1700232 1772765
9372 1772765 1696344 1782889 1699926 1825441 1798712 1924007 1979846 1975486 1915638 1909045 1908877 1985991
9360 1985991 2125485 2055489 2003015 2075496 2034929 2051622 2122597 2143623 2198185 2100020 2079802
9349 2079802 2151846 2180650 2186565 2029001 2283403 2318575 2208014 2264278 2358511 2415491 2461226
9338 2461226 2437516 2569664 2458452 2326523 2499172 2670893 2798214 2731923 2642189 2640356
$$ packed form
9415A350016k9091r8313Q3293P4854l3589J81252K302n0633n3141o8101J11491
9404A470340L7239j02332O8232k6900k0117J44598j10958j66895J76135Q471P0902
9393A548715j27941J95611j15008N6402P3772O2666j33114R2655J49906j99374
9383A604290M0168N9525k2111j03108j15254J94788J7765n541O8091l8381P2533
9372A772765p6421Q6545q2963J25515k6729J25295N5839m360n9848o593j68P7114
9360A985991J39494o9996n2474P2481m0567J6693P0975K1026N4562r8165k0218
9349B079802P2044K8804N915j57564K54402L5172j10561N6264R4233N6980M5735
9338B461226k3710J32148j11212j31929J72649J71721J27321o6291q9734j833
$$ plain form
9328 2640356 2763336 2930009 2945415 3053750 3158009 3184300 3139910 3018952 3194729 3418472
9318 3418472 3480253 3481421 3432949 3344173 3445019 3424383 3618974 3671930 3563889 3625476 3740552
9307 3740552 3966460 3852978 3980438 4116322 4118594 4013163 4157196 4195899 4256100 4285170
9297 4285170 4310600 4640587 4649983 4711532 4779693 4905411 5097880 5332182 5396919 5385317 5555005
9286 5555005 5644434 5680273 5893733 5995247 6069249 6129854 6195842 6289480 6269452 6401608 6735834
9275 6735834 6751964 6983106 7211852 7356325 7429561 7493174 7619048 7715310 7840700 7949601
9265 7949601 7956354 8221539 8449447 8554377 8762320 8873817 8982289 9157713 9449512 9774829
9255 9774829 10027324 10132362 10156307 10505746 10825552 11119558 11429193 11608102 11881229 12117654
$$ packed form
9328B640356J22980J66673J5406J08335J04259K6291m4390j20958J75777K23743
9318C418472O1781J168m8472q8776J00846k0636J94591N2956j08041O1587J15076
9307C740552K25908j13482J27460J35884K272j05431J44033L8703O0201K9070
9297D285170K5430L29987R396O1549O8161J25718J92469K34302O4737j1602J69688
9286E555005Q9429L5839K13460J01514P4002O0605O5988R3638k0028J32156L34226
9275F735834J6130K31142K28746J44473P3236O3613J25874R6262J25390J08901
9265G949601O753K65185K27908J04930K07943J11497J08472J75424K91799L25317
9255I774829K52495J05038K3945L49439L19806K94006L09635J78909K73127K36425
$$ plain form
9245 12117654 12393256 12882725 13193671 13406686 13514461 13833790 14210011 14542637 14808305
9236 14808305 15221491 15605288 15874313 16320993 16970675 17370848 17650027 18075286 18389460
9227 18389460 18864056 19316259 19845293 20326934 20933297 21752006 22228365 22965387 23893673
9218 23893673 24649104 25387008 26115344 26984331 27911486 28869949 29772180 31090920 32389991
9209 32389991 33428709 34752052 36329124 37831173 39391671 41135309 43099889 45093953
9201 45093953 47448640 49952215 52675399 55662284 58893261 62363504 65963333 70036187
9193 70036187 74488140 79382620 84846336 90349647 96116768 102189593 107949361 113470615
9185 113470615 118709536 123414167 127664983 131354284 134436614 136763162 138251846 139035767
$$ packed form
9245A2117654K75602M89469L10946K13015J07775L19329L76221L32626K65668
9236A4808305M13186L83797K69025M46680O49682M00173K79179M25259L14174
9227A8389460M74596M52203N29034M81641O06363Q18709M76359P37022R28286
9218B3893673P55431P37904P28336Q68987R27155R58463R02231J318740J299071
9209C2389991J038718J323343J577072J502049J560498J743638J964580J994064
9201D5093953K354687K503575K723184K986885L230977L470243L599829M072854
9193G0036187M451953M894480N463716N503311N767121O072825N759768N521254
9185A13470615N238921M704631M250816L689301L082330K326548J488684P83921
$$ plain form
9177 139035767 139016586 138215782 136960506 135507319 133944450 132116305 130437288 128797445
9169 128797445 127522638 126548370 126183850 126175383 126723187 127868316 129682448 132179787 135080167
9160 135080167 138605428 142588758 147012098 152031640 157615781 163178872 168862508 174652832
9152 174652832 180302582 185743062 190402596 194468151 197913308 200871638 203263173 205281526
9144 205281526 206862851 207645178 207979556 207591902 206825529 205619263 204261705 202782828 201356030
9135 201356030 199954341 198510229 196740006 194679344 192622032 190225134 187349615 183692881
9127 183692881 179463140 174921339 170014287 165079301 160027169 155263469 150761786 146425444
9119 146425444 142446103 139144376 136348189 134029515 132526283 131553465 131235125 131546417
$$ packed form
9177A39035767j9181q00804j255276j453187j562869j828145j679017j639843
9169A28797445j274807r74268l64520q467N47804J145129J814132K497339K900380
9160A35080167L525261L983330M423340N019542N584141N563091N683636N790324
9152A74652832N649750N440480M659534M065555L445157K958330K391535K018353
9144B05281526J581325P82327L34378l87654p66373j206266j357558j478877j426798
9135B01356030j401689j444112j770223k060662k057312k396898k875519l656734
9127A83692881m229741m541801m907052m934986n052132m763700m501683m336342
9119A46425444l979341l301727k796187k318674j503232r72818l18340L11292
$$ plain form
9111 131546417 132284269 133480000 135019465 137092410 139695750 142480441 145577758 148626626
9103 148626626 151541236 154240870 156473001 158054858 158501908 157968637 156570878 154580054
9095 154580054 151744237 148148389 143762076 138569100 132340607 125448909 118416618 111126341
9087 111126341 103582851 96142385 89425328 83536188 77847426 72736379 68225484 64106290
9079 64106290 60560505 57408994 54248050 51547851 49031635 46729152 44687457 42743322
9071 42743322 41100644 39556399 38055300 36576297 35196219 33852879 32761311 31668641
9063 31668641 30639355 29575656 28787039 27988844 27220430 26403696 25765031 25051441 24341036
9054 24341036 23744522 23290964 22612568 22052385 21608597 21187399 20875031 20410978 19967465
$$ packed form
9111A31546417P37852J195731J539465K072945K603340K784691L097317L048868
9103A48626626K914610K699634K232131J581857M47050n33271j397759j990824
9095A54580054k835817l595848m386313n192976o228493o891698p032291p290277
9087A11126341p543490p440466o717057n889140n688762n111047m510895m119194
9079F4106290l545785l151511l160944k700199k516216k302483k041695j944135
9071D2743322j642678j544245j501099j479003j380078j343340j091568j092670
9063C1668641j029286j063699p88617p98195p68414q16734o38665p13590p10405
9054B4341036n96514m53558o78396n60183m43788m21198l12368m64053m43513
$$ plain form
9045 19967465 19571883 19331768 19002495 18586596 18287609 18142059 17955648 17727871 17407568
9036 17407568 17200745 17073849 17022068 16695323 16561821 16626211 16322615 16147635 16193833 16171349
9026 16171349 15891941 15675404 15686093 15639873 15476101 15269630 15355187 15131058 15041070 15123636
9016 15123636 15124319 15100165 14993653 15020177 15037919 15144131 15159310 15073661 15047488 15178850 15333525
9005 15333525 15371086 15473358 15599894 15869950 16083159 16233085 16497284 16782659 17028819 17234563
8995 17234563 17586632 17902159 18260607 18663179 19016702 19396550 19941581 20516153 21070145
8986 21070145 21549336 22131837 22663701 23288893 23891462 24619996 25644172 26695798 27595315
8977 27595315 28679880 29948938 31451548 33272499 35171376 37178580 39358220 41599360
$$ packed form
9045A9967465l95582k40115l29273m15899k98987j45550j86411k27777l20303
9036A7407568k06823j26896n1781l26745j33502O4390l03596j74980M6198k2484
9026A6171349k79408k16537J0689m6220j63772k06471Q5557k24129q9988Q2566
9016A5123636O83k4154j06512K6524J7742J06212J5179q5649k6173J31362J54675
9005A5333525L7561J02272J26536K70056K13209J49926K64199K85375K46160K05744
8995A7234563L52069L15527L58448M02572L53523L79848N45031N74572N53992
8986B1070145M79191N82501N31864O25192O02569P28534J024176J051626Q99517
8977B7595315J084565J269058J502610J820951J898877K007204K179640K241140
$$ plain form
8969 41599360 44053541 46523194 48817829 51303172 53263517 55008055 56525125 57702038
8961 57702038 58740340 59157414 59288895 59232276 59074037 58781066 58568770 58673430 58700296 58911622
8951 58911622 59450499 60349185 61459507 62683765 63903276 65466113 67279320 69309520
8943 69309520 71791629 74535810 77940514 81891509 86760485 92270056 98725451 106114705
8935 106114705 114350350 122887405 131464677 139676766 146568284 151503969 154083233 154322026
8927 154322026 152166786 148160869 143241995 138291328 133952250 130547515 128151002 127081408
8919 127081408 126833544 127332039 128286708 129741792 131700071 134517476 138067037 142574377
8911 142574377 148117877 154672485 162329770 170888272 180080126 189645687 199705731 209689516
$$ packed form
8969D1599360K454181K469653K294635K485343J960345J744538J517070J176913
8961E7702038J038302M17074J31481n6619j58239k92971k12296J04660K6866K11326
8951E8911622N38877Q98686J110322J224258J219511J562837J813207K030200
8943F9309520K482109K744181L404704L950995M868976N509571O455395P389254
8935A06114705Q235645Q537055Q577272Q212089O891518M935685K579264K38793
8927A54322026k155240m005917m918874m950667m339078l404735k396513j069594
8919A27081408k47864M98495R54669J455084J958279K817405L549561M507340
8911A42574377N543500O554608P657285Q558502R191854R565561J0060044R983785
$$ plain form
8903 209689516 219063259 227856751 235865431 242591050 247897313 252044222 255167277 257427528
8895 257427528 258940237 260266011 261765627 263358389 265614466 268485228 271825634 275487816
8887 275487816 279284401 282890022 285915356 288404947 290229525 291322299 291654971 291039125
8879 291039125 289527987 287148884 283548371 278980712 273211993 266212983 258283969 250074042
8871 250074042 241749690 233721416 226635395 220458797 215482047 211945369 209845442 209034680
8863 209034680 209507758 211036625 213784748 217367406 221835341 227198786 233206657 239782319
8855 239782319 246343827 252830966 258593732 263452848 266749800 268519671 268700944 267512568
8847 267512568 265185197 261485793 256802892 251068384 244575701 236886205 228230552 218771612
$$ packed form
8903B09689516R373743Q793492Q008680O725619N306263M146909L123055K260251
8895B57427528J512709J325774J499616J592762K256077K870762L340406L662182
8887B75487816L796585L605621L025334K489591J824578J092774L32672o15846
8879B91039125j511138k379103l600513m567659n768719o999010p929014q209927
8871B50074042q324352q028274p086021o176598m976750l536678k099927q10762
8863B09034680M73078J528867K748123L582658M467935N363445O007871O575662
8855B39782319O561508O487139N762766M859116L296952J769871J81273j188376
8847B67512568k327371l699404m682901n734508o492683p689496q655653r458940
$$ plain form
8839 218771612 208391600 197889299 187464133 177274541 167925397 159331179 151655874
8832 151655874 144991252 139142261 134229678 130143835 126913381 124465211 122420400 120741282
8824 120741282 119381306 118279032 117295300 116367472 115262773 114220258 113094021 111956560
8816 111956560 110787326 109309941 107704734 105642154 103206954 100352119 96816278 93049611
8808 93049611 88863822 84729401 80790479 76666505 72631537 68838950 65423754 61865566
8800 61865566 58032964 54551178 51342316 48179258 45336170 42859297 40575420 38491827
8792 38491827 36511504 34730382 33158782 31807791 30508590 29375796 28190657 27105835
8784 27105835 26175467 25363946 24587258 23705808 22757283 22128028 21598873 20968294 20478083
$$ packed form
8839B18771612j0380012j0502301j0425166j0189592r349144q594218p675305
8832A51655874o664622n848991m912583m085843l230454k448170k044811j679118
8824A20741282j359976j102274r83732r27828j104699j042515j126237j137461
8816A11956560j169234j477385j605207k062580k435200k854835l535841l766667
8808I3049611m185789m134421l938922m123974m034968l792587l415196l558188
8800F1865566l832602l481786l208862l163058k843088k476873k283877k083593
8792C8491827j980323j781122j571600j350991j299201j132794j185139j084822
8784B7105835r30368q11521p76688q81450r48525o29255n29155o30579m90211
$$ plain form
8775 20478083 20097328 19583826 19071694 18629498 18162429 17639100 17121928 16643837 16299753
8766 16299753 16011644 15575313 15314817 15018376 14518950 14248071 14067186 13720197 13367847
8757 13367847 13160076 12905589 12668877 12152553 11796966 11684264 11397249 11082376 10914479
8748 10914479 10763907 10428359 10184422 10072771 9898374 9730266 9556025 9292916 9333388 9269890
8738 9269890 9231091 9246763 9093224 8937601 8803314 8655583 8683659 8607677 8526295 8328539
8728 8328539 8387975 8238985 8165766 8190290 8175449 8069717 7957988 7743696 7800635 7792615 7878120
8717 7878120 7895428 7900952 7893638 8170056 8268078 8469161 8803234 9307738 10051201 10828783 11718475
8706 11718475 12813465 14397999 16788126 19766647 22829122 24979660 24818366 22021040
$$ packed form
8775B0478083l80755n13502n12132m42196m67069n23329n17172m78091l44084
8766A6299753k88109m36331k60496k96441m99426k70879j80885l46989l52350
8757A3367847k07771k54487k36712n16324l55587j12702k87015l14873j67897
8748A0914479j50572l35548k43937j11651j74397j68108j74241k63109M0472o3498
8738I269890l8799J5672j53539j55623j34287j47731K8076p5982q1382j97756
8728H328539N9436j48990p3219K4524j4841j05732j11729k14292N6939q020Q5505
8717G878120J7308N524p314K76418R8022K01083L34073N04504P43463P77582Q89692
8706A1718475J094990J584534K390127K978521L062475K150538j61294k797326
$$ plain form
8698 22021040 17736767 14485582 12176728 10886686 9973284 8962555 8283414 7716682 7314139
8689 7314139 7071780 6712691 6461372 6176074 5887703 5664208 5464036 5090382 4943983 4846163
8679 4846163 4878139 4614935 4541921 4478061 4290855 4092717 3902597 3849124 3710540 3696691
8669 3696691 3579131 3560323 3514382 3500874 3338785 3162401 3148282 3189901 3141039 3059525 3045696
8658 3045696 2967757 3007977 2991691 3023888 2824134 2728157 2718805 2711470 2635642 2648413 2578018 2493253
8646 2493253 2472281 2332390 2266370 2267560 2228169 2238333 2262044 2141732 2123542 2067084 1985578
8635 1985578 2016822 2125686 2137742 2070265 1799625 1758896 1750422 1617930 1692515 1572492 1547032
8624 1547032 1656117 1671419 1671695 1750947 1754112 1815200 1844457 1836492 1814070 1620753 1563152 1626970
$$ packed form
8698B2021040m284273l251185k308854j290042r13402j010729o79141n66732m02543
8689G314139k42359l59089k51319k85298k88371k23495k00172l73654j46399r7820
8679D846163L1976k63204p3014o3860j87206j98138j90120n3473j38584j3849
8669C696691j17560j8808m5941j3508j62089j76384j4119M1619m8862q1514j3829
8658C045696p7939M0220j6286L2197j99754r5977r352p335p5828J2771p0395q4765
8646B493253k0972j39891o6020J190l9391J0164K3711j20312j8190n6458q1506
8635A985578L1244J08864J2056o7477k70640m0729q474j32492P4585j20023k5460
8624A547032J09085J5302K76P9252L165O1088K9257p965k2422j93317n7601O3818
$$ plain form
8612 1626970 1509502 1401622 1361379 1502858 1589979 1654917 1507149 1639125 1613636 1357102
8602 1357102 1459035 1490303 1623133 1564164 1555971 1688819 1689859 1752718 1841255 1883316 1955322
8591 1955322 2044404 2020622 2121080 1982882 1800897 1822127 1870147 1933016 1864371 1878054 1866288
8580 1866288 1762419 1660983 1826323 1626460 1505226 1623477 1651411 1653656 1680992 1616195
8570 1616195 1469133 1370496 1548587 1579471 1568575 1695729 1670687 1689991 1656160 1636141 1623367
8559 1623367 1840217 1815030 1744823 1783317 1839806 1940348 1798612 1759439 1668393 1622149 1580715
8548 1580715 1531561 1476620 1573118 1698034 1725643 1583014 1483458 1448368 1385049 1229064 1397207
8537 1397207 1375411 1343291 1387680 1386255 1443086 1322618 1408616 1522046 1432464 1534295 1557481
$$ packed form
8612A626970j17468j07880m0243J41479Q7121O4938j47768J31976k5489k56534
8602A357102J01933L1268J32830n8969q193J32848J040O2859Q8537M2061P2006
8591A955322Q9082k3782J00458j38198j81985K1230M8020O2869o8645J3683j1766
8580A866288j03869j01436J65340j99863j21234J18251K7934K245K7336o4797
8570A616195j47062r8637J78091L0884j0896J27154k5042J9304l3831k0019j2774
8559A623367K16850k5187p0207L8494N6489J00542j41736l9173r1046m6244m1434
8548A580715m9154n4941R6498J24916K7609j42629r9556l5090o3319j55985J68143
8537A397207k1796l2120M4389j425N6831j20468Q5998J13430q9582J01831K3186
$$ plain form
8526 1557481 1839476 1889277 1886240 1934979 1896484 1750803 1849208 1945525 1925016 1865152 1873164
8515 1873164 1810868 1709960 1650969 1667272 1782895 1758019 1604751 1654712 1714446 1487782 1459091
8504 1459091 1346502 1373146 1421487 1486715 1533568 1498227 1361034 1483614 1594291 1658101 1713125
8493 1713125 1722070 1683792 1607846 1684236 1680287 1818390 1899360 1807033 1866159 1808307 1681267
8482 1681267 1707921 1822424 1734486 1775201 1766360 1797082 1671382 1626038 1548738 1500363 1424077
8471 1424077 1418395 1390762 1409923 1388466 1409451 1147087 1203480 1225543 1158627 1146476 1166266
8460 1166266 1053634 990810 828607 943452 1043800 1181162 1184482 1113987 1046326 968139 994029
8449 994029 997605 1078015 1039748 981648 991185 1018541 838445 834704 689133 670959 777484 724151
$$ packed form
8526A557481K81995M9801l037M8739l8495j45681R8405R6317k0509n9864Q012
8515A873164o2296j00908n8991J6303J15623k4876j53268M9961N9734k26664k8691
8504A459091j12589K6644M8341O5228M6853l5341j37193J22580J10677O3810N5024
8493A713125Q945l8278p5946P6390l949J38103Q0970r2327N9126n7852j27040
8482A681267K6654J14503q7938M0715q841L0722j25700m5344p7300m8375p6286
8471A424077n682k7633J9161k1457K0985k62364N6393K2063o6916j2151J9790
8460A166266j12632o2824j62203J14845J00348J37362L320p0495o7661p8187K5890
8449I94029L576Q0410l8267n8100R537K7356j80096l741j45571j8174J06525n3333
$$ plain form
8437 724151 719259 774209 639116 516813 341408 324757 452379 536297 554663 564367 384160
8426 384160 326726 368502 284688 253245 338765 227623 349683 402502 399380 306532 260414
8415 260414 181807 233776 258343 334022 292614 228550 238011 123203 179555 -2583 39095
8404 39095 196653 148141 116165 85443 221151 87017 -45428 14162 -11623 49343 28665
8393 28665 31034 -43393 -58750 1988 7680 140232 77531 -32879 -72317 44061 19302 -174197
8381 -174197 -115457 51466 217357 109526 -69741 -28556 -46235 -32774 -12962 -26528 154548
8370 154548 94803 16619 65380 71172 9291 -77437 98196 -28248 -33190 10197 146801
8359 146801 47905 26262 99271 -38261 -28299 89414 -29222 -127404 95924 64793 74344
$$ packed form
8437G24151m892N4950j35093j22303j75405j6651J27622Q3918J8366R704j80207
8426C84160n7434M1776q3814l1443Q5520j11142J22060N2819l122r2848m6118
8415B60414p8607N1969K4567P5679m1408o4064R461j14808N6352j82138M1678
8404C9095J57558m8512l1976l0722J35708j34134j32445N9590k5785O0966k0678
8393B8665K369p4427j5357O0738N692J32552o2701j10410l9438J16378k4759j93499
8381a74197N8740J66923J65891j07831j79267M1185j7679J3461J9812j3566J81076
8370A54548n9745p8184M8761N792o1881q6728J75633j26444m942M3387J36604
8359A46801r8896k1643P3009j37532R962J17713j18636r8182K23328l1131R551
$$ plain form
8348 74344 133251 89446 67022 49205 -26536 134520 133172 80813 104812 143883 94249 18148
8336 18148 -146 -27835 -576 -25641 19443 29995 -63048 -49204 94922 -998 -33398 127038
8324 127038 80403 -25471 148996 162391 165796 197559 131778 10630 -9322 119974 36044
8313 36044 157490 34352 -108508 -19973 -44880 14685 -97676 -96743 108628 69451 16937
8302 16937 -110098 -56132 35372 -79103 -216274 -183321 -13822 21030 -1509 -1412 -52437 -179412
8290 -179412 -83520 94735 192977 185269 -30255 -60250 23239 49926 -49440 -177121 -173981
8279 -173981 2446 -63967 -103756 -122044 -164834 -179588 -103066 -107281 -144258 -143318 -48145 95264
8267 95264 18409 -40497 120880 -23729 -66280 -94078 -105958 23459 123157 -24160 -215002
$$ packed form
8348G4344N8907m3805k2424j7817p5741J61056j348n2359K3999L9071m9634p6101
8336A8148j8294k7689K7259k5065M5084J0552r3043J3844J44126r5920l2400J60436
8324A27038m6635j05874J74467J3395L405L1763o5781j21148j9952J29296q3930
8313C6044J21446j23138j42860Q8535k4907N9565j12361R33K05371l9177n2514
8302A6937j27035N3966R1504j14475j37171L2953J69499L4852k2539R7n1025j26975
8290a79412R5892J78255R8242p708k15524k9995Q3489K6687r9366j27681L140
8279a73981J76427o6413l9789j8288m2790j4754P6522m215l6977R40R5173J43409
8267I5264p6855n8906J61377j44609m2551k7798j1880J29417R9698j47317j90842
$$ plain form
8256 -215002 -86494 -168018 -87813 -60331 -39923 -91950 8923 -93631 -38766 -5235 70625
8245 70625 77629 185892 45009 -210607 -53612 -8337 -15610 -98283 -25840 -77990 -184071
8234 -184071 -234701 -146166 -193575 -111838 -216062 -210719 -274153 -182543 -144579 85007 164081
8223 164081 127076 223941 92842 -92129 -128869 73882 31377 -191419 -223973 -133485 -125989
8212 -125989 -215383 -236444 -274229 -270219 -151265 3529 -35779 -184942 -196287 -197366 -191751 -274330
8200 -274330 -231272 -429217 -371259 -410060 -402980 -642228 -580619 -1215661 134939 1189746
8190 1189746 522246 425633 127451 126035 47894 131562 109608 77720 -69147 57795 -2140
8179 -2140 31766 302876 131927 -17077 25906 -28937 -36664 -54263 -85530 -181696 -11317
$$ packed form
8256b15002J28508q1524Q0205K7482K0408n2027J00873j02554N4865L3531P5860
8245G0625P004J08263j40883k55616J56995M5275p273q2673P2443n2150j06081
8234a84071n0630Q8535m7409Q1737j04224N343o3434R1610L7964K29586P9074
8223A64081l7005R6865j31099j84971l6740K02751m2505k22796l2554R0488P496
8212a25989q9394k1061l7785M010J18954J54794l9308j49163j1345j079N615q2579
8200b74330M3058j97945N7958l8801P080k39248O1609o35042J350600J054807
8190A189746o67500r6613k98182j416p8141Q3668k1954l1888j46867J26942n9935
8179b140L3906K71110j70949j49004M2983n4843p727j7599l1267r6166J70379
$$ plain form
8168 -11317 81770 -113111 -190197 -4221 -6813 69559 85964 45176 -126594 -198663 -197391 -160185
8156 -160185 -60582 -114043 -51566 -26511 -14841 -90185 -44545 -45040 -205414 -111029 30908 33037
8144 33037 67280 -45115 123541 97801 23923 -27512 -140113 18643 -58255 -55055 74297
8133 74297 -22978 -105742 -111782 -189455 -143759 3277 61805 -179351 -211161 -143966 -101821 -70535
8121 -70535 33579 -75142 -75377 72916 -76566 -123624 -60533 -20190 22004 -21592 -30445 122169
8109 122169 43634 -65308 -129725 -43348 -174778 -134091 -44633 84803 34103 -44113 -126120
8098 -126120 -216788 -124628 80708 114896 -142359 -79764 -34219 -230165 -56730 -68112 -145260
8087 -145260 -152630 -237767 -169766 -112941 34120 -97061 -66493 -84185 -54954 102233 74412
$$ packed form
8168a1317R3087j94881p7086J85976k592P6372J6405m0788j71770p2069J272L7206
8156a60185R9603n3461O2477K5055J1670p5344M5640m95j60374R4385J41937K129
8144C3037L4243j12395J68656k5740p3878n1435j12601J58756p6898L200J29352
8133G4297r7275q2764o040p7673M5696J47036N8528k41156l1810O7195M2145L1286
8121g0535J04114j08721k35J48293j49482m7058O3091M0343M2194m3596q853J52614
8109A22169p8535j08942o4417Q6377j31430M0687Q9458J29436n0700p8216q2007
8098a26120r0668R2160K05336L4188k57255O2595M5545j95946J73435j1382p7148
8087a45260p370q5137O8001N6825J47061j31181L0568j7692K9231J57187k7821
$$ plain form
8076 74412 -39287 -18852 82974 73002 -62278 -138482 -110417 47814 45867 80558 -51498
8065 -51498 26252 55019 -121064 -41993 184106 134933 165476 106490 163285 142272 54942
8054 54942 -16653 -43181 35392 -61522 48233 -93842 -139391 -53178 83864 80010 -71148
8043 -71148 -152515 -11718 163691 146261 18967 -644 -36284 -76119 -86461 -102401 -124428
8032 -124428 -197714 -118584 72557 195534 124649 55385 25221 -91450 -69963 -28890 -260951
8021 -260951 -189072 -15658 -175584 26073 132191 -44624 -113453 -3938 7878 -2047 148449
8010 148449 256499 156675 125609 21765 -28415 60475 -17279 -33612 -19303 -93884 -830
7999 -830 103604 230476 85761 138576 185949 42732 54765 -57448 -50998 17358 174992
$$ packed form
8076G4412j13699K0435J01826r972j35280p6204K8065J58231j947L4691j32056
8065e1498P7750K8767j76083P9071K26099m9173L0543n8986N6795k1013q7330
8054E4942p1595k6528P8573r6914J09755j42075m5549Q6213J37042l854j51158
8043g1148q1367J40797J75409j7430j27294j9611l5640l9835j0342j5940k2027
8032a24428p3286P9130J91141J22977p0885o9264l0164j16671K1487M1073k32061
8021b60951P1879J73414j59926K01657J06118j76815o8829J09515J1816r925J50496
8010A48449J08050r9824l1066j03844n0180Q8890p7754j6333J4309p4581R3054
7999h30J04434J26872j44715N2815M7373j43217J2033j12213O450O8356J57634
$$ plain form
7988 174992 161198 91581 170227 190538 46611 99329 197758 -5706 99531 263035 164586
7977 164586 23011 -110761 14775 170171 108319 121440 3567 -43743 113225 300727
7967 300727 304762 101616 25049 19363 -51940 56430 188322 94208 109187 -26259 -115471
7956 -115471 -6551 26950 189754 255820 122288 69312 97966 114782 195866 141853 143654
7945 143654 114593 -12670 18896 -131391 13141 198191 245555 237372 108607 117596 257988
7934 257988 214856 132610 -22658 138274 203230 247370 131466 96854 237833 215617 118708
7923 118708 30023 -22609 101204 256224 220471 162931 113567 140736 207220 200631 306963
7912 306963 181953 -43873 47039 116615 1153 144746 126143 64795 204444 60610
$$ packed form
7988A74992j3794o9617P8646K0311j43927N2718R8429k03464J05237J63504r8449
7977A64586j41575j33772J25536J55396o1852J3121j17873m7310J56968J87502
7967C00727M035k03146p6567n686p1303J08370J31892r4114J4979j35446q9212
7956a15471J08920L3501J62804O6066j33532n2976K8654J6816Q1084n4013J801
7945A43654k9061j27263L1566j50287J44532J85050M7364q183j28765Q989J40392
7934B57988m3132q2246j55268J60932O4956M4140j15904l4612J40979k2216r6909
7923A18708q8685n2632J23813J55020l5753n7540m9364K7169O6484o589J06332
7912C06963j25010k25826R0912O9576j15462J43593j8603o1348J39649j43834
$$ plain form
7902 60610 109593 266385 126369 236561 194102 -16039 137446 286199 384025 223259
7892 223259 117206 199365 143544 93381 176832 216237 405397 276394 195085 216570 335760
7881 335760 159416 211253 285054 313635 258182 265738 276827 262167 221403 151270 173874 119863
7869 119863 248444 401380 254554 208440 324734 238647 257694 255593 331386 174318 286618
7858 286618 347419 248125 245475 99231 122790 292526 375892 287054 298262 325461 389301
7847 389301 346582 289723 129738 216206 29916 -70618 98277 131089 184402 341804 438745
7836 438745 296643 295797 395632 338488 246274 400807 307312 248167 294163 320262 504105
7825 504105 412700 320055 231992 341003 477883 423259 326204 447744 444873 542511 473439
$$ packed form
7902F0610M8983J56792j40016J10192m2459k10141J53485J48753R7826j60766
7892B23259j06053Q2159n5821n0163Q3451L9405J89160j29003q1309K1485J19190
7881C35760j76344N1837P3801K8581n5453P556J1089j4660m0764p0133K2604n4011
7869A19863J28581J52936j46826m6114J16294q6087J9047k101P5793j57068J12300
7858B86618O0801r9294k650j46244K3559J69736Q3366q8838J1208K7199O3840
7847C89301m2719n6859j59985Q6468j86290j00534J68895L2812N3313J57402R6941
7836D38745j42102q46R9835n7144r2214J54533r3495n9145M5996K6099J83843
7825E04105r1405r2645q8063J09011J36880n4624r7055J21540k871R7638o9072
$$ plain form
7814 473439 333091 187202 211112 272914 420977 444655 245125 368340 284908 300578 301177
7803 301177 358983 404094 410105 305886 448330 174913 119164 253132 383618 349677 460756
7792 460756 442386 395928 445144 521411 445729 311682 385302 472086 525687 582371 537906
7781 537906 488100 380942 319326 479638 562009 517309 538442 612400 651600 468476 464066
7770 464066 564981 667278 486858 632624 666778 546779 371298 465585 480404 469444
7760 469444 583303 536764 577709 530018 518442 487134 451127 504489 494838 521115 545530 325112
7748 325112 596207 473404 474205 567814 517811 555726 823396 602585 617528 693800 681262
7737 681262 677570 694735 828643 794999 708943 697002 549152 454606 470675 602286 503799
$$ packed form
7814D73439j40348j45889K3910O1802J48063K3678j99530J23215q3432J5670N99
7803C01177N7806M5111O011j04219J42444k73417n5749J33968J30486l3941J11079
7792D60756j8370m6458M9216P6267p5682j34047P3620Q6784N3601N6684m4465
7781E37906m9806j07158o1616J60312Q2371m4700K1133P3958L9200j83124m410
7770D64066J00915J02297j80420J45766L4154j19999j75481R4287J4819j0960
7760D69444J13859m6539M0945m7691j1576l1308l6007N3362r651K6277K4415k20418
7748C25112K71095j22803Q01R3609n0003L7915K67670k20811J4943P6272j2538
7737F81262l692J7165J33908l3644q6056j1941j47850r4546J6069J31611r8487
$$ plain form
7726 503799 469880 667352 733144 777016 663137 643013 647840 628399 631499 730845 781605 773057
7714 773057 873905 863794 753567 795465 790473 693568 711872 716881 806483 705582 890880
7703 890880 979581 864116 998301 991033 978657 925761 984415 961100 961768 878829 874934 948313
7691 948313 990505 1040025 966217 1000771 941256 1045517 1083040 1113712 1103102 1037800 1072986
7680 1072986 1111022 1081124 995212 996250 982073 1097321 1165062 1201539 1198341 1170913 1298272
7669 1298272 1266791 1142105 1108673 1089571 1200986 1257825 1285772 1314088 1314342 1390519 1391080 1358771
7657 1358771 1395654 1271676 1212325 1268932 1306571 1150862 1234437 1390710 1365803 1424788 1376848
7646 1376848 1287180 1320940 1558662 1532651 1465985 1533914 1763905 1636226 1604285 1779064 1728093
$$ packed form
7726E03799l3919J97472O5792M3872j13879k0124M827j9441L100R9346N0760q548
7714G73057J00848j0111j10227M1898m992r6905J8304N009Q9602j00901J85298
7703H90880Q8701j15465J34185p268j2376n2896N8654k3315O68q2939l895P3379
7691I48313M2192M9520p3808L4554n9515J04261L7523L0672j0610o5302L5186
7680A072986L8036k9898q5912J038j4177J15248O7741L6477l198k7428J27359
7669A298272l1481j24686l3432j9102J11415N6839K7947K8316K54P6177N61l2309
7657A358771L6883j23978n9351N6607L7639j55709Q3575J56273k4907N8985m7940
7646A376848q9668L3760K37722k6011o6666O7929K29991j27679l1941J74779n0971
$$ plain form
7635 1728093 1696798 1828150 1542714 1474497 1657348 1716402 1846660 1747409 1817282 1821701 1815503
7624 1815503 1807818 1808272 1762587 1740771 1732193 1888479 1970545 2062056 1903822 1929864 1983659 2080670
7612 2080670 2172595 2092551 2069199 2007618 2129418 2253797 2396008 2357546 2428639 2586791 2432273
7601 2432273 2360522 2310031 2538447 2680081 2703169 2501848 2480021 2605355 2717103 2802272
7591 2802272 2893153 2853235 2733101 2672597 2838030 2815130 2711559 2780423 2893374 3016315
7581 3016315 3103948 3062439 3229142 3265607 3223236 3334641 3244777 3341198 3418880 3382486 3447005
7570 3447005 3392588 3400099 3595281 3650354 3662760 3658777 3751899 3804656 3936161 3960504 3958217 3821859
7558 3821859 3955863 4239238 4330325 4088042 4239468 4552627 4336920 4370934 4676363 4661729
$$ packed form
7635A728093l1295J31352k85436o8217J82851N9054J30258r9251O9873M419o198
7624A815503p685M54m5685k1816q578J56286Q2066R1511j58234K6042N3795R7011
7612B080670R1925q0044k3352o1581J21800J24379J42211l8462P1093J58152j54518
7601B432273p1751n0491K28416J41634K3088k01321k1827J25334J11748Q5169
7591B802272R0881l9918j20134o0504J65433k2900j03571O8864J12951J22941
7581C016315Q7633m1509J66703L6465m2371J11405q9864R6421P7682l6394O4519
7570C447005n4417P511J95182N5073J2406l983R3122N2757J31505K4343k287j36358
7558C821859J34004K83375R1087k42283J51426L13159k15707L4014L05429j4634
$$ plain form
7548 4661729 4743569 4799022 4833010 4946203 5070428 5067778 5067304 5246744 5289931 5323971 5463580
7537 5463580 5576137 5578744 5601165 5942913 5907908 5813147 6123454 6309698 6421098 6512356 6388340
7526 6388340 6539470 6739698 6798671 6633281 6840176 7034890 7112488 7304389 7546093 7559623
7516 7559623 7587910 7743150 7902700 8217036 8354029 8437393 8659459 8731661 8801739 8969027
7506 8969027 9133656 9346991 9451186 9567577 9727278 10078715 10167405 10407926 10585174 10749058
7496 10749058 10955404 11112301 11321924 11620360 11652453 11898371 12184533 12414903 12636698 12844315
7486 12844315 13113030 13169807 13373093 13677661 13936178 14172174 14356396 14541932 14817819 15074003
7476 15074003 15447608 15783775 16149446 16346714 16499041 16771183 17173786 17479373 17664816
$$ packed form
7548D661729Q1840N5453L3988J13193J24225k650m74J79440M3187L4040J39609
7537E463580J12557K607K2421L41748l5005r4761L10307J86244J11400R1258j24016
7526F388340J51130K00228N8973j65390K06895J94714P7598J91901K41704J3530
7516G559623K8287J55240J59550L14336J36993Q3364K22066P2202P0078J67288
7506H969027J64629K13335J04195J16391J59701L51437Q8690K40521J77248J63884
7496A0749058K06346J56897K09623K98436L2093K45918K86162K30370K21795K07617
7486A2844315K68715N6777K03286L04568K58517K35996J84222J85536K75887K56184
7476A5074003L73605L36167L65671J97268J52327K72142M02603L05587J85443
$$ plain form
7467 17664816 17998102 18507580 18755201 19067724 19470225 19669456 19929981 20327650 20676551
7458 20676551 20986080 21462833 21772896 22069139 22221468 22531960 22940237 23221834 23423567
7449 23423567 23739348 24032548 24208148 24316866 24712154 25168589 25390170 25595956 25769570
7440 25769570 25992939 26363210 26595437 26822704 27046507 27182822 27365758 27531047 27766137
7431 27766137 27740566 27867129 28011880 27872893 28137751 28228295 28258737 28308812 28183592 28304008
7421 28304008 28364226 28197364 28026044 28015896 28075290 27933443 27783135 27824296 27773681 27747217
7411 27747217 27493243 27312010 27237462 27057439 26961777 26731956 26749092 26478641 26371725 26148813
7401 26148813 26005719 25979001 25722146 25511083 25336909 25182242 24927610 24855906 24657994 24470812
$$ packed form
7467A7664816L33286N09478K47621L12523M02501J99231K60525L97669L48901
7458B0676551L09529M76753L10063K96243J52329L10492M08277K81597K01733
7449B3423567L15781K93200J75600J08718L95288M56435K21581K05786J73614
7440B5769570K23369L70271K32227K27267K23803J36315J82936J65289K35090
7431B7766137k5571J26563J44751j38987K64858R0544L0442N0075j25220J20416
7421B8304008O0218j66862j71320j0148N9394j41847j50308M1161n0615k6464
7411B7747217k53974j81233p4548j80023r5662k29821J7136k70451j06916k22912
7401B6148813j43094k6718k56855k11063j74174j54667k54632p1704j97912j87182
$$ plain form
7391 24470812 24181943 24149192 23756205 23435609 23406659 23098468 22832965 22624059 22513059 22403045
7381 22403045 22236450 21975925 21804891 21523239 21354305 21193113 21033365 20871915 20719136
7372 20719136 20499946 20247732 20060489 19985195 19760537 19377374 19053701 18821354 18691836 18607359
7362 18607359 18408121 18165599 17988961 17840785 17649975 17434776 17368947 17041804 16678561 16495936
7352 16495936 16439725 16227688 15992152 15928516 15846838 15540441 15289845 14932402 14943811 14783029
7342 14783029 14633124 14492012 14322895 14108016 13871201 13673717 13501538 13508023 13378992 13237239
7332 13237239 13000192 12774498 12461580 12405759 12382730 12225326 12092303 11798202 11636332 11595693
7322 11595693 11590020 11348239 11147102 11001652 11043820 10899421 10707034 10508836 10306137 10268004
$$ packed form
7391B4470812k88869l2751l92987l20596k8950l08191k65503k08906j11000j10014
7381B2403045j66595k60525j71034k81652j68934j61192j59748j61450j52779
7372B0719136k19190k52214j87243p5294k24658l83163l23673k32347j29518q4477
7362A8607359j99238k42522j76638j48176j90810k15199o5829l27143l63243j82625
7352A6495936n6211k12037k35536o3636q1678l06397k50596l57443J1409j60782
7342A4783029j49905j41112j69117k14879k36815j97484j72179O485j29031j41753
7332A3237239k37047k25694l12918n5821k3029j57404j33023k94101j61870m0639
7322A1595693n673k41781k01137j45450M2168j44399j92387j98198k02699l8133
$$ plain form
7312 10268004 10192512 10032087 9830711 9643994 9726893 9683112 9470900 9353449 9327197 9206812
7302 9206812 9050502 8795944 8715088 8764617 8675463 8529859 8338267 8456439 8171507 8032345
7292 8032345 7816521 7662062 7670598 7511211 7441180 7377610 7287263 7233822 7144438 7140059 7208874
7281 7208874 7129701 6904334 6992198 6899819 6769071 6575843 6606480 6460513 6297032 6225687
7271 6225687 6221415 6239110 6228966 6176871 5973193 5826443 5817275 5622676 5714738 5818670 5564812
7260 5564812 5496363 5418210 5307833 5375364 5311627 5126850 5057858 4915362 4841483 4930989 5065960
7249 5065960 5129607 5060390 4948287 4888815 4799275 4820012 4761375 4653759 4661471 4456766 4421228
7238 4421228 4240847 4188089 4255209 4162389 4049384 4148476 4195388 4070808 4061922 3933126 4045622
$$ packed form
7312A0268004p5492j60425k01376j86717Q2899m3781k12212j17451k6252j20385
7302I206812j56310k54558q0856M9529q9154j45604j91592J18172k84932j39162
7292H032345k15824j54459Q536j59387p0031o3570r0347n3441q9384m379O8815
7281G208874p9173k25367Q7864r2379j30748j93228L0637j45967j63481p1345
7271F225687m272J7695j0144n2095k03678j46750r168j94599R2062J03932k53858
7260E564812o8449p8153j10377O7531o3737j84777o8992j42496p3879Q9506J34971
7249E065960O3647o9217j12103n9472q9540K0737n8637j07616P712k04705l5538
7238D421228j80381n2758O7120r2820j13005R9092M6912j24580q886j28796J12496
$$ plain form
7227 4045622 3866655 3915482 4028932 3827873 3754537 3751631 3641671 3773999 3850898 3740218
7217 3740218 3589218 3567881 3447005 3426997 3368588 3491441 3484022 3411590 3265729 3319473 3273373
7206 3273373 3149091 3211759 3230961 3018424 3008650 3152645 3300410 3106162 2891668 2790200
7196 2790200 2945678 3038456 2673729 2773411 2737031 2709848 2807444 2755373 2777746 2903707 2798984
7185 2798984 2866058 2916058 2851131 2711656 2694489 2616327 2487660 2592549 2612566 2405457 2489791
7174 2489791 2474564 2516869 2449892 2471338 2367824 2240244 2213392 2194029 2260110 2209650 2185582
7163 2185582 2164784 2105461 2267788 2133232 1936935 1977715 2028424 2006768 1891425 2022226
7153 2022226 1905147 1864930 1792559 1888422 1933435 1925003 1971142 1979985 1895149 1675025 1718113
$$ packed form
7227D045622j78967M8827J13450k01059p3336k906j09960J32328P6899j10680
7217C740218j51000k1337j20876k0008n8409J22853p419p2432j45861N3744m6100
7206C273373j24282O2668J9202k12537r774J43995J47765j94248k14494j01468
7196B790200J55478R2778l64727R9682l6380k7183R7596n2071K2373J25961j04723
7185B798984O7074N0000o4927j39475j7167p8162j28667J04889K0017k07109Q4334
7174B489791j5227M2305o6977K1446j03514j27580k6852j9363O6081n0460k4068
7163B185582k0798n9323J62327j34556j96297M0780N0709k1656j15343J30801
7153B022226j17079m0217p2371R5863M5013q432M6139Q843q4836k20124M3088
$$ plain form
7142 1718113 1806037 1780472 1715227 1748382 1714725 1846429 1946075 1711717 1666269 1680947 1607224
7131 1607224 1651734 1619387 1529294 1750314 1547444 1437563 1513937 1451466 1502019 1569058 1428278
7120 1428278 1546037 1642254 1490243 1528927 1476793 1543287 1536232 1638725 1518775 1330866 1340710
7109 1340710 1475773 1422156 1307365 1344092 1324887 1329708 1228991 1276687 1420863 1383718 1328101
7098 1328101 1242907 1189396 1263079 1303136 1181385 1447827 1369823 1286788 1280352 1108488 987909
7087 987909 1026162 1067304 1065738 1242494 1180358 1231164 1229720 1316881 1186637 1061441 1077727
7076 1077727 1176428 1097438 1176934 1124014 1026889 1055478 991779 956893 1045254 978377 1185741
7065 1185741 1124421 1008676 1126295 1004350 948721 951001 732064 714947 880454 957646 941056
$$ packed form
7142A718113Q7924k5565o5245L3155l3657J31704R9646k34358m5448J4678p3723
7131A607224M4510l2347r0093K21020k02870j09881P6374o2471N0553O7039j40780
7120A428278J17759R6217j52011L8684n2134O6494p055J02493j19950j87909R844
7109A340710J35063n3617j14791L6727j9205M821j00717M7696J44176l7145n5617
7098A328101q5194n3511P3683M0057j21751K66442p8004q3035o436j71864j20579
7087I87909L8253M1142j566J76756o2136N0806j444Q7161j30244j25196J6286
7076A077727R8701p8990P9496n2920r7125K8589o3699l4886Q8361o6877K07364
7065A185741o1320j15745J17619j21945n5629K280k18937j7117J65507P7192j6590
$$ plain form
7054 941056 861531 830431 774105 972847 900311 1012231 1012309 1043631 898205 836151 768304 816440
7042 816440 743789 686596 729394 765291 732666 652157 736398 688328 728194 629595 530754 524217
7030 524217 623375 666848 773434 858663 795762 904923 894503 789809 740441 716581 710082
7019 710082 565619 521228 645296 733167 708019 761027 646298 531029 639912 618222 680059
7008 680059 663781 497775 462066 496619 638438 790114 772275 735625 602509 540852 675112
6997 675112 646797 516816 606533 723765 590638 346419 373842 459317 422890 604375 656090
6986 656090 579335 490319 527257 494065 369310 260096 392705 661766 710439 542565 416415
6975 416415 512482 552980 454099 478967 398738 388427 441388 528992 573337 462613 525224
$$ packed form
7054I41056p9525l1100n6326J98742p2536J11920P8L1322j45426o2054o7847M8136
7042H16440p2651n7193M2798L5897l2625q0509Q4241m8070L9866r8599r8841o537
7030E24217R9158M3473J06586Q5229o2901J09161j0420j04694m9368k3860o499
7019G10082j44463m4391J24068Q7871k5148N3008j14729j15269J08883k1690O1837
7008F80059j6278j66006l5709L4553J41819J51676j7839l6650j33116o1657J34260
6997F75112k8315j29981Q9717J17232j33127k44219K7423Q5475l6427J81485N1715
6986F56090p6755q9016L6938l3192j24755j09214J32609K69061M8673j67874j26150
6975D16415R6067M0498r8881K4868q0229j0311N2961Q7604M4345j10724O2611
$$ plain form
6964 525224 508553 425049 313563 344445 392538 511449 557193 577178 568233 504102 566512
6953 566512 533364 275928 348035 413215 509277 612743 700276 668988 358020 390307 380484
6942 380484 177096 86011 235449 241807 164284 232927 62013 279919 421711 506532 508694
6931 508694 420013 496124 467767 436861 334065 412647 430218 488178 469279 423070 200383
6920 200383 333095 409252 498140 531445 418586 582450 479522 455699 462724 317594 432419
6909 432419 394769 487426 390151 264850 435663 387946 371242 357706 224667 359375 346826
6898 346826 350509 352006 363711 329343 202344 183238 268524 387199 275021 281245 359967 387801
6886 387801 326204 381824 358286 207166 309703 339030 364566 312410 417209 607661 384045
$$ packed form
6964E25224j6671q3504j11486L0882M8093J18911M5744J9985q945o4131O2410
6953E66512l3148k57436P2107O5180R6062J03466Q7533l1288l10968L2287r823
6942C80484k03388r1085J49438O358p7523O8643j70914K17906J41792Q4821K162
6931E08694q8681P6111k8357l0906j02796P8582J7571N7960j8899m6209k22687
6920B00383J32712P6157Q8888L3305j12859J63864j02928k3823P025j45130J14825
6909D32419l7650R2657r7275j25301J70813m7717j6704j3536j33039J34708j2549
6898C46826L683J497J1705l4368j26999j9106Q5286J18675j12178O224P8722K7834
6886C87801o1597N5620k3538j51120J02537K9327K5536n2156J04799J90452k23616
$$ plain form
6875 384045 393945 370790 367486 246264 202435 193961 144961 185376 198029 113970 235447 278426
6863 278426 247195 221455 109491 101816 273553 296368 354161 276491 161622 235701 365056
6852 365056 403015 304581 378906 470411 283724 358559 410761 365949 331735 289565 168623
6841 168623 247110 341558 150134 242343 329711 230497 82482 82944 170166 357627 342924
6830 342924 330356 258036 304369 142959 241796 203145 186274 245370 260137 203273 335884
6819 335884 269152 334315 445353 259128 136782 55543 197963 118428 209964 303442 145539
6808 145539 109606 244268 244683 189673 250174 242790 230582 239011 300697 224056 282071 354339
6796 354339 368037 329096 146994 97671 19525 4527 -1237 96356 171680 195975 66073
$$ packed form
6875C84045R900k3155l304j21222m3829q474m9000M0415J2653q4059J21477M2979
6863B78426l1231k5740j11964p675J71737K2815N7793p7670j14869P4079J29355
6852C65056L7959r8434P4325R1505j86687P4835N2202m4812l4214m2170j20942
6841A68623P8487R4448j91424R2209Q7368r9214j48015M62Q7222J87461j4703
6830C42924j2568p2320M6333j61410R8837l8651j6871N9096J4767n6864J32611
6819C35884o6732O5163J11038j86225j22346q1239J42420p9535R1536R3478j57903
6808A45539l5933J34662M15n5010O0501p384j2208Q429O1686p6641N8015P2268
6796C54339J3698l8941j82102m9323p8146j4998n764R7593P5324K4295j29902
$$ plain form
6785 66073 56128 5621 154175 244576 251033 269678 320032 319297 271603 363827 388269 416126
6773 416126 584576 541983 470799 471534 516992 319382 335851 347607 327402 162882 187049
6762 187049 173112 159097 222054 133541 247179 170229 254322 178497 173137 250986 171201 135014
6750 135014 303921 384258 150995 -35666 72755 158541 42984 99838 101822 152764 50986
6739 50986 231294 330012 209860 76332 175811 386269 213811 251500 124248 184827 205199
6728 205199 106346 136621 152404 158604 130864 130856 136888 123063 255831 322389 298463 216482 140277
6715 140277 247307 250461 64680 116081 156410 112813 111713 176602 68316 9357 120451
6704 120451 277302 346586 269566 115996 164431 284748 202348 73468 -39514 -78023 7365
$$ packed form
6785F6073r945n0507J48554R0401O457J8645N0354p35m7694R2224K4442K7857
6773D16126J68450m2593p1184P35M5458j97610J6469J1756k0205j64520K4167
6762A87049j3937j4015O2957q8513J13638p6950Q4093p5825n360P7849p9785l6187
6750A35014J68907Q0337k33263j86661J08421Q5786j15557N6854J984N0942j01778
6739E0986J80308R8718j20152j33528R9479K10458j72458L7689j27252O0579K0372
6728B05199r8853L0275J5783O200k7740qO032j3825J32768O6558k3926q1981p6205
6715A40277J07030L154j85781N1401M0329m3597j100O4889j08286n8959J11094
6704A20451J56851O9284p7020j53570M8435J20317q2400j28880j12982l8509Q5388
$$ plain form
6693 7365 71043 230144 158210 98174 191768 207542 138068 162993 228386 317708 214032 231810
6681 231810 100311 130795 202891 105314 125720 97706 74445 128080 17345 -47981 32084
6670 32084 15467 61358 102562 127991 59560 -56046 44127 85560 50072 129770 159435
6659 159435 -25360 196564 281485 201181 237968 132294 139621 136291 135278 89301 169275 91897
6647 91897 174293 97709 129628 188930 275428 191868 76400 119877 169782 180896 125899 73289
6635 73289 155952 -932 -19709 26398 226328 280966 324544 167863 120427 254128 103300
6624 103300 72769 158176 113921 100862 133460 15190 53369 104301 117685 183849 164723
6613 164723 151638 291195 229312 102028 -744 -169696 -26769 15098 23884 121121 117098
$$ packed form
6693G365O3678J59101p1934o0036R3594J5774o9474K4925O5393Q9322j03676J7778
6681B31810j31499L0484P2096r7577K0406k8014k3261N3635j10735o5326Q0065
6670C2084j6617M5891M1204K5429o8431j15606J00173M1433l5488P9698K9665
6659A59435j84795K21924Q4921q0304L6787j05674P327l330j013m5977P9974p7378
6647I1897Q2396p6584L1919N9302Q6498q3560j15468M3477M9905J1114n4997n2610
6635G3289Q2663j56884j8777M6107J99930N4638M3578j56681m7436J33701j50828
6624A03300l0531Q5407m4255j3059L2598j18270L8179N0932J3384O6164j9126
6613A64723j3085J39557o1883j27284j02772j68952J42927M1867Q786R7237m023
$$ plain form
6602 117098 95931 65818 119218 112340 164617 191552 133070 73424 47879 103784 77522 79828
6590 79828 115426 110728 163143 210682 188231 107815 69836 106391 235540 226255 207663 178659
6578 178659 94379 259749 275895 163910 144237 198917 196870 96661 50206 173788 210609
6567 210609 125528 228345 66822 49410 88238 228188 397874 312037 198871 136313 110021
6556 110021 299373 364360 198564 23635 23226 37934 31708 33215 204335 283536 300810 300441
6544 300441 233941 344433 296617 222445 269772 128134 166551 157003 15513 -84506 -31956
6533 -31956 98879 -405 7613 -19586 -63715 124302 295079 245863 272529 347754 402446
6522 402446 250199 173985 218727 173729 138544 156954 338312 232059 143500 216518 115733
$$ packed form
6602A17098k1167l0113N3400o878N2277K6935n8482n9646k5545N5905k6262K306
6590G9828L5598m698N2415M7539k2451q0416l7979L6555J29149r285j8592k9004
6578A78659q4280J65370J6146j11985j9673N4680k047j00209m6455J23582L6821
6567B10609q5081J02817j61523j7412L8828J39950J69686q5837j13166o2558k6292
6556A10021J89352O4987j65796j74929m09J4708o226J507J71120P9201J7274l69
6544C00441o6500J10492m7816p4172M7327j41638L8417r548j41490j00019N2550
6533c1956J30835r9284Q018k7199m4129J88017J70777m9216K6666P5225N4692
6522D02446j52247p6214M4742m4998l5185J8410J81358j06253q8559P3018j00785
$$ plain form
6511 115733 104685 131123 158460 153133 175356 252910 434847 288294 181233 170670 164604
6500 164604 280230 399184 391079 287686 41559 80105 319981 339329 158876 -60419
6490 -60419 69152 246054 369726 377383 253655 225593 237972 274339 298038 239748 307819
6479 307819 182357 122269 293320 360641 232152 360242 395582 395120 367099 316850 226849
6468 226849 262077 324373 430957 346166 237582 271015 247191 491796 651371 740838 664087
6457 664087 591115 604879 463242 527575 496227 519508 604459 484638 581592 423947 544853
6446 544853 751677 918309 875599 884834 1095038 1153767 1263765 1304762 1173207 1140139 1384998
6435 1384998 1373553 1507517 1572025 1693367 1710966 1760579 1600853 1564880 1682283 1450661
$$ packed form
6511A15733j1048K6438K7337n327K2223P7554J81937j46553j07061j0563o066
6500A64604J15626J18954q105j03393k46127L8546K39876J9348j80453k19295
6490f0419J29571J76902J23672P657j23728k8062J2379L6367K3699n8290O8071
6479C07819j25462o0088J71051O7321j28489J28090L5340m62k8021n0249r0001
6468B26849L5228O2296J06584q4791j08584L3433k3824K44605J59575Q9467p6751
6457F64087p2972J3764j41637O4333l1348K3281Q4951j19821R6954j57645J20906
6446E44853K06824J66632m2710R235K10204N8729J09998M0997j31555l3068K44859
6435A384998j1445J33964O4508J21342J7599M9613j59726l5973J17403k31622
$$ plain form
6425 1450661 1341854 1228608 1216525 1075208 1046848 945686 841238 858623 764891 631019
6415 631019 820390 747090 684477 667311 571714 661954 678734 708434 611113 785822 730631
6404 730631 511598 669960 769710 723068 649462 657220 555222 669864 593252 755595 758929
6393 758929 550395 744446 775032 686764 657306 592008 682617 867893 1032202 918977 750310
6382 750310 727624 600507 621806 760850 739257 692399 632092 660727 695593 619330 669795
6371 669795 616962 669348 714792 875517 840050 775290 716574 729260 770970 866660 918781
6360 918781 771224 805667 885120 748743 634886 630642 576652 598318 583828 786782 942545
6349 942545 809631 791631 939816 872133 813634 789990 872206 893404 801914 810714 658980
$$ packed form
6425A450661j08807j13246j2083j41317k8360j01162j04448J7385r3732j33872
6415F31019J89371p3300o2613j7166r5597R0240J6780K9700r7321J74709n5191
6404G30631k19033J58362R9750m6642p3606P758j01998J14642p6612J62343L334
6393G58929k08534J94051L0586q8268k9458o5298R0609J85276J64309j13225j68667
6382G50310k2686j27117K1299J39044k1593m6858o0307K8635L4866p6263N0465
6371F69795n2833N2386M5444J60725l5467o4760n8716J2686M1710R5690N2121
6360I18781j47557L4443P9453j36377j13857m244n3990K1666j4490K02954J55763
6349I42545j32914j8000J48185o7683n8499k3644Q2216K1198r1490Q800j51734
$$ plain form
6338 658980 601560 611712 652720 642985 678578 678772 753293 823332 722284 912798 1007850 1004163
6326 1004163 1009779 1105921 1143178 913145 942870 1038243 1088626 1199210 1145432 1178824 1097838
6315 1097838 984878 1006173 1049484 1014172 942142 906414 833489 750756 968513 1148355 1047094
6304 1047094 893103 993501 961706 1012721 1074433 949058 1008630 1113668 1336911 1248976
6294 1248976 1229207 1359309 1447932 1507953 1436490 1382627 1205999 1355700 1740942 1652518 1624842
6283 1624842 1507917 1424876 1472533 1564923 1506280 1530941 1465059 1607751 1513003 1493507 1639248
6272 1639248 1506779 1398205 1612524 1581704 1483215 1612443 1695029 1722258 1863566 1873402 1971438
6261 1971438 1969421 1952649 1993314 2156593 2329788 2270047 2116608 2265491 2387198 2497891
$$ packed form
6338F58980n7420J0152M1008r735L5593J94P4521P0039j01048J90514R5052l687
6326A004163N616R6142L7257k30033K9725R5373N0383J10584n3778L3392q0986
6315A097838j12960K1295M3311l5312p2030l5728p2925q2733K17757J79842j01261
6304A047094j53991J00398l1795N1015O1712j25375N9572J05038K23243q7935
6294A248976j9769J30102Q8623O0021p1463n3863j76628J49701L85242q8424k7676
6283A624842j16925q3041M7657R2390n8643K4661o5882J42692r4748j9496J45741
6272A639248j32469j08574K14319l0820r8489J29228Q2586K7229J41308R836R8036
6261A971438k017j6772M0665J63279J73195n9741j53439J48883J21707J10693
$$ plain form
6251 2497891 2553556 2390497 2531391 2509543 2583664 2499617 2714392 2847578 2762348 2704529 2898848
6240 2898848 3026462 3075150 3039663 3051310 3045273 3070854 3012850 3194063 3185438 3226904 3313165
6229 3313165 3294666 3408688 3498308 3346183 3532730 3710787 3807290 3729040 3882930 4017096
6219 4017096 3956887 4229355 4395466 4555139 4522850 4902216 4858614 4989362 5204745 5167827
6209 5167827 5231967 5189644 5449366 5676759 5821517 5913983 5914429 6056597 6315394 6368964 6305651
6198 6305651 6459139 6702113 6855391 7065969 7201304 7476795 7766457 7890723 8068703 8330345
6188 8330345 8519903 8683284 8791112 9293278 9615742 9803348 10057957 10229354 10574807 11027986
6178 11027986 11292614 11589088 12025041 12105328 12427537 12883743 13267650 13516325 13881414 14272170
$$ packed form
6251B497891N5665j63059J40894k1848P4121q4047K14775J33186q5230n7819J94319
6240B898848J27614M8688l5487J1647o037K5581n8004J81213q625M1466Q6261
6229C313165j8499J14022Q9620j52125J86547J78057R6503p8250J53890J34166
6219D017096o0209K72468J66111J59673l2289L79366m3602J30748K15383l6918
6209E167827O4140m2323K59722K27393J44758R2466M46J42168K58797N3570o3313
6198F305651J53488K42974J53278K10578J35335K75491K89662J24266J77980K61642
6188H330345J89558J63381J07828N02166L22464J87606K54609J71397L45453M53179
6178A1027986K64628K96474M35953Q0287L22209M56206L83907K48675L65089L90756
$$ plain form
6168 14272170 14864210 15213124 15477381 15864079 16355566 16828677 17349270 17854573 18412131
6159 18412131 18971182 19524677 20257205 20895288 21422771 22034108 22959189 23902311 24606862
6150 24606862 25390510 26507041 27726522 29022292 30424366 31781257 33218520 34852680
6142 34852680 36714331 38518333 40524191 42353686 44407817 46633332 48979445 51727033
6134 51727033 54516481 57550108 60950949 64499130 68387557 72948071 77781046 83374325
6126 83374325 89493064 96633795 104988847 114070597 124301621 136004168 149096187 163682409
6118 163682409 179869637 197374298 215871243 234750980 252887763 268787475 280644853
6111 280644853 287033309 286924946 280203290 267706626 251270094 232543252 213020384 193949114
$$ packed form
6168A4272170N92040L48914K64257L86698M91487M73111N20593N05303N57558
6159A8412131N59051N53495P32528O38083N27483O11337R25081R43122P04551
6150B4606862P83648J116531J219481J295770J402074J356891J437263J634160
6142C4852680J861651J804002K005858J829495K054131K225515K346113K747588
6134E1727033K789448L033627L400841L548181L888427M560514M832975N593279
6126H3374325O118739P140731Q355052R081750J0231024J1702547J3092019J4586222
6118A63682409J6187228J7504661J8496945J8879737J8136783J5899712J1857378
6111B80644853O388456j08363o721656j2496664j6436532j8726842j9522868j9071270
$$ plain form
6103 193949114 176168764 159834479 145144847 132291884 121024388 111024955 102247522
6096 102247522 94652087 87864336 81842250 76454348 71271040 66883860 63001357 59232977
6088 59232977 55848545 52798259 50069737 47611645 45345250 43047976 40762749 38884936
6080 38884936 37254760 35468827 33916403 32594613 31392851 30135911 29045130 28136880
6072 28136880 27082297 25970559 25197807 24336176 23555689 22550307 21746859 21017455 20264720
6063 20264720 19510734 18792845 18165890 17524058 17029358 16303418 15780139 15156767 14646104
6054 14646104 14301628 13780725 13246465 12835977 12501797 12172761 11926569 11514264 11088034
6045 11088034 10802417 10670752 10242188 9762506 9412332 9134028 8903683 8449515 8182774
$$ packed form
6103A93949114j7780350j6334285j4689632j2852963j1267496r999433q777433
6096A02247522p595435o787751o022086n387902n183308m387180l882503l768380
6088E9232977l384432l050286k728522k458092k266395k297274k285227j877813
6080C8884936j630176j785933j552424j321790j201762j256940j090781r08250
6072B8136880j054583j111738p72752q61631p80487j005382q03448p29404p52735
6063B0264720p53986p17889o26955o41832m94700p25940n23279o23372n10663
6054A4646104l44476n20903n34260m10488l34180l29036k46192m12305m26230
6045A1088034k85617j31665m28564m79682l50174k78304k30345m54168k66741
$$ plain form
6036 8182774 8001064 7912129 7603326 7332598 7107857 6950393 6858391 6604116 6521651 6426716
6026 6426716 6219088 6205439 6017652 5813454 5648079 5307584 5186127 4991936 4815162 4730677
6016 4730677 4596749 4468020 4379826 4254130 4125796 4132962 3888667 3817286 3712580 3618088
6006 3618088 3530101 3410187 3382196 3402956 3534645 3406729 3450525 3398046 3324433 3378213 3303178
5995 3303178 3172966 3028959 3128219 2996715 2993287 3115608 2839120 2883102 2894531 2724229
5985 2724229 2755245 2683705 2536299 2384355 2304777 2382156 2174288 2133146 2170624 2194748 2320232
5974 2320232 2173535 2168367 2135870 1981375 1920898 1877713 1960963 2048138 2073470 1955874 1930930
5963 1930930 1840845 1743936 1817607 1847209 1927101 1782275 1774729 1985624 2020282 1784865 1713154
$$ packed form
6036H182774j81710q8935l08803k70728k24741j57464r2002k54275q2465r4935
6026F426716k07628j3649j87787k04198j65375l40495j21457j94191j76774q4485
6016D730677j33928j28729q8194j25696j28334P166k44295p1381j04706r4492
6006C618088q7987j19914k7991K0760J31689j27916M3796n2479p3613N3780p5035
5995C303178j30212j44007R9260j31504l428J22321k76488M3982J1429j70302
5985B724229L1016p1540j47406j51944p9578P7379k07868m1142L7478K4124J25484
5974B320232j46697n168l2497j54495o0477m3185Q3250Q7175K5332j17596k4944
5963A930930r0085r6909P3671K9602P9892j44826p546K10895L4658k35417p1711
$$ plain form
5952 1713154 1784094 1628842 1399146 1492392 1509402 1525180 1335034 1350943 1388920 1266346 1323919
5941 1323919 1329313 1272122 1189171 1268951 1070263 1092102 978393 905426 844347 976661 976389
5930 976389 910193 1045300 1028137 1077630 1115699 861077 875212 1056156 1039780 1045972 886869
5919 886869 904668 921811 955164 1005737 982806 956659 823654 887449 931150 841372 892778
5908 892778 805058 835509 816544 885092 916710 936803 882298 741521 743041 741149 709214 613591
5896 613591 608842 538267 556304 508402 427178 508772 560226 576294 723353 716460 450672 324610
5884 324610 366781 406006 369387 325302 385660 351571 340170 425697 356414 473305 458400
5873 458400 459846 330830 468465 335766 209459 173934 87666 389349 306271 385412 340167
$$ packed form
5952A713154P0940j55252k29696R3246J7010J5778j90146J5909L7977j22574N7573
5941A323919N394n7191q2951P9780j98688K1839j13709p2967o1079J32314k72
5930I76389o6196J35107j7163M9493L8069k54622J4135J80944j6376O192j59103
5919H86869J7799J7143L3353N0573k2931k6147j33005O3795M3701q9778N1406
5908H92778q7720L0451j8965O8548L1618K0093n4505j40777J520j892l1935r5623
5896F13591m749p0575J8037m7902q1224Q1594N1454J6068J47059o893k65788j26062
5884C24610M2171L9225l6619m4085O0358l4089j1401Q5527o9283J16891j4905
5873D58400J446j29016J37635j32699j26307l5525q6268L01683q3078P9141m5245
$$ plain form
5862 340167 344507 161106 153743 192303 228865 299441 199345 222153 279023 374224 414211 419570
5850 419570 386153 337674 369657 346615 331320 347436 304866 279186 219200 240196 97163
5839 97163 212661 402150 202660 188821 160700 252100 412081 350267 397085 415320 442799
5828 442799 394497 378165 401042 203001 -8280 83158 128154 205278 407443 625285 656765
5817 656765 569736 568362 544628 458939 482623 640427 719960 594094 684202 549059 502726
5806 502726 754330 756900 609204 683482 746083 796118 855561 826408 845019 863844 875747
5795 875747 964669 1164562 1207822 1185527 1187591 1252818 1386892 1262391 1427319 1646873 1573872
5784 1573872 1615333 1513515 1401024 1441759 1321231 1202226 1070705 1045685 957031 848912
$$ packed form
5862C40167M340j83401p363L8560L6562P0576j00096K2808N6870R5201L9987N359
5850D19570l3417m8479L1983k3042j5295J6116m2570k5680n9986K0996j43033
5839I7163J15498J89489j99490j3839k8121R1400J59981o1814M6818J8235K7479
5828D42799m8302j6332K2877j98041k11281R1438M4996P7124K02165K17842L1480
5817F56765q7029j374k3734q5689K3684J57804P9533j25866R0108j35143m6333
5806E02726K51604K570j47696P4278O2601N0035N9443k9153J8611J8825J1903
5795H75747Q8922J99893M3260k2295K064O5227J34074j24501J64928K19554p3001
5784A573872M1461j01818j12491M0735j20528j19005j31521k5020q8654j08119
$$ [...]
##END NTUPLES=NMR SPECTRUM
##END=
