##TITLE=1H_74-2024
 CDCl3
 8 sc, 
 9.9.2024
##JCAMPDX= 6.0         $$ Bruker NMR JCAMP-DX V2.0
##DATA TYPE= NMR FID
##DATA CLASS= NTUPLES
##ORIGIN= UXNMR, Bruker Analytische Messtechnik GmbH
##OWNER= root
$$ XWIN-NMR		Version 3.5
$$ Mon Sep  9 15:53:31 2024 Russian Standard Time (UT+4h)  she@DPX200
##.OBSERVE FREQUENCY= 200.1318
##.OBSERVE NUCLEUS= ^1H
##.DELAY= (6, 6)
##.ACQUISITION MODE= SIMULTANEOUS
##.ACQUISITION SCHEME= undefined
##.AVERAGES= 8
##.DIGITISER RES= 18
##SPECTROMETER/DATA SYSTEM= spect
##.PULSE SEQUENCE= zg30
##.SOLVENT NAME= CDCl3
##.SHIFT REFERENCE= (INTERNAL, CDCl3, 0, 15.7039)
##AUDIT TRAIL= $$ (NUMBER, WHEN, WHO, WHERE, WHAT)
$$ ##TITLE= Audit trail, XWIN-NMR		Version 3.5
$$ ##JCAMPDX= 5.01
$$ ##ORIGIN= Bruker BioSpin GmbH
$$ ##OWNER= she
$$ F:/spectra/data/she/nmr/H-F/1/audita.txt
$$ ##AUDIT TRAIL=  $$ (NUMBER, WHEN, WHO, WHERE, WHAT)
(   1,<2024-09-09 15:52:24.90 +0400>,<she>,<DPX200>,
      <created by zg, POWCHK disabled, PULCHK disabled
       configuration hash MD5:
       00 E9 B6 7A A2 85 ED C7 34 08 36 98 17 FE 4E 26
       data hash MD5: 16K
       8B 65 5A 19 E6 15 CD E3 41 1E E4 1F D6 83 F6 90>)
$$ ##END=
$$ 
$$ hash MD5
$$ 07 63 50 AC 13 06 C8 9A 7E F5 F0 14 3B 84 30 41
##$RELAX= 
##$RELAX= 
##$RELAX= 
##$RELAX= 
##$RELAX= 
##$RELAX= 
$$ Bruker specific parameters
$$ --------------------------
##$DU= <F:/spectra>
##$EXPNO= 1
##$NAME= <H-F>
##$PROCNO= 1
##$TYPE= <nmr>
##$USER= <she>
##$AMP= (0..31)
100 100 100 100 100 100 100 100 100 100 100 100 100 100 100 100 100 100 
100 100 100 100 100 100 100 100 100 100 100 100 100 100 
##$AQSEQ= 0
##$AQ_mod= 1
##$AUNM= <au_zg>
##$AUTOPOS= <>
##$BF1= 200.13
##$BF2= 200.13
##$BF3= 200.13
##$BF4= 200.13
##$BF5= 200.13
##$BF6= 200.13
##$BF7= 200.13
##$BF8= 200.13
##$BYTORDA= 1
##$CFDGTYP= 0
##$CFRGTYP= 5
##$CHEMSTR= <none>
##$CNST= (0..31)
1 1 145 1 1 1 1 1 1 1 1 1 1 1 1 1 1 1 1 1 1 1 1 1 1 1 1 1 1 1 1 1 
##$CPDPRG= <>
##$CPDPRG1= <>
##$CPDPRG2= <>
##$CPDPRG3= <>
##$CPDPRG4= <mlev>
##$CPDPRG5= <mlev>
##$CPDPRG6= <mlev>
##$CPDPRG7= <mlev>
##$CPDPRG8= <mlev>
##$CPDPRGB= <>
##$CPDPRGT= <>
##$D= (0..31)
0 1.2 0 0 0 0 0 0 0 0.06 0 0.03 0 0 0 0 0.0002 0 0 0 0 0 0 0 0 0 0 0 0 
0 0 0 
##$DATE= 1725882744
##$DBL= (0..7)
120 120 120 120 120 120 120 120 
##$DBP= (0..7)
150 150 150 150 150 150 150 150 
##$DBP07= 0
##$DBPNAM0= <>
##$DBPNAM1= <>
##$DBPNAM2= <>
##$DBPNAM3= <>
##$DBPNAM4= <>
##$DBPNAM5= <>
##$DBPNAM6= <>
##$DBPNAM7= <>
##$DBPOAL= (0..7)
0.5 0.5 0.5 0.5 0.5 0.5 0.5 0.5 
##$DBPOFFS= (0..7)
0 0 0 0 0 0 0 0 
##$DE= 6
##$DECBNUC= <off>
##$DECIM= 24
##$DECNUC= <off>
##$DECSTAT= 4
##$DIGMOD= 1
##$DIGTYP= 9
##$DL= (0..7)
0 120 120 120 120 120 120 120 
##$DP= (0..7)
150 150 150 150 150 150 150 150 
##$DP07= 0
##$DPNAME0= <>
##$DPNAME1= <>
##$DPNAME2= <>
##$DPNAME3= <>
##$DPNAME4= <>
##$DPNAME5= <>
##$DPNAME6= <>
##$DPNAME7= <>
##$DPOAL= (0..7)
0.5 0.5 0.5 0.5 0.5 0.5 0.5 0.5 
##$DPOFFS= (0..7)
0 0 0 0 0 0 0 0 
##$DQDMODE= 0
##$DR= 18
##$DS= 0
##$DSLIST= <SSSSSSSSSSSSSSS>
$$ [...]
##$SUBNAM2= <"">
##$SUBNAM3= <"">
##$SUBNAM4= <"">
##$SUBNAM5= <"">
##$SUBNAM6= <"">
##$SUBNAM7= <"">
##$SUBNAM8= <"">
##$SUBNAM9= <"">
##$SW= 24.0689170037331
##$SWIBOX= (0..15)
0 0 2 0 0 0 0 0 0 0 0 0 0 0 0 0 
##$SW_h= 4816.95568400771
##$TD= 16384
##$TD0= 1
##$TE= 0
##$TE2= 300
##$TE3= 300
##$TEG= 300
##$TL= (0..7)
0 120 120 120 120 120 120 120 
##$TP= (0..7)
150 150 150 150 150 150 150 150 
##$TP07= 0
##$TPNAME0= <>
##$TPNAME1= <>
##$TPNAME2= <>
##$TPNAME3= <>
##$TPNAME4= <>
##$TPNAME5= <>
##$TPNAME6= <>
##$TPNAME7= <>
##$TPOAL= (0..7)
0.5 0.5 0.5 0.5 0.5 0.5 0.5 0.5 
##$TPOFFS= (0..7)
0 0 0 0 0 0 0 0 
##$TUNHIN= 0
##$TUNHOUT= 0
##$TUNXOUT= 0
##$USERA1= <user>
##$USERA2= <user>
##$USERA3= <user>
##$USERA4= <user>
##$USERA5= <user>
##$V9= 5
##$VALIST= <valist>
##$VCLIST= <CCCCCCCCCCCCCCC>
##$VD= 0
##$VDLIST= <DDDDDDDDDDDDDDD>
##$VPLIST= <PPPPPPPPPPPPPPP>
##$VTLIST= <TTTTTTTTTTTTTTT>
##$WBST= 1024
##$WBSW= 4
##$XGAIN= (0..3)
0 0 0 0 
##$XL= 0
##$YL= 0
##$YMAX_a= 82948
##$YMIN_a= -75508
##$ZGOPTNS= <>
##$ZL1= 120
##$ZL2= 120
##$ZL3= 120
##$ZL4= 120
##$ABSF1= 10
##$ABSF2= 0
##$ABSG= 5
##$ABSL= 3
##$ALPHA= 0
##$AQORDER= 0
##$ASSFAC= 0
##$ASSFACI= 0
##$ASSFACX= 0
##$ASSWID= 0
##$AUNMP= <proc_1d>
##$AZFE= 0.1
##$AZFW= 0.1
##$BCFW= 1
##$BC_mod= 2
##$BYTORDP= 1
##$COROFFS= 0
##$CY= 11.3945322036743
##$DATMOD= 1
##$DC= 2
##$DFILT= <>
##$DTYPP= 0
##$F1P= 15.6554695791079
##$F2P= 12.8336369535428
##$FCOR= 0.5
##$FTSIZE= 0
##$FT_mod= 4
##$GAMMA= 1
##$GB= 0.15
##$INTBC= 1
##$INTSCL= 1
##$ISEN= 128
##$LB= 0.24
##$LEV0= 0
##$LPBIN= 0
##$MAXI= 10000
##$MC2= 0
##$MEAN= 0
##$ME_mod= 0
##$MI= 1.114404
##$NCOEF= 0
##$NC_proc= 0
##$NLEV= 6
##$NOISF1= 3.799351
##$NOISF2= 2.8
##$NSP= 1
##$NTH_PI= 0
##$NZP= 0
##$OFFSET= 15.70392
##$PC= 1
##$PHC0= -25993.46
##$PHC1= 12.78748
##$PH_mod= 1
##$PKNL= yes
##$PPARMOD= 0
##$PSCAL= 0
##$PSIGN= 0
##$REVERSE= no
##$SF= 200.130013532006
##$SI= 16384
##$SIGF1= 3
##$SIGF2= 2
##$SINO= 400
##$SIOLD= 16384
##$SREGLST= <1H.CDCl3>
##$SSB= 0
##$STSI= 0
##$STSR= 0
##$SW_p= 3612.71676300578
##$SYMM= 0
##$S_DEV= 0
##$TDeff= 0
##$TDoff= 0
##$TI= <>
##$TILT= no
##$TM1= 0
##$TM2= 0
##$TOPLEV= 0
##$USERP1= <user>
##$USERP2= <user>
##$USERP3= <user>
##$USERP4= <user>
##$USERP5= <user>
##$WDW= 1
##$XDIM= 8192
##$YMAX_p= 0
##$YMIN_p= 0
$$ End of Bruker specific parameters
$$ ---------------------------------
##NTUPLES= NMR FID
##VAR_NAME=  TIME,          FID/REAL,        FID/IMAG
##SYMBOL=    X,             R,               I
##VAR_TYPE=  INDEPENDENT,   DEPENDENT,       DEPENDENT
##VAR_FORM=  AFFN,          ASDF,            ASDF
##VAR_DIM=   8192,          8192,            8192
##UNITS=     SECONDS,       ARBITRARY UNITS, ARBITRARY UNITS
##FACTOR=    0.0002076,     1,               1
##FIRST=     0,             0,               0
##LAST=      1.7004516,     0,               0
##MIN=       0,             -75508,          0
##MAX=       1.7004516,     82948,           0
$$ Real data points
##PAGE= N=1
##DATA TABLE= (X++(R..R)), XYDATA
$$ [...]
$$ plain form
2224 -603 1489 -598 -17 988 -717 904 152 -361 -40 -899 -230 -144 -915 1159 -79 -502 1141 -823
2242 -823 116 630 -604 742 -372 -812 509 -1323 -198 964 -663 744 890 -524 670 -191
2258 -191 -207 407 -747 210 -422 -890 825 -814 93 1277 -891 472 1026 -1354 696 -343 -562
2275 -562 503 -920 216 57 -967 844 31 -185 1450 -622 -13 804 -782 510 -66 -580 482
2292 482 -799 248 285 -1223 1246 469 -630 1589 -376 -263 740 -650 101 256 -681 470 -659
2309 -659 -25 711 -457 681 738 -767 972 -256 -938 586 -689 -39 388 -683 696 -210 -96
2326 -96 1333 -477 466 856 -1264 180 -126 -1077 565 -734 -601 371 -495 801 -148 -74 1444 -469
2344 -469 -62 294 -1299 28 90 -674 1045 3 156 980 -454 902 244 -667 1068 -292 -816 471
$$ packed form
2224f03K092k087N81J005j705J621p52n13L21q59O69Q6p71K074j238m23J643j964
2242h23R39N14j234J346j114m40J321j832J125J162j627J407J46j414J194q61
2258a91j6O14j154R57o32m68J715j639R07J184k168J363N54k380K050j039k19
2275e62J065j423J136j59j024J811q13k16J635k072O09Q17j586J292n76n14J062
2292D82j281J047L7j508K469p77j099K219j965J13J003j390P51J55r37J151j129
2309f59O34P36j168J138N7j505J739j228o82J524j275O50M27j071J379r06J14
2326i6J429j810R43L90k120J444l06r51J642j299J33R72q66J296r49P4J518j913
2344d69M07L56j593J327O2p64J719j042J53Q24j434J356o58r11J735j360n24J287
$$ plain form
2362 471 -1296 -286 365 -531 728 264 -35 456 -885 349 509 -1136 808 -196 -1047 1037 -486
2379 -486 102 1048 -50 736 -43 -196 655 -661 -63 550 -1094 306 -113 -1148 703 -451 -312 442
2397 442 -700 193 -218 -496 823 -494 52 1037 -1005 -61 619 -955 810 283 -33 882 -374 507
2415 507 224 -852 887 -411 -983 654 -1176 -505 415 -984 829 227 -281 534 -611 -19 139
2432 139 -903 430 -126 -775 829 -117 36 1473 21 708 742 -443 141 -791 -571 281 -1209 86
2450 86 138 -1174 844 -175 -438 755 -445 -71 95 -976 209 -758 -234 903 -387 393 894 -753
2468 -753 702 518 -323 699 -158 -3 -3 -952 359 -57 -534 1071 -710 -257 744 -891 44 405
2486 405 -737 277 -102 -196 163 -704 384 292 -471 1241 -168 -187 1449 -141 540 818 -606 450
$$ packed form
2362D71j767J010O51q96J259m64k99M91j341J234J60j645J944j004q51K084j523
2379d86N88R46j098P86p79j53Q51j316N98O13j644J400m19j035J851j154J39P54
2397D42j142Q93m11k78J319j317N46R85k042R44O80j574J765n27l16R15j256Q81
2415E07k83j076J739j298n72J637j830O71R20j399J813o02n08Q15j145N92J58
2432A39j042J333n56o49J604r46J53J437j452O87L4j185N84r32K20Q52j490J295
2450H6N2j312K018j019k63J193j200L74J66j071J185r67N24J137j290P80N01j647
2468g53J455j84q41J022q57J55%r49J311m16m77J605j781M53J001j635R35L61
2486D05j142J014l79r4L59q67J088r2p63J712j409j9J636j590O81K78j424J056
$$ plain form
2504 450 -303 -657 158 -769 288 339 -885 549 -28 -671 1004 -525 -323 449 -948 93 -461 -424
2522 -424 850 -143 463 1252 -646 873 488 -995 600 -56 -504 326 -694 39 183 -433 593 -211
2540 -211 86 825 -1127 -81 -88 -1423 465 -449 -582 837 -492 401 677 -236 947 329 -265 913
2558 913 -540 -345 398 -773 336 -130 -592 555 -566 -61 761 -805 498 -20 -1201 513 -608
2575 -608 -817 823 -254 280 403 -587 746 -93 338 1091 -453 342 195 -718 678 -386 -421 786
2593 786 -808 146 401 -814 730 -171 -632 783 -1060 -322 489 -1305 110 266 -598 483 142
2610 142 29 244 -152 973 -52 -309 928 -781 -541 260 -1139 283 353 -673 754 -44 -183 662
2628 662 -619 -30 277 -950 200 -178 -707 662 -300 303 718 -88 580 -456 -286 697 -352 510
$$ packed form
2504D50p53l54Q15r27J057N1j224J434n77o43J675j529K02P72j397J041n54L7
2522d24J274r93O06P89j898J519l85j483J595o56m48Q30j020P33J44o16J026q04
2540b11K97P39j952J046pj335J888r14j33J419j329Q93K76r13J183o18n94J178
2558I13j453J95P43j171J109m66m62J147j121N05Q22j566J303n18j181J714j121
2575f08k09J640j077N34J23r90J333q39M31P53j544P95j47r13J396j064l5J207
2593G86j594R54K55j215J544r01m61J415j843P38Q11j794J415J56q64J081l41
2610A42j13K15l96J125j025k57J237j709K40Q01j399J422P0j026J427p98j39Q45
2628F62j281N89L07j227J150l78n29J369r62O03M15q06O68j036J70R83j049Q62
$$ plain form
2646 510 140 -1065 480 309 -1022 1162 -20 -4 622 -555 -69 115 -714 222 -652 -306 243 -984
2664 -984 660 186 -385 1069 -246 -98 560 -664 469 200 -926 852 -437 -493 571 -498 -50
2681 -50 740 -183 474 140 -428 315 -551 49 -135 -610 768 -164 -447 931 -518 247 1095 -577 109
2700 109 -30 -686 411 -568 -137 525 -498 338 493 -468 800 -191 -74 600 -415 -344 -283 -575 406
2719 406 -659 12 922 -640 572 495 -790 978 344 -838 532 -495 -565 105 -405 391 -293 -215
2737 -215 560 -399 -143 407 -541 642 240 -470 621 -683 -92 393 -756 725 310 -607 1204 -48
2755 -48 -242 886 -531 326 350 -660 65 -505 -3 425 -288 493 367 -547 798 -320 -408 818 -777
2774 -777 -219 308 -1119 439 47 -145 840 -152 112 275 -522 543 18 -897 429 -285 -271 228 -496
$$ packed form
2646E10l70j205J545j71j331K184j182J6O26j177M86J84q29R36q74L46N49j227
2664i84J644m74n71J454j315J48O58j224J133k69j126J778j289n6J064j069M48
2681e0P90r23O57l34n68P43q66O00j84m75J378r32k83J378j449P65Q48j672O86
2700A09j39o56J097r79M31O62j023Q36J55r61J268r91J17O74j015P1O1k92R81
2719D06j065O71R10j562J212p7j285J768o34j182J370j027p0O70n10P96o84P8
2737b15P75r59K56N50r48J183m02p10J091j304N91M85j149J481m15r17J811j252
2755d8j94J128j417Q57K4j010P25n70N02M28p13P81j26r14J345j118q8J226j595
2774g77N58N27j427J558l92j92R85r92K64J63p97J065n25r15J326p14J4M99p24
$$ plain form
2793 -496 595 -9 -124 896 -539 147 607 -858 467 379 -1095 260 -131 -609 878 -310 464
2810 464 499 97 618 -335 -276 709 -876 -10 415 -714 357 136 -332 763 -522 237 626 -470 490
2829 490 -262 -793 472 -424 -373 493 -750 37 249 -332 460 -72 251 225 -845 320 -126 -714 819
2848 819 -315 -451 885 -348 117 426 -476 697 -125 -247 334 -944 17 178 -867 417 147 -324
2866 -324 588 -473 16 228 -652 514 -196 -563 710 -575 -160 507 -552 523 378 -550 631 100
2884 100 7 449 -644 196 -18 -483 291 -386 -217 559 -373 211 166 -567 481 -265 -43 198 -832 218
2904 218 190 -909 720 35 -356 1109 -8 -89 546 -473 300 -336 -409 276 -547 -125 387 -859 638
2923 638 374 -595 845 -431 -383 468 -712 43 166 -750 618 -587 -197 856 -425 500 734 -731
$$ packed form
2793d96J091o04j15J020j435O86M60j465J325q8j474J355l91m78J487j188P74
2810D64L5m02N21r53N9R85j585Q66M25j129J071k21m68J095j285P59L89j096R60
2829D90p52n31J265q96N1Q66j243P87K12n81P92n32L23k6j070J165m46n88J533
2848H19j134j36J336j233M65L09r02J173q22j22N81j278R61J61j045J284k70m71
2866c24R12j061M89K12q80J166p10l67J273j285M15O67j059J075j45r28J181n31
2884A00r3M42j093Q40k14m65P74o77J69P76r32N84m5p33J048p46K22K41j030J050
2904B18k8j099J629o85l91J465j117q1O35j019P73o36p3O85q23M22N12j246J497
2923F38k64r69J440j276M8Q51j180P55J23r16J368j205L90J053j281R25K34j465
$$ plain form
2941 -731 615 -181 -387 551 -309 157 177 -500 653 -286 -323 902 -597 75 460 -884 217 -180 -621
2960 -621 381 -329 -150 328 -633 527 150 -170 699 -100 -143 801 -568 164 -8 -616 486 -124 127
2979 127 318 -516 452 266 -464 640 -180 -791 392 -847 -140 259 -701 401 48 -130 885 -450
2997 -450 563 695 -658 412 45 -710 380 -494 76 400 -333 697 36 14 564 -711 -322 427
3015 427 -992 -39 241 -846 441 -150 105 818 -135 564 -7 -483 737 -259 -188 642 -505 24 378
3034 378 -338 561 -30 248 532 -573 59 107 -817 581 1 -679 615 -487 -292 427 -369 278 81
3053 81 -80 514 -568 200 262 -377 483 378 -536 474 -55 88 803 -155 138 247 -417 210 -271 -327
3073 -327 244 -767 25 153 -609 401 30 -150 956 -91 190 207 -402 436 -291 -294 477 -596 242
$$ packed form
2941g31J346p96k06R38q60M66K0o77J153r39l7J225j499O72L85j344J101l97m41
2960f21J002p10J79M78r61J160l77l20Q69p99m3R44j369P32j72o08J102o10K51
2979A27J91q34R68j86p30J104q20o11J183j239P07L99r60J102l53j78J015j335
2997d50J013J32j353J070l67p55J090q74N70L24p33J030o61k2N50j275L89P49
3015D27j419R53K80j087J287n91K55P13r53O99n71m76J220r96P1Q30j147N29L54
3034C78p16Q99n91K78K84j105O32M8r24J398n80o80J294j102J95P19p96O47j97
3053H1j61N94j082P68O2o39Q60j05r14J010n29J43P15r58K93J09o64O27m81n6
3073c27N71j011P92J28p62J010l71j80J106j047K81J7o09Q38p27lP71j073Q38
$$ plain form
3092 242 867 -395 755 391 -271 515 -368 -69 7 -813 60 -505 -721 578 -304 -296 776 -267 373
3111 373 426 -544 291 -397 -105 398 -581 560 527 -327 864 164 -315 891 -422 -137 300 -698 345
3130 345 -189 -459 282 -297 103 570 -340 611 -190 -546 345 -387 -301 260 -413 275 -86 -499 863 -160
3150 -160 29 719 -557 263 280 -652 507 -213 -102 -60 -549 -77 181 -463 424 -238 -162 736 -327 37
3170 37 393 -536 182 24 12 463 -499 155 321 -70 856 140 -322 617 -544 -240 184 -491 352 49
3190 49 -210 332 -453 155 746 -273 711 275 -697 347 -205 -435 508 -486 327 406 -241 686 110 -159
3210 -159 623 -338 -126 177 -866 128 -170 -192 359 -405 -88 -109 -330 741 -45 -356 792 -610 -184
3229 -184 265 -768 389 358 -163 628 -1 157 329 -266 434 48 -418 620 -307 -232 439 -480 410 209
$$ packed form
3092B42O25j262J150l64o62P86q83K99P6q20Q73n65k16J299q82QJ072j043O40
3111C73N3r70Q35o88K92N03r79J141l3q54J191p00m79J206j313K85M37r98J043
3130C45n34k70P41n79M00M67r10R51q01l56Q91p32Q6N61o73O88l61m13J362j023
3150a60J89O90j276Q20J7r32J159p20J11M2m89M72K58o44Q87o62P6Q98j063L64
3170C7L56r29P18j58j2M51r62O54J66l91R26p16m62R39j161L04M24o75Q43l03
3190D9k59N42p85O08N91j019R84m36r72J044n52k30R43r94Q13P9o47R27n76k69
3210a59P82r61K12L03j043R94k98k2N51p64L17k1k21J071p86l11J148j402M26
3229a84M49j033J157l1n21P91o29J58J72n95P00l86m66J038r27P5O71r19Q90k01
$$ plain form
3249 209 -263 306 -422 -77 500 -428 319 374 -708 597 -309 -699 474 38 40 306 -274 332 -41 101
3269 101 716 -736 128 622 -832 246 53 -514 780 -128 -54 293 -488 274 81 -344 392 -479 -205
3288 -205 378 -257 -44 644 -234 617 43 41 425 -504 331 162 -849 431 -498 -330 509 -556 244 700
3308 700 -189 258 288 -420 1 -204 237 92 -773 355 305 -196 705 -133 282 420 -257 391 124 -602
3328 -602 272 -307 -164 442 -596 354 95 -435 313 -87 -244 693 -329 -306 -194 -443 329 -463 -121 573
3348 573 -514 308 513 -638 336 96 -332 374 -468 -181 -29 -719 245 227 -204 697 -204 91 527 -437
3368 -437 246 -159 -345 258 -622 -10 239 -489 645 145 -461 543 -246 -436 584 -427 -135 260 -455
3387 -455 18 -292 -79 213 -234 375 292 -517 546 -37 -249 555 -235 -286 198 -651 510 -87 -408 918
$$ packed form
3249B09m72N69p28L45N77r28P47N5j082J305r06l90J173m36KK66n80O06l73J42
3269A01O15j452Q64M94j454J078j93n67J294r08P4L47p81P62j93m25P36q71K74
3288b05N83o35K13O88q78Q51n74kL84r29Q35j69j011J280r29J68Q39j065Q00M56
3308G00q89M47L0p08M21k05M41j45q65J128n0n01R01q38M15J38o77O48k67p26
3328f02Q74n79J43O06j038R50k59n30P48m00j57R37j022K3J12k49P72p92L42O94
3348E73j087Q22K05j151R74k40m28P06q42K87J52o90R64j8m31R01r01K95M36r64
3368d37O83m05j86O03q80O12K49p28J134n00o06J004p89j90J020j011K92L95p15
3387d55M73l10K13K92m47O09q3q09J063n83k12Q04p90n1M84q49J161n97l21J326
$$ plain form
3407 918 -188 229 452 -754 4 210 -503 426 -146 -103 550 -409 345 -100 39 767 -114 -75 337 -808
3427 -808 172 357 -636 366 -285 -214 166 -9 277 299 -376 584 -102 -296 192 -482 -103 359 -398 254
3447 254 -332 -112 287 -40 222 365 -507 434 -234 -727 493 -334 -119 617 -316 -34 399 -265 346 -235
3467 -235 30 89 -642 462 -274 -780 402 -257 -94 750 22 172 132 -196 404 -162 -211 461 -584 95
3487 95 504 -521 281 70 47 445 -157 77 405 -191 187 -292 -499 432 -444 9 477 -225 381 324 -99
3508 -99 288 -101 -221 413 -398 174 -93 -756 646 -26 -37 616 -288 -65 328 -342 70 -363 -44 659
3528 659 -604 153 174 -605 531 129 -231 589 -237 203 473 -478 152 -109 -78 479 -413 -194 228 -406
3548 -406 471 160 -268 327 129 -215 312 -388 5 -295 -344 626 -365 -9 532 -242 492 483 -367 344 24
$$ packed form
3407I18j106M17K23j206P58K06p13R29n72M3O53r59P54m45J39P28q81L9M12j145
3427h08R80J85r93J002o51P1L80j75K86K2o75R60o86j94M88o74L79M62p57O52
3447B54n86K20L99l27K62J43q72R41o68m93J220q27K15P36r33K82M33o64O11n81
3467b35K65N9p31J104p36n06J182o59J63Q44p28J50m0l28O00n66m9O72j045O79
3487I5M09j025Q02k11k3L98o02K34L28n96L78m79k07R31q76M53M68p02O06n7m23
3508i9L87l89j20O34q11N72k67o63J402o72j1O53r04K23L93o70M12m33L19P03
3528F59j263P57K1p79J136m02l60Q20q26M40K70r51O30k61L1N57q92K19M22o34
3548d06Q77l11m28N95j98l44N27p00L93l00m9R70r91L56N41p74P34rq50P11l20
$$ plain form
3569 24 -181 36 -573 -76 -65 -371 406 -183 -211 891 -217 -133 -5 -658 80 -45 -54 251 -209 294 490
3590 490 -194 447 116 -168 620 66 -312 -1 -570 -127 -114 -295 277 -262 0 407 -643 -5 186 -334
3610 -334 206 -335 -409 270 -481 111 80 -350 746 -171 -316 763 -69 111 392 -287 325 202 -519 378
3630 378 -72 11 -127 -345 282 -2 -14 320 -325 -92 638 -163 150 96 -458 245 13 47 399 -130 383
3651 383 142 -362 586 -19 -334 300 -620 -237 224 -349 441 -22 -3 468 -415 108 -116 -651 95 -540
3671 -540 -551 193 -240 249 452 65 535 262 63 500 -257 -213 155 -838 -26 -79 -355 550 -52 66 295
3692 295 -365 181 -61 -468 245 -414 -112 596 -520 78 282 -268 341 43 -94 417 -420 227 51 -451
3712 -451 357 -120 -180 406 -263 -44 367 -268 360 -165 -277 546 -485 176 150 -615 87 254 -332 736
$$ packed form
3569B4k05K17o09M97J1l06P77n89k8J102j108Q4J28o53P38j25rL05m60N03J96
3590D90o84O41l31k84P88n54l78L11n69M43J3j81N72n39K62M07j050O38J91n20
3610c34N40n41p4O79p51N92l1m30J096r17j45J079q32J80K81o79O12j23p21Q97
3630C78m50Q3j38k18O27k84j2L34o45K33P30q01L13n4n54P03k32L4L52n29N13
3651C83k41n04R48o05l15O34r20L83M61n73P90m63J9M71q83N23k24n35P46o35
3671e40j1P44m33M89K03l87M70k73j99M37p57M4L68r93Q12n3k76R05o02J18K29
3692B95o60N46k42m07P13o59L02P08j116N98K04n50O09k98j37N11q37O47j76n02
3712d51Q08m77o0N86o69K19M11o35O28n25j12Q23j031O61k6p65P02J67n86J068
$$ plain form
3732 736 -314 -214 350 -270 455 141 -76 189 -454 -15 270 -413 185 325 -71 238 -120 -307 431 -167
3752 -167 12 79 -373 148 -132 -190 397 -344 111 561 -135 262 122 -422 341 -225 -183 -142 -404 82 -170
3773 -170 -233 505 -82 206 500 -260 194 83 -449 128 -359 -315 226 -426 233 119 -336 393 100 -63 534
3794 534 -445 105 33 -339 405 -412 -109 292 -303 306 211 -401 759 17 -329 197 -316 -176 230 -255
3814 -255 200 -123 -359 327 -89 231 313 -448 -26 -147 -349 317 -481 -105 220 -393 58 -56 -335 613
3834 613 -71 -182 420 -487 -103 36 -401 -6 -314 -186 170 -186 338 72 -378 616 9 -117 140 -448
3854 -448 13 45 -380 -9 41 -119 268 -247 189 181 -426 249 72 -419 298 -46 -138 260 -202 180 246 -58
3876 -58 555 -394 -82 566 -519 248 155 -466 355 -13 -96 605 38 309 182 -156 365 -183 -278 527 -233
$$ packed form
3732G36j050J00N64o20P25l14k17K65o43M39K85o83N98J40l96L09l58j87P38n98
3752a67J79O7m52N21k80n8N87p41M55M50o96L97j40n44P63n66M2M1k62M86k52
3773a70o3P38n87K88K94p60M54j11n32N77m87M4N41o52O59j14m55P29k93j63N97
3794E34r79N50p2l72P44q17L03M01n95O09r5o12J160p42l46N26n13J40M06m85
3814b55M55l23k36O86m16L20Q2p61M22j21k02O66p98L76L25o13M51j14k79R48
3834F13o84j11O02r07L84J39m37L95l08J28L56l56N24k66m50R94o07j26K57n88
3854d48M61L2m25L71N0j60L87n15M36qo07O75j77m91P17l44r2L98m62L82O6l04
3876e8O13r49L12O48j085P67r3o21Q21l68q3P01n67K71j27l38N21n48r5Q05p60
$$ plain form
3897 -233 2 63 -321 281 -124 -153 302 73 181 324 -252 329 -234 -419 208 -475 -111 343 -574 170 199
3918 199 -255 359 -31 42 153 -499 105 -287 -455 401 -352 116 666 -178 32 347 -341 165 65 -300
3938 -300 536 -593 215 207 -674 162 13 -35 685 -169 69 214 -109 249 162 -307 298 -436 37 515 -644
3959 -644 431 458 -411 642 -53 -5 228 -195 443 -227 -172 315 -88 -308 544 -299 162 126 -272 310 139
3980 139 -87 263 -457 -51 120 -513 344 -186 -198 365 -55 24 188 -131 86 -51 -467 365 -183 87 83
4001 83 -561 425 289 -355 318 -180 -367 432 -396 189 -250 -403 459 -111 -296 506 -38 108 477 -330
4021 -330 326 45 -402 407 -188 73 -106 -257 218 20 -127 384 -235 -23 571 -422 179 -122 -134 325
4041 325 -354 -50 281 -310 365 18 -113 610 -257 -291 301 -326 49 217 -85 300 -156 -18 178 -429
$$ packed form
3897b33K35O1l84O02m05k9M55k29J08J43n76N81n63j85O27o83L64M54r17P44K9
3918A99m54O14l90P3J11o52O04l92j68Q56p53M68N50q44K10L15o88N06j00l65
3938c00Q36j129Q08qq81Q36j49m8P20q54K38J45l23L58q7m69O05p34M73M78j159
3959f44J075K7q69J053o95M8K33m23O38o70N5M87m03k20Q52q43M61l6l98N82j71
3980A39k26L50p20M06J71o33Q57n30j2N63m20P9J64l19K17j37m16Q32n48K70m
4001H3o44R86j36o44O73m98j87P99q28N85m39j53Q62n70j85Q02n44J46L69q07
4021c30O56k81m47Q09n95K61j79j51M75j98j47N11o19K12N94r93O01l01j2M59
4041C25o79L04L31n91O75l47j31P23q67l4N92o27L75J68l02L85m56J38J96o07
$$ plain form
4061 -429 409 267 -208 415 -223 -444 221 -280 -59 62 -9 168 -155 -126 129 -147 51 183 -644 232 -129
4082 -129 -179 288 -260 -100 481 -337 439 235 45 332 -151 -47 249 -707 124 90 -362 0 -261 -71 345
4103 345 -264 305 -159 -206 469 -325 -453 290 -333 -37 171 -259 90 57 -18 430 -143 127 10 -244 311
4124 311 -235 -293 313 -202 -12 472 -526 81 301 72 202 -164 -198 284 -438 150 -272 -494 213 -107 74
4145 74 442 -175 -50 259 -82 373 -239 -336 59 -506 33 297 -265 434 138 76 442 -284 -49 20 -328
4166 -328 196 -367 -234 379 -227 194 328 -238 306 208 -171 276 -174 112 160 -160 294 -44 -237 462 -279
4187 -279 -23 336 -144 169 440 -257 104 -35 -99 247 -532 153 30 -364 385 -121 -78 453 -137 70 441
4208 441 -309 -110 127 -104 247 -235 171 211 -170 132 80 -394 378 -235 35 45 -492 98 -114 -31 383
$$ packed form
4061d29Q38j42m75O23o38k21O65n01K21J21p1J77l23K9K55k76J98J32q27Q76l61
4082a29n0M67n48J60N81q18P76k04j90K87m83J04K96r56Q31l4m52L62k61J90M16
4103C45o09N69m64m7O75p94j28P43o23K96K08m30L49l3p5M48n73K70j17k54N55
4124C11n46n8O06n15J90M84r98O07K20k29J30l66l4M82p22N88m22k22P07l20J81
4145G4L68o17J25L09l41M55o12r7L95n65N39K64n62O99k96o2L66p26K35O9l48
4166c28N24n63J33O13o06M21J34n66N44r8l79M47m50K86M8l20M54l38j93O99p41
4187b79K56L59m80L13K71o97L61j39o4L46p79O85j23l94P49n06M3N31n90K07L71
4208D41p50J99K37k31L51m82M06M0l81L02n2m74P72o13K70J0n37N90k12Q3M14
$$ plain form
4229 383 -211 -61 369 -374 439 24 -478 233 -10 -368 -2 -305 134 1 -46 492 -225 31 417 -291
4249 -291 -69 316 -446 -16 -253 -171 299 -323 188 281 67 258 -240 -304 536 -317 -250 101 -311 -100 104
4270 104 -38 330 -359 0 736 -357 250 -138 -409 353 -163 -194 483 -292 -5 107 -370 347 154 -83
4290 -83 457 -360 -189 51 -59 406 -54 -374 354 -52 79 195 -118 368 106 -194 720 -250 33 233
4310 233 -460 354 -76 -238 108 16 82 421 -75 554 398 -570 200 -279 -317 226 -324 -98 -45 -163 349
4331 349 175 74 345 -227 -19 114 -473 231 -328 -395 603 -116 -6 -48 -8 421 -44 -255 413 -343 57
4352 57 315 -598 135 -88 -231 282 -76 -55 91 -264 294 -185 -435 475 -440 -195 285 -518 204 125 -299
4373 -299 65 -99 -152 158 -187 23 -89 -465 176 5 -238 411 -248 -98 181 -159 84 145 72 182 -469
$$ packed form
4229C83n94J50M30p43Q13m15n02P11k43l58L66l03M39j33m7N38p17K56L86p08
4249b91K22L85p62M30k37Q2M70o22N11R3k14J91m98o4Q40q53O7L51m12K11K04
4270A04j42L68o89L59P36j093O07l88k71P62n16l1O77p75K87J12m77P17j93k37
4290h3N40q17J71K40j10M65m60l20P28m06J31J16l13M86k62l00R14r70K83K00
4310B33o93Q14m30j62L46r2O6L39m96O29j56r68P70m79l8N43n50K26N3j18N12
4331C49j74j01K71n72K08J33n87P04n59o7R98p19J10m2M0M29m65k11O68p56M00
4352E7K58r13P33k23j43N13l58K1J46l55N58m79k50R10r15K45M80q03P22p9m24
4373b99L64j64n3L10l45K10j12l76O41j71k43O49o59J50K79l40K43O1p3J10o51
$$ plain form
4394 -469 -124 236 -255 419 -29 -226 524 -315 -123 326 -223 41 17 -346 -76 -340 -298 363 -279 291 -29
4415 -29 -350 409 -61 56 636 -73 199 6 -313 321 -121 39 379 -356 242 243 -419 414 -90 -79 265
4436 265 -261 -273 134 -417 330 8 -296 385 -234 -82 359 -189 321 -49 -174 174 -17 -129 71 -308
4456 -308 514 183 -364 304 15 61 187 -199 -104 6 -172 236 -41 -42 206 -301 255 127 -346 443 126
4477 126 -19 665 -141 -444 277 -241 388 26 -108 453 -424 135 257 -217 162 55 -253 255 7 -300
4497 -300 190 -288 203 34 -97 368 -220 -233 359 -589 1 -27 -325 118 -342 -116 575 12 54 88 -466
4518 -466 626 24 -148 447 -356 -138 272 -343 110 118 -170 400 -103 110 220 -607 113 -160 -441 227
4538 227 -198 -35 365 -211 152 -69 -62 574 115 -275 191 -365 333 33 -429 416 93 -73 386 57 272
$$ packed form
4394d69L45L60m91O74m48j97P50q39J92M49n49K64k4l63K70k64M2O61o42N70l20
4415b9l21P59m70J17N80p09K72j93l19O34m42J60L40p35N98Jo62Q33n04J1L44
4436B65n26j2M07n51P47l22l04O81o19J52M41n48N10l70j25L48j91j12K00l79
4456c08Q22l31n47O68k89M6J26l86R5J10j78M08k77jK48n07N56j28m73P89l17
4477A26j45O84q06l03P21n18O29l62j34N61q77N59J22m74L79j07l08N08k48l07
4497c00M90m78M91j69j31M65n88j3N92r48N90k8k98M43m60K26O91n63M2L4n54
4518d66J092o02j72N95q03K18M10o15M53Qk88N70n03K13J10q27P20k73k81O68
4538B27m25J63M00n76L63k21PO36m59l90M66n56O98l00m62Q45l23j66M59l29K15
$$ plain form
4559 272 192 -291 472 -350 -29 339 -410 66 256 -610 21 17 -436 479 -142 74 225 -319 -39 -428 -475
4580 -475 389 -369 -63 196 -272 290 246 -170 560 -231 84 118 -95 67 -29 -475 217 -103 58 667 -361
4601 -361 157 156 -213 -17 -164 -212 118 -276 36 88 -260 150 37 -75 670 -292 -10 171 -260 368 -145
4622 -145 -211 143 -533 -229 357 -67 176 138 -197 170 -164 -147 155 -460 395 150 -307 179 -21 -3 368
4643 368 -174 208 359 -254 270 69 -4 102 -554 207 -142 -59 379 -166 -37 501 -316 -195 194 -624 135
4664 135 -58 -73 251 -111 -57 69 -199 424 -150 -181 279 -2 136 242 -381 35 -5 -276 83 -148 -68 228
4686 228 -257 230 126 -268 266 -314 -203 164 -249 294 -65 4 17 -48 252 381 -293 147 275 -430 74
4707 74 -460 -472 167 -339 -28 378 -138 565 90 -192 288 -142 -17 388 -401 -78 122 -514 160 13 -95
$$ packed form
4559B72q0m83P63q22L21L68p49M76J90q66O31mm53R15o21K16J51n44K80l89m7
4580d75Q64p58L06K59m68N62m4m16P30p91L15L4k13J62r6m46O92l20J61O09j028
4601c61N18jl69J96j47m8L30l94L12N2l48M10j13j12P45r62K82J81m31O28n13
4622a45o6L54o76L04N86m24K43l8l35L67l34J7L02o15Q55k45m57M86k00J8L71
4643C68n42L82J51o13N24k01p3J06o56P61l49Q3M38n45J29N38q17J21L89q18P59
4664A35j93j5L24l62N4J26k68O23n74l1M60k81J38J06o23M16m0k71L59k31Q0K96
4686B28m85M87j04l94N34n80J11L67m13N43l59O9J3o5L00J29o74M40J28p05N04
4707G4n34j2O39n06L11M06n16P03m75k82M80m30J25M05p89L23K00o36O74j47j08
$$ plain form
4728 -95 525 -44 188 194 -134 153 -245 -428 374 -401 -108 -20 -326 385 72 114 475 -4 -57 27 -264 151
4750 151 201 -261 456 -259 -231 497 -316 317 5 -287 237 -348 104 290 -291 -228 97 -524 20 -151 -15
4771 -15 350 -117 332 340 17 299 47 -136 329 -439 -121 127 -476 98 108 -87 331 -233 168 139 -329 -45
4793 -45 -105 -229 307 -337 -164 372 -128 324 80 -112 443 -134 -190 294 -285 96 265 -293 236 33 -103
4814 -103 284 -226 104 -146 -6 166 -201 -306 58 -361 403 239 -334 299 -196 -354 124 -24 -212 -137
4834 -137 -268 108 47 -168 188 114 141 188 -282 458 32 -158 252 -102 -37 78 -210 185 -127 -119 287 -219
4856 -219 -115 429 -134 209 165 -226 291 -99 -284 91 -180 197 286 -269 284 -199 -78 156 -136 -206 138
4877 138 -378 98 22 -299 114 -352 234 226 -274 210 117 -170 357 -304 -127 335 -194 -30 -220 -214 411 -252
$$ packed form
4728i5O20n69K32Ol28K87l98j83Q02p75K93Q8l06P11l13M2L61m79n3Q4k91M15
4750A51N0m62P17p15K8P28q13O33l12k92N24n85M52J86n81O3L25o21N44j71J36
4771a5L65m67M49Ql23K82k52j83M65p68L18K48o03N74J0j95M18n64M01k9m68K84
4793d5o0j24N36o44J73N36n00M52k44j92N55n77n6M84n79L81J69n58N29k03j36
4814a03L87n10L30k50J40J72l67j05L64m19P64j64n73O33m95j58M78j48j88P5
4834a37j31L76o1k15L56p4K7M7m70P40m26j90M10l54O5J15k88L95l12QM06n06
4856b19J04N44n63L43m4l91N17l90j85L75k71L77Q9n55N53m83J21K34k92p0L44
4877A38n16M76p6l21M13m66N86qn00M84r3k87N27o61J77M62n29J64j90OO25o63
$$ plain form
4899 -252 71 335 -306 244 -64 -325 120 -209 -186 178 -251 90 22 -424 202 -180 137 542 -160 -57 -62
4920 -62 -267 27 102 -207 334 -108 374 306 -55 106 52 -334 451 -133 -240 -56 -343 0 209 -255 280
4941 280 -318 233 272 -262 244 205 -350 137 -189 -118 260 21 235 0 -12 183 -300 43 318 -132 223
4962 223 211 -396 252 -88 -345 213 -356 142 49 -22 291 -97 -101 269 -252 9 174 -171 54 -225 -242 192
4984 192 -110 -174 598 23 184 -231 -290 295 -309 -341 -20 -219 27 99 -201 49 145 -157 98 -324 179 191
5006 191 -299 98 92 -174 406 161 18 155 -153 65 187 -5 70 -495 168 157 -471 127 -66 -428 196
5027 196 -75 -143 157 -261 163 65 -407 44 -269 -203 490 -357 -27 216 -112 614 -92 24 38 -281 42
5048 42 41 -364 121 -168 -126 251 -127 174 279 -199 166 -94 -266 -118 -154 -132 -36 -173 341 -106 -339 669
$$ packed form
4899b52L23K64o41N50l08k61M45l29K3L64m29L41o8m46O26l82L17M05p02J03n
4920f2k05K94P5l09N41m42M82o8l61J61n4l86P85n84j07J84k87L43K09m64N35
4941B80n98N51L9n34N06l9n55M87l26P1L78k39K14k35j2J95m83L43K75m50L55
4962B23j2o07O48l40k57N58n69M98r3p1L13l88mL70n21K61J65l45K25k79j7M34
4984A92l02o4P72n75J61m15n9N85o04l2L21j99K46P2l00K50R6l02K55m22N03J2
5006A91m90L97ok66N80k45j43J37l08K18J22j92P5n65O63j1o28N98j93l62O24
5027A96k71o8L00m18M24r8m72M51l13O6O93q47L30K43l28P26p06J16J4l19L23
5048D2jm05M85k89M2L77l78L01J05m78L65k60j72J48l6K2R6j37N14m47k33J008
$$ plain form
5070 669 -58 -85 294 -349 312 118 -523 -34 -172 -85 162 -256 -105 85 -159 442 182 -41 58 -260 0
5091 0 134 -30 171 -64 -101 296 -234 219 164 -370 264 183 -174 369 20 -49 241 -20 111 -138 -64 275
5113 275 -221 314 355 -115 -98 -32 -204 334 129 -216 185 70 113 -37 -50 278 -8 32 374 -228 182 95
5135 95 -233 39 -45 -68 142 -98 162 366 -136 374 1 -169 392 -217 202 128 -56 258 20 -96 253
5156 253 -317 116 382 -326 145 64 -365 218 -364 -187 198 -331 89 227 -261 165 -207 -167 147 -288 24
5177 24 59 -276 227 56 -239 229 -133 167 408 -252 211 -158 -82 125 -305 -79 67 -191 159 -27 -139
5198 -139 175 38 44 -38 -341 392 130 -144 179 82 -239 365 -51 61 109 151 326 -117 -404 -46 -174 93
5220 93 40 -315 387 -391 -116 379 -357 -15 114 -80 165 150 -223 0 -182 -52 87 -264 -69 60 -20
$$ packed form
5070F69p27k7L79o43O61j94o41M89j38Q7K47m18J51J90k44O01k60k23R9l18K60
5091@J34j64K01k35l7L97n30M53n5n34O34q1l57N43l49o9K90k61J31k49P4L39
5113B75m96N35M1m70J7O6j72N38k05l45M01j15M3j50j3L28k86M0L42o02M10q7
5135I5l28K72q4k3K10k40K60K04n02N10l73j70N61o09M19p4j84L14k38j16L49
5156B53n70M33K66p08M71q1m29N83n82J77L85n29M20J38m88M26l72M0L14m35L12
5177B4L5l35N03j71k95M68l62L00K41o60M63l69P6K07m30K26J46k58L50j86j12
5198a39L14j37Oq2l03P33k62k74L23r7l21O04m16J12M8M2J75m43k87L58j28K67
5220I3n3l55P02p78K75M95p36L42J29j94K45j5l73K23j82J30J39l51J95J29q0
$$ plain form
5241 -20 179 -75 45 254 7 109 -69 -115 281 47 234 221 -395 47 228 -420 417 -117 90 149 -424
5262 -424 334 -253 -434 271 11 45 202 -172 261 138 -113 209 -116 -148 127 -118 42 105 -246 387 -33
5283 -33 -35 449 73 -114 394 -159 25 -150 -133 196 -144 -203 -6 -288 231 123 -342 219 -52 -39 149 -32
5305 -32 8 25 -327 427 32 144 377 -262 -10 235 -415 312 125 -200 87 -297 -208 94 -126 -43 -300 -80
5327 -80 357 -107 132 76 -326 132 -147 -206 -78 -130 -25 263 -32 63 76 -64 253 45 -225 172 -527 -56
5349 -56 109 -445 110 -101 168 137 -43 455 120 -379 297 -140 -265 313 -339 -49 138 -277 -7 -137 -37
5370 -37 341 -159 71 273 -296 6 -66 -309 191 -444 21 268 -75 201 -101 -217 14 -188 -170 197 -231
5391 -231 44 -45 -324 153 25 -81 307 -78 257 54 -174 196 -161 51 310 -404 73 -50 -22 197 161
$$ packed form
5241b0J99k54J20K09k47J02j78m6L96k34J87j3o16M42J81o48Q37n34K07N9n73
5262d24P58n87j81P05k60L4J57l74M33j23k51L22l25l2K75k45J60O3l51O33m20
5283c3kM84l76j87N08n53J84j75J7L29l40n9J97k82N19j08m65N61k71J3J88j81
5305c2M0J7l52P54l95J12K33o39K52K45o50P27j87l25K87l84Q9L02k20Q3k57K20
5327h0M37m64K39n6m02M58k79n9J28n2J05K88k95R5J3j40L17k08k70L97o99M71
5349e6J65n54N55k11K69l1j80M98l35m99O76m37j25N78o52K90J87m15K70j30J00
5370c7L78n00K30K02n69L02p2k43N00o35M65K47l43K76l02j16K31k02J8L67m28
5391b31K75q9k79M77j28j06L88l85L35k03k28L70l57K12K59p14M77j23K8K19l6
$$ plain form
5412 161 -48 141 -111 234 -3 -231 303 -218 -181 142 -206 -48 452 -206 81 98 142 15 -245 -155 175
5433 175 -471 128 190 -376 332 192 -125 21 -41 -169 -3 -34 143 -17 -94 56 -201 159 141 -219 323 -4
5455 -4 -114 394 -55 -36 224 -345 175 -42 -93 220 -146 97 255 -280 417 94 -197 50 -86 -192 -34
5476 -34 -384 161 -126 99 270 -30 75 541 -177 14 -4 -314 -54 -56 146 131 -10 230 104 -149 428 2
5498 2 -223 0 -133 140 -84 -287 191 -129 -49 329 -206 -166 120 -264 87 -61 -216 44 -77 28 151
5519 151 -198 169 -198 -114 -36 -88 90 214 -65 26 21 -436 -52 -143 -35 119 23 200 97 -32 173 -170 -153
5542 -153 109 -57 48 107 -512 24 39 8 -83 -190 -32 31 -173 179 120 -162 272 -119 -131 39 -338 -126
5564 -126 209 -254 306 -80 147 128 32 220 114 -164 231 -46 -21 -20 -194 -99 -123 -301 450 66 -96 333
$$ packed form
5412A61k09J89k52L45k37k28N34n21L7L23l48J58N00o58K87J7M4j27k60R0L30
5433A75o46N99O2n66P08j40l17J46o2j28J66l1J77j60p7J50k57L60j8l60N42l27
5455dj10N08m49J9K60n69N20k17n1L13l66K43J58n35O97l23k91K47j36j06J58
5476c4l50N45k87K25J71l00J05M66p18J91j8l10K60kK02j5j41K40j26k53N77m26
5498Bk25K23j33K73k24k03M78l20Q0L78n35M0K86l84L51j48j55K60j21J05J23
5519A51l49L67l67Q4P8n2J78J24k79R1nm57L84r1J08J54r6J77j03j29K05l43J7
5542a53K62j66J05N9o19N36J5l1r1j07J58O3k04L52n9k82M34l91j2J70l77K12
5564a26L35m63N60l86K27j9r6J88j06k78L95k77K5Jj74R5k4j78P51l84j62M29
$$ plain form
5586 333 -617 -44 -25 -351 188 -56 -200 21 -257 -27 354 -17 111 -156 15 342 -103 -101 103 -377 -27
5607 -27 91 95 218 171 -223 -50 -188 284 73 -194 -49 -12 -162 109 -472 -107 49 17 258 54 186 439
5629 439 -108 68 145 -448 405 -174 -74 284 -67 8 187 -175 124 -81 -71 250 -553 -53 78 -531 68
5650 68 -19 -75 312 -165 -219 112 102 242 -74 -56 596 -122 -124 271 -52 -25 197 -142 110 -67 -228 -93 -289
5673 -289 175 -132 -361 160 -187 -262 220 -192 90 161 -180 184 115 -24 200 -83 -4 -54 -257 -75 -62 -166
5695 -166 408 -183 74 237 43 269 -100 -80 137 -111 -153 198 -227 254 293 65 244 -94 -125 280 -360
5716 -360 -35 -170 -219 103 45 18 154 -467 -74 237 -75 400 -126 -235 8 -244 55 185 -118 302 -157
5737 -157 -83 193 13 150 203 -442 262 158 -182 395 -102 -168 235 -75 168 145 -151 198 -90 -187 285 -167
$$ packed form
5586C33r50N73J9l26N39k44j44K21k78K30L81l71J28k67J71L27m45KK04m80L50
5607b7J18MJ23m7l94J73j38M72k11k67J45L7j50K71n81L65J56l2K41k04J32K53
5629D39n47J76P7n93Q53n79J00L58l51P5J79l62K99k05J0L21q03N00J31o09N99
5650F8q7n6L87m77n4L31j0J40l16J8O52p18kL95l23K7K22l39K52j77j61J35j96
5673b89M64l07k29N21l47p5M82m12K82P1l41L64o9j39K24k83P9n0k03J82J3j04
5695a66N74n91K57J63j94K26l69K0K17k48m2L51m25M81L9k28J79l38l1M05o40
5716c60L25j35m9L22n8k7J36o21L93L11l12M75n26j09K43k52K99J30l03M20m59
5737a57P4K76j80J37N3o45P04j04l40N77m97o6M03l10K43k3k96L49k88r7M72m52
$$ plain form
5759 -167 125 -144 -237 235 -283 -65 206 -181 130 353 -80 279 -5 -52 20 -151 9 -34 -42 156 86 -73
5781 -73 105 -315 131 186 -210 -93 -166 -333 22 20 -28 -127 33 299 32 -147 18 15 -31 53 -71 -129 118 -94
5805 -94 -5 75 -162 152 -221 -46 181 -221 265 65 -251 130 -240 -215 -64 -88 65 76 -42 208 -251 110
5827 110 27 -214 251 -38 -295 8 -180 -137 -119 -243 55 178 -322 302 -61 18 325 -418 273 415 -527
5848 -527 121 -106 -123 376 77 122 138 -163 290 -286 -279 178 -222 -178 325 -342 52 214 -106 501 59 -2
5870 -2 119 -182 69 -229 -143 121 -20 122 116 -180 223 270 -431 151 -123 13 47 -280 89 108 -363 276 -323
5893 -323 -408 226 -185 -167 165 -107 -118 -402 -161 167 -312 -87 193 -201 207 -36 -240 327 -175 -143 -10
5914 -10 -27 65 213 -389 307 -120 -9 124 -98 133 200 -168 213 163 -224 72 -253 268 -58 -313 114 216
$$ packed form
5759a67K92k69r3M72n18K18K71l87L11K23m33L59k84m7P2j71J60m3qJ98p0j59
5781g3J78m20M46N5l96J17p3j67L55km8r9J60K66k67j79J65lm6Q4j24n8K47k12
5805i4Q9Q0k37L14l73J75K27m02M86k00l16L81l70K5J51k4J53J1j18K50m59L61
5827A10q3k41M65k89k57L03j88M3J8j24K98J23n00O24l63P9L07p43O91J42r42
5848e27O48k27j7M99k99M5J6l01M53n76PM57m00M4N03o67L94J62l20O07m42o1
5870bJ21l01K51k98Q6K64j41J42ok96M03M7p01N82k74J36L4l27L69J9m71O39n99
5893c23q5O34m11J8L32k72j1k84K41L28m79K25K80l94M08k43k04N67n02L2J33
5914a0j7R2J48o02O96m27J11J33k22K31O7l68L81n0l87K96l25N21l26k55M27J02
$$ plain form
5936 216 118 310 -246 -321 116 -239 20 -94 115 92 -176 136 270 -142 91 -83 -239 306 -10 -41 22 -223
5958 -223 -76 -212 -367 309 -77 -226 121 -111 165 84 -279 45 -31 -344 -7 -143 138 -38 -161 25 21
5979 21 -22 264 -151 231 87 -115 277 -368 -217 278 -57 -87 194 106 267 -152 137 71 -370 25 11 -412
6001 -412 -95 -200 -226 199 -321 -202 137 -18 234 -229 -114 435 -275 -114 101 -352 -24 312 -154 74
6021 74 123 61 -20 -185 175 -33 -159 -30 -133 -151 -90 -274 -23 229 -88 28 -56 104 319 -91 3 -15 -286
6044 -286 195 -115 -178 127 93 174 300 69 105 49 -328 152 -292 -254 61 -192 -210 -124 -381 171 149 -42 130
6067 130 -108 229 26 -327 190 -210 -117 143 -21 174 291 16 215 -148 -220 149 -71 157 136 -130 -17
6088 -17 11 -249 424 -242 -253 168 -173 -2 150 -111 -34 -53 52 279 -191 277 -18 -117 119 -271 -109 342
$$ packed form
5936B16r8J92n56p5M37l55K59j14K09k3k68L12J34m12K33j74j56N45l16l1O3k45
5958b23J47j36j55O76l86j49L47k32K76q1l63L24p6l13L37j36K81j76j23J86m
5979B1m3K86m15L82j44k02L92o45J51M95l35l0K81q8J61m19K89o6m41L95j4m23
6001d12L17j05k6M25n20J19L39j55K52m63J15N49p10J61K15m53L28L36m66K28
6021G4M9o2q1j65L60k08j26J29j03j8O1j84K51K52l17J16q4J60K15m10R4j8k71
6044b86M81l10o3L05l4Q1J26k31L6n6l77M80m44L8L15k53j8Q6k57N52k2j91J72
6067A30k38L37k03l53N17m00R3K60j64J95J17k75J99l63p2L69k20K28k1k66J13
6088a7K8k60O73o66j1M21l41J71J52k61P7j9J05K27m70M68k95r9K36l90J62M51
$$ plain form
6110 342 -81 28 -40 -140 25 -118 -162 151 -450 68 170 -231 126 172 -166 266 -128 49 16 -275 247
6131 247 38 -1 40 12 170 258 5 113 -5 124 -15 40 -45 -95 -296 167 185 -64 139 -151 191 225 -82
6154 -82 -7 125 -98 56 -108 -177 192 -591 132 116 -78 323 -25 -179 47 -230 -90 132 -234 -4 159
6175 159 42 -12 109 174 135 -10 171 -46 -334 -58 -144 -33 37 -87 138 68 37 323 48 154 -16 -117
6197 -117 -47 44 -375 166 -62 50 132 -155 215 116 -301 144 -86 -210 119 37 -58 365 -313 215 -111 -443
6219 -443 -24 110 121 260 -307 193 116 -223 186 -178 86 -3 15 79 50 180 60 -89 -200 38 97 -29
6241 -29 1 -310 14 -215 99 46 107 127 -234 38 118 -15 -92 280 55 -126 -95 -254 232 37 -24 127 -6
6264 -6 114 87 246 34 124 -209 180 -289 -260 49 -214 -39 0 -211 285 -11 -102 283 -267 130 -93 -306
$$ packed form
6110C42m23J09o8j00J65j43m4L13o01N18J02m01L57M6l38M32l94J77l3k91N22
6131B47k09l9M1k8J58Q8k53J08j18J29j39N5q5n0k01M63J8k49K03k90L42L4l07
6154h2P5J32k23J54j64o9L69p83P23j6j94M01l48j54K26k77J40K22l66K30J63
6175A59j17n4J21O5l9j45J81k17k88K76q6J11P0j24K25p0l1K86k75J06j70j01
6197a17P0R1m19N41k28J12Q2k87L70r9m17M45k30j24L29q2r5M23o78N28l26l32
6219d43M19J34J1J39n67N00p7l39M09l64K64q9J8O4k9J30j20j49j11K38N9j26
6241b9L0l11L24k29L14n3O1K0l61K72Q0j33p7L72k25j81L1j59M86j95o1J51j33
6264fJ20k7J59k12R0l33L89m69K9L09k63J75L9k11M96k96r1L85n50L97k23k13
$$ plain form
6286 -306 306 -210 -376 189 61 68 191 184 59 -126 -83 -259 -147 294 50 -310 207 -195 -314 324 -52 248
6308 248 378 -84 64 -11 122 103 -360 31 186 -276 224 186 -262 288 11 22 116 1 59 -116 -119 124 -44
6331 -44 -93 44 -215 162 59 55 192 5 23 326 -22 164 -30 -167 48 -75 -51 -51 -247 72 64 -18 185 -28
6355 -28 -277 193 -139 42 91 -293 34 55 104 134 151 -53 143 -97 -22 -34 -153 161 -109 -231 -87 -95 49
6378 49 242 -340 227 140 -90 167 -89 137 -24 -180 37 -255 15 -9 2 -135 120 20 230 -100 -155 -106
6400 -106 -227 79 -61 3 -227 119 71 348 -322 110 231 -226 35 -100 -138 56 39 -243 28 84 328 -15
6422 -15 -101 200 168 -63 81 -28 -14 25 -239 190 -60 -250 143 -439 263 178 -204 125 31 -297 198 -217
6444 -217 -115 145 -293 -84 -60 34 338 -148 125 88 -125 -149 -95 -326 136 227 -158 319 47 122 21 56 -45
$$ packed form
6286c06O12n16j66N65j28PJ23pj25j85M3j76J12M41k44l60N17m02j19O38l76L00
6308B48J30m62J48p5J33j9m63L91J55m62N00l8m48N50k77J1R4j15N8j75lK43j68
6331d4m9J37k59L77j03mJ37j87J8L03l48J86j94j37K15j23K4%j96L19qq2K03k13
6355b8k49M70l32J81M9l84L27K1M9L0J7k04J96k40P5j2j19L14k70j22J44qJ44
6378D9J93n82N67q7k30K57k56K26j61j56K17k92K70k4J1j37K55j00K10l30n5M9
6400a06j21L06j40O4k30L46m8K77o70M32J21m57K61j35l8J94j7k82K71N6K44l43
6422a5q6L01l2k31J44j09J4L9k64M29k50j90L93n82P02q5l82L29r4l28M95m15
6444b17J02K60m38K09K4R4L04m86K73l7k13k4N4k31M62R1l85M77k72P5j01L5j01
$$ plain form
6467 -45 -90 -285 192 -232 263 223 -351 357 154 55 139 -213 -74 -70 -50 275 81 8 161 -151 -145 203 -40 -21
6491 -21 28 -80 411 -88 -102 61 -74 -214 -352 -112 11 -449 -39 156 -57 72 -186 77 94 -28 109
6512 109 382 -36 289 167 -125 227 141 -163 145 -60 38 266 8 109 -99 -14 98 -200 -12 -7 -230 38
6534 38 -67 -45 107 -173 92 218 8 138 10 -452 276 -34 146 326 -130 -71 138 -8 24 -99 -129 -177
6556 -177 -9 -180 38 -198 -87 -88 101 262 -151 50 12 -179 -232 -8 87 -18 -218 269 243 -119 8 37
6578 37 79 185 -91 -3 33 -298 -90 -16 -209 69 -192 85 324 -61 165 94 -302 270 266 -235 -85 -242 33
6601 33 -32 -217 204 -232 18 331 -95 113 18 -26 -29 25 -102 -18 -14 139 -222 -217 75 102 16 239 -148 -29 190
6626 190 -155 -275 -103 -311 186 235 -74 106 -120 156 42 -60 15 -63 2 -22 -167 106 35 79 75 -208 120
$$ packed form
6467d5m5j95M77m24M95m0n74P08k03r9Q4l52J39MK0L25j94p3J53l12OL48k43J9
6491b1M9j08M91m99j4J63j35j40j38K40J23m60M10J95k13J29k58K63J7j22J37
6512A09K73m18L25j22k92L52q6l04L08k05R8K28k58J01k08Q5J12k98J88Nk23K68
6534C8j05K2J52k80K65J26k10J30j28m62P28l10J80J80m56N9K09j46L2j23l0m8
6556a77J68j71K18k36J11jJ89J61m13K01l8j91n3K24R5j05k00M87k6l62J27K9
6578C7M2J06k76Q8L6l31K08P4j93K78k61K77K39l85K26p1l96N72mn01J50j57K75
6601C3o5j85M21m36K50L13m26K08r5m4lN4j27Q4MJ53l61NK92K7q6K23l87J19K19
6626A90l45j20J72k08M97M9l09J80k26K76j14j02P5p8O5k4j45K73p1M4mk83L28
$$ plain form
6649 120 196 58 63 -113 -30 91 120 -299 217 -354 4 63 35 243 56 -87 201 -160 108 266 -276 15
6671 15 -263 -319 -98 -197 -143 190 -147 243 61 -96 76 -167 -60 85 -410 14 -47 -175 32 -175 20 113
6693 113 -35 76 -73 -181 117 -87 -135 -51 -121 -266 209 42 11 -121 -237 234 -207 -7 135 -147 8
6714 8 -38 -223 353 45 37 332 -64 130 -122 141 -58 -112 -25 291 -193 125 233 -243 355 100 36 52 -102
6737 -102 94 82 -216 239 -119 -50 66 -341 -154 77 -58 242 -60 -243 269 -223 91 -36 -24 358 -103
6758 -103 -143 227 -101 -256 272 9 24 205 -30 244 -53 -138 192 22 55 57 -170 114 -113 -119 119 -9 77
6781 77 315 -103 -65 -28 -214 91 37 -152 275 -141 95 262 -125 153 234 -90 76 -302 297 -74 -88 348
6803 348 -203 31 155 2 311 -134 -110 148 119 87 -85 -137 -153 -7 -147 222 220 71 248 158 1 -233 -354
$$ packed form
6649A20P6j38Nj76Q3J21K9m19N16n71L58N9k8K08j87j43K88l61K68J58n42K91
6671A5k78n6K21r9N4L33l37L90j82j57J72k43J07J45m95M24o1j28K07k07J95R3
6693A13j48J11j49j08K98k04m8Q4p0j45M75j67l1j32j16M71m41K00J42k82J55
6714Hm6j85N76l08qK95l96J94k52K63j99n4Q7L16m84L18J08m76N98k55o4J6j54
6737a02J96j2k98M55l58O9J16m07J87K31j35L00l02j83N12m92L14j27J2L82m61
6758a03m0L70l28j55N28k63J5J81k35K74k97q5L30j70L3Kk27K84k27oK38j28Q6
6781G7K38m18L8L7j86L05n4j89M27m16K36J67l87K78Q1l24J66l78N99l71j4M36
6803C48n51K34J24j53L09m45K4K58k9l2j72n2j6J46j40L69kj49J77r0j57k34j21
$$ plain form
6826 -354 106 -120 103 213 37 124 145 -5 291 -72 -196 161 -159 -22 75 -81 -140 -240 -118 276 2
6847 2 249 257 26 179 -238 -35 -60 -119 -68 197 -98 32 -71 -14 281 -75 -195 167 -115 -19 -42 -65 255 -105
6871 -105 -142 -15 53 16 85 -19 225 -195 164 120 -127 146 43 -162 77 45 92 115 -230 47 223 77 79
6894 79 -97 -408 44 -62 -100 -94 -232 86 14 -194 55 3 -271 -63 -259 -55 16 -382 97 -7 -250 279
6916 279 -161 -213 108 -239 18 36 148 -25 -157 30 28 -256 144 110 -37 243 -183 -86 -12 -215 91 136 -95
6939 -95 40 168 180 111 -314 -98 268 -90 40 6 -108 164 -315 -133 115 -255 6 -84 -118 -12 -146 19
6961 19 207 1 219 -5 -144 275 -265 39 21 -140 172 121 -3 93 -36 -165 -4 18 -103 53 -83 11
6983 11 -186 -151 105 -226 -30 15 27 40 -295 -67 63 51 -12 21 43 48 -344 -27 242 -388 -24 335 -163 302
$$ packed form
6826c54M60k26K23J10j76Q7K1j50K96l63j24L57l20J37R7j56n9j00J22L94k74
6847BK47Qk31J53m17K03k5n9N1K65k95J30j03N7K95l56j20L62k82R6k3k3L20l60
6871a05l7J27O8l7O9j04K44m20L59m4k47K73j03k05K39l2M7K3l45K77J76j46K
6894G9j76l11M52j06l8Oj38L18p2k08K49n2k74K08j96K04P1l98M79j04k43N29
6916B79m40n2L21l47K57J8J12j73j32J87kk84M00l4j47K80m26R7P4k03L06M5k31
6939i5J35J28J2o9m25K16L66l58J30l4j14K72m79J82K48l70K61r0l4J06j34J65
6961A9J88k06K18k24j39M19n40L04j8j61L12n1j24R6j29j29J61K2j21J56j36R4
6983A1j97L5K56l31J96M5J2J3l35K28J30j2o3L3K2Nl92L17K69o30L64L59m98M65
$$ plain form
7007 302 113 -151 289 83 -176 -161 -276 108 139 -196 166 -237 25 341 -98 161 22 -68 -129 -157 -61 136
7029 136 -35 149 -39 -25 -111 -93 181 95 -214 87 185 -80 241 -125 260 -112 -157 83 141 -186 199 193 -130
7052 -130 97 -260 -48 80 29 119 54 81 144 -157 -5 158 -241 147 -40 -74 169 -59 -172 130 -219 20
7074 20 199 -15 245 -346 97 36 -52 9 60 -130 100 -10 -9 250 -75 521 -7 -198 272 72 -3 169 -408
7097 -408 72 100 13 -136 215 41 26 -111 -23 163 -39 271 14 -69 208 -290 -148 253 28 170 -6 -17
7119 -17 120 -164 -101 226 -86 27 -52 -251 136 -211 -58 -62 -28 122 18 -406 -9 32 -82 107 -198 -149 252
7142 252 -17 161 -146 -144 426 -158 -63 169 -43 57 129 46 38 -241 77 110 -110 24 175 -51 205 -6 86
7165 86 34 -67 66 18 -69 -110 -232 10 296 -87 11 30 -210 254 -209 -65 64 -335 64 -146 -449 121
$$ packed form
7007C02j89k64M40k06k59J5j15L84L1l35L62m03K62L16m39K59j39r0o1k8R6J97
7029A36j71J84j88J4q6J8K74q6l09L01R8k65L21l66L85l72m5K40N8l27L85ol23
7052a30K27l57K12J28n1R0o5K7O3l01J52J63l99L88j87l4K43k28j13L02l49K39
7074B0J79k14K60n91M43o1q8O1N1j90K30j10JK59l25N96n28j91M70k00p5J72n77
7097d08M80K8q7j49L51j74j5j37Q8J86k02L10k57q3K77m98J42M01k25J42j76j1
7119a7J37k84O3L27l12J13p9j99L87l47J53mL4J50j04m24L97M1j14J89l05M9M01
7142B52k69J78l07KN70n84R5K32k12J00P2q3qk79L18L3k20J34J51k26K56k11R2
7165H6n2j01J33m8q7m1j22K42K86l83R8J9k40M64m63J44J29l99L99k10l03N70
$$ plain form
7187 121 -80 -46 191 5 3 83 -72 118 245 -87 162 -173 -201 131 -187 286 200 -50 214 -247 55 -211
7209 -211 -329 -15 39 -237 -18 55 40 307 -21 22 202 -500 -44 -211 -283 53 -160 -142 211 25 118 154 -53
7232 -53 353 -236 -262 162 -37 160 56 -78 -20 -38 -159 -26 -85 -114 92 134 75 -326 -24 263 -174 129 -146
7255 -146 29 -9 -281 -75 66 -28 87 -7 -131 20 -162 -3 230 -128 97 145 -25 115 15 237 46
7276 46 -118 -50 90 -271 77 -92 -226 -91 -214 216 118 26 197 -184 -76 155 -143 92 46 -66 -251 -6
7298 -6 -296 110 -51 84 141 -11 79 -93 -209 245 -228 -150 172 -142 6 -161 20 181 -256 159 176 -193
7320 -193 72 35 -54 109 -48 -14 -1 -56 -47 86 97 -14 -141 -195 85 -151 -251 220 -135 74 76 -10 114 -132
7344 -132 -143 119 55 205 118 -11 116 -120 -176 -8 -25 10 -133 -284 30 -28 59 101 -94 -58 -86 -226 76 -98
$$ packed form
7187A21k01L4K37j86kQ0j55J90J27l32K49l35k8L32l18M73q6k50K64m61L02k66
7209b11j18L14N4k76K19P3j5K67l28M3J80p02M56j67p2L36k13J8L53j86R3L6k07
7232e3M06n89k6M24j99J97j04j34N8j8j21J33n9k9K06M2n9m01L02K87m37L03k75
7255a46J75l8k72K06J41r4J15r4j24J51j82J59K33l58K25M8j70J40j00K22j91
7276D6j64O8J40l61L48j69j34J35j23M30r8r2J71l81J08K31k98K35m6j12j85K45
7298fk90M06j61J35N7j52R0j72j16M54m73P8L22l14J48j67J81J61m37M15J7l69
7320a93K65l7q9J63j57L4J3n5RJ33J1j11j27n4K80k36j00M71l55K09Kq6J24k46
7344a32j1K62o4J50q7j29J27k36n6J68j7L5j43j51L14n8Q7M2j95L6k8j40L02j74
$$ plain form
7368 -98 133 250 -101 45 170 -49 277 18 64 166 -76 -14 -14 -86 37 60 -113 137 -201 -139 175 -45 148
7391 148 -2 141 177 -16 142 -61 -236 356 -130 -164 27 127 -143 77 -274 11 32 -34 -11 -280 -44 357
7413 357 -107 86 490 44 266 -51 -102 149 33 -202 190 -175 107 -102 -85 171 -173 33 146 -168 -68
7434 -68 -141 77 128 -17 -25 80 -95 10 88 -304 390 -51 -119 -182 -239 -132 58 -284 58 -143 -137 445 54 108
7458 108 58 -285 102 121 -128 10 -37 -70 10 -351 -41 54 -99 141 -74 247 108 -203 30 119 156 -50 -131
7481 -131 88 147 -194 219 265 -337 219 -247 113 344 -97 94 106 -274 59 183 -146 -62 -164 153 252 -197
7503 -197 -80 -37 -102 27 -388 -110 -38 74 41 25 -123 90 -167 -56 198 -247 113 -88 -182 97 -136 -275
7525 -275 266 -77 70 15 10 24 65 -66 220 -141 99 -118 -230 -62 -96 87 163 -119 -50 346 -12 236 87
$$ packed form
7368i8K31J17l51J46J25k19L26k59M6J02k42O2%p2J23K3j73K50l38O2L14k20J93
7391A48j50J43L6j93J58k03j75N92m86l4J91J00k70K20l51K85K1o6K3k69K36M01
7413C57m64J93M04m46K22l17n1K51j16k35L92l65K82k09J7K56l44K06J13l14J00
7434f8p3K18N1j45qJ05j75J05P8l92O94m41o8o3n7J07J90l42L42k01ON82l91N4
7458A08n0l43L87J9k49J38m7l3Q0l61L10R5j53K40k15L21j39l11K33Q9L7k06q1
7481a31K19N9l41M13M6o02N56m66L60K31m41J91J2l80L33J24l29Q4j02L17R9m49
7503a97J17M3o5J29m15K78P2J12l3j6j48K13k57J11K54m45L60k01r4K79k33j39
7525b75N41l43J47n5nJ4M1j31K86l61K40k17j12J68l4J83P6k82O9L96l58K48j49
$$ plain form
7548 87 -14 92 -213 -58 219 -229 214 -107 -96 -46 129 26 -41 81 6 -96 -161 46 98 16 131 -148 133
7571 133 71 -80 -106 -227 176 183 -314 5 16 -139 201 -208 -418 120 25 55 208 83 168 -110 44 203 -365
7594 -365 -260 19 -122 -89 -182 -198 -27 -148 71 106 -87 215 72 -149 253 -66 -181 18 -224 203 -71
7615 -71 -166 181 20 -180 120 -11 49 -85 -145 188 -87 -225 -35 18 51 61 -243 -13 -5 -74 28 139 82 -134
7639 -134 -63 330 34 45 -127 -337 83 -103 -28 -56 -47 86 179 -175 -103 147 53 59 -63 -321 40 -200 34 97
7663 97 -223 154 36 77 -89 -141 -20 70 -81 -6 2 -74 38 -106 -94 85 -280 -44 70 -33 88 -62 -157
7686 -157 307 -12 -174 323 -186 -137 -34 18 -57 -111 104 27 -17 305 97 -172 139 -9 4 69 -97 -74 13
7709 13 3 36 84 145 172 -292 101 208 -172 297 -257 -187 42 -44 11 31 -97 20 -12 -63 377 -174 117 129
$$ packed form
7548H7j01J06l05J55K77m48M43l21J1N0J75j03o7J22p5j02o5K07N2q2J15k79K81
7571A33o2j51k6j21M03Pm97L19J1j55L40m09k10N38r5L0J53j25Q5k78J54J59n68
7594c65J05K79j41L3r3j6J71j21K19L5j93L02j43k21M02l19j15J99k42M27k74
7615g1r5L47j61k00L00j31O0j34o0L33k75j38J90N3L3J0l04K30Qo9J02J11n7k16
7639a34P1L93k96J1j72k10M20j86P5k8RJ33R3l54P2K50r4Oj22k58L61k40K34O3
7663I7l20L77j18M1j66n2J21R0j51P5Qp6J12j44J2J79l65K36J14j03J21j50r5
7686a57M64l19j62M97n09M9J03N2p5n4K15p7m4L22k08k69L11j48J3O5j66K3Q7
7709A3j0L3M8O1K7m64L93J07l80M69n54P0K29q6N5K0j28J17l2n1M40n51K91J2
$$ plain form
7733 129 -162 273 139 -79 33 -200 87 115 -49 351 -4 141 132 27 150 -101 -314 78 -104 47 140
7754 140 16 -82 380 -171 54 19 -94 174 -68 -93 67 -12 232 -24 -261 354 -19 -104 129 20 262 213
7776 213 -211 -17 267 -139 -75 -52 -114 -9 -98 -119 5 -223 151 28 -94 138 -15 -79 -255 -48 182 13
7798 13 -125 165 208 67 -141 25 92 -63 -21 260 53 -222 -61 -78 185 50 85 26 -84 70 -127 -167 177
7821 177 -89 -93 17 -7 234 10 4 -289 -11 -161 165 -43 53 72 -303 10 106 137 42 -19 -50 136 113 86 194
7846 194 29 81 -146 -116 195 -175 -6 40 -14 166 -137 -27 152 -30 187 -71 -219 85 120 -85 -10 -228
7868 -228 -31 132 40 -14 -174 104 125 53 -85 -39 76 143 -15 -104 186 183 -37 82 -118 51 -104 87 26
7891 26 -258 6 -60 -120 117 231 197 261 -246 -108 114 -144 -160 199 -194 39 -126 -242 70 -145 -295 -80
$$ packed form
7733A29k91M35j34k18J12k33K87K8j64M00l55J45rj05J23k51k13L92j82J51R3
7754A40j24r8M62n51K25l5j13K68k42k5J60p9K44k56k37O15l73q5K33j09K42m9
7776B13m24J94K84m06O4K3o2J05q9k1J24k28L74j23j22K32j53o4j76K07K30j69
7798A3j38K90M3j41k08J66O7j55M2K81k07k75J61j7K63j35L5n9j10J54j97m0L44
7821A77k66mJ10k4K41k24ok93K78j50L26k08R6J9l75L13R6L1r5o1l1J86k3k7J08
7846A94j65N2k27L0L11l70J69M6n4J80l03J10J79j82K17k58j48L04L5k05P5k18
7868b28J97J63r2n4j60K78K1p2j38M6J15O7j58q9K90lk20J19k00J69j55J91o1
7891B6k84K64o6o0K37J14l4O4n07J38K22k58j6L59l93K33j65j16L12k15j50K15
$$ plain form
7913 -80 -246 65 93 -60 409 -182 -103 310 -28 117 127 -201 21 -47 46 59 -316 223 149 -168 135 -130 -161
7936 -161 172 -60 -100 69 115 158 165 20 -32 -195 -2 15 -293 294 -344 -198 181 -187 208 -20 -10 50 81
7959 81 -242 43 -224 40 20 -318 119 -121 111 163 -57 -47 169 -35 124 70 55 62 106 -75 16 -179 -126 -104
7983 -104 -9 346 -57 79 65 -63 173 157 -22 73 -35 -84 133 -102 142 142 107 211 37 84 -9 -95 79 64
8007 64 -147 -46 261 -209 229 84 -12 195 4 0 95 -130 179 -43 19 24 -26 234 -13 -121 35 9 29 -44
8031 -44 -335 -30 -150 -154 20 51 -63 -5 -51 -113 99 -18 -124 -71 -327 108 83 90 17 -75 71 -100 -92 89 3
8056 3 106 226 230 -187 -170 -22 159 56 -163 118 -79 70 5 -323 115 -55 -6 -26 49 122 148 -129 143 -7
8080 -7 -125 55 152 -185 -99 -80 45 18 -255 294 87 294 162 -228 4 -25 24 -14 -159 158 155 -10 103 126
$$ packed form
7913h0j66L11K8j53M69n91P9M13l38J45J0l28K22o8R3J3l75N39p4l17L03k65l1
7936a61L33k32m0J69M6M3Pj45n2j63J93J7l08N87o38J46L79l68L95k28J0O0L1
7959H1l23K85k67K64k0l38M37k40K32N2k20J0K16k04J59n4j5PM4j81R1j95N3K2
7983a04R5L55m03J36j4j28K36j6j79R5j08m9K17k35K44%l5J04j74M7r3q6J74j5
8007F4k11J01L07m70M38j45r6K07j91mR5k25L09k22O2Nn0K60k47j08J56k6K0p3
8031d4k91L05j20mJ74L1j14N8m6o2K12j17j06N3k56M35k5Pp3r2J46j71QJ81q6
8056CJ03J20Mm17J7J48J81j03k19K81j97J49o5l28M38j70M9k0P5P3K6k77K72j50
8080gj18J80R7l37Q6J9J25k7k73N49k07K07j32l90K32k9M9l8j45L17lj65J13K3
$$ plain form
8104 126 -54 -28 -106 -44 119 145 -148 -31 -213 -207 151 -3 283 -167 -177 55 -160 -45 -199 -42 2 -145 -244
8127 -244 267 -195 104 -102 -180 44 -17 -14 -92 -78 -90 -108 -207 170 -77 17 210 -175 94 119 -84 -69 48 -85
8151 -85 330 -103 -4 -25 -166 229 52 -7 199 -161 111 -6 -67 9 -246 94 -38 -156 16 107 25 -144 111
8174 111 -11 263 -398 60 124 -41 112 -27 23 124 189 79 -264 5 46 -146 -52
$$ packed form
8104A26j80K6p8O2J63K6k93J17j82OL58j54K86m50j0K32k15J15j54J57M4j47r9
8127b44N11m62K99k06p8K24o1Lp8J4j2j8r9L77k47R4J93l85K69K5k03J5J17j33
8151h5M15m33R9k1j41L95j77n9K06l60K72j17o1P6k55L40j32j18J72R1q2j69K55
8174A11j22K74o61M58O4j65J53j39N0J01O5j10l43K69M1j92R4
8191e2
$$ Imaginary data points
##PAGE= N=2
##DATA TABLE= (X++(I..I)), XYDATA
$$ plain form
0 0 0 0 0 0 0 0 0 0 8 -8 8 -8 15 -16 16 -24 25 -32 40 -45 53 -62 72 -81 93 -105 121 -137 157 -177 198 -222
32 -222 250 -279 311 -348 387 -429 476 -527 584 -646 716 -791 878 -973 1083 -1206 1350
49 1350 -1514 1709 -1943 2236 -2600 3077 -3732 4686 -6209 9015 -15857 65890 46732 -75508
63 -75508 70470 10870 -51745 49284 21204 -58946 4426 26566 -24299 -14559 36630 -20212
75 -20212 -19988 51217 -16867 -44361 19774 -28251 -16776 23607 -21519 -8466 2950 -38 29591
88 29591 -7562 4708 30573 -15816 19751 22056 -40922 9506 23535 -13696 15394 8864 -22264
101 -22264 -5449 19654 -2567 -26464 16314 -2563 -35758 32568 -10860 -56771 40697 936
113 936 -36372 44621 -16678 -39263 44551 5293 -15625 27162 5541 -8080 17275 15768 -21582
$$ packed form
0@%%%%%%%%Qj6J6j6K3l1L2m0M9n7P2q5R8j15J34j53J74j98K26k58K94l34L75m20
32b22M72n29N90o59P35q16R05j003J111j230J362j507J669j851K056k289K556
49A350k864L223l652M179m836N677o809Q418j0895J5224k4872Q1747j9158j22240
63g5508J45978n9600o2615J01029k8080q0150O3372K2140n0865R740N1189n6842
75b0212K24P1205o8084k7494O4135m8025J1475M0383m5126J3053J1416k988K9629
88B9591l7153J2270K5865m6389L5567K305o2978N0428J4029l7231K9090o530l1128
101b2264J6815K5103k2221k3897M2778j8877l3195O8326m3428m5911R7468l9761
113I36l7308Q0993o1299k2585Q3814l9258k0918M2787k1621j3621K5355j507l7350
$$ plain form
126 -21582 -9052 25719 -14056 -5200 21020 -35154 -3199 31664 -20950 7195 7796 -30993 10336
139 10336 -3638 -24292 4167 -14002 1184 17978 -7975 5195 3645 2117 24067 4895
151 4895 -748 -323 -8994 5711 -4490 -3020 3634 -9152 21250 8429 -19799 17096 -10526
164 -10526 -16424 30623 -21034 -27268 15919 -21883 -7756 21498 -11999 -3201 17901 8185 -3136
177 -3136 -116 8481 -9945 5381 23558 -22244 -5626 18536 -17648 13121 18620 -19500 11523
190 11523 7869 -10883 6835 -12757 -7960 7580 -7065 3028 -7083 -15016 7527 -247 4359
203 4359 6523 -7494 8426 1758 -1377 8758 -12605 3213 13594 -10657 7338 -3350 -14410
216 -14410 18213 1948 -1393 11925 -13565 2291 8082 -13938 2318 -4169 -8811 7849 -5398
$$ packed form
126b1582J2530L4771l9775Q856K6220n6174L1955L4863n2614K8145O01l8789M1329
139A0336j3974k0654K8459j8169J5186J6794k5953J3170j550j528K1950j9172
151D895n643M25q671J4705j0201J470O654j2786L0402j2821k8228L6895k7622
164a0526n898M7047n1657o234M3187l7802J4127K9254l3497Q798K1102r716j1321
177c136L020Q597j8426J5326J8177m5802J6618K4162l6184L0769N499l8120L1023
190A1523l654j8752J7718j9592M797J5540j4645J0093j0111p933K2543p774M606
203D359K164j4017J5920o668l135J0135k1363J5818J0381k4251J7995j0688j1060
216a4410L2623j6265l341J3318k5490J5856N791k2020J6256o487m642J6660j3247
$$ plain form
229 -5398 -5270 -2648 -1527 13491 883 3990 6141 -16220 8342 5943 -18691 9778 -412 -11646
243 -11646 17089 -3153 -8611 9765 398 7275 3830 -5745 -1407 -11855 1994 4007 -15205
256 -15205 6234 1966 -8209 13611 -1930 -6401 10065 -385 5096 -839 -10231 1910 -8636
269 -8636 2173 11143 -12972 5760 9499 -10833 10336 1810 -10218 9672 1068 -2966 -2569 -9394
283 -9394 1177 -3724 2681 9981 -10875 4624 9452 -10445 8428 2121 -10188 10219 -1579
296 -1579 -5365 676 -9406 4936 4035 -1263 10035 -6814 -671 10741 -7856 2495 3007 -9163
310 -9163 6078 -2686 -6540 1692 -6424 7526 6751 -3575 8033 -4785 -3408 10117 -7458 76
324 76 3338 -9096 5880 -2014 -7967 7131 -3358 5024 10303 -7217 2236 -502 -5911 5944
$$ packed form
229e398J28K622J121J5018j2608L107K151k2361K4562k399k4634K8469j0190j1234
243a1646K8735k0242n458J8376r367O877l445r575M338j0448J3849K013j9212
256a5205K1439m268j0175K1820j5541m471J6466j0450N481n935r392J2141j0546
269h636J0809Q970k4115J8732L739k0332K1169q526j2028J9890q604m034L97o825
283i394J0571m901O405P300k0856J5499M828j9897J8873o307j2309K0407j1798
296a579l786O041j0082J4342r01n298J1298j6849O143J1412j8597J0351N12j2170
310i163J5241q764l854Q232q116J3950p75j0326J1608j2818J377J3525j7575P534
324G6L262j2434J4976p894n953J5098j0489Q382N279j7520R453k738n409J1855
$$ plain form
338 5944 -4463 -2577 1509 -6533 5554 -2150 -4812 11137 -2727 2805 9971 -11745 -578 3252
352 3252 -7682 5321 -1461 -5006 3131 -4118 4281 1188 -4193 10905 -1223 -2339 7356 -11488
366 -11488 -3481 5501 -6308 3496 -638 -3782 4260 -3536 4982 3263 -6272 10238 -1353 -8103
380 -8103 6884 -9318 -4778 9039 -4911 1165 2439 -3606 4746 -377 3577 3911 -6435 6610
394 6610 -1698 -10473 5536 -5741 -3522 10311 -4113 496 3236 -4678 5735 -289 -511 4754
408 4754 -7453 1481 638 -10254 4678 -1 -2083 9717 -2081 31 4072 -3941 5931 205
422 205 -3705 4670 -7519 -1586 3445 -8008 4452 3281 -2438 7492 -3240 -2104 4082 -5606
436 -5606 3834 -10 -8013 3951 -5024 -3516 6586 -2902 4287 6303 -1548 5051 -2708 -1668 4476
$$ packed form
338E944j0407J886M086q042J2087p704k662J5949j3864N532P166k1716J1167L830
352C252j0934J3003o782l545Q137p249Q399l093n381J5098j2128j116R695j8844
366a1488Q007Q982j1809R804m134l144Q042p796Q518j719r535J6510j1591o750
380h103J4987j6202M540J3817j3950O076J274o045Q352n123L954L34j0346J3045
394F610q308q775J6009j1277K219J3833j4424M609K740p914J0413o024k22N265
408D754j2207Q934q43j0892J4932m679k082J1800j1798K112M041q013R872n726
422B05l910Q375j2189N933N031j1453J2460j171n719R930j0732J136O186r688
436e606R440l844q003J1964q975J508J0102r488P189K016p851O599p759J040O144
$$ plain form
451 4476 -5602 3328 1511 -9027 4971 -1611 -4438 7993 -2212 857 4050 -5412 822 -3918
465 -3918 -4426 4392 -6512 587 3842 -8404 4419 3762 -3492 8103 1360 -439 3198 -3831 1976
480 1976 -1578 -1868 6769 -5461 -550 5472 -9183 3111 5144 -6894 5379 -1 -6230 986
494 986 -4733 -1370 -339 -3239 4109 -3611 -1894 5888 -4773 3934 7175 -2972 6029 741 -4196
509 -4196 3275 -4210 1052 3362 -5329 5003 -457 -4704 7672 -2255 -1876 5873 -5691 -2644 -2062
524 -2062 -6951 -707 -2734 1426 3169 -3508 6052 1264 -2346 9739 -1852 -1070 7017 -6488 -610
539 -610 2125 -6560 5482 2895 -451 6830 -2661 -683 2878 -4823 642 -2375 -4981 -220 -5787
554 -5787 -525 -29 -3402 8117 -66 -1414 7637 -6014 -101 7597 -6145 2778 3874 -5438 4224
$$ packed form
451D476j0078Q930j817j0538J3998o582k827J2431j0205L069L193r462O234m740
465c918n08Q818j0904P099L255j2246J2823o57p254J1595o743j799L637p029N807
480A976l554k90Q637j2230M911O022j4655J2294K033j2038J2273n380o229P216
494I86n719L363J031k900P348p720J717P782j0661Q707L241j0147R001n288m937
509d196P471p485N262K310q691J0332n460m247J2376r927L79P749j1564L047N82
524b062m889O244k027M160J743o677R560m788l610J2085j1591P82Q087j3505N878
539f10K735q685J2042k587l346P281r491J978L561p701N465l017k606M761n567
554e787N262M96l373J1519q183j348R051j3651N913P698j3742Q923J096r312R662
$$ plain form
569 4224 1016 -1511 4534 38 3213 1184 -3657 850 -4803 -1814 2559 -5345 528 -1885 -5781
584 -5781 3785 -4140 -1932 6324 -4732 3791 5194 -7582 4455 2798 -3851 7178 425 -3676
598 -3676 2641 -517 1433 688 2077 3236 -2540 3643 -254 -8382 3313 -3125 -6379 4938 -7050
613 -7050 -4799 4851 -4808 3650 5280 -3326 5555 590 -3929 2576 -3923 -1025 3658 145 2283
628 2283 -440 2131 3660 -767 6625 -426 -5764 5642 -6187 -7194 4336 -8003 -1673 7221
642 7221 -5015 1031 2412 -3506 3780 669 -940 168 -4034 1525 -341 -1516 4375 25 4154
657 4154 5010 -2212 3267 -1882 -2372 6689 -5071 -1977 3856 -9741 1117 4620 -8734 2884
671 2884 3631 -4917 2139 -217 -3842 -674 2629 3261 -3250 1873 1984 -6440 5877 3711 -7015
$$ packed form
569D224l208k527O045m496L175k029m841M507n653K989M373p904N873k413l896
584e781R566p925K208Q256j1056Q523J403j2776J2037j657o649J1029o753m101
598c676O317l158J950p45J389J159n776O183l897q128J1695o438l254J1317j1988
613g050K251R650r659Q458J630q606Q881m965m519O505o499K898M683l513K138
628B283k723K571J529m427P392p051n338J1406j1829j007J1530j2339O330Q894
642G221j2236O046J381n918P286l111j609J108m202N559j866j175N891m350M129
657D154Q56p222N479n149m90R061j1760L094N833j3597J0858L503j3354J1618
671B884P47q548P056k356l625L168L303O32o511N123J11q424J2317k166j0726
$$ plain form
686 -7015 6837 2351 -3922 6686 -2093 -2584 4329 -1966 1493 -1930 -6583 1461 -3228 -1105 4358
701 4358 -3646 475 3783 -1302 691 -1543 522 342 -2481 4088 -4133 -5231 8726 -1951 523
716 523 10745 -4807 2 7351 -5910 -1728 1140 -4638 -341 -124 -522 -2738 -1263 5713 -328
731 -328 636 4120 -6303 -244 2405 -6424 1499 -332 -2975 5817 -1138 -292 4398 -2614 4747 4062
747 4062 -4529 1104 -2080 -3533 2253 -1647 -549 497 96 3366 -2637 -496 1736 -3639 4371
762 4371 701 -6601 2675 -2314 -2816 6094 -3022 -654 4492 -2733 2635 1101 -3319 3244 681
777 681 645 507 -3752 -119 -1625 -143 3421 -4209 868 3000 -4353 3787 665 -4504 5626 -118
793 -118 -2660 2099 -5374 -1340 2776 -758 2794 -540 -387 3838 -1014 1869 463 -3416 3310 -1449
$$ packed form
686g015J3852m486o273J0608q779m91O913o295L459l423m653Q044m689K123N463
701D358q004M121L308n085J993k234K065j80k823O569q221j098J3957j0677K474
716E23J0222j5552M809P349j3261M182K868n778M297K17l98k216J475O976o041
731c28R64L484j0423O059K649q829P923j831k643Q792o955Q46M690p012P361o85
747D062q591N633l184j453N786l900J098J046m01L270o003K141K232n375Q010
762D371l670p302R276m989n02Q910r116K368N146p225N368j534m420O563k563
777F81l6j38m259L633j506J482L564p630N077K132p353Q140l122n169J0130n744
793a18k542M759p473M034M116l534L552l334J53M225m852K883j406l879O726m759
$$ plain form
809 -1449 -3198 432 -4853 1367 3908 -1562 3692 -805 -1849 5258 -2749 -1125 1803 -4636 1336
824 1336 911 -4323 1252 47 1922 4086 -436 1714 -1980 -2107 4013 -3835 -1578 2377 -4833 2087
840 2087 2123 -4507 2495 1250 866 3891 -2971 -760 -179 -2966 3120 -1722 -2817 2943 -2059 1223
856 1223 2369 -2798 2321 1173 709 2614 -5122 -842 1440 -4026 3250 -125 -4774 3397 -361
871 -361 -661 2496 -1605 2034 1249 -282 1660 -4926 -845 3126 -3041 2344 1091 -4378 3462 1212
887 1212 -623 2234 -1830 1602 1001 -3049 920 -4055 -1871 4816 -1958 56 2025 -3067 3026
902 3026 2009 -1073 1520 -2332 1170 485 -4098 1578 -1695 -1511 6391 -983 -1205 2897 -2326 1947
918 1947 2397 -2219 419 -2245 -438 656 -3969 1630 376 -1069 5480 -1180 -2167 2722 -2038 1440
$$ packed form
809a449j749L630n285O220K541n470N254m497j044P107q007J624K928o439N972
824A336m25n234N575j205J875K164m522K150l694j27O120p848K257L955p210O920
840B087L6o630P002j245l84L025o862K211N81k787O086m842j095N760n002L282
856A223J146n167N119j148m64J905p736M280K282n466P276l375m649Q171l758
871c61l00L157m101L639p85j531J942o586M081L971o167N385j253n469P840k250
887A212j835K857m064L432o01m050L969m975K184O687o774K014J969n092O093
902C026j017l082K593l852L502o85m583N676l273J84P902p374k22M102n223M273
918A947M50m616K638k664J807J094m625N599j254j445O549o660r87M889m760L478
$$ plain form
934 1440 1488 -3655 719 -1487 -1255 2378 -3087 1244 2737 -1059 3589 -718 -3395 2181 -1167 341
950 341 598 -3968 641 -905 -707 3433 -2730 1515 3837 -2646 1683 -422 -4411 2671 -241 -836
966 -836 1073 -3609 747 904 -733 3490 -1140 82 3811 -2599 -81 -224 -3251 2249 -119 -999
982 -999 1196 -3244 1915 2503 -1812 3667 -444 -2173 3710 -2745 -2260 830 -2342 1591 189 -1377
998 -1377 948 -2071 2594 2698 -2402 2851 -637 -3236 2656 -2383 -2080 1835 -1222 1952 867 -1824
1014 -1824 1976 -718 1478 3391 -3340 324 430 -3830 1361 -1303 -2213 2142 -222 1613 440
1029 440 -1918 2536 -533 0 3145 -4324 -1009 1574 -3342 1963 406 -1598 3031 75 481 1145
1045 1145 -2352 2239 434 -1593 2147 -3480 -1730 1931 -2119 1185 981 -1104 2773 -1025 -4
$$ packed form
934A440M8n143M374k206K32L633n465M331J493l796M648m307k677N576l348J508
950C41K57m566M609j546J98M140o163M245K322o483M329k105l989P082k912n95
966h36J909m682M356J57j637M223m630J222L729o410K518j43l027N500k368q80
982i99K195m440N159N88m315N479m111j729N883o455M85L090l172L933j402j566
998a377K325l019M665J04n100N253l488k599N892n039L03L915l057L174j085k691
1014a824L800k694K196J913o731L664J06m260N191k664r10M355k364J835j173
1029D40k358M454l069N33L145p469L315K583m916N305j557k004M629k956M06O64
1045A145l497M591j805k027L740n627J750L661m050L304k04k085L877l798J021
$$ plain form
1060 -4 1177 -3213 2128 1085 -3159 1847 -1950 -2236 3573 -621 790 2032 -1151 2220 -377 -850
1076 -850 1387 -3150 1126 1122 -3697 918 -1044 -1648 3589 -317 301 1529 -1818 1951 -869 -2284
1092 -2284 1915 -2442 -95 2445 -3642 644 2136 -793 3592 822 -298 697 -2203 834 -1199
1107 -1199 -2820 2450 -1889 -610 2789 -3106 999 2787 -1816 2572 -583 -2485 848 -2429 117
1122 117 721 -2404 2612 529 -1147 3195 -1061 596 2784 -1288 733 -1124 -2292 1323 -1919
1137 -1919 1153 1645 -3119 2397 493 -2794 2730 -1402 -1188 2636 -1906 -407 -307 -2369 1723 -532
1153 -532 212 1852 -2048 1657 1200 -1775 2336 -32 -390 2446 -2445 -167 -367 -2973 2928 -755
1169 -755 -1819 3294 -2234 -228 2971 -1910 987 894 -1927 360 -1886 -783 85 -1397 3413 486
$$ packed form
1060dJ181m390N341j043m244N006l797k86N809m194J411J242l183L371k597m73
1076h50K237m537M276mm819M615j962o04N237l906O18J228l347L769k820j415
1092b284M199m357K347K540o087M286J492k929M385k770j120R95k900L037k033
1107a199j621N270m339J279L399n895M105J788m603M388l155j902L333l277K546
1122A17O04l125N016k083j676M342m256J657K188m072K021j857j168L615l242
1137a919L072M92m764N516j904l287N524m132K14L824m542J499J00k062M092k255
1153e32P44J640l900L705m57k975M111k368l58K836m891K278k00k606N901l683
1169g55j064N113n528K006L199m881K897r3k821K287k246J103Q68j482M810k927
$$ plain form
1185 486 -414 3661 -1444 284 2856 -2929 790 335 -3115 1216 -1830 -1071 2682 -922 2244 1807
1201 1807 -2627 1514 -635 -2151 921 -2314 -687 -211 -1387 1627 -652 1199 3835 -1480 2133
1216 2133 1221 -4305 1627 35 -3100 2601 -945 -1238 2333 -777 1016 516 -338 2207 -1431 -629
1232 -629 21 -3235 1015 56 -1596 2275 -1206 -74 1616 -2115 1960 661 -1954 3650 -979 -1877
1248 -1877 2551 -2220 -31 2614 -1585 287 -10 -789 752 -731 1496 522 -1541 2420 -1994 -2236
1264 -2236 2388 -2497 18 2015 -2790 1174 423 -1207 2915 -162 198 2215 -2284 -3 -238 -2714
1280 -2714 1420 -280 -123 1570 -653 1376 187 -464 2857 -2120 -749 1681 -4614 17 1144
1295 1144 -3333 2770 1768 -1262 2779 -218 -55 1000 -902 799 -1486 -1467 836 -2457 602 2202
$$ packed form
1185D86r00M075n105J728K572n785L719m55l450M331l046P59L753l604L166m37
1201A807m434M141k149j516L072l235J627M76j176L014k279J851K636n315L613
1216B133r12n526N932j592l135N701l546k93L571l110J793n00q54K545l638Q02
1232f29O50l256M250r59j652L871l481J132J690l731M075j299k615N604m629q98
1248a877M428m771K189K645m199J872k97p79J541j483K227r74k063L961m414k42
1264b236M624m885K515J997m805L964p51j630M122l077L60K017m499K281k35k476
1280b714M134j700J57J693k223K029j189o51L321m977J371K430o295M631J127
1295A144m477O103j002l030M041k997J63J055j902J701k285J9K303l293L059J600
$$ plain form
1311 2202 -1075 2777 801 -1170 1561 -2189 -354 850 -2763 1661 -369 -2860 2615 -654 -1170
1326 -1170 3610 -807 -63 1234 -1498 -195 -804 227 658 -1666 1983 -258 -2237 3142 -1031 -857
1342 -857 3901 -1954 -295 1562 -2661 799 264 -1206 1741 -1568 -283 606 -2160 1752 729 -765
1358 -765 2370 -976 -118 570 -1759 1108 -776 -1393 2018 -2402 104 2508 -2124 2328 2047 -2227
1374 -2227 1810 -789 -2245 796 -1522 -127 179 -1145 1559 -903 276 2448 -1404 1504 858
1389 858 -2583 1021 -1487 -2362 2232 -1495 698 1954 -1927 1886 757 -1203 2150 -991 -524 680
1405 680 -2093 -200 -786 -659 2039 -880 837 1858 -2346 1871 496 -2108 2080 -1350 -1284 1455
1421 1455 -2251 110 1296 -973 2537 132 -464 1583 -1658 327 801 -1540 1218 -853 -1428 904
$$ packed form
1311B202l277L852j976j971K731l750J835J204l613M424k030k491N475l269n16
1326a170M780m417P44J297k732J303o09J031M31k324L649k241j979N379m173J74
1342h57M758n855J659J857m223L460n35j470K947l309J285Q89k766L912j023j494
1358g65L135l346Q58O88k329K867j884o17L411m420K506K404m632M452k81m274
1374b227M037k599j456L041k318J395L06j324K704k462J179K172l852K908o46
1389H58l441L604k508q75M594l727K193J256l881L813j129j960L353l141M67J204
1405F80k773J893n86J27K698k919J717J021m204M217j375k604M188l430O6K739
1421A455l706K361J186k269L510k405n96K047l241J985M74k341K758k071n75K332
$$ plain form
1437 904 -1543 1036 1302 -1102 2586 -567 -1593 2446 -1914 -290 1980 -1938 224 319 -1549 796
1453 796 -402 703 1390 -876 1728 -584 -1877 2028 -1619 -780 1282 -2614 394 575 -1629 2186
1469 2186 -87 244 2593 -1992 479 609 -2679 1506 -28 -1379 1069 -1160 -324 977 -518 2066
1485 2066 -338 175 1962 -2764 -136 918 -3216 1227 1197 -2258 1378 -456 -664 1699 -316 1129
1501 1129 204 -913 1187 -2102 -598 1430 -2088 965 1029 -1468 1501 63 193 2054 -1001 833
1517 833 -35 -2672 1246 -1608 -1642 2543 -1126 242 1835 -1314 576 490 -324 1017 -1362 319 -285
1534 -285 -2494 1500 -937 -1701 3137 -774 -246 2245 -1718 690 710 -792 1003 -1613 -719 744
1550 744 -1948 1318 552 -1297 2373 73 -563 1332 -1244 504 404 -1304 1192 -1943 -888 1894
$$ packed form
1437I04k447K579K66k404L688l153j026M039m360J624K270l918K162R5j868K345
1453G96j198J105O87k266K604k312j293L905l647Q39K062l896L008J81k204L815
1469B186k273L31K349m585K471J30l288M185j534j351K448k229Q36J301j495K584
1485B066k404N13J787m726K628J054m134M443l0l455L636j834k08K363k015J445
1501A129r25j117K100l289J504K028l518L053O4k497K969j438J30J861l055J834
1517H33q68k637L918k854l4M185l669J368J593l149J890q6q14J341k379J681o04
1534b85k209L994k437p64M838l911N28K491l963K408K0j502J795k616Q94J463
1550G44k692L266p66j849L670k300o36J895k576J748j00j708K496l135J055K782
$$ plain form
1566 1894 -1788 1114 1975 -2025 1553 420 -1930 1266 -813 -145 719 -1224 533 -1165 -650 2188
1582 2188 -1080 894 1924 -1894 1173 10 -1695 1283 -1307 -170 1231 -2187 734 210 -1206
1597 -1206 2892 15 -500 1783 -1547 -378 194 -1705 634 -700 -252 1227 -1850 906 894 -1063
1613 -1063 2470 -210 -1257 1644 -1689 -683 928 -1672 1062 90 -786 1559 -1523 445 1880
1628 1880 -1095 1162 -133 -1571 583 -991 -201 522 -1285 1422 14 -987 2136 -990 81
1643 81 2311 -1579 127 409 -2335 644 81 -606 1193 -672 711 585 -973 1559 -549 -439 2061
1660 2061 -1602 -799 160 -2101 928 466 -421 1602 -592 817 1150 -1591 1342 239 -1596 1404
1676 1404 -1271 -1480 1057 -1212 872 989 -232 1255 -697 453 962 -2046 816 310 -2088 1294
$$ packed form
1566A894l682K902Q61m000L578j133k350L196k079O68Q64j943J757j698N15K838
1582B188l268J974J030l818L067j163j705K978k590J137J401l418K921n24j416
1597a206M098k877n15K283l330J169N72j899K339j334M48J479l077K756j2j957
1613a063L533k680j047K901l333J006J611k600K734r72q76K345l082J968J435
1628A880k975K257j295j438K154j574P90P23j807K707j408j001L123l126J071
1643H1K230l890J706K82k744K979n63o87J799j865J383j26j558K532k108J10K500
1660B061l663Q03R59k261L029m62q87K023k194J409L33k741K933j103j835L000
1676A404k675k09K537k269K084J17j221J487j952J150N09l008K862n06k398L382
$$ plain form
1692 1294 -1158 -1146 1896 -287 1087 1322 -1117 927 -802 -739 1117 -1821 -205 1145 -1728 719
1708 719 -54 -824 1811 -88 1074 640 -1570 899 -719 -1265 1721 -1426 -444 1535 -1676 406
1724 406 698 -1041 1748 -31 -276 554 -1670 664 177 -1280 1420 -728 -975 1357 -1452 480
1740 480 799 -530 1965 -465 -611 790 -1995 433 1076 -2069 1275 -4 -1215 2119 -126 61
1756 61 1332 -308 935 -773 -1322 410 -1576 349 1065 -1538 1465 626 -808 2000 -234 -168 1119
1773 1119 -1613 193 -683 -1842 1203 -453 -8 2411 -1007 542 1387 -1180 786 -19 -917 376
1789 376 -1397 60 -196 -1624 2014 -68 -157 2090 -1493 -104 1299 -1564 572 167 -1233 747
1805 747 -662 144 1077 -832 1754 847 -945 1409 -735 -602 1275 -1052 545 -214 -1285 1028
$$ packed form
1692A294k452J2L042k183J374K35k439K044j729O3J856k938J616J350k873K447
1708G19p73p70K635j899J162m34k210K469j618n46K986l147R82J979l211K082
1724D06K92j739K789j779k45Q30k224K334m87j457K700k148k47K332k809J932
1740D80L19j329K495k430j46J401k785K428O43l145L344j279j211L334k245J87
1756F1J271j640J243j708n49J732j986J925P16k603L003q39j434K808k234O6J287
1773A119k732J806q76j159L045j656M45K419l418J549Q45k567J966q05q98J293
1789C76j773J457k56j428L638k082q9K247l583J389J403k863K136m05j400J980
1805G47j409Q06R33j909K586r07j792K354k144J33J877k327J597p59j071K313
$$ plain form
1821 1028 -1542 -213 1511 -1611 1130 1050 -1770 1020 -80 -1065 1224 -577 -448 -91 -918 764
1837 764 -576 104 1934 -870 1064 1241 -1848 865 35 -1305 878 -1011 -714 441 -1345 942
1853 942 224 -447 2258 -788 -629 812 -1831 -610 151 -1052 796 -487 68 915 -372 2231 809
1870 809 -947 1860 -1034 -1588 1044 -1793 -660 1524 -584 828 524 -477 824 -634 614 -65
1886 -65 -1943 620 -919 -1357 985 -747 315 1526 -448 1001 203 -734 1487 -690 32 1157
1902 1157 -1753 307 732 -1225 1054 -47 -85 892 -490 166 -477 -820 1257 -1067 -391 978 -2043
1919 -2043 136 631 -1541 1323 361 -620 1752 -322 421 895 -684 1149 -83 -1163 646 -1121
1935 -1121 -223 659 -647 908 -123 -482 984 -1264 113 573 -1902 656 -393 -2025 1090 -186
$$ packed form
1821A028k570J329J724l122K741q0k820K790j100r85K289j801J29L57q27J682
1837G64j340O80J830k804J934J77l089K713q30j340K183j889K97J155j786K287
1853I42p18o71K705l046J59J441k643J221P61j203J848j283N55Q47j287K603j422
1870H09j756K807k894n54K632k837J133K184k108J412l04j001J301j458J248o79
1886f5j878K563j539m38K342j732J062J211j974J449p98r37K221k177P22J125
1902A157k910K060M25j957K279j101l8R77j382O56o43l43K077k324O76J369l021
1919b043K179M95k172K864r62r81K372k074P43M74j579J833j232j080J809j767
1935a121Q98Q82j306J555j031l59J466k248J377M60k475K558j049j632L115j276
$$ plain form
1951 -186 -181 1999 -82 589 971 -583 649 -563 -396 443 -1182 633 251 -1446 1503 -61 -273
1968 -273 1654 -1070 -43 229 -1955 109 -528 -1017 1006 -1006 -118 1550 -972 1079 842 -233
1984 -233 703 -322 -161 185 -1184 1414 -281 -508 1854 -833 -77 1703 -1306 579 916 -1515 500
2001 500 -623 -1004 505 -712 319 359 -757 1147 -507 -284 1307 -471 908 719 -1066 749
2017 749 -803 -708 1399 -1145 564 908 -1420 938 325 -926 1240 -285 -691 218 -1026 -292 -629
2034 -629 -477 782 -562 763 1045 -999 987 305 -1101 1346 -779 -793 711 -1400 187 913 -515
2051 -515 1191 297 -520 986 -1007 -256 443 -985 -8 -858 -606 254 -934 1035 455 -708 1773
2068 1773 -100 -1039 1519 -1025 -685 997 -1053 166 204 -884 722 -242 320 1078 -855 576 -160
$$ packed form
1951a86NK180k081O71L82j554J232j212J67Q39j625J815l82j697K949j564k12
1968b73J927k724J027K72k184K064o37m89K023k012Q88J668k522K051k37j075
1984b33R36j025J61L46j369K598j695k27K362k687P56J780l009J885L37k431K015
2001E00j123l81J509j217J031M0j116J904j654K23J591j778J379j89j785J815
2017G49j552R5K107k544J709L44k328K358o13j251K166j525m06R09j244P34l37
2034f29J52J259j344J325K82k044J986o82j406K447k125j4J504k111J587P26j428
2051e15J706q94q17J506j993P51O99j428R77q50K52Q60j188J969n80j163K481
2068A773j873r39K558k544L40J682k050J219L8j088J606r64N62P58j933J431p36
$$ plain form
2085 -160 -1330 552 -670 -504 461 -1082 318 175 -830 1591 -408 40 1576 -1428 -69 842
2101 842 -1471 525 495 -935 383 160 -185 351 230 991 -327 -34 1024 -1365 -209 626 -1781
2118 -1781 813 590 -1329 1289 -113 -105 1231 -180 804 291 -964 504 -907 -471 923 -771 280
2135 280 558 -581 748 -332 335 967 -1135 690 -192 -1591 825 -734 -1208 1336 -465 -160 1221
2152 1221 -634 499 472 -315 591 -554 132 -153 -1377 666 -127 -422 1304 -374 228 860 -865
2169 -865 555 -237 -930 936 -1068 -729 975 -1320 211 1221 -603 1105 287 -285 416 -630 282
2186 282 345 -775 429 -986 -257 1062 -1100 537 1414 -1089 825 210 -1094 730 -772 10 358
2203 358 -1199 450 -138 -802 1268 -220 163 1105 -727 409 -369 -815 230 -822 179 473 -1328
$$ packed form
2085a60j170J882j222J66R65j543J400j43j005K421j999M48J536l004J359R11
2101H42k313J996l0j430J318k23l45N36j21P61j318K93J058k389J156Q35k407
2118a781K594k23j919K618j402QJ336j411R84n13j255J468j411M36J394j694J051
2135B80K78j139J329j080O67O32k102J825q82j399K416j559m74K544j801L05J381
2152A221j855J133k7p87R06j145O86k85j224K043p93k95J726j678O02O32j725
2169h65J420p92o93J866k004L39J704k295J531J010j824J708q18n72P01j046R12
2186B82O3j120J204j415P29J319k162J637Q77k503J914o15j304J824j502P82L48
2203C58j557J649n88o64K070j488L83R42j832J136p78m46J045j052J001K94j801
$$ plain form
2220 -1328 612 417 -975 1739 359 -528 990 -1105 -657 213 -738 260 -277 -272 786 -536 543
2237 543 804 -602 1125 100 -603 356 -1253 -232 437 -1006 608 -25 -661 1464 -649 -255 1172
2254 1172 -657 458 61 -1074 176 -523 -436 402 -560 798 60 -560 1274 -702 -137 1063 -792
2271 -792 180 104 -1397 427 -260 -348 858 -726 719 599 -746 1001 -129 -853 1149 -819 -499
2288 -499 70 -1006 472 -210 12 931 -662 169 731 -1620 708 291 -1157 981 -577 -951 596
2305 596 -447 528 429 -50 857 -281 126 790 -1050 454 334 -1052 631 -315 -688 930 -328 644
2323 644 590 -548 924 -539 -772 798 -1040 -288 519 -1216 73 371 -210 1006 59 535 332 -857
2341 -857 439 -311 -886 742 -766 -355 708 -801 540 381 -368 1197 -313 -261 590 -1435 -53
$$ packed form
2220a328J940j95j392K714j380q87J518k095M48Q70r51R98n37NJ058j322J079
2237E43K61j406J727j025p03R59j609J021O69j443J614o33o36K125k113L94J427
2254A172j829J115l97j135J250o99Q7Q38r62J358p38o20J834j976N65J200j855
2271g92R72p6j501J824o87q8J206j584J445j20j345J747j130p24K002j968L20
2288d99N69j076J478o82K22R19j593Q31N62k351K328m17j448K138j558l74J547
2305E96j043R75r9m79R07j138M07O64j840J504j20j386J683r46l73J618j258R72
2323F44n4j138J472j463k33J570j838P52Q07j735J289K98n81J216r47M76k03j189
2341h57J296p50n75J628j508M11J063j509J341j59p49J565j510N2Q51k025J382
$$ plain form
2358 -53 101 -1273 720 20 -307 896 -280 186 431 -361 942 -592 -352 436 -1145 440 705 -664
2376 -664 992 523 -455 791 -402 20 366 -684 70 -761 -890 649 -794 -218 881 -870 157
2393 157 294 -661 709 -240 -55 531 -545 646 -95 -1001 1030 -204 -391 1117 -653 159 494 -517
2411 -517 528 148 -443 73 -1115 -523 -427 -1304 803 -194 -456 935 -223 243 841 -589 808 136
2429 136 -696 587 -662 -191 923 -633 1118 757 -469 993 -229 -576 314 -841 -248 -634 -1053
2446 -1053 571 -632 -394 1109 -264 776 593 -1263 358 -183 -699 616 -307 482 490 -365 1355
2463 1355 97 -56 1226 -372 77 616 -1034 0 18 -765 617 -654 -76 424 -735 640 128
2480 128 -624 1023 -380 -513 445 -801 141 415 -239 809 -195 55 679 -483 732 332 -733
$$ packed form
2358e3J54j374J993p00l27J203j176M66K45p92J303j534K40P88j581J585K65j369
2376f64J656m69r78J246j193M22L46j050P54q31j29J539j443N76J099j751J027
2393A57J37r55J370r49J85N86j076J191p41r06K031j234j87J508j770Q12L35j011
2411e17J045l80n91N16j188N92R6q77K107r97k62J391j158M66N98j430J397o72
2429A36q32J283j249M71J114j556J751l61j226J462j222l47Q90j155N93l86m19
2446a053J624j203K38J503j373J040j83j856J621n41n16J315r23P89Qq55J720
2463A355j258j53J282j598M49N39j650J034J8p83J382j271N78N00j159J375n12
2480A28p52J647j403j33R58j246R42K74o54J048j004K50O24j162J215m00j065
$$ plain form
2497 -733 1250 -305 -1006 586 -806 -356 273 -730 41 -540 -140 828 -537 483 650 -1075 440
2514 440 -215 -695 771 -358 255 786 -143 836 341 -168 1496 -545 29 665 -1399 -407 -354 -1263 215
2533 215 -23 -362 328 -299 467 59 -637 667 -687 -377 567 -963 187 626 -203 1287 596 -24
2551 -24 971 -391 -34 669 -1055 524 -645 -846 485 -565 20 425 -562 578 -24 -766 508 -1040
2569 -1040 -170 680 -1159 415 274 -617 1096 162 -18 1178 -33 433 382 -452 519 -280 -66 741
2587 741 -794 17 -38 -953 794 75 -434 721 -635 340 60 -1179 536 -306 -732 940 -501 -163
2605 -163 870 -521 410 599 41 373 -114 69 53 -616 487 -118 -615 931 -727 -343 794 -621
2623 -621 490 563 -730 98 -463 -587 466 -1025 253 689 -365 1140 140 -322 899 -140 444
$$ packed form
2497g33J983j555p01J592j392M50O29j003P71n81M00R68j365J020J67j725J515
2514D40o55m80J466j129O13N31r29R79m95n09J664k041N74O36k064R92N3r09J478
2533B15k38l39O90o27P66m08o96J304j354L10R44j530J150M39q29J490o91o20
2551b4R95j362L57P03j724J579j169k01J331j050N85M05r87J140o02p42J274j548
2569a040Q70Q50j839J574j41q91J713r34j80J196j211M66n1q34R71p99K14Q07
2587G41j535Q11n5r15J747p19n09J155j356R75k80j239J715q42m26J672j441L38
2605a63J033j391R31J89n58L32m87J83j6o69J103o05m97J546j658L84J137j415
2623f21J111P3j293Q28n61j24J053j491J278M36j054J505j000m62J221j039N84
$$ plain form
2640 444 265 -694 291 -592 -318 688 -735 297 890 -1032 663 368 -1080 749 -242 -436 411 -636
2658 -636 122 -210 -101 964 -156 479 797 -670 739 267 -781 770 -467 -356 401 -1048 511
2675 511 432 -428 1152 92 -724 893 -674 -287 581 -809 298 -226 -246 155 -274 672 379 -659
2693 -659 975 -151 -666 764 -710 -502 783 -853 278 194 -727 524 -125 269 847 -597 166
2710 166 247 -941 265 -296 -147 269 -484 186 -100 -393 1012 -229 145 1088 -885 -51 431 -1246
2728 -1246 233 199 -673 576 -227 41 381 -366 806 98 -334 539 -494 -284 444 -515 531 59
2746 59 -383 807 -385 8 538 -681 740 340 -1071 586 -742 -739 831 -625 -138 341 -93 407
2764 407 -382 162 620 -478 306 -41 -1037 649 -219 -740 649 -146 7 784 -664 473 182 -520
$$ packed form
2640D44j79r59R85q83K74J006j423J032N93j922J695k95j448J829r91j94Q47j047
2658f36P58l32J09J065j120O35L18j467J409m72j048J551j237J11P57j449J559
2675E11p9q60J580j060q16J617j567L87Q68j390J107n24k0M01m29R46k93j038
2693f59J634j126n15J430j474K08J285j636J131q4r21J251o49L94N78j444P63
2710A66Q1j188J206n61J49M16p53O70k86k93J405j241L74R43j973Q34M82j677
2728a246J479l4q72J249q03K68L40p47J172p08m32Q73j033K10P28r59J046m72
2746E9m42J190j192L93N30j219J421m00j411J657j328LJ570j456M87M79m34N00
2764D07p89N44M58j098P84l47r96J686q68n21J389p95J53P77j448J137k91p02
$$ plain form
2782 -520 692 -594 -79 496 -870 361 152 -251 762 -198 -288 817 -395 604 -161 -617 746 -923
2800 -923 -409 445 -1069 228 649 -291 514 196 -364 509 -551 113 -2 -621 399 -490 -489 777 -484
2819 -484 79 868 -323 513 -212 -375 463 -647 -36 519 -968 724 230 -788 696 92 -131 723
2837 723 -366 -58 -45 -553 219 -505 -70 386 -764 682 320 -652 1195 -56 -289 490 -721 -376
2855 -376 -18 -588 389 -373 -223 650 -746 180 474 -480 276 -74 -501 348 -533 -31 289 -442 663
2874 663 -106 -398 773 -384 -68 1030 -695 269 171 -553 106 -648 -150 441 -643 421 37 -615
2892 -615 823 -27 -151 749 -610 -11 40 -703 521 -333 9 831 -345 460 745 -790 742 468
2910 468 -708 562 -547 -176 216 -567 376 -167 189 1031 -380 -34 518 -952 427 69 -1002 490
$$ packed form
2782e20J212j286N15N75j366J231k09m03J013r60r0J105j212R99p65m56J363j669
2800i23N14Q54j514J297M21r40Q05l18n60Q73j060O64j15o19J020q89JJ266j261
2819d84N63P89j191Q36p25j63Q38j110O11N55j487J692m94j018J484o04k23Q54
2837G23j089L08J3n08P72p24M35M56j150J446l62r72J847j251k33P79j211L45
2855c76L58n70R77p62J50Q73j396R26K94r54P56l50m27Q49q81N02L20p31J105
2874F63p69k92J171j157L16J098j725R64r8p24O59p54M98N91j084J064l84o52
2892f15J438q50j24R00j359N99N1p43J224q54L42Q22j176Q05K85j535J532k74
2910D68j176J270j109L71L92p83R43n43L56Q42j411L46N52j470J379l58j071J492
$$ plain form
2928 490 -437 -384 278 -453 443 398 -23 906 -288 -202 586 -810 -34 404 -657 286 -220 -289 502 -461
2948 -461 298 166 -601 553 -333 -681 497 -542 -30 473 -748 271 134 -163 871 8 363 735
2966 735 -596 475 383 -735 829 -243 -419 355 -502 10 97 -328 752 28 -108 470 -927 59
2984 59 144 -942 391 161 -436 843 -78 561 507 -222 839 -233 -335 618 -633 -183 439 -488 530
3003 530 -72 -503 447 -354 206 572 -571 256 -182 -935 393 -398 -22 709 -108 450 632 -355 446
3022 446 -26 106 431 -771 274 -47 -565 723 40 -429 914 -578 18 69 -661 332 -320 -430 289
3041 289 -709 -50 662 -788 663 337 -94 714 -268 -23 455 -531 233 53 -325 556 -485 15 518
3060 518 -757 354 366 -437 537 -188 -193 92 -531 354 -300 -668 721 -538 -295 912 -411 429 719
$$ packed form
2928D90r27N3O62p31Q96m5m21R29j194Q6P88j396P76M38j061R43n06o9P91r63
2948d61P59j32p67J154q86l48J178j039N12N03j221J019j37k97J034q63L55L72
2966G35j331J071r2j118J564j072j76P74q57N12Q7m25J080p24j36N78j397R86
2984E9Q5j086J333k30n97J279r21O39n4p29J061j072j02R53j251M50O22r27J018
3003E30o02m31R50q01N60L66j143Q27m38p53J328p91L76P31q17N58J82r87Q01
3022D46m72J32L25j202J045l21n18J288o83m69J343j492N96N1p30R93o52j10P19
3041B89r98O59P12j450J451l26m31Q08r82K45M78r86P64j80l78Q81j041N00N03
3060E18j275J111J2q03R74p25nK85o23Q85o54l68J389j259K43J207j323Q40K90
$$ plain form
3079 719 -609 426 119 -376 495 -494 100 109 -531 254 36 -333 1006 -319 -90 256 -733 -29 -329
3098 -329 -583 -33 -703 -79 408 -522 776 530 -392 643 -195 -234 451 -559 340 23 -413 643 -156
3117 -156 -10 637 -499 488 423 -809 403 -279 -673 344 -585 68 161 -141 733 -39 -306 862 -306
3136 -306 286 510 -660 497 -24 -243 396 -384 371 443 -549 464 278 -482 833 -459 -362 428 -843
3155 -843 -122 45 -563 175 82 -38 595 -215 130 270 -418 1035 54 -545 538 -395 -125 300 -532 691
3175 691 144 136 484 -410 116 402 -687 260 -151 -886 499 -239 -124 500 -182 460 7 -88 733 -553
3195 -553 88 417 -730 154 358 -676 375 2 29 746 -350 205 105 -689 167 -530 -299 315 -519
3214 -519 159 165 -646 367 -121 164 603 -414 151 175 -656 664 -90 -599 797 -479 -102 622 -113
$$ packed form
3079G19j328J035l07m95Q71r89N94Ro40P85k18l69J339j325K29L46r89P04l00
3098c29k54N50o70O24M87r30J298k46r22J035q38l9O85j010Q99l17m36J056p99
3117a56J46O47j136R87o5j232J212o82l94J017r29O53R3l02Q74p72k67J168j168
3136c06N92K24j170J157n21k19O39p80P55P2r92J013j86p60J315j292R7P90j271
3155h43P21J67o08P38r3j20O33q10L45J40o88J453r81n99J083r33K70M25q32J223
3175F91n47qL48q94N26K86j089R47m11p35J385p38J15O24o82O42m53r5Q21j286
3195e53O41L29j147Q84K04j034J051l73K7P17j096N55j00p94Q56o97K31O14q34
3214e19O78Oq11J013m88K85M39j017N65K4q31J320p54n09J396j276L77P24p35
$$ plain form
3233 -113 245 447 -363 288 -544 -251 200 -631 353 78 -491 421 -21 -176 343 -72 420 426 -303 273 -373
3254 -373 -511 533 -413 116 322 -433 239 106 -248 624 -166 24 207 -447 153 -422 -274 592 -545
3273 -545 -172 602 -580 489 316 -368 564 -6 -87 350 -621 314 37 -94 639 -99 -99 670 -482 277
3293 277 136 -401 76 -329 -51 138 -697 136 274 -119 989 125 -267 639 -485 -97 466 -369 27
3312 27 -53 -71 256 -174 80 333 -225 577 -23 -580 555 -321 -218 128 -821 232 -130 -573 813 -112
3332 -112 132 777 -457 127 244 -563 426 -37 -184 473 -359 231 141 -139 855 -187 -77 657 -635
3351 -635 -158 35 -768 205 -85 -246 284 -429 362 181 -416 526 27 -498 437 -350 -473 339 -682 -3
3371 -3 -61 -398 448 -287 334 280 -480 296 214 -835 458 -405 -382 332 -117 151 -77 -401 714 -86 53
$$ packed form
3233a13L58K02q10O51q32K93M51q31R84k75n69R12m42j55N19m15M92Op29N76o46
3254c73j38J044r46N29K06p55O72j33l54Q72p90J90J83o54O00n75J48Q66j137
3273e45L73P74j182J069j73o84R32n70q1M37r71R35k77j31P33p38%P69j152P59
3293B77j41n37M77m05K78J89q35Q33J38l93J108q64l92R06j124L88N63q35L96
3312B7q0j8L27m30K54K53n58Q02o00n57J135q76J03L46r49J053l62m43J386r25
3332a12K44O45j234N84J17q07R89m63j47O57q32N90r0k80R94j042J10P34j292
3351f35M77J93q03R73k90j61N30p13P91j81n97R42m99n25R35p87j23Q12j021O79
3371cn8l37Q46p35O21n4p60P76q2j049J293q63K3P14m49K68k28l24J115q00J39
$$ plain form
3392 53 499 -526 72 155 -599 -33 70 -311 501 -71 56 337 -461 678 -117 -290 435 -807 -77 487
3412 487 -482 88 321 -282 441 42 -11 291 -488 528 -209 -507 419 -342 -223 466 -371 67 456 -479
3432 -479 707 -137 -22 451 -465 221 298 -786 497 -308 -511 693 -275 -259 389 -79 497 -95 -271
3451 -271 358 -467 48 292 -708 369 111 -334 597 -37 -23 582 -141 238 -129 -412 318 -282 -216 388
3471 388 -364 338 396 -123 500 48 -158 313 -535 124 -255 -663 357 -222 -302 419 -278 258 585 -206
3491 -206 292 75 -424 318 -669 14 177 -497 514 -130 -346 352 -66 -122 538 -407 169 211 -701 365
3511 365 -258 -43 24 -568 354 499 -549 498 -110 59 478 -213 -264 -100 -295 222 -145 -44 605 -198
3531 -198 314 266 -353 337 281 -361 362 -141 -249 -51 -488 188 162 -444 773 -194 63 673 -474 303
$$ packed form
3392E3M46j025N98Q3p54N66J03l81Q12n72J27K81p98J139p95j73P25j242P30N64
3412D87r69N70K33o03P23l99n3L02p79J016p37k98R26p61J19O89q37M38L89r35
3432d79J186q44J15M73r16O86P7j084J283q05k03J204r68J6O48m68N76n92j76
3451b71O29q25N15K44j000J077k58m45R31o34J4O05p23L79l67k83P30o00O6O04
3471C88p52P02N8n19O23m52k06M71q48O59l79m08J020n79q0P21o97N36L27p91
3491b06M98k17m99P42r87O83J63o74J011o44k16O98m18n6O60r45N76M2r12J066
3511C65o23K15O7n92R22J45j048J047o08J69M19o91n1J64j95N17l67J01O49q03
3531a98N12m8o19O90n6o42P23n03j08J98m37O76k6o06J217r67K57O10j147P77
$$ plain form
3551 303 42 -596 151 -283 -25 398 -115 446 157 -386 687 -140 -441 277 -503 -132 186 -352 61 -344
3571 -344 -234 308 -320 309 389 -621 397 -48 -574 318 -208 -122 49 -188 210 118 127 559 -1 212 269
3592 269 -685 241 -117 -447 238 -397 -140 409 -11 341 -37 -106 504 -205 -56 442 -493 44 90 -420 592
3613 592 52 187 461 -136 129 142 -276 385 -57 -375 407 -485 -277 516 -630 141 -69 -233 445 -164
3633 -164 76 46 -154 512 -58 -566 471 -229 -148 428 -117 332 116 -114 490 -169 -24 383 -537 52
3653 52 -256 -827 388 16 -217 235 -136 181 294 -95 105 -398 -183 481 -415 11 252 -503 489 379
3673 379 -61 509 4 16 315 -341 183 -177 -470 284 -449 -200 583 -235 447 133 33 273 -273 -251 258
3694 258 -649 346 -140 -264 672 -90 4 760 -51 -47 330 -465 213 -23 -66 422 -559 237 4 -599 563
$$ packed form
3551C03k61o38P47m34K58M23n13N61k89n43J073q27l01P18p80L71L18n38M13m05
3571c44J10N42o28O29Q0j010J018m45n26Q92n26Q6J71k37L98r2RM32n60K13N7
3592B69r54R26l58l30O85o35K57N49m20L52l78o9O10p09J49M98r35N37M6n10J012
3613E92n40J35K74n97K65J3m18O61m42l18P82q92K08P93j146P71k10j64O78o09
3633a64K40l0k00O66n70n08J037p00Q1N76n45M49k16k30O04o59J45M07r20N89
3653E2l08n71J215l72k33M52l71L17J13l89K00n03K15O64q96M26K41p55R92j10
3673C79m40N70n05J2K99o56N24l60k93P54p33K49P83q18O82l14j00K40n46K2N09
3694B58r07R95m86j24R36p62R4P56q11ML77p95O78k36m3M88r81P96k33o03J162
$$ plain form
3715 563 6 -350 543 -173 -19 168 -304 141 55 126 461 -512 114 496 -535 151 65 -481 517 196 -414
3736 -414 62 -418 147 69 -420 227 -408 40 524 -505 472 296 -493 116 81 -333 -39 -450 228 21
3756 21 -489 394 166 -238 256 -148 1 301 -631 -55 -180 -80 115 -272 230 196 -175 601 124 -200 574
3777 574 -114 -208 375 -467 47 135 -177 426 65 413 355 -249 318 205 -379 183 -190 -296 248 -563 10
3798 10 -16 -236 507 -220 74 554 -627 56 549 -308 292 -142 -401 305 -227 37 244 -229 569 -148
3818 -148 -85 485 -291 -31 187 -358 -13 110 -451 495 -77 -3 537 -208 526 180 -268 185 -408 -241 383
3839 383 -281 -65 225 -277 351 -34 -91 255 -419 17 -77 -514 155 -183 -347 377 -299 -63 367 -307 349
3860 349 173 -111 282 -471 -319 211 -586 243 191 -305 430 -121 -51 570 -354 389 -106 -361 555 -335 -350
$$ packed form
3715E63n57l56Q93p16J54J87m72M45q6P1L35r73O26L82j031O86q6n46R98l21o10
3736d14M76m80N65p8m89O47o35M48M84j029R77j76p89O09l5m14K94m11O78k07
3756B1n10Q83k28m04M94m04J49L00r32N76j25J00J95l87N02l4l71P76m77l24P74
3777E74o88r4N83q42N14Q8l12O03l61L48n8o04N67j13n84N62l73j06N44q11N73
3798A0k6k20P43p27K94M80j181O83M93q57O00m34k59P06n32K64K07m73P98p17
3818a48O3N70p76K60K18n45L45J23n61R46n72P4N40p45P34l46m48M53n93J67O24
3839C83o64K16K90n02O28l85n7L46o74M36r4m37O69l38j64P24o76K36M30o74O56
3860C49j76k84L93p53J52N30p97Q29n2m96P35n51P0O21r24P43m95k55R16q90j5
$$ plain form
3881 -350 479 -502 -171 379 -234 75 165 103 197 -250 50 25 -434 136 -192 -136 581 -400 92 399 -230 211
3903 211 6 -124 316 -293 -128 149 -563 410 134 -458 435 -134 -117 260 -200 260 189 -371 258 -203 -218
3924 -218 166 -513 263 156 -345 487 -176 -96 257 -434 145 346 -514 343 -19 -239 135 -222 159 252 -377
3945 -377 196 133 -168 253 -198 3 139 -474 494 -175 -303 651 -255 -88 632 -520 222 200 -323 63
3965 63 -30 -310 158 -351 -9 288 -286 645 -95 -247 236 -245 75 67 -536 30 -11 -301 468 -388 463 253
3987 253 -197 381 -148 -398 263 -225 -346 177 -390 215 120 -290 245 -223 183 508 -630 145 273 -122
4007 -122 168 -363 -284 436 -479 80 298 -226 388 -83 124 424 -347 302 1 -518 309 -174 -331 321
4027 321 -196 189 158 -470 533 97 -366 568 -466 -201 255 -520 131 380 -101 406 -343 51 191 -241
$$ packed form
3881c50Q29r81L31N50o13L09R0o2R4m47L00k5m59N70l28N6P17r81M92L07o29M41
3903B11k05j30M40o09J65K77p12R73k76n92Q93n69J7L77m60M60p1n60O29m61j5
3924b18L84o79P76j07n01Q32o63Q0L53o91N79K01q60Q57l62k20L74l57L81R3o29
3945c77N73o3l01M21m51K01J36o13R68o69j28R54r06J67P20j152P42k2n23L86
3965F3r3k80M68n09L42K97n74R31p40j52M83m81L20qo03N66m1k90P69q56Q51k10
3987B53m50N78n29k50O61m88j21N23n67O05r5m10N35m68M06L25j138P75J28l95
4007a22K90n31P9P20r15N59K18n24O14m71K07L00p71O49l01n19Q27m83j57O52
4027C21n17L85l1o28J003m36m63R34j034K65M56p75O51K49m81N07p49L94J40m32
$$ plain form
4047 -241 258 73 -323 267 -342 -187 107 -348 253 22 -271 275 -9 -139 172 -501 112 279 -373 473
4067 473 121 -339 440 -88 271 -50 -117 369 49 -234 403 -304 -176 310 -495 197 -19 -438 338 4
4087 4 150 278 -404 131 -94 -284 295 -1 -266 506 -128 58 72 -449 406 -264 -222 247 -235 41 70 -543
4109 -543 280 -168 -395 511 -364 161 366 56 685 -77 -51 243 -427 -41 84 -602 282 -33 -482 466
4129 466 45 -108 145 -411 1 -194 -275 172 -351 52 323 -424 234 381 -298 486 -287 -237 -18 -244 146
4150 146 -161 -533 432 -130 -215 751 -417 145 367 -562 117 33 -358 150 -257 51 266 -386 239 -224
4170 -224 -41 703 -355 -124 467 -433 111 -4 44 560 -124 -148 254 -183 116 7 -330 342 -265 109
4190 109 315 -155 75 3 -313 357 -167 14 273 -177 157 189 -379 357 -110 -295 278 -329 -280 194 -88
$$ packed form
4047b41M99j85l96N90o09J55K94m55O01k31k93N46k84j30L11o73O13J67o52Q46
4067D73l52m60P79n28L59l21o7M86l20k83O37p07J28M86q05O92k16m19P76l34
4087DJ46J28o82N35k25j90N79k96k65P72o34J86J4n21Q55o70M2M69m82K76K9o13
4109e43Q23m48k27R06q75N25K05l10O29p62K6K94o70L86J25o86Q84l15m49R48
4129D66m21j53K53n56M12j95q1M47n23M03K71p47O58J47o79P84p73N0K19k26L90
4150A46l07l72R65n62q5R66j168N62K22r29O79q4l91N08m07L08K15o52O25m63
4170b24J83P44j058K31N91r00N44j15M8N16o84k4M02m37K99j09l37O72o07L74
4190A09K06m70K30p2l16O70n24J81K59m50L34L2n68P36m67j85N73o07M9M74k82
$$ plain form
4211 -88 145 -34 -121 293 -72 158 259 -910 153 -72 -486 -27 -400 -142 57 -35 410 134 -192 512
4231 512 -155 -46 194 -433 -17 103 -299 197 4 66 444 2 525 168 -220 439 -417 -585 201 -374
4251 -374 -192 194 -351 220 15 -142 695 -93 120 59 -423 137 -183 -333 309 -91 72 675 -131 317
4271 317 -231 -129 565 -544 -125 68 -382 79 -11 -409 392 42 -24 286 -289 124 199 -130 360 -96 -162
4292 -162 159 -311 59 88 -281 350 102 -75 283 -449 102 64 -553 172 -226 -506 355 -130 -199 112 -370
4313 -370 109 3 36 305 21 -17 146 -194 157 -17 -315 454 258 55 724 92 202 177 -56 92 -126
4334 -126 -196 180 -464 124 60 -606 380 233 -270 309 -89 -25 140 -239 -39 -408 -349 459 -389 -46 461
4355 461 -136 488 311 -388 41 -168 -241 116 -407 97 -169 -327 331 -310 -350 293 -305 361 215 -392 140
$$ packed form
4211h8K33j79q7M14l65K30J01j169J063k25m14M59l73K58J99r2M45k76l26P04
4231E12o67J09K40o27M16J20m02M96j93O2L78m42N23l57l88O59q56j68P86n75
4251c74J82L86n45N71k05j57Q37p88K13o1m82N60l20j50O42m00J63O03q06M48
4271C17n48J02O94j109M19J93m50M61r0l98Q01l50o6L10n75M13P5l29M90m56o6
4292a62L21m70L70K9l69O31k48j77L58p32N51l8o17P25l98k80Q61m85o9L11m82
4313c70M79j06L3K69k84l8J63l40L51j74k98P69j96k03O69o32J10k5k33J48k18
4334a26p0L76o44N88o4o66R86j47n03N79l98O4J65l79K00l69N9Q08q48L43N07
4355D61n97O24j77o99M29k09p3L57n23N04k66j58O58o41m0O43n98O66j46o07N32
$$ plain form
4376 140 -93 -72 113 -502 74 452 -297 504 -34 -208 590 -206 26 67 -268 46 24 -22 163 -311 -61
4397 -61 502 -470 263 -41 -249 577 -345 -198 241 -232 37 136 -85 444 188 477 462 -240 83 158 -194
4418 -194 202 28 -68 128 -189 244 3 -332 512 -249 -136 341 -205 34 165 -504 141 286 -377 85
4438 85 -325 170 442 -125 259 -48 -510 469 -358 17 472 -184 97 6 -202 234 -61 -15 461 -409 24
4459 24 224 -627 445 -120 -383 327 -5 175 250 -118 325 182 -90 311 -406 58 275 -505 142 -44
4479 -44 -280 347 -289 50 279 -142 108 122 -43 384 -470 -171 422 -409 227 201 -17 247 -121 112 394
4500 394 -275 426 146 -242 110 -511 -212 418 -337 19 235 -222 341 266 109 125 -251 -43 168 -375 243
4521 243 7 -162 341 -133 -167 387 -440 186 -9 -362 248 -174 258 154 -284 254 108 -156 470 12
$$ packed form
4376A40k33K1J85o15N76L78p49Q01n38j74P98p96K32M1l35L14k2m6J85m74K50
4397f1N63r72P33l04k08Q26r22J47M39m73K69R9k21N29k56K89j5p02L23P5l52
4418a94L96j74r6J96l17M33k41l35Q44p61J13M77n46K39J31o69O45J45o63M62
4438H5m10M95K72n67L84l07m62R79q27L75M55o56K81r1k08M36k95M6M76q70M33
4459B4K00q51J072n65k63P10l32J80P5l68M43j43k72M01p17M64K17p80O47j86
4479d4k36O27o36L39K29m21K50J4j65M27q54K99N93q31O36k6k18K64l68K33K82
4500C94o69P01k80l88L52o21K99O30p55L56K16m57N63p5j57J6l76K08K11n43O18
4521B43k36j69N03m74l4N54q27O26j95l53O10m22M32j04m38N38j46k64O26m58
$$ plain form
4541 12 -31 453 -423 107 154 -261 304 -505 -173 288 -356 432 597 -184 671 -49 -141 112 -298 234 156 -350
4563 -350 -35 -129 -337 282 -255 181 300 -232 230 -64 -18 322 -355 -41 55 -174 211 45 -188 582 -185
4584 -185 111 506 -194 -4 -210 -407 -19 -148 -303 -37 -249 323 122 -143 416 47 -192 238 -396 197
4604 197 -45 -185 64 -209 -127 216 -249 238 10 -78 120 159 -150 318 -265 -326 229 -466 309 109 -163
4625 -163 395 -238 -87 318 -588 -24 92 -369 123 -107 -268 302 -378 145 66 -430 375 16 -59 157 -349
4646 -349 -168 140 -126 269 -372 -191 162 17 380 67 -39 351 -148 -264 408 48 11 370 -426 223
4666 223 96 -180 405 -225 51 158 -446 196 46 -221 210 -256 34 10 -188 83 204 -330 424 -116
4686 -116 45 227 -639 119 35 -242 -16 314 -175 417 -157 -112 226 -278 269 -12 -265 162 -484 -85 209
$$ packed form
4541A2m3M84q76N30M7m15N65q09L32M61o44P88J65p81Q55p20r2K53m10N32p8n06
4563c50L15r4k08O19n37M36J19n32M62k94M6L40o77L14R6k29L85j66k33P70p67
4584a85K96L95p00J90k06j97L88j29j55K66k12N72k01k65N59l69k39M30o34N93
4604A97k42j40K49k73Q2L43m65M87k28q8J98L9l09M68n83o1N55o95P75k00k72
4625a63N58o33J51M05r06N64J16m61M92k30j61N70o80N23p9m96Q05l59p5K16n06
4646c49J81L08k66L95o41J81L53j45L63l13j06L90m99j16O72l60l7L59p96O49
4666B23j27k76N85o30K76J07o04O42j50k67M31m66K90k4j98K71J21n34P54n40
4686a16J61J82q66P58q4k77K26L30m89N92n74M5L38n04N47k81k53M27o46L99K94
$$ plain form
4707 209 -380 101 116 -347 264 -66 244 77 -290 328 -74 -457 333 -268 -109 311 -139 78 147 -185 171
4728 171 38 -257 53 -564 -101 223 -122 416 -37 66 314 -220 275 493 -153 452 -354 -286 161 -702
4748 -702 -22 288 -440 345 -31 -79 42 74 -87 154 -110 -41 71 -304 238 -132 87 516 -161 247 199
4769 199 -337 277 243 -216 145 -233 -21 116 -248 391 -133 102 401 -182 159 219 -317 472 124 -368 156
4790 156 -142 -62 149 -489 112 121 -265 536 -21 89 149 -390 187 -99 -78 312 -209 28 268 -12 374 114
4812 114 -226 253 -233 -304 21 -368 26 -5 -283 183 -220 11 307 -122 210 196 -66 145 -141 -561 254
4833 254 -25 -42 249 -187 444 -141 -296 378 -187 27 255 -140 -5 39 -132 520 -52 -57 155 -544 338
4854 338 -114 -124 396 -241 -197 490 -533 127 317 5 136 227 0 20 -463 166 139 -359 272 -116 -234
$$ packed form
4707B09n89M81J5m63O11l30L10j67l67O18m02l83P90o01J59M20m50K17O9l32L56
4728A71j33k95L10o17M63L24l45N38m53J03K48n34M95K18o46O05q06O8M47q63
4748g02O80L10p28P85l76m8J21L2j61K41k64O9J12l75N42l70K19M29o77M08m8
4769A99n36O14l4m59L61l78K12J37l64O39n24K35K99n83L41O0n36P89l48m92N24
4790A56k98Q0K11o38O01Rl86Q01n57J10O0n39N77k86K1L90n21K37K40k80L86k60
4812A14l40M79m86p1L25l89L94l1k78M66m03K31K96m29L32j4k62K11k86m20Q15
4833B54k79j7K91m36O31n85j55O74n65K14K28l95J35M4j71O52n72nK12o99Q82
4854C38m52j0N20o37M4O87j023O60J90l12J31R1k27K0m83O29k7m98O31l88j18
$$ plain form
4875 -234 389 -210 -326 -31 -358 309 -148 -32 316 -232 131 311 -270 302 -53 -244 -61 55 -136 -56
4895 -56 -124 191 375 -284 567 -79 -58 183 -431 -102 92 -382 153 -5 -96 577 -60 4 141 19 307 -63
4917 -63 -200 152 -261 -5 228 -223 209 1 34 265 -231 133 -35 -571 288 -50 -127 423 -252 -51 239
4938 239 89 217 159 -126 128 -109 -13 144 -369 31 358 -282 58 -103 -77 192 -49 135 -112 -338 85
4959 85 -448 -329 300 -338 124 -115 -240 -8 -23 39 191 -264 -6 182 -260 210 157 -123 509 -179 35
4980 35 230 -239 187 551 -71 96 -179 -197 67 -292 17 -81 -408 222 -102 -104 89 8 76 164 -218 140 -408
5003 -408 -105 241 -146 267 189 -140 270 105 -213 201 -315 256 162 -517 -106 -212 -64 235 -44 221 275
5024 275 -69 349 135 -228 356 -104 35 143 -196 -15 -76 -141 263 16 -58 398 -173 76 -70 -306 151
$$ packed form
4875b34O23n99j16K95l27O67m57J16L48n48L63J80n81N72l55j91J83J16j91Q0
4895e6o8L15J84o59Q51o46K1K41o14L29J94m74N35j58r1O73o37O4J37j22K88l70
4917f3j37L52m13K56K33m51M32k08L3K31m96L64j68n36Q59l38p7N50o75K01K90
4938B39j50J28n8k85K54k37R6J57n13M00L27o40L40j61K6K69k41J84k47k26M23
4959H5n33J19O29o38M62k39j25K32j5O2J52m55K58J88m42M70n3k80O32o88K14
4980C5J95m69M26L64o22J67k75j8K64l59L09r8l27O30l24kJ93q1O8Q8l82L58n48
5003d08L03L46l87M13p8l29M10j65l18M14n16N71r4o79M11j06J48K99k79K65N4
5024B75l44M18k14l63N84m60J39J08l39J81o1o5M04k47p4M56n71K49j46k36M57
$$ plain form
5045 151 -145 10 62 -239 25 156 -252 316 57 -124 232 -114 196 59 -274 203 112 12 249 -264 85
5066 85 219 -243 -176 -49 -121 395 -243 -118 2 -197 88 -209 -231 296 167 -31 322 -66 133 26 -144
5087 -144 194 -166 -190 195 -265 -54 103 -85 330 -145 -91 150 -137 82 -23 -61 -119 -126 -103 -13 -218 -57 160
5110 160 47 246 -69 -85 370 -192 -126 -66 -128 175 166 -386 318 142 -24 241 -398 280 -192 -393 110 -285
5132 -285 -132 135 -300 -46 55 -77 66 102 -31 325 -336 69 1 -320 239 -77 -140 95 -172 -77 159
5153 159 -512 370 274 -47 80 -160 35 19 -608 26 131 -181 267 -68 315 226 -277 177 -74 -67 301 173
5175 173 49 141 -356 138 302 -337 59 62 -96 258 -215 -179 -72 -555 336 -223 -89 118 -151 136 115 -154
$$ packed form
5045A51k96J55N2l01K64J31m08N68k59j81L56l46L10j37l33M77r1j00K37n13L49
5066H5J34m62O7J27p2N16o38J25J20j99K85k97k2N27j29j98L53l88J99j07j70
5087a44L38l60k4L85m60K11J57j88M15m75N4K41k87K19j05l8n8pK3R0k05J61K17
5110A60j13J99l15j6M55n62O6O0o2L03rn52P04j76j66K65o39O78m72k01N03l95
5132b85J53K67m35K54J01j32J43L6j33L56o61M05o8l21N59l16o3K35k67R5K36
5153A59o71Q82r6l21J27k40J95j6o27O34J05l12M48l35L83q9n03M54k51PL68j28
5175A73j24R2m97M94J64o39L96Lj58L54m73L6J07m83Q91n59J34K07k69K87k1k69
$$ [...]
8191A6
##END NTUPLES=NMR FID
##END=
