##TITLE=1H_74-2022
 CDCl3
 8 sc, 
 19.09.2022
##JCAMPDX= 6.0         $$ Bruker NMR JCAMP-DX V2.0
##DATA TYPE= NMR SPECTRUM
##DATA CLASS= NTUPLES
##ORIGIN= UXNMR, Bruker Analytische Messtechnik GmbH
##OWNER= root
$$ XWIN-NMR		Version 3.5
$$ Mon Sep 19 14:09:45 2022 Russian Standard Time (UT+4h)  she@DPX200
##.OBSERVE FREQUENCY= 200.1313499994
##.OBSERVE NUCLEUS= ^1H
##.ACQUISITION MODE= SIMULTANEOUS
##.ACQUISITION SCHEME= undefined
##.AVERAGES= 8
##.DIGITISER RES= 18
##SPECTROMETER/DATA SYSTEM= spect
##.PULSE SEQUENCE= zg30
##.SOLVENT NAME= CDCl3
##.SHIFT REFERENCE= (INTERNAL, CDCl3, 0, 15.7579)
##AUDIT TRAIL= $$ (NUMBER, WHEN, WHO, WHERE, WHAT)
$$ ##TITLE= Audit trail, XWIN-NMR		Version 3.5
$$ ##JCAMPDX= 5.01
$$ ##ORIGIN= Bruker BioSpin GmbH
$$ ##OWNER= she
$$ F:/spectra/data/she/nmr/H-F/1/pdata/1/auditp.txt
$$ ##AUDIT TRAIL=  $$ (NUMBER, WHEN, WHO, WHERE, WHAT)
(   1,<2022-09-19 14:08:29.85 +0400>,<she>,<DPX200>,
      <created by zg, POWCHK disabled, PULCHK disabled
       configuration hash MD5:
       00 E9 B6 7A A2 85 ED C7 34 08 36 98 17 FE 4E 26
       data hash MD5: 16K
       AA 2A ED 77 CF 1F 09 02 0B 62 BF DA 89 D2 0C 84>)
(   2,<2022-09-19 14:08:32.81 +0400>,<she>,<DPX200>,
      <Start of raw data processing
       efp BC_mod = 2 LB = 0.24 FT_mod = 6 PKNL = 1 PHC0 = -18032.74 PHC1 = 7.200691 SI = 16K 
       data hash MD5: 16K
       2A F0 88 F1 8A 4F F2 3D EE 8B D3 FC E5 2C B4 EB>)
(   3,<2022-09-19 14:08:48.75 +0400>,<she>,<DPX200>,
      <pk PHC0 = -0.8126885 PHC1 = 1.4 
       data hash MD5: 16K
       5F 56 BA C3 AE 7D A4 E1 D3 96 DA BE 5A BB 90 67>)
(   4,<2022-09-19 14:08:51.56 +0400>,<she>,<DPX200>,
      <abs ABSG = 5 
       data hash MD5: 16K
       DC C2 69 FA 40 7E 04 A8 76 7B 1E 3C 76 44 31 52>)
$$ ##END=
$$ 
$$ hash MD5
$$ D8 19 52 E4 3E B7 4A 25 95 2B 8D 2C 2D 59 14 9C
##$RELAX= 
##$RELAX= 
##$RELAX= 
##$RELAX= 
##$RELAX= 
##$RELAX= 
$$ Bruker specific parameters
$$ --------------------------
##$DU= <F:/spectra>
##$EXPNO= 1
##$NAME= <H-F>
##$PROCNO= 1
##$TYPE= <nmr>
##$USER= <she>
##$AMP= (0..31)
100 100 100 100 100 100 100 100 100 100 100 100 100 100 100 100 100 100 
100 100 100 100 100 100 100 100 100 100 100 100 100 100 
##$AQSEQ= 0
##$AQ_mod= 1
##$AUNM= <au_zg>
##$AUTOPOS= <>
##$BF1= 200.13
##$BF2= 200.13
##$BF3= 200.13
##$BF4= 200.13
##$BF5= 200.13
##$BF6= 200.13
##$BF7= 200.13
##$BF8= 200.13
##$BYTORDA= 1
##$CFDGTYP= 0
##$CFRGTYP= 5
##$CHEMSTR= <none>
##$CNST= (0..31)
1 1 145 1 1 1 1 1 1 1 1 1 1 1 1 1 1 1 1 1 1 1 1 1 1 1 1 1 1 1 1 1 
##$CPDPRG= <>
##$CPDPRG1= <>
##$CPDPRG2= <>
##$CPDPRG3= <>
##$CPDPRG4= <mlev>
##$CPDPRG5= <mlev>
##$CPDPRG6= <mlev>
##$CPDPRG7= <mlev>
##$CPDPRG8= <mlev>
##$CPDPRGB= <>
##$CPDPRGT= <>
##$D= (0..31)
0 1.2 0 0 0 0 0 0 0 0.06 0 0.03 0 0 0 0 0.0002 0 0 0 0 0 0 0 0 0 0 0 0 
0 0 0 
##$DATE= 1663582109
##$DBL= (0..7)
120 120 120 120 120 120 120 120 
##$DBP= (0..7)
150 150 150 150 150 150 150 150 
##$DBP07= 0
##$DBPNAM0= <>
##$DBPNAM1= <>
##$DBPNAM2= <>
##$DBPNAM3= <>
##$DBPNAM4= <>
$$ [...]
##$SUBNAM3= <"">
##$SUBNAM4= <"">
##$SUBNAM5= <"">
##$SUBNAM6= <"">
##$SUBNAM7= <"">
##$SUBNAM8= <"">
##$SUBNAM9= <"">
##$SW= 18.0517283424941
##$SWIBOX= (0..15)
0 0 2 0 0 0 0 0 0 0 0 0 0 0 0 0 
##$SW_h= 3612.71676300578
##$TD= 16384
##$TD0= 1
##$TE= 0
##$TE2= 300
##$TE3= 300
##$TEG= 300
##$TL= (0..7)
0 120 120 120 120 120 120 120 
##$TP= (0..7)
150 150 150 150 150 150 150 150 
##$TP07= 0
##$TPNAME0= <>
##$TPNAME1= <>
##$TPNAME2= <>
##$TPNAME3= <>
##$TPNAME4= <>
##$TPNAME5= <>
##$TPNAME6= <>
##$TPNAME7= <>
##$TPOAL= (0..7)
0.5 0.5 0.5 0.5 0.5 0.5 0.5 0.5 
##$TPOFFS= (0..7)
0 0 0 0 0 0 0 0 
##$TUNHIN= 0
##$TUNHOUT= 0
##$TUNXOUT= 0
##$USERA1= <user>
##$USERA2= <user>
##$USERA3= <user>
##$USERA4= <user>
##$USERA5= <user>
##$V9= 5
##$VALIST= <valist>
##$VCLIST= <CCCCCCCCCCCCCCC>
##$VD= 0
##$VDLIST= <DDDDDDDDDDDDDDD>
##$VPLIST= <PPPPPPPPPPPPPPP>
##$VTLIST= <TTTTTTTTTTTTTTT>
##$WBST= 1024
##$WBSW= 4
##$XGAIN= (0..3)
0 0 0 0 
##$XL= 0
##$YL= 0
##$YMAX_a= 652914
##$YMIN_a= -703699
##$ZGOPTNS= <>
##$ZL1= 120
##$ZL2= 120
##$ZL3= 120
##$ZL4= 120
##$ABSF1= 15.73477
##$ABSF2= -2.31708
##$ABSG= 5
##$ABSL= 3
##$ALPHA= 0
##$AQORDER= 0
##$ASSFAC= 0
##$ASSFACI= 0
##$ASSFACX= 0
##$ASSWID= 0
##$AUNMP= <proc_1d>
##$AZFE= 0.1
##$AZFW= 0.1
##$BCFW= 0
##$BC_mod= 2
##$BYTORDP= 0
##$COROFFS= 0
##$CY= -3
##$DATMOD= 1
##$DC= 0
##$DFILT= <>
##$DTYPP= 0
##$F1P= 0
##$F2P= 0
##$FCOR= 1
##$FTSIZE= 16384
##$FT_mod= 6
##$GAMMA= 0
##$GB= 0
##$INTBC= 1
##$INTSCL= 3.70164e-10
##$ISEN= 128
##$LB= 0.24
##$LEV0= 0
##$LPBIN= 0
##$MAXI= 10000
##$MC2= 0
##$MEAN= 0
##$ME_mod= 0
##$MI= 1.114404
##$NCOEF= 0
##$NC_proc= -4
##$NLEV= 6
##$NOISF1= 3.799351
##$NOISF2= 2.8
##$NSP= 0
##$NTH_PI= 0
##$NZP= 0
##$OFFSET= 15.75791
##$PC= 1
##$PHC0= -18033.55
##$PHC1= 8.600691
##$PH_mod= 1
##$PKNL= yes
##$PPARMOD= 0
##$PSCAL= 0
##$PSIGN= 0
##$REVERSE= no
##$SF= 200.130002727831
##$SI= 16384
##$SIGF1= 3
##$SIGF2= 2
##$SINO= 5.538805
##$SIOLD= 16384
##$SREGLST= <1H.CDCl3>
##$SSB= 0
##$STSI= 16384
##$STSR= 0
##$SW_p= 3612.71676300578
##$SYMM= 0
##$S_DEV= 0
##$TDeff= 16384
##$TDoff= 0
##$TI= <>
##$TILT= no
##$TM1= 0
##$TM2= 0
##$TOPLEV= 0
##$USERP1= <user>
##$USERP2= <user>
##$USERP3= <user>
##$USERP4= <user>
##$USERP5= <user>
##$WDW= 1
##$XDIM= 16384
##$YMAX_p= 277742136
##$YMIN_p= -103135
$$ End of Bruker specific parameters
$$ ---------------------------------
##NTUPLES= NMR SPECTRUM
##VAR_NAME=  FREQUENCY,     SPECTRUM/REAL,   SPECTRUM/IMAG
##SYMBOL=    X,             R,               I
##VAR_TYPE=  INDEPENDENT,   DEPENDENT,       DEPENDENT
##VAR_FORM=  AFFN,          ASDF,            ASDF
##VAR_DIM=   16384,         16384,           16384
##UNITS=     HZ,            ARBITRARY UNITS, ARBITRARY UNITS
##FACTOR=    0.220516191357247, 1,           1
##FIRST=     3153.63052621169, 0,            0
##LAST=      -459.086236794089, 0,           0
##MIN=       -459.086236794089, -103135,     0
##MAX=       3153.63052621169, 277742136,    0
$$ Real data points
##PAGE= N=1
##DATA TABLE= (X++(R..R)), XYDATA
$$ [...]
6641b6404j4717K2461L521j7025j1036K2071O334r309L25P367k836k7645K965
6628d3928M604P450J6862J3616L567j1691k0800M340l006j0022L479K0068m457
6615a9918q756k1119J7693o496j8696N665J1546L6449k3161k2580J6729j664K1149
6602a3159k6589O26J2149j7482K4231M386j1847N15M870l2397k965K1393J1980
6589b4289j3822k174n953m122r58OJ3159j054p477k1982R69N809J0448L0544J7661
6574c235K556k3292j3705J035O815j496n154O753Q550k930J2799j4306q015M239
6560b9386K95j107J299j2197r436q399R118J5066K6123p96r828K6o397q553M966
6545b9206j026K4247J1763j7186m806L116k50J5016r537j5591l3365J287M3891
$$ plain form
6641 -26404 -41121 -18660 -15139 -32164 -43200 -21129 -14795 -24104 -23779 -16412 -19248 -46893 -43928
6628 -43928 -39324 -31874 -15012 -1396 2171 -9520 -30320 -25980 -28986 -39008 -35529 -15461 -19918
6615 -19918 -28674 -49793 -32100 -38596 -57292 -51627 -40081 -3632 -26793 -49373 -32644 -34308 -13159
6602 -13159 -39748 -39122 -26973 -44455 -20224 -15838 -27685 -27170 -22300 -54697 -57662 -36269 -24289
6589 -24289 -38111 -40285 -46238 -50360 -51318 -51312 -38153 -39207 -46684 -68666 -67697 -61888 -51440 -20896 -3235
6574 -3235 -679 -23971 -37676 -36641 -29826 -31322 -36476 -29723 -21173 -24103 -11304 -25610 -33625 -29386
6560 -29386 -29091 -30198 -28899 -41096 -50532 -58931 -49813 -34747 -8624 -9420 -19248 -19222 -25619 -34172 -29206
6545 -29206 -30232 -5985 5778 -11408 -16214 -13098 -13348 1668 -7869 -23460 -56825 -55538 -11647
6532a1647j7235J0747L607l31j078K366j6419o849L1345O146j2329J0897K029
6519A249k1604j5261N65R226p717J0271P502j2818N856J231M208J3604N179k6544
6505b5053n926P257J4285m369k0282K139J3854n093K5379l285l1301N707q390
6492c5078P489L619l20l317o12J1366K4438K3477k7782M813N247k5335J1908K7714
6478B7627j3748j3888j1379K3361j4599r783l520l5541O119M5800k7737j688J7589
6465a1387R329j0634j858o271l016J9472j4339j717J5206j1857M719l003J381
6452a3975M377m996K371m362K732j3753L2868n308M855p884J1915K858j338j4376
6438d016j364L692N229p12l027K178O004o913k2628K5M052j9742M424J3685p620
$$ plain form
6532 -11647 -28882 -18135 -14528 -14859 -15937 -13571 -29990 -36839 -5494 652 -11677 -780 1249
6519 1249 -20355 -35616 -35051 -25825 -33542 -23271 -15769 -28587 -22731 -21500 -17292 -3688 1491 -25053
6505 -25053 -30979 -23722 -9437 -13806 -34088 -31949 -18095 -23188 2191 -1094 -32395 -26688 -35078
6492 -35078 -27589 -23970 -24290 -27607 -28219 -16853 7585 31062 3280 8093 13340 -11995 -87 27627
6478 27627 13879 -9 -11388 11973 -2626 -12409 -15929 -51470 -45351 449 -27288 -28976 -11387
6465 -11387 -2058 -12692 -14550 -20821 -23837 -4365 -18704 -20421 -5215 -17072 -12353 -15356 -13975
6452 -13975 -9598 -14594 -12223 -16585 -13853 -27606 5262 -46 4809 -3075 8840 11698 10360 -4016
6438 -4016 -5380 -1688 3541 2829 -198 1980 7984 1071 -21557 -21532 -17480 -37222 -32798 -19113 -26733
6423b6733k6104J7858J6086l546q7N695j5615p72r447Q556n709J1277K5392l5282
6409c8431N312L0369j790k530j582r280k449j4202J4780r225K6767J8342M154
6396B0235k681j4173k0608K0503R908j4421R814q271q468M479M976j598J0291
6383I986j5689r741K4130j4067M369k602l6168O000J4370r166P448K8166J6506
6370B3542P633j4523P013K203j7588l462l551K897q501n427K0853q544O131K3635
6356C2311r011Q977q228j5800n34Q214R653l876q071j0622K5612J3063j1235j3461
6342A6992J2240K5114M29k939l393K3870O936m093q417K6576j5115O592O926Q284
6328A00002R882r665L0527J2476L1372J4553J2534K1956J2569j5473K2502M417
$$ plain form
6423 -26733 -52837 -34979 -18893 -22439 -22526 -16831 -32446 -33218 -42665 -34109 -39818 -28541 -3149 -38431
6409 -38431 -33119 -2750 -4540 -7070 -8652 -17932 -20381 -34583 -19803 -29028 -2261 16081 20235
6396 20235 17554 3381 -17227 3276 13184 -1237 8577 306 -8162 -3683 1293 -305 9986
6383 9986 -5703 -15444 8686 -5381 -1012 -3614 -39782 -33782 -19412 -28578 -21130 7036 23542
6370 23542 31175 16652 23665 25868 8280 4818 1267 4164 -4337 -9764 11089 2545 8676 32311
6356 32311 23300 32277 24049 8249 7715 15929 25582 21706 13635 3013 28625 41688 30453 16992
6342 16992 29232 54346 54775 51836 48443 72313 79249 75156 66739 93315 78200 84792 91718 100002
6328 100002 109884 100219 130746 143222 174594 189147 201681 223637 236206 220733 243235 247652
6316B47652R971p159J248k6152l7983l221R83k7362n3450J4100j9912j858j3255
6303H3602q430K2072p068j7957J373j8033o344j8099P8J6120J2119k7031j9230
6290A3172N356K2179K534j4360o714r007Q036J2574p740j1145M840K97L3336j1048
6276D2310J4020K626k013K383k4846K5943l667k5038k5723r77K646R402K8846
6263D5912K1909j6710k4721o067j1170K5995O534n605j9568R53K1666Q787l78
6250D7537P896l8838o724M3603L828l2412j0554K0580O800k0171J4705R250J5699
6237F1199o989k0213j1536k2364N686K2221P121J669N9Q305K0235J616j9410j5544
6223C2055J3422J9591r523J3265p427L754p432j8494K7132l504L101o827M941
$$ plain form
6316 247652 257623 250464 251712 225560 187577 184356 185339 157977 104527 118627 98715 96857 83602
6303 83602 75172 97244 90176 72219 73592 55559 49215 31116 31194 47314 59433 32402 13172
6290 13172 18528 40707 43241 28881 22167 13160 21196 33770 26030 14885 19725 20022 53358 42310
6276 42310 56330 58956 56943 59326 34480 60423 56756 31718 5995 5018 7664 17066 45912
6263 45912 67821 51111 26390 20323 9153 35148 41682 36077 16509 17462 39128 47915 47537
6250 47537 55433 16595 9871 53474 57302 24890 14336 34916 41716 21545 36250 45500 61199
6237 61199 54210 33997 22461 97 5783 28004 35125 36794 36853 45158 65393 67009 47599 32055
6223 32055 45477 65068 55545 68810 61383 65137 57705 39211 66343 62839 65940 59113 64054
6210F4054K3524k2043N697J2501n973j2763p026Q60L1570k0624j0997L0691l107
6197H6364o627J4912K6083k3766J928m925K6432n344m496J872L0234j8376j7916
6184A06375L2140N114k0060j1069Q636j0043k2536j3035N552K0513r52j7040l8385
6171D5210K3256J0320J3231n999m52l811R707O701o125J9647K043K843j1994K3086
6157A27663j539J1582l1062K2975K4067j4737Q540r697j343q361J6641K4661M932
6144A74322J9680K5561k887j0167j0653l928L1535J6193j0400O360J5975K784
6132B54375l887j4405L3344N285J077q369r656Q654J4550J6032n570K5185L0904
6119C47519J2877r273j0232K453J1469L2362m4639N227K5552L889J6635m380J3031
$$ plain form
6210 64054 87578 65535 71232 83733 77760 64997 57971 58831 90401 69777 58780 89471 86364
6197 86364 79737 94649 120732 96966 98894 93969 120401 115057 110561 112433 142667 124291 106375
6184 106375 138515 143629 123569 112500 121136 111093 88557 75522 81074 101587 100635 83595 45210
6171 45210 68466 78786 92017 86018 85566 81755 91462 98163 92038 111685 113728 116571 104577 127663
6157 127663 126124 137706 106644 129619 153686 138949 147489 137792 136449 128088 144729 169390 174322
6144 174322 194002 219563 216676 206509 195856 191928 223463 239656 229256 235616 251591 254375
6132 254375 250488 236083 269427 274712 275789 267420 257764 266418 280968 297000 291430 316615 347519
6119 347519 360396 351123 340891 343344 354813 387175 342536 347763 373315 377204 393839 389459 402490
6106D02490J2851J5250K6467q255M512K9335K0801L2518L184J1668K3963K9380
6094F04164l666J2468J7470K0661J1080L1712L3215q362l745L3670l945J3258
6082G57980J3553K6314K3223K6547L2353R948M0711K7317J9236L1382M0166J7528
6070A066258L6902N5914M4618K0153N2470N4871M7988M0683J7344L7989N2744
6059A527934O2242M8240L6889N2914L0335M2059N9031O7327L2802O0661L9191
6048B059625N9029Q1124N1876N0685L4011Q4972J07208R9234Q6528J02241J20371
6037B936904R5031J48933J27091J12781J66034J58375J40179J34192J75315J68157
6027D362992J97384J86980K14126K55199K73663K69088L05543L18187L58391M36937
$$ plain form
6106 402490 415341 430591 457058 448803 453315 482650 503451 535969 539153 550821 574784 604164
6094 604164 600498 612966 630436 651097 662177 693889 727104 718742 714997 748667 744722 757980
6082 757980 771533 797847 821070 847617 879970 889918 930629 957946 977182 1008564 1048730 1066258
6070 1066258 1103160 1159074 1203692 1223845 1276315 1331186 1379174 1419857 1437201 1475190 1527934
6059 1527934 1590176 1638416 1675305 1728219 1758554 1800613 1859644 1926971 1959773 2020434 2059625
6048 2059625 2118654 2199778 2251654 2302339 2336350 2421322 2528530 2627764 2714292 2816533 2936904
6037 2936904 3031935 3180868 3307959 3420740 3586774 3745149 3885328 4019520 4194835 4362992
6027 4362992 4560376 4747356 4961482 5216681 5490344 5759432 6064975 6383162 6741553 7178490
6017G178490M36407M60024M83025N62489O23875O61142P74786Q84640R90578J128941
6007A4184397J313453J496413J746593K040442K330863K692915L115842L655776
5999C2576694M252839M827311N203462M969759L721401J447132j515849m261777
5991E1220972n812398o080442n522659m685871l825733l084123k492728k028651
5983A7688367j693428j398035j190369j032797q97525p99661p18339o53708o09856
5974H694649m76950m21442m10739l60115l53224l29957l14207k80370k69218k40540
5964E237887k16941k12320k24170k06333j87871j81065j81496j54893j28282j09713
5954C434803j26123r9077j17562n8962p5174r3315n9298q5363o8395j07543r8522
$$ plain form
6017 7178490 7614897 8074921 8557946 9120435 9744310 10405452 11180238 12064878 13055456 14184397
6007 14184397 15497850 16994263 18740856 20781298 23112161 25805076 28920918 32576694
5999 32576694 36829533 41656844 46860306 51830065 55551466 56998598 55482749 51220972
5991 51220972 45408574 39328132 33805473 29119602 25293869 22209746 19717018 17688367
5983 17688367 15994939 14596904 13406535 12373738 11476213 10676552 9958213 9304505 8694649
5974 8694649 8217699 7796257 7385518 7025403 6672179 6342222 6028015 5747645 5478427 5237887
5964 5237887 5020946 4808626 4584456 4378123 4190252 4009187 3827691 3672798 3544516 3434803
5954 3434803 3308680 3209603 3092041 3033079 2957905 2864590 2805292 2719929 2651534 2543991 2445469
5943B445469o7158o4431p5697l0117n4532l9218o3380o7425m1118l6030j7376
5932A888987k4847l5047n1985k9807o043k4215r876k381j2016k1039o216L1388
5920A696903o26m2910o9719q5125q6261q8246n8650m0751n4580m4568p1649m4637
5908A009181k8593l0033l6266k2449j7069m3128l5178r981j2203j6150K0803k3543
5896G55391l8075k0424p561j6208j4908l7390J3331J5390j1662m7426J220q307
5884E83371j3556l6364j769L708q416J5421j1078l829o848k6312k3194l0978L516
5871D43672J7481j3941l125r013J0483k1072P486M752j3721k1783P135r397l2489
5858C66468o001j958j285J1811l343R587o070j7826O001m459p388k785l2893k228
$$ plain form
5943 2445469 2378311 2313880 2238183 2208066 2153534 2114316 2050936 1983511 1942393 1906363 1888987
5932 1888987 1864140 1829093 1777108 1747301 1741258 1717043 1707167 1704786 1692770 1671731 1665515 1696903
5920 1696903 1696277 1653367 1583648 1498523 1412262 1324016 1265366 1224615 1170035 1125467 1053818 1009181
5908 1009181 980588 950555 914289 891840 874771 831643 796465 786484 774281 758131 778934 755391
5896 755391 717316 696892 689331 673123 658215 620825 634156 649546 637884 590458 591678 583371
5884 583371 569815 533451 531682 535390 526974 542395 531317 527488 520640 494328 471134 440156 443672
5871 443672 461153 447212 444087 435074 445557 424485 431971 436723 423002 401219 408354 398957 366468
5858 366468 360467 358509 357224 369035 365692 375279 369209 351383 357384 352925 345537 342752 309859 307631
5844C07631J8857K8857J7958j5487j4649k0097o972r034q627L591r452P434J5168
5831C15178o625o1253J6926L5187j5374K202Q86k9355j29L4159J2551j4681o610
5818B83062o699k0496j3776j5104l793K7447m362M097o107L940j0760k411K2420
5805B57458J5089j9396L2818R343n321K9234J527J48J063J8875J5737O775K8845
5792C92195n442R884K8588J31M6707J8929J3556O2870O0719J4798j7790k0281
5780F04864j8157n2883o5491l5245k5678o2812k0556j8396P741O934J5110J368
5768C36799j7318k6547J154j714J682j9238K286l4144k8265j5808j8678j3952
5756A66257K08N892J5831K838j3925j6849K73J9873k8360j0613n92p105j2976
$$ plain form
5844 307631 326488 355345 373303 357816 343167 323070 316098 307064 298437 302028 292576 300010 315178
5831 315178 308553 247300 264226 299413 284039 286241 287127 257772 257643 291802 304353 289672 283062
5818 283062 276363 255867 242091 226987 223194 250641 246279 250376 244269 248209 237449 235038 257458
5805 257458 272547 253151 285969 295312 289991 319225 320752 320900 321963 340838 356575 363350 392195
5792 392195 386753 396637 425225 425356 472063 490992 504548 567418 628137 642935 625145 604864
5780 604864 586707 533824 468333 433088 407410 344598 324042 305646 313387 320321 335431 336799
5768 336799 319481 292934 294088 292374 294056 274818 277104 242960 214695 198887 180209 166257
5756 166257 166465 172357 188188 191026 177101 160252 160525 180398 152038 141425 140833 133728 120752
5743A20752j5029J8769l899R453P224m808J4523j4602Q704p673n611J1487j5896
5730A23394J1543J0151M352m015k3372k2965n108K300o735j8359K5911j4982j2690
5717F9425J4419l3107J0532K8530J0927q081j0116q210j9137O246L0973k6219
5705F6182J924K3804M129N725J2013k8931j74K9907p137k585N408o498k0525M697
5691H7939K5913q561Q141M130K0792k2154J1284J2101j3673O549K3811J3782n649
5678A64405K7203R049m516l401o990J4742M5125K1772J5624J7628n851k613Q697
5665C00874j1882j317r849k8366l1525l8857k5458o138j7513l9911n668N3427
5653A37817M351l1954J918J1749K232L967k9165j8456L400K190K3764k8226L2503
$$ plain form
5743 120752 105723 124492 120593 130046 137270 132462 146985 132383 141087 133414 127803 139290 123394
5730 123394 134937 145088 149440 145425 122053 99088 93980 96280 89545 71186 97097 82115 69425
5717 69425 83844 50737 61269 89799 100726 92645 82529 74319 55182 61428 92401 66182
5705 66182 68106 91910 96039 101764 113777 84846 84672 114579 107442 104857 110265 103767 83242 87939
5691 87939 113852 105291 113432 117562 138354 116200 127484 139585 125912 132461 156272 170054 164405
5678 164405 191608 200657 196141 192740 185750 200492 245617 267389 283013 300641 294790 292177 300874
5665 300874 288992 287675 277826 249460 217935 179078 153620 147482 129969 90058 84390 137817
5653 137817 142168 110214 112132 123881 126113 130080 100915 82459 85859 88049 111813 83587 116090
5640A16090l255m068Q066k7414O758R048K3504l7171j9383J4157M052L521o648
5627H7257K3432k8090j3750l291Q777J1676k1401O451O63J0775J9907J1399j256
5614A12549k8927l3897l642o453J0688K294J8696q942K701K0008k9720j6226Q941
5601D8070J3664j5067j121j3902l860L1062o759J0022j9725L949J6739p703o341
5588D9028n401r96n631J1032J565k6978j8811M3374O893n079N776q725p284k0331
5574A8432n222n746j5115K743J2875L0718j6896N973K980m626n423o536J7897
5561C2054J8273P816l2339j8076K1432J729k6095K4319R253k4355N380J2800K5
5548C2216j1879J7093m54K0244m22j6437j8574j7905O749O128J6334q05J663j5155
$$ plain form
5640 116090 112835 108767 116833 89419 96177 105225 128729 91558 72175 86332 90384 93905 87257
5627 87257 110689 82599 68849 65558 74335 86011 64610 71061 71724 82499 102406 113805 112549
5614 112549 83622 49725 46083 39630 50318 52612 71308 62366 65067 85075 55355 39129 48070
5601 48070 61734 46667 45546 31644 27784 58846 52087 62109 42384 46333 63072 55369 49028
5588 49028 43627 42631 37000 48032 49597 22619 3808 47182 54075 48996 54772 46047 38763 18432
5574 18432 13210 7464 -7651 -4908 7967 38685 21789 27762 30742 26116 20693 14157 32054
5561 32054 50327 58143 25804 7728 29160 30889 4794 29113 38366 14011 19391 32191 32216
5548 32216 20337 37430 36976 57220 56798 40361 21787 3882 10631 16759 33093 32288 33951 18796
5534A8796N346j2007K7070n223k4441k1692L8656J6041k4916j8092J76L4285q780
5521B5219l0411O647M570k448J1002J0864k9016J3443l414j3798O151j633J1421
5508H597N566R665K3679L188n063j7485j9610k263J4845j53k18l800K787Q092
5494B7827j739R013Q290j0229Q594n64k978r302J9789k3673q737j3703k4828L3748
5480A1508j2873K5470K4470N070j6990n601j7649M272j1875J7003J2802J9021
5468E4628j0520j1015r2n763Q338J2340J209J515k2234o113J9186N945m949J3726
5454E6201j316j0251j3486J1511J0810j054k6567K808L5554m327j5744k942j4894
5441B6303K2210L436n987m0882L1742K8060k4876K5537L365k8431L1617j309j4850
$$ plain form
5534 18796 24142 12135 39205 33982 9541 -12151 26505 42546 17630 -462 -286 33999 25219
5521 25219 -5192 1455 6025 3577 14579 25443 -3573 9870 6456 -7342 -1191 -2824 8597
5508 8597 14163 23828 47507 50695 45632 28147 8537 6274 21119 20966 20748 16948 19735 27827
5494 27827 26088 35101 43391 33162 41756 41192 38214 28912 48701 25028 16291 2588 -22240 11508
5480 11508 -1365 24105 48575 53645 36655 31054 13405 17677 5802 22805 35607 54628
5468 54628 44108 33093 33001 27238 35576 47916 49125 50640 28406 22293 41479 47424 42475 56201
5454 56201 54885 44634 31148 42659 53469 52415 25848 28656 64210 59883 44139 41197 26303
5441 26303 48513 51949 45962 5080 36822 64882 40006 65543 68908 40477 72094 70785 55935
5428E5935K0343n42K620J0j1658L911K9329M054L847j9705R359m906M103n113
5414I1587O074O328L16J2652j4421r996J8514j3625j2641J0172j9869k7600N745
5401E3236K2621P980k018J1743k97J1904p568J2445j182J967K5137m666J6393
5388A47695p188P395n125N988L139k2329K3163j2975Q253p391n460J2095j1821
5375A35439j7100n098J7302j3365k2384K7976J2994Q622j348N102j1772j3936
5363A22432j9166K1115J6726k0202p259l461J9308K2312k368k583Q820l2389j7409
5350A05876K1910J3087K0023j4250N83N496P677q073k6628J4281J9611j0964j4772
5337A33857j4375j2401K880J580K0031j8185j2628J6959j5899Q144M421O321N614
$$ plain form
5428 55935 76278 75736 78356 78366 66708 70619 99948 104002 107849 88144 97503 92597 96700 91587
5414 91587 97661 103989 104305 116957 102536 92540 111054 97429 84788 94960 75091 47491 53236
5401 53236 75857 83837 81819 93562 93265 105169 97601 110046 108864 110831 135968 131302 147695
5388 147695 140507 147902 142777 148765 151904 129575 152738 139763 148016 140625 135165 147260 135439
5375 135439 118339 113241 130543 117178 94794 122770 135764 144386 143038 148140 136368 122432
5363 122432 103266 124381 141107 120905 113646 110185 129493 151805 149437 146854 155674 123285 105876
5350 105876 127786 140873 160896 146646 147229 152725 160402 152329 125701 139982 159593 148629 133857
5337 133857 119482 107081 109961 111541 131572 113387 100759 117718 101819 109963 114384 120705 126319
5324A26319p07q93N255J0453o46K4096j3486k743L1394o171j7556r403k443o970
5310A36499N712L366L6735K6266k6894J0012k8663J6037K0690j4680j9565J7351
5298A82866J0943o754l856J0682m647J9718J5583n466O316j9701j8975L353J2327
5285B02389J9156j9377N741J7843k124K0907J5937K125L193q219L4j2174N491
5272B50922J6776k2863L12J4533J1614q656K295O869O074N899l293R784q865J60
5258B81561m333j5993Q739j6907j7237j052L167J7604J6103O172j0376O528K4980
5245B98956j2173N815J9286j987o902k188P950O098j6947J0913R096j7752j5272
5232B84893L504K3392j1012J0185r729K88L746K3083J4587k360J7898j0787p175
$$ plain form
5324 126319 125612 124719 129974 140427 139781 163877 150391 147648 179042 172871 155315 145912 143469 136499
5310 136499 142211 145577 182312 208578 181684 191696 163033 179070 199760 185080 165515 182866
5298 182866 193809 187055 183199 193881 189234 208952 224535 219069 225385 205684 186709 190062 202389
5285 202389 221545 202168 207909 225752 223628 244535 260472 262597 265790 257571 257605 245431 250922
5272 250922 267698 244835 245147 259680 271294 262638 264933 271802 277876 283775 280482 290266 281401 281561
5258 281561 277228 261235 269974 253067 235830 234778 237945 255549 271652 277824 267448 273976 298956
5245 298956 286783 292598 311884 309897 302995 300807 308757 314855 297908 308821 317917 300165 284893
5232 284893 288397 311789 300777 310962 301233 301521 305267 328350 342937 340577 358475 347688 340513
5219C40513j8811M489K1400L1392O575l464J0004M053j956J5485K70N854j3890
5206D01914J6099J9922J097K4399L4447p525p238K2459L0297J0259j0439r220
5194E26471K1670k980J8157J5619J5209L0966j1093K9542J2031n051M0965J7874
5182G09380j948K6674J6207R43K8923K7112J1509J2870K238L7424M0656Q805K3104
5169I43897J6413K2968L5787K4823K7059K3896L3542J3007J4510M4626J3642J4887
5157A229057N3158L4012L6141N6484M4161M0698M6587L5096L7305M7693N6167
5146A716559M3571N2883O2893Q5147M4372J04795Q7603O4410O8805Q0939P3185
5135B485162J28755R2652R5414J22141J04636J26563J41690J49813J57144J72642
$$ plain form
5219 340513 321702 326191 347591 378983 385558 382094 392098 396151 394195 409680 409950 415804 401914
5206 401914 418013 437935 439032 463431 497878 490353 483115 505574 535871 546130 535691 526471
5194 526471 548141 545161 563318 578937 594146 625112 614019 643561 655592 650541 691506 709380
5182 709380 707432 734106 750313 751256 780179 807291 818800 831670 833908 871332 911988 920793 943897
5169 943897 960310 983278 1019065 1043888 1070947 1094843 1128385 1141392 1155902 1200528 1214170 1229057
5157 1229057 1282215 1316227 1352368 1408852 1453013 1493711 1540298 1575394 1612699 1660392 1716559
5146 1716559 1760130 1813013 1875906 1961053 2005425 2110220 2197823 2262233 2331038 2411977 2485162
5135 2485162 2613917 2706569 2801983 2924124 3028760 3155323 3297013 3446826 3603970 3776612
5125C776612J89497K04427K22377K56291K69741K95167L34331M09646L86774M43733
5115F788596N11662N66102O15444O72053P32280P80218P83416P57968O57552N17278
5105A3382569K75727m607k12159l67540m68348m89611m69777m23057l18420k95652
5095A0609125j90910p5911N170Q1999J59894K04248K77230L43785M06817N03122
5085A2324569N99968O86340O88886P15617P31976P20490O87501N77294M95712
5076A8228353M55906L59805L05203J83174J13208M844j36870k52588l51362m18123
5066A8491550l75878l98643m28185m13484m34485n18314n68606n80632o17214
5057A4156109n71265n06757m62243l81036l08826k22563j30872p1748L729P7223
$$ plain form
5125 3776612 3966109 4170536 4392913 4649204 4918945 5214112 5548443 5958089 6344863 6788596
5115 6788596 7300258 7866360 8481804 9153857 9886137 10666355 11449771 12207739 12865291 13382569
5105 13382569 13658296 13653689 13441530 13073990 12605642 12116031 11646254 11223197 10904777 10609125
5095 10609125 10418215 10342304 10347474 10429473 10589367 10793615 11070845 11414630 11821447 12324569
5085 12324569 12924537 13610877 14299763 15015380 15747356 16467846 17155347 17732641 18228353
5076 18228353 18684259 19044064 19349267 19532441 19645649 19650493 19513623 19261035 18909673 18491550
5066 18491550 18115672 17717029 17288844 16875360 16440875 15922561 15353955 14773323 14156109
5057 14156109 13584844 13078087 12615844 12234808 11925982 11703419 11572547 11500799 11504528 11581751
5047A1581751J75917K37073K97686L88778M70897N48307N84265N94471N42236
5038A5421381M79682K53623j3546k32876m96546o91805q07528q28585q37468p19805
5028A1526527o13006n39561m30418l63314k88317k46689j83287j38818p6029l7407
5018H609681L561O3530J19191J85338K16417K47889K89687L89198M35359M73935
5008A1033786N03532N54085N91897N74265N35942M46879K78862J17210p1078k45688
4998A4319692l50410m45404m55218m35807l92403k94556k32465j73415j20464
4989A1419550k0313N2952P8995J58454K30129K66861L30486L83851M61285M87761
4979A3850011N33350N69536N95181O26857O16107N39808N01020M23584L23613
$$ plain form
5047 11581751 11757668 11994741 12292427 12681205 13152102 13700409 14284674 14879145 15421381
5038 15421381 15901063 16154686 16141140 15908264 15411718 14719913 13912385 13083800 12246332 11526527
5028 11526527 10913521 10373960 9943542 9580228 9291911 9045222 8861935 8723117 8647088 8609681
5018 8609681 8613242 8676772 8795963 8981301 9197718 9445607 9735294 10124492 10559851 11033786
5008 11033786 11537318 12091403 12683300 13257565 13793507 14240386 14519248 14636458 14565380 14319692
4998 14319692 13969282 13523878 13068660 12632853 12240450 11945894 11713429 11540014 11419550
4989 11419550 11399237 11452189 11531184 11689638 11919767 12186628 12517114 12900965 13362250 13850011
4979 13850011 14383361 14952897 15548078 16174935 16791042 17330850 17831870 18255454 18579067
4970A8579067K56982J63782N0027n8075j42608k84356l30954l95344m14289m39326
4960A6984906m81246n13250m92791m98558n12299m83808n17596m66348m31697
4951A2587313m11231l87399l08101k82028k14276j38651p4088J1776O0041J39221
4941A0982577J99533K35927L19113L75632L98738L83184L89125L13592J51976
4932A3749397j5865j93037m46869o29772p20687p99279q01088p59120p02244o38281
4922H043155n61974m99692m71056l92238l59092l45874l02256k84584k38567k22710
4912D365112k09785j79806j72200j49651j42240j32980j26978j47724q3625j03179
4902B916944r1554r5356p5875q3199p0495o3416r8133m5840l3689m9523o1289
$$ plain form
4970 18579067 18836049 18999831 19049858 18991783 18849175 18564819 18233865 17838521 17424232 16984906
4960 16984906 16503660 15990410 15497619 14999061 14486762 14002954 13485358 13019010 12587313
4951 12587313 12176082 11788683 11480582 11198554 10984278 10845627 10771539 10783315 10843356 10982577
4941 10982577 11182110 11418037 11737150 12112782 12511520 12894704 13283829 13597421 13749397
4932 13749397 13733532 13540495 13093626 12463854 11743167 10943888 10142800 9383680 8681436 8043155
4922 8043155 7481181 6981489 6510433 6118195 5759103 5413229 5110973 4826389 4587822 4365112
4912 4365112 4155327 3975521 3803321 3653670 3511430 3378450 3251472 3103748 3020123 2916944
4902 2916944 2825390 2730034 2654159 2570960 2500465 2437049 2338916 2293076 2259387 2209864 2148575
4891B148575p5307k9379m8508n7063n0321l1282m1961p9228n3712m5201l1813
4880A604800l5435l5040l8923m9122l7130l2302j6926m3404k8781k7728k2145
4869A237864j8329m1439o51j3171n9336l336M728j4072n1704n2243k714K9986
4857A015583r590k6159L203j5971l5503J1408p629j0392j4831j7441k7809k9523
4845H35346k1915k6887j3516j9561k331k5912O982M997j5996j6723m6651J3699
4833F71532K4573m4100l3790r155k5117L0725j2892k4673r067k0838j1996j41
4821E35061j6547R61K5024J5839j0988j5717k1074j8097j7612j1459j7938j676
4809D45777j3281j8435L6973j2499P025k5578n452J6894N374k6549K0210j5301
$$ plain form
4891 2148575 2073268 2043889 1995381 1938318 1887997 1856715 1814754 1735526 1681814 1636613 1604800
4880 1604800 1569365 1534325 1495402 1446280 1409150 1376848 1359922 1316518 1287737 1260009 1237864
4869 1237864 1219535 1178096 1177445 1164274 1104938 1101602 1106330 1092258 1040554 988311 985597 1015583
4857 1015583 1005993 979834 983037 967066 931563 942971 935342 924950 910119 892678 864869 835346
4845 835346 813431 786544 773028 753467 751136 725224 732206 737203 721207 704484 657833 671532
4833 671532 696105 652005 618215 609060 583943 614668 601776 577103 568036 547198 535202 535061
4821 535061 518514 519475 544499 560338 549350 533633 512559 494462 476850 465391 447453 445777
4809 445777 432496 414061 451034 438535 445560 419982 414530 431424 436798 410249 430459 415158
4797D15158m437l47J6504J65o270q492J4937J654J2036q000k7463k1847j9750
4784C63848J7704O901J0202K073j7546j7340O774J4474k9046J2204r822J5458
4772C75884K102J5979J3411k1161J5240o232J4862M240J8043Q980Q477j686M177
4759D52316N70j3992J8401j623O101M831m780k5353l2765N254J3096m869j2344
4746D04843J211l677k578o498q542J0498R257j4099O443J441J2285R143L079J2944
4732D35750j881K087K4202J0743m640p645J1557K1056K2707k4691N630N386o887
4719D93374K6330M199J754k4865O644R711l663J3421m7219K854j930k860k9522
4706D48228j1127j0675Q162q062J046J4566j7856J1397J7368K1326P351k0380
$$ plain form
4797 415158 410721 410374 426878 427043 420773 412281 427218 428872 440908 432908 405445 383598 363848
4784 363848 381552 388453 398655 400728 383182 365842 372616 387090 358044 370248 360426 375884
4772 375884 377986 393965 407376 386215 401455 395223 410085 414325 432368 441348 449825 448139 452316
4759 452316 452886 438894 457295 455672 461773 466604 461824 436471 403706 408960 422056 417187 404843
4746 404843 406054 402377 399799 393301 384759 395257 404514 390415 396858 398299 410584 419727 422806 435750
4732 435750 433869 435956 460158 470901 466261 458616 470173 491229 513936 489245 494875 500261 493374
4719 493374 519704 523903 525657 500792 507436 517147 513484 526905 479686 482540 480610 477750 448228
4706 448228 437101 426426 434588 426526 427572 442138 424282 435679 453047 474373 481724 461344
4694D61344J7993K2633J5947Q04l4761k0722J2044L4332o597J3482P728k5328
4682D98899j8818l060m45k137k7909j526o812mp787j667k0683N299j0976l2947
4668C69427J6062j4044k836J2145j4976k3701o876J8777N713k2151Q456Q501k4099
4655C30398j2102J035J175o470L298J1084j3573O524P963q880k2328R856j3825
4642B94155O041J1667l5474k3636K320K0553j0909j3932J4775k0781j5125K805
4630B32459m974m6181R248k1965n107J6834P529j8046o154k190m3292O705O845
4617A31711J649n062j8751J1762j742M662q511j9330K0043j5178l603k5553M857
4604G6954j0567K944k2237J6241J141o91L1160k1718p640R968N148j5820k7861
$$ plain form
4694 461344 479337 501970 517917 518721 483960 463238 475282 509614 503017 516499 524227 498899
4682 498899 480081 477021 476576 474439 446530 445004 438192 438188 430401 428734 408051 413350 402374 369427
4668 369427 385489 371445 368609 380754 365778 342077 335201 353978 359691 337540 345996 354497 330398
4655 330398 318296 319331 320506 314036 317334 328418 314845 321369 329332 320452 298124 307980 294155
4642 294155 300196 311863 276389 252753 255073 275626 264717 250785 265560 244779 229654 232459
4630 232459 227485 181304 190552 168587 163480 180314 187843 169797 163643 161453 118161 124866 131711
4617 131711 133360 128298 109547 121309 119567 124229 115718 96388 116431 101253 97650 72097 76954
4604 76954 66387 69331 47094 63335 64476 63785 94945 73227 65587 75555 80703 64883 37022
4591C7022L0544J1418k4332j5941P963M690q883p825J2163k492J9158J0558l169
4578G0874j5210m30k3725J886L3103K1939m2080j5025J0485k9128J6835j2189
4566A7335r523K0900J3983j0638r909P516j0920J4342j0139l1831M1269j5482
4554A6903K2253P279k8415N007r057j966L3104j3200l5190p748O679J2486P823
4541A5958N265P659k3801r129j4547K2025L1488p314J8878p844p614l843M261
4528C1442J084m491Q871p419k1140J311J1743P173r681P819R939P424j8142N836
4514C1769n086R433n763K221J5433k4095Q645r832J0064m2098k527L2116j0845
4501I435K5202j1252j3806l267o38n774j4158K6921l2030j3076L4151K7500k6588
$$ plain form
4591 37022 67566 78984 54652 38711 46674 51364 42481 34656 46819 44327 63485 74043 70874
4578 70874 55664 55234 31509 33395 66498 88437 46357 31332 41817 12689 29524 17335
4566 17335 7812 28712 42695 32057 22148 29664 18744 33086 22947 -8884 32385 16903
4554 16903 39156 46435 18020 23027 13970 12004 45108 31908 -3282 -11030 -4351 8135 15958
4541 15958 21223 28882 5081 -4048 -18595 3430 34918 27604 46482 38638 31024 27181 31442
4528 31442 32526 28035 36906 29487 8347 9658 21401 28574 18893 26712 36651 44075 25933 31769
4514 31769 26683 36116 30353 32574 48007 23912 32557 22725 32789 -9309 -11836 20280 9435
4501 9435 34637 23385 9579 6312 5674 -100 -14258 12663 -19367 -32443 1708 29208 2620
4488B620k8279N698K3562n557k7275J3187J4838l582L802m473L253R423j1807
4475d590n281r87K2249m117J3438j0472k171J1949j3898n81K2674m001j6738J144
4461H618j0170K1070j6400L798J3758k1259q580M6085J279k5012M268J0861l060
4448B5256k6493M246K3536k06M204q586J2202k1811j1337J7311K4894j1301Q419
4435D0334K581m2924j1096N324J8318p562O163K5577r457k6328M725K6144J3245
4422D5044j6261j930J169o276J3384p67M343l125j0237R416k14J6361Q540l0066
4408B9381J689K0019k98J4179m252j6137k7433J7248j0993N793L0793K4951j0660
4395G4280Q605j4326m282K8169r716k798m558J2637P237r544k1656K3710N923
$$ plain form
4488 2620 -25659 -19961 3601 -1956 -29231 -16044 -1206 -4788 -986 -5459 -2206 7217 -4590
4475 -4590 -9871 -10858 11391 7274 20712 10240 8069 20018 6120 5539 28213 24212 7474 8618
4461 8618 -1552 19518 3118 6916 20674 -585 -9165 36920 38199 13187 17455 28316 25256
4448 25256 -1237 3009 26545 26339 30543 21957 34159 12348 1011 18322 43216 31915 40334
4435 40334 42915 -9 -11105 -5781 12537 4975 11138 36715 27258 930 5655 31799 45044
4422 45044 28783 26853 28022 21746 35130 34363 38706 35581 25344 34760 34546 50907 59447 29381
4408 29381 31070 51089 50791 64970 60718 44581 17148 34396 23403 29196 59989 84940 74280
4395 74280 82885 68559 64277 92446 82730 79932 75374 88011 95248 85704 64048 87758 93681
4382I3681k244j5046j1119L6642p428n317K2750O719l2753J3011L009M806M442
4369A11153J1803j5986J9623J1786M193j8987J2046j3544o465J2079j4728P706
4357A20679L0552J3603k0468j7113j0504p373K314K6188Q146L479j9866L587J756
4344A34980L811r337Q354k8879L034n019K9707r442J959r958P537J8906k9924
4331A15729J4237j2039J0537l359p387m932j689K4845l137j4975j5655j7178n994
4318G9003O265J7214R483k4346j757Q60j9872M655J5751p254J821R081L85n534
4304H5755m225j9536M624K0022j2680J863O090J1863r695k72k7356O070P713q133
4290F2103o497J138L3537M691j0847j3688k205q175O522J4253j423q486L0158
$$ plain form
4382 93681 91437 76391 65272 101914 94486 89169 111919 118638 85885 98896 101905 106711 111153
4369 111153 122956 106970 126593 138379 142572 123585 135631 122087 115622 127701 112973 120679
4357 120679 151231 164834 144366 127253 116749 109376 111690 137878 146024 149503 129637 133224 134980
4344 134980 138791 129454 137808 108929 111963 106944 136651 127209 129168 119210 126747 145653 115729
4331 115729 129966 117927 128464 125105 117718 112786 111097 135942 132805 117830 102175 84997 79003
4318 79003 85268 102482 111965 87619 85862 86722 66850 71505 87256 80002 81823 90904 91289 85755
4304 85755 81530 61994 66618 86640 73960 75823 81913 93776 84081 83809 56453 62523 70236 62103
4290 62103 55606 56744 90281 94972 84125 70437 68232 60057 66579 80832 79409 70923 101081
4277A01081j9451j5524J6950J493j3625p43J9282j2366O369j2868l994K555n980
4264F3179J6045J0684J0230O289P7j4686k310J2292J1238j7430K3143j7476k905
4251I8370L2190J7593l2863n328P285J9250J2454j4078K6844L365J930L139J1592
4238A81743Q798M569K2136M2609r585K5003L9478L0097L1253P2143O4076N7027
4226E69347R4609J44465J00209J10996J05912P6201J8269m9856p4985j27469j37935
4215H29763j31687r3269q3113o2887p4548n5522k9673l2287n746j7859k7661r670
4203B05841m2824L5574J5500k7331K3130k4994R429J2727J921j711k0743m4191
4191A42328l4519K7083J1511k2529p163j2439j3046J0840j2500O853k0353k5052
$$ plain form
4277 101081 81630 66106 83056 84549 70924 70181 89463 77097 83466 70598 66604 69159 63179
4264 63179 79224 89908 100138 106427 106504 91818 89508 101800 113038 95608 118751 101275 98370
4251 98370 130560 148153 115290 109962 117247 136497 148951 134873 161717 165082 167012 170151 181743
4238 181743 190541 195110 217246 259855 250270 275273 314751 344848 376101 448244 512320 569347
4226 569347 663956 808421 908630 1019626 1125538 1201739 1220008 1170152 1095167 967698 829763
4215 829763 698076 604807 521694 458807 384259 328737 299064 266777 261031 243172 215511 205841
4203 205841 163017 198591 214091 186760 209890 184896 194325 207052 208973 207262 186519 142328
4191 142328 107809 134892 146403 123874 116711 104272 91226 102066 89566 96419 76066 51014
4179E1014L6467k267j4236O846r73K4444J4345j810J79k9474K2227Q12J873P947
4165A17394J67K9458K0773j9390j8904o144K7843l3841j5565p125r664J5384j3819
4152H6567L2268p198o765l4757k0430L577m387J4110K4608q468l2412K644O343
4139E5700L0147J1008j5670J2280J3610k3381J996J0056M964j2846J5564J4927
4127A18355l9374O505J8929m0115j7730R321p887Q902j4626j307J594K5118l125
4114F4560n443l4057L838J5613j3248J3650P990o120j6134J5479L244j2490K101
4101C8983j8325J5252p90J4018K9K039R58j85P721M080k0976j3820J2581J2047
4087E3612j6851J3735K5494j8662j2377R102Q792Q826k3864J6506r62Q499m804
$$ plain form
4179 51014 87481 85214 70978 77824 76851 101295 115640 113830 114009 84535 106762 107574 109447 117394
4165 117394 117561 147019 167792 148402 129498 123354 151197 117356 101791 94666 85002 100386 86567
4152 86567 118835 111637 104872 70115 49685 53262 48875 62985 87593 79125 46713 49357 55700
4139 55700 85847 96855 81185 93465 107075 83694 85690 95746 100710 87864 103428 118355
4127 118355 78981 85486 104415 64300 46570 55891 48004 56906 42280 40973 42567 67685 64560
4114 64560 59117 25060 28898 44511 31263 44913 52903 46783 30649 46128 49372 36882 38983
4101 38983 20658 35910 35120 49138 49167 51206 52164 51979 59700 63780 42804 28984 41565 53612
4087 53612 36761 50496 75990 57328 44951 54053 62845 71671 47807 64313 63351 71850 67046
4074F7046l2609M980M833J4142j2870k055K1313K4384k5152n760l997q60k7914
4061B5481N13L2643l979k76j795O547L5314o969l287o048J189j6302J0080K119
4047G5230M529L445J8900J2757j1580K4349K283k318l664l4285O327o829J5567
4034A04711L1932O99M616k553r663L971k4441K0919L1855j4664l085p335j4445
4021A22517K6518J4762l277J0531l077N837K0751j7152M968o229m286K3134P850
4008B02847j3900L154R769M4483K29r667P740J0665j7013p719r534j6711K5004
3995B29347L5159L897j2463K4603m696K9058n894J0274L262J6578N125J5738J0286
3982C60274L1419J1208J6471J0099K109K5395K0481O077L5303L8962N0986L4580
$$ plain form
4074 67046 34437 39417 44250 58392 45522 43467 64780 89164 64012 58252 54255 53395 25481
4061 25481 25994 58637 54658 54382 52587 59134 94448 87479 84192 78144 79333 63031 73111 75230
4047 75230 79759 83204 102104 114861 103281 127630 129913 127595 123931 89646 95973 89144 104711
4034 104711 136643 137342 141958 139405 129742 133713 109272 130191 162046 147382 144297 136962 122517
4021 122517 149035 163797 160520 171051 167974 173811 194562 177410 182378 176149 171863 194997 202847
4008 202847 188947 192101 201870 246353 246582 236915 244655 255320 238307 230588 221054 204343 229347
3995 229347 264506 268403 255940 280543 275847 304905 299011 309285 312547 329125 334250 349988 360274
3982 360274 391693 402901 419372 429471 431580 456975 477456 483533 518836 557798 608784 643364
3970F43364M7721M0568M5826J7049O2039M7920N7833P5880N7827R1993R2136J13756
3958A393912J83900K06601K14529K51778L36155M28544N45233O27612O71230O72496
3948E531990N60963K53674j09644l61798m25640m54934o27560o47101n53732m73682
3938B692536l74749k86660j93383j98859j76547j04710j31537o6521q2797q1064
3928I95709p7059l5287m9687l1907o4436j7169j6248m0725l1620q758N792j0366
3916F18239n9488k7183k2628l4260P460j4113k8217p451j9009o700j4766k5600
3904C66284q816Q626l5524j3094L5835k3875l3133j1550O903J017R704q606k7627
3891B66144j0022j9265P217p084M859N709N43k8770l1459J1666K1540K6834j1678
$$ plain form
3970 643364 691085 731653 777479 794528 856567 904487 962320 1038200 1096027 1188020 1280156 1393912
3958 1393912 1577812 1784413 1998942 2250720 2586875 3015419 3560652 4188264 4859494 5531990
3948 5531990 6092953 6346627 6236983 5875185 5449545 4994611 4367051 3719950 3166218 2692536
3938 2692536 2317787 2031127 1837744 1638885 1462338 1357628 1226091 1159570 1076773 995709
3928 995709 918650 883363 833676 801769 737333 720164 703916 663191 631571 622813 628605 618239
3916 618239 558751 531568 508940 474680 482140 468027 439810 432359 413350 406650 391884 366284
3904 366284 357468 366094 330570 317476 353311 329436 296303 284753 291656 292673 302377 293771 266144
3891 266144 256122 236857 244074 236990 241849 247558 248101 219331 187872 199538 221078 247912 236234
3878B36234l7888j2881J0206P729K2070l6911j2044Qk0872K57J7752K4164J806
3865A99630m2440N441M99j6684N913R032j7829q631J4512p8L680Q428j7980P672
3851A51165n984M4548r36k4552k3193k019J2569P902j9598k8212J6421J6796p091
3838A37816L0258j7417l0858J1908J0709J9287j9197k411M088N693J6254n060
3826A61070j1849J1702k962J0197J0290k5982j1864P68P560K628j0873R67K3986
3813A65638J2243j3730p468j1228Q450K0134J7657k3451J017K732N652J7068K2997
3800B17711k2817j7147J3750J51J5278K355o139m162K5018J6087o785q695R415
3787B34020j1207k6425j158J2683J6599q639P438Q650R472M942J3875j3269J184
$$ plain form
3878 236234 198346 185465 195671 203400 225470 188559 176515 176523 155651 155908 173660 197824 199630
3865 199630 157190 162631 163130 146446 152359 161391 143562 134931 149443 149365 153045 161473 143493 151165
3851 151165 145181 189729 188793 164241 141048 139029 151598 159500 139902 111690 128111 144907 137816
3838 137816 168074 150657 119799 131707 142416 161703 142506 140095 144183 149876 166130 161070
3826 161070 149221 160923 157961 168158 178448 152466 140602 141370 148930 151558 140685 141652 165638
3813 165638 177881 164151 156683 145455 153905 174039 191696 168245 169262 171994 177646 194714 217711
3800 217711 194894 177747 191497 191648 206926 209281 203142 198980 223998 240085 233300 224605 234020
3787 234020 222813 196388 195230 207913 224512 215873 223311 231961 241433 246375 260250 246981 248165
3774B48165j488l515j730J7172R417J4908n905K164P765R858j6420q561J997J6483
3760B90310R035k3302O941J6100J4855K181j1016J4595J6721k5454r774m507m57
3747B96228j4622M859J2323J4M844Q2K6367K2402j9916j6808J4848P21m862j2812
3733C13668J7380O033M751l937q925q376j0897K8137J0633J0482r718j4526j4550
3720C20155K6119p425q298J3335K188j0027J9152K475j0942j876J3311L934k2994
3707C39107N960J9051k2836k1691K291r668P260M762o162Q610L059K3502k3445
3694C29800j683K0167r383J2284J3920L721l6681n545K4834j633P94L4176L2646
3681D17417l6140M4086l2666l2133J5276J6631n395n79R57R28K1822j8503N42
$$ plain form
3774 248165 246677 243162 241432 258604 268021 282929 277024 279188 286953 296811 280391 271830 273827 290310
3760 290310 299345 276043 282984 299084 313939 316120 305104 319699 336420 310966 301192 296685 296228
3747 296228 281606 286465 298788 298802 303646 303728 330095 352497 332581 315773 330621 331342 326480 313668
3733 313668 331048 337081 341832 337895 328970 320594 309697 337834 348467 358949 349231 334705 320155
3720 320155 346274 338849 330551 343886 346074 336047 355199 357674 346732 344856 358167 362101 339107
3707 339107 345067 364118 341282 319591 321882 312214 319474 324236 318074 326684 329743 353245 329800
3694 329800 328117 348284 338901 351185 365105 368826 332145 326600 351434 349801 350595 384771 417417
3681 417417 381277 425363 392697 360564 375840 392471 387076 386497 387454 388382 410204 391701 392243
3668C92243p295M584o188O123J1233L2871o836j1759J689n537K5016J8865L211
3655D58220J8623k8587K5068J4487j3340M799p489K4054J0422J9480N979J327
3643E33043o358q695L7123L9226K874P611l434R966P737J0120K2904K0637K7403
3630G00157k3565L7109M3335J7772K2074K9597K421O180Q740R272J0455L9423
3618I02970K0063P926R317K0465M9198R877J0290L4221L6906K0105K0339J7472
3606A159149O281K9011L5067L0430K246L1867M9878K3208L4069M0512L8765L9196
3594A519679N5427M4629L4867K1995M7805O0921L2965K5685L1613O9385O0717
3583B005688N4835L1535L5148L8129N5531N7740L7952N4935K3571P4100O0907
$$ plain form
3668 392243 384948 389532 383344 389467 400700 433571 426735 414976 416665 411128 436144 455009 458220
3655 458220 476843 448256 473324 487811 474471 479270 471781 495835 506257 525737 531716 533043
3643 533043 526685 517990 555113 594339 597213 604824 601390 611356 619093 629213 652117 672754 700157
3630 700157 676592 713701 757036 774808 796882 826479 828900 835080 843820 853092 863547 902970
3618 902970 923033 930959 940276 960741 1009939 1019816 1030106 1064327 1101233 1121338 1141677 1159149
3606 1159149 1165430 1194441 1229508 1259938 1262184 1294051 1343929 1367137 1401206 1441718 1480483 1519679
3594 1519679 1575106 1619735 1654602 1676597 1724402 1785323 1818288 1843973 1875586 1944971 2005688
3583 2005688 2060523 2092058 2127206 2165335 2220866 2278606 2316558 2371493 2395064 2469164 2530071
3572B530071N9480N1468M2270P7536Q0471P8402R3977P6748J03508Q3077O9585
3561C346593Q3980P7619R8923R4392J15013J18972J13261J63742J48291J40224
3551D501010J25971J34625J62212J53506J68606J94726K03956J62014K00146K30573
3541F237345K57728K21836K32994K40342K47283K81115K49752K70035K62402K50092
3531H750924K56197K53596K22001K18034K26274K05373K08311K17759K45519K42271
3521A1046259K71108K96761K96323K93439L31675L42609L75424L78884M07168
3512A4039650M38719M48131M74758M84529M85897N06577N32544N06496M94062
3503A8411363M88584M81495M49625M26166L99700L54072L22290K95420K57370
$$ plain form
3572 2530071 2589551 2641019 2683289 2760825 2841296 2919698 3013675 3090423 3193931 3277008 3346593
3561 3346593 3430573 3508192 3607115 3701507 3816520 3935492 4048753 4212495 4360786 4501010
3551 4501010 4626981 4761606 4923818 5077324 5245930 5440656 5644612 5806626 6006772 6237345
3541 6237345 6495073 6716909 6949903 7190245 7437528 7718643 7968395 8238430 8500832 8750924
3531 8750924 9007121 9260717 9482718 9700752 9927026 10132399 10340710 10558469 10803988 11046259
3521 11046259 11317367 11614128 11910451 12203890 12535565 12878174 13253598 13632482 14039650
3512 14039650 14478369 14926500 15401258 15885787 16371684 16878261 17410805 17917301 18411363
3503 18411363 18899947 19381442 19831067 20257233 20656933 21011005 21333295 21628715 21886085
3494B1886085K40810K02537J88179K01842K12627J78723J82613J69600J72141
3485B3635157J99307J91879J80618K17600K52982K79454K61167K79458K72255
3476B5769877K91263K87106K84995K92484K62206K44425K41527J93980J42266
3467B8010129J58679J07342O5053K8435j2507m7191k9433p4052j02719j18028
3457B7985708j22048j47669j76970j48792j39296j80611j97991j82314j97035
3448B6492982j97640k26431k41275k22530k10321k07598j95999j88106j88022
3439B4615060j99035j52008j55275j84984j79743k18955k27637j96603k54494
3430B2846326k73738l11884l52800l56279m14225m13685m38332m33681l99256
$$ plain form
3494 21886085 22126895 22329432 22517611 22719453 22932080 23110803 23293416 23463016 23635157
3485 23635157 23834464 24026343 24206961 24424561 24677543 24956997 25218164 25497622 25769877
3476 25769877 26061140 26348246 26633241 26925725 27187931 27432356 27673883 27867863 28010129
3467 28010129 28168808 28276150 28341203 28369638 28357131 28309940 28280507 28206455 28103736 27985708
3457 27985708 27863660 27715991 27539021 27390229 27250933 27070322 26872331 26690017 26492982
3448 26492982 26295342 26068911 25827636 25605106 25394785 25187187 24991188 24803082 24615060
3439 24615060 24416025 24264017 24108742 23923758 23744015 23525060 23297423 23100820 22846326
3430 22846326 22572588 22260704 21907904 21551625 21137400 20723715 20285383 19851702 19452446
3421A9452446m48527m27895m55123m11911m25336l99356l88889l89948l47218
3412A5758243l61408l31961l30637k96643k84789k71223k47126k13487k22414
3403A3198555k28526k33805k41000k27249k16701k49952k53915k66542k66175
3394A1014690k92198k44412k57000k52102k09372j81093k11979j98470j69816
3385H998248j84812j73466j49183j24799j20032j07946o6087r8428o8202n7118
3375G848175q6602l2341j8472m6332m6972r248j6691m645L917K6063k398L8103
3363G652557K7428J0271O3942M9489M8646Q2327N9780O1029R1577P4667J18547
3352H340260J07670R9162J11967J26737J11922J31596J60859J62082J73323J81917
$$ plain form
3421 19452446 19003919 18576024 18120901 17708990 17283654 16884298 16495409 16105461 15758243
3412 15758243 15396835 15064874 14734237 14437594 14152805 13881582 13634456 13420969 13198555
3403 13198555 12970029 12736224 12495224 12267975 12051274 11801322 11547407 11280865 11014690
3394 11014690 10722492 10478080 10221080 9968978 9759606 9578513 9366534 9168064 8998248
3385 8998248 8813436 8639970 8490787 8365988 8245956 8138010 8071923 7973495 7905293 7848175
3375 7848175 7761573 7729232 7710760 7664428 7617456 7608208 7591517 7586872 7590789 7616852 7614454 7652557
3363 7652557 7679985 7690256 7754198 7803687 7852333 7934660 7994440 8055469 8147046 8221713 8340260
3352 8340260 8447930 8547092 8659059 8785796 8897718 9029314 9190173 9352255 9525578 9707495
3342I707495J78437J77187K10210K09839K32630K14366K44947K49066K26614K42862
3332A1893653K55205K72015K82665K88264K91827L06544K89665L23721L32314
3323A4535873L38857L78996M08604M31716M36065M44000M73994M98308M93341
3314A8439754N37367N69935N79623N96461N98394O37514O65506O51993O71458
3305B3948005O80747O60098O37641O56037O79920O96439O72199P08204P20674
3296C0059964P26360P89448Q17146Q65896R03651R40246J009001J068327J161382
3287C8341421J261491J285921J351864J428168J502738J558447J658412J732321
3279E0120783J816270J899783K008485K104121K162278K262782K350084K455041
$$ plain form
3342 9707495 9885932 10063119 10273329 10483168 10715798 10930164 11175111 11424177 11650791 11893653
3332 11893653 12148858 12420873 12703538 12991802 13283629 13590173 13879838 14203559 14535873
3323 14535873 14874730 15253726 15662330 16094046 16530111 16974111 17448105 17946413 18439754
3314 18439754 18977121 19547056 20126679 20723140 21321534 21959048 22624554 23276547 23948005
3305 23948005 24628752 25288850 25926491 26582528 27262448 27958887 28631086 29339290 30059964
3296 30059964 30786324 31575772 32392918 33258814 34162465 35102711 36111712 37180039 38341421
3287 38341421 39602912 40888833 42240697 43668865 45171603 46730050 48388462 50120783
3279 50120783 51937053 53836836 55845321 57949442 60111720 62374502 64724586 67179627
3271F7179627K575993K679635K812834K988027L138577L353897L510304L731017
3263I1969911L953806M156366M424338M681556M903254N109461N310372N497637
3255A30006701N691550N805624N936653O128945O298825O533132O782714P098572
3247A80282716P440922P804210Q198590Q528045Q898282R188822R215246R041982
3239B48598815Q483385P520881O153830M439379K376258J69588k035328m219630
3231B71487178o218054p823063r076410r878665j0290985j0400523j0236931r974754
3223A97587793r661121r273611q833507q333889p779616p233862o731932o299056
3215A33441199n896088n544787n244374n033643m780870m621851m437479m231148
$$ plain form
3271 67179627 69755620 72435255 75248089 78236116 81374693 84728590 88238894 91969911
3263 91969911 95923717 100080083 104504421 109185977 114089231 119198692 124509064 130006701
3255 130006701 135698251 141503875 147440528 153569473 159868298 166401430 173184144 180282716
3247 180282716 187723638 195527848 203726438 212254483 221152765 230341587 239556833 248598815
3239 248598815 257082200 264603081 270756911 275196290 277572548 277742136 275706808 271487178
3231 271487178 265269124 257446061 248369651 238490986 228200001 217799478 207562547 197587793
3223 197587793 187926672 178653061 169819554 161485665 153706049 146472187 139740255 133441199
3215 133441199 127545111 122000324 116755950 111722307 106941437 102319586 97882107 93650959
3207I3650959m067832l942584l750816l579970l437749l280608l101964k907074
3199F5582362k748847k593215k432817k243267k139460j999099j864050j768921
3191D7792686j682282j618548j515712j443355j387324j350885j279930j257913
3183C6256737j220931j166116j077391j075870j060982r94382r66019r35994q90976
3174B6868076q55904q16716q01131p68481p08901o58825o25500n85886n77974
3165B0468758n96820n38250n54340n34982n10040n30110m83880m72698m73530
3156A5774108m52781m43407m15069m40080m42115l80434l87995l67710l70951
3147A2073566l30732l09312l16754k88839k80111k46459k75986k57002k40906
$$ plain form
3207 93650959 89583127 85640543 81889727 78309757 74872008 71591400 68489436 65582362
3199 65582362 62833515 60240300 57807483 55564216 53424756 51425657 49561607 47792686
3191 47792686 46110404 44491856 42976144 41532789 40145465 38794580 37514650 36256737
3183 36256737 35035806 33869690 32792299 31716429 30655447 29661065 28695046 27759052 26868076
3174 26868076 26012172 25195456 24394325 23625844 22916943 22258118 21632618 21046732 20468758
3165 20468758 19871938 19333688 18779348 18244366 17734326 17204216 16720336 16247638 15774108
3156 15774108 15321327 14877920 14462851 14022771 13580656 13200222 12812227 12444517 12073566
3147 12073566 11742834 11433522 11116768 10827929 10547818 10301359 10025373 9768371 9527465
3138I527465k18849k10181k37410k35997j77887k01963k02804j41621j48741j72279
3128G579733j61618j58695j38428j20242j45551j56524j37543j17473j22950j11966
3118F208743j28638j36162r0576j13987q3157p6196j18137j00515r9323o9098
3108E192954r2740r7032q5769q5165r4794q0421k5155o2859r0124p9981n3513
3097D345401m3555o4441p1529n7027o7543m8235l6549m6399l6679n2937n0282
3086C770225l9855j6612m7794l4284l1468l7869n5951j2646l4607k5882p170o2185
3074C363902l6664l5489m4928l3949l0719l8402l3563k7191m2712l8602j9321
3063B982362l1038l4823l5898l1127n0987m1250j9292l4801k8938l2828m4021
$$ plain form
3138 9527465 9308616 9098435 8861025 8625028 8447141 8245178 8042374 7900753 7752012 7579733
3128 7579733 7418115 7259420 7120992 7000750 6855199 6698675 6561132 6443659 6320709 6208743
3118 6208743 6080105 5943943 5853367 5739380 5656223 5580027 5461890 5361375 5262052 5192954
3108 5192954 5100214 5003182 4917413 4832248 4737454 4657033 4631878 4569019 4478895 4398914 4345401
3097 4345401 4301846 4237405 4165876 4108849 4041306 3993071 3956522 3910123 3873444 3820507 3770225
3086 3770225 3730370 3713758 3665964 3631680 3600212 3562343 3506392 3493746 3459139 3433257 3426087 3363902
3074 3363902 3327238 3291749 3246821 3212872 3182153 3143751 3110188 3082997 3040285 3001683 2982362
3063 2982362 2951324 2916501 2880603 2849476 2798489 2757239 2737947 2703146 2674208 2641380 2597359
3052B597359l7454k1706l3945m8011k0132k2090k6007k1419m3311j5061m913q469
3040B294841L821k5922L252j9227j6565n219N231l0057M079Q081L759k671J3057
3027B236460l97O400J6477L1786K7510L542J4183J0925K1354J6560J1957J2408
3015B409165J5526J6682L6748L8282J4418j308L4306M8375J60M5472J9000J1647
3003B688473N9996K9334L3175J3088L7367N0854M5736M5702L8908M5739Q4066
2992C172438M0217K1896L8807N2295P9550L8964N2816N2463Q9653R1368L4640
2981C765107Q1061N2076P4660J07757P1731Q1571J03251N8734Q5746J01797P9196
2970D662687P9884J06193Q4989J05432J19393J06253J04090J41988J23364J43887
$$ plain form
3052 2597359 2559905 2538199 2504254 2456243 2436111 2414021 2388014 2366595 2323284 2308223 2303310 2294841
3040 2294841 2298662 2272740 2275992 2256765 2240200 2234981 2240212 2210155 2214234 2222315 2226074 2223403 2236460
3027 2236460 2236063 2242463 2258940 2290726 2318236 2321778 2335961 2346886 2368240 2384800 2396757 2409165
3015 2409165 2424691 2441373 2478121 2516403 2530821 2529513 2563819 2612194 2612354 2657826 2676826 2688473
3003 2688473 2748469 2777803 2810978 2824066 2861433 2912287 2958023 3003725 3042633 3088372 3172438
2992 3172438 3212655 3234551 3273358 3325653 3405203 3444167 3496983 3549446 3639099 3730467 3765107
2981 3765107 3846168 3898244 3972904 4080661 4152392 4233963 4337214 4395948 4481694 4583491 4662687
2970 4662687 4742571 4848764 4933753 5039185 5158578 5264831 5368921 5510909 5634273 5778160
2960E778160J31538J28914J60213J67916J49418J23278J49306J63716J68594J88190
2950G309243J95683J66902J95156K35525K19603K27885K59460K39532K72747K82518
2940I604254L05484L57389L43112L55803L93847M22708M45228M73442N31010N89430
2930A3821707O35045O88942P59588P93592Q65782R59367J005592J105367J247343
2921B1882325J303641J410451J523583J615607J667106J714479J694203J640323
2913C4451718J544651J379748J243295J136487J077079R88598R18384P89520O25735
2904D4155215M71111L24170K16735J86325K39506K86247L78066N11202O05916
2895D7374493P52380R11867J133253J386110J666248K071798K548819L056277
$$ plain form
2960 5778160 5909698 6038612 6198825 6366741 6516159 6639437 6788743 6952459 7121053 7309243
2950 7309243 7504926 7671828 7866984 8102509 8322112 8549997 8809457 9048989 9321736 9604254
2940 9604254 9909738 10267127 10610239 10966042 11359889 11782597 12227825 12701267 13232277 13821707
2930 13821707 14456752 15145694 15905282 16698874 17564656 18524023 19529615 20634982 21882325
2921 21882325 23185966 24596417 26120000 27735607 29402713 31117192 32811395 34451718
2913 34451718 35996369 37376117 38619412 39755899 40832978 41821576 42739960 43529480 44155215
2904 44155215 44626326 44950496 45167231 45353556 45593062 45879309 46257375 46768577 47374493
2895 47374493 48126873 49038740 50171993 51558103 53224351 55296149 57844968 60901245
2887F0901245L404369L420497K895940J754869J00036j103963j358334r80417
2879F9034242m16844j75713n02986j501379k962805m128391m348993l992306l452038
2870D7552787k874413k343465j880458j491050j158724r08654o97939n01782l65522
2861C5330780j92847n7252Q1994K18338K46332K88788K20652O3348j55199l65256
2851C5679678n67159p25556q10611q99221r79532j143268j272273j426174j565180
2842B6290704j581087j590962j521600j447184j346075j192347j077707r85989
2834A5547753r02531q11755p31423o60286o34440o02987n35470n04509m61458
2825I702894m38789l84313l67498l44748l30625l21423k71880k73470k59380k46424
$$ plain form
2887 60901245 64305614 67726111 70622051 72376920 72476956 71372993 70014659 69034242
2879 69034242 68617398 68441685 67938699 66437320 63474515 59346124 54997131 51004825 47552787
2870 47552787 44678374 42334909 40454451 38963401 37804677 36896023 36198084 35696302 35330780
2861 35330780 35137933 35080681 35162675 35381013 35627345 35916133 36136785 36200133 36044934 35679678
2851 35679678 35112519 34386963 33576352 32677131 31697599 30554331 29282058 27855884 26290704
2842 26290704 24709617 23118655 21597055 20149871 18803796 17611449 16533742 15547753
2834 15547753 14645222 13833467 13102044 12441758 11807318 11204331 10668861 10164352 9702894
2825 9702894 9264105 8879792 8512294 8167546 7836921 7515498 7243618 6970148 6710768 6464344
2815F464344k17872j85736k04919k14997k02400j54771j57205j45066j58716j73610
2805D649052r4745j33806j49066j26445j06467j12835j15734j26957q7861q7841
2795C507295r7947q6920j09599j04120l9104p4351q6608q5783o5452o0156o1661
2784B635594n2241m1572l7216o9319n3968o1890m6465m1902n0976m8284m8049
2773B083712n0738j4161l3040n6032l8862n0595l3771k7650j5509l9804l0724
2762A692826k7826n4102k3387l3362k3943l9586j8904j7225k5125l6462k3390
2751A369514l2770k0793l485j7189j4681j5917r835R992l7561l5641j81M308m6082
2738A149679n995j1116j4612p986M691q780m1652k2695r704o025j3005p360k6553
$$ plain form
2815 6464344 6246472 6060736 5855817 5640820 5438420 5283649 5126444 4981378 4822662 4649052
2805 4649052 4554307 4420501 4271435 4144990 4038523 3925688 3809954 3682997 3595136 3507295
2795 3507295 3409348 3322428 3212829 3108709 3069605 2995254 2908646 2822863 2757411 2697255 2635594
2784 2635594 2583353 2541781 2504565 2435246 2381278 2319388 2272923 2231021 2180045 2131761 2083712
2773 2083712 2032974 2018813 1985773 1929741 1890879 1840284 1806513 1778863 1763354 1723550 1692826
2762 1692826 1665000 1610898 1587511 1554149 1530206 1490620 1471716 1454491 1429366 1392904 1369514
2751 1369514 1336744 1315951 1312466 1295277 1280596 1264679 1254844 1264836 1227275 1191634 1191453 1195761 1149679
2738 1149679 1143684 1132568 1117956 1109970 1114661 1105881 1064229 1041534 1031830 1025805 1012800 1005440 978887
2725I78887j5698R232j1083j0479K215l7121m5308k2942R485r765j8510j6589
2713H12324j3779J3514j3451n237L394p425j1612j8332j1316k7689l854k6591
2701F89946J73l182o934l1626q269K174l5368l4430J8632j4702J2077R832k8758
2688E69565N860p495p213o758j4759j9932n578J491J1564M619k0427k9412N477
2675D87002K0240j4925j8527J2647k1625K526M771k464j2819k2631o161M859K6837
2662D59730N819j4021k7457O379O414l350j6677l382j1662J6052Q595j1502p955
2649D06983K0287j7892j5723L2783Q34j4072K232P25O783j2991k0603J7443P331
2636D14120J1771K1025K791M074J1153l748q232K247p708J1548K2313L019k2568
$$ plain form
2725 978887 963189 972421 961338 950859 953074 915953 870645 847703 857188 847423 828913 812324
2713 812324 798545 812059 798608 793371 796765 789340 777728 759396 748080 720391 716537 689946
2701 689946 690119 686937 680003 648377 640108 642282 606914 572484 591116 576414 588491 598323 569565
2688 569565 575425 567930 560717 553959 539200 519268 513690 515181 526745 531364 510937 481525 487002
2675 487002 507242 492317 473790 486437 464812 467338 472109 469645 456826 434195 428034 432893 459730
2662 459730 465549 451528 424071 430450 436864 433514 416837 413455 401793 417845 426440 414938 406983
2649 406983 427270 409378 393655 426438 427272 413200 415432 416157 422940 409949 389346 406789 414120
2636 414120 425891 446916 449707 453781 464934 461186 452954 455201 447493 459041 481354 484373 461805
2623D61805K911j3193O88K8258O640k0147j1036K769j6809J3389k4763M336J5092
2610D49940L0158J7878k0041k813K2809P487J8205l218J1175J6206K0842k068
2598E66560k8149o44j3240j4178J6485k8005J9636l725n7426l0541j8071j9139
2586C89563l3731Q82K1594k5047k1065o701k018L210M530j5820j6291p17j7598
2573B80791j014K4319j6853k1417K0825K8589j8811k0678P015r753j4851o434
2561B51728Q888m1532J7154M835k5504m224k0804o047r870j4066j0185J5282k3991
2548A41664k7903J9005J9477j1385l3245K5633j1485k0878J37l4009K9271L561
2536I9843k6984J0413L1445o227j9114J4965j8746r257J2824J2658K3856j7997
$$ plain form
2623 461805 464716 451523 452211 480469 487109 466962 455926 458695 441886 455275 430512 434848 449940
2610 449940 480098 497976 477935 475122 497931 505418 523623 520405 531580 547786 568628 566560
2598 566560 538411 537767 524527 510349 526834 498829 518465 514740 457314 426773 408702 389563
2586 389563 355832 356714 378308 353261 332196 325495 323477 326687 331217 315397 299106 298389 280791
2573 280791 279777 304096 287243 265826 286651 315240 296429 275751 282766 273013 258162 251728
2561 251728 260616 219084 236238 241073 215569 211345 190541 184494 174624 160558 150373 165655 141664
2548 141664 113761 132766 152243 140858 107613 133246 121761 100883 101020 67011 96282 99843
2536 99843 72859 83272 114717 108490 89376 104341 85595 76338 89162 101820 125676 107679
2524A07679m2667r855l105K8242pN765J5755n270k709p409k5j3503k405J0264
2510H0750J1010P335j2243k5920K114R588J8957K166K789j5727o684O87O815K0296
2496A01933k5164J493O629J1467l151j8892q370L3026j0712j4183j8464j4665
2484D0947Q348K8388J218j1355q115K2963J243k1524K8003k1511l9755K462N533
2471C6845L0370N004n894j6728K3771j4268P394J9903k6870k689j3737L532o631
2458D0002o407J8961m062M017J1018k0946j3166J6879J5240j0690J0808K370N573
2445F9597o318q531m383r715l931k1347J0954K4263p307p597n374K1133r497r051
2431C2896N115O116k0876K8626j115m770K847J2155o700nq084q821j27r748O098
$$ plain form
2524 107679 65012 55157 52052 80294 80287 86052 101807 96537 93828 86419 86394 72891 70486 80750
2510 80750 91760 99095 86852 60932 63046 72634 91591 93757 96546 80819 74135 74822 81637 101933
2496 101933 76769 78262 84891 96358 93207 74315 65945 98971 88259 74076 55612 40947
2484 40947 49295 77683 78901 67546 59431 82394 83637 62113 90116 68605 28850 31312 36845
2471 36845 67215 72219 66325 49597 73368 59100 66494 86397 59527 56838 43101 46633 40002
2458 40002 33595 52556 48494 52511 63529 42583 29417 46296 61536 50846 61654 64024 69597
2445 69597 63279 54748 50365 40650 36719 15372 26326 50589 43282 35685 30311 51444 41947 32896
2431 32896 38011 44127 23251 51877 50762 45992 48839 60994 54294 54289 46205 37384 37257 27509 33607
2416C3607L144J5302J1018k5563q194j8362K5503P373k4393j566L228R785n83
2403C0299L472r389n436j0268K7615Q02L206j4701K5221Q228j7538K2121o739
2390E6893k6955j6877j0029L3134j2385J3952k328l9202J9274J021r279r895J7666
2377A4990O075j4634o641J6107R482j841P936M359J6611j3715K830j2791k8923
2364a55J5550j1939J5278j269j6189K2834L5103k1662m988P661j799J1259j6433
2351C3251M702J0121K0272J384K811k250j5027j1232rj9502J4268R308P654Q880
2337F4631l4942j9649O976P756J3975r578k6072o710M978L0594j3267j6159R095
2324A1628K52j5924M357o611k697K0697o772O83R409J0938J245l8077J6521Q046
$$ plain form
2416 33607 36751 52053 63071 37508 29314 10952 36455 43828 19435 17869 21097 30882 30299
2403 30299 33771 24382 18946 8678 36293 37095 40301 25600 50821 59049 41511 63632 56893
2390 56893 29938 13061 3032 36166 23781 37733 35405 -3797 15477 16498 7219 -2676 14990
2377 14990 21065 6431 -210 15897 25379 23538 31474 35833 52444 38729 41559 28768 -155
2364 -155 15395 3456 18734 17465 1276 24110 59213 37551 32563 40224 38425 49684 33251
2351 33251 37953 48074 68346 69730 72541 70291 55264 44032 44023 24521 38789 48097 55751 64631
2337 64631 29689 10040 17016 24772 38747 29169 3097 -3613 1365 31959 18692 2533 11628
2324 11628 11880 -4044 313 -6298 -8995 11702 4930 5613 15022 25960 27205 -10872 5649 13695
2310A3695l0205l105P896J6008J9952j3870m814j1621j628O2K1607k784N236O526
2296B2955j1618K1062n102j404j6351j5381J8716k811k5080M743K7378m852k692
2283I563j446j2379K8586J9048J3652j7455n390j883M22j5214k1973P436j8493
2270a5526J3126M413J1926K364j9725k717p749K8112j258j498q538p767j8543
2257b3380P276n218L702J8497O733j6028n253K3851O510p96q023O771j310J2155
2243B5487l056k7157j275R749p210l427K483Q03M904l924j607N104l033j6937
2229a9096j3491L8355L0164k1881R036L01k0420l798K2227k1729k5636K3974K1308
2216A9314Q237r18L212k5228j2489N097M432p506R925J1798j2040R426Q735l502
$$ plain form
2310 13695 -16510 -19615 -11719 4289 24241 10371 5557 -6064 -7692 -7630 13977 11193 16429 22955
2296 22955 11337 32399 27297 25893 9542 -5839 12877 10066 -15014 -10271 17107 12255 9563
2283 9563 8117 -4262 24324 43372 57024 39569 34179 32296 32718 17504 -4469 2967 -15526
2270 -15526 -2400 2013 13939 16303 -3422 -6139 -13888 14224 12966 11468 2930 -4837 -23380
2257 -23380 -16104 -21322 -17620 877 7610 -8418 -13671 10180 16690 15894 7871 14642 13332 25487
2243 25487 22431 -4726 -6001 3748 -3462 -6889 -4406 -3603 1301 -2623 -4230 874 -2159 -19096
2229 -19096 -32587 5768 35932 14051 23087 23388 2968 -830 21397 -332 -25968 -1994 19314
2216 19314 27551 26633 29845 4617 -7872 -2775 1657 -5849 4076 15874 3834 13260 21995 18493
2202A8493r323j6002L229J5745P424J7939M830J0652J3751m4854J7119j4776j515
2189B2712P406j2828Q704K114K9136k1273j7944J8948J2924j2977K8661Q85J2845
2176G9313j1058j1338O470q009J0142m530n490o05m609J847M067Q649J3389J1824
2162I0062j3225J1650K318J5081K9350J5975J060N217k4471N016J8496j7089J247
2149A40687l447L2890R858q263R017L2036O695p975L4586k3357k5003J3119J3592
2136B24435L974M468L0957J092j549n227L8355K438P21j6880M0878L1889l054
2123C52497K3999K3035J5501N448J0687M4752J3453K740J5398L1158K5272K1463
2111E85403L1581M9568L7710M6369M9003P7297N4745K8212N6220R6194J01265
$$ plain form
2202 18493 9170 -6832 -3603 12142 19566 37505 42335 52987 66738 21884 39003 24227 22712
2189 22712 30118 17290 25994 28108 57244 35971 18027 36975 49899 36922 65583 66468 79313
2176 79313 68255 56917 63387 55378 65520 60990 55500 54895 50286 52133 56200 64849 78238 90062
2162 90062 76837 88487 90805 105886 135236 151211 152271 157488 133017 138033 156529 139440 140687
2149 140687 137240 170130 179988 171725 180742 212778 219473 211498 246084 222727 197724 210843 224435
2136 224435 228409 232877 263834 264926 263377 258150 296505 298943 299664 282784 323662 355551 352497
2123 352497 376496 399531 415032 420480 431167 475919 489372 492112 507510 538668 563940 585403
2111 585403 616984 666552 704262 750631 799634 876931 931676 959888 1016108 1112302 1213567
2100A213567P9118J03142J35347J56541J15480N1024J25297J63796K71671K92271
2090B707254L66425L88472N19442O67403R69457J286744J626031J370718J097216
2081A0999162k07158k142873k019680j551802j035725o99229n14400l99357k76772
2072B152166k14203j44196j28122p5542p5874n5910p3924j10319j19745r9692
2062A054639r9331o5775m5431l8245l4984m7181l0041k5051l2239j9837j8626
2051E97898m6916l7746j6837k7988k9505l3284m6541K3919o648o370K3835l7617
2039C56200m4720L070K0304k2743K478j0325k7449j0837j1942Q600k7339j9569
2027B15728O14K470j18k6971j9444j0096n997K4028j7401l3252j8509K6164L6860
$$ plain form
2100 1213567 1292685 1395827 1531174 1687715 1803195 1854219 1979516 2143312 2414983 2707254
2090 2707254 3073679 3462151 3981593 4648996 5618453 6905197 8531228 9901946 10999162
2081 10999162 10792004 8649131 6629451 5077649 4041924 3342695 2828295 2428938 2152166
2072 2152166 1937963 1793767 1665645 1590103 1514229 1458319 1384395 1274076 1154331 1054639
2062 1054639 955308 889533 844102 805857 770873 723692 693651 668600 636361 616524 597898
2051 597898 550982 513236 496399 468411 438906 405622 359081 383000 376352 369982 393817 356200
2039 356200 311480 314550 334854 312111 314589 304264 276815 265978 254036 262636 235297 215728
2027 215728 216342 218812 218694 191723 172279 162183 156186 180214 162813 129561 111052 137216 174076
2014A74076m346j6141k0282l169j9172j7337J7741J8312j9031J0496J1213m4693
2002H7667l340Q376j1474k4145J0319J5118l035r571n346J9361k4399j3811O849
1989E2569j2264J0284K4309k1056j4467r750r453J3848m697J9594q64J6599j1411
1976E3241R693m988j1925L718n667J0906o98Q54p940j0624j2596n818J41K2293
1962D0590k922k695R010k3497m739j1510L0236K130q899M964j2608L984p114M505
1948B1435n282K322Q823k5328j140J8963O592j8865l866k340J0876R002P664r977
1934A8879j2995k680P067j4449P824O129J738k8552r143L0718N801k6877K42Q067
1920h231o561K7754P919l5180K9K9830p501j4882j6112J6059N07J0918L5277l779
$$ plain form
2014 174076 169730 153589 133307 130138 110966 93629 111370 129682 110651 121147 132360 87667
2002 87667 84327 92703 81229 57084 67403 82521 79486 69915 64569 83930 59531 45720 52569
1989 52569 40305 50589 74898 53842 39375 29625 20172 34020 29323 48917 48053 64652 53241
1976 53241 62934 57946 46021 49739 44072 54978 54280 55134 47194 36570 23974 18156 18297 40590
1962 40590 37668 34973 43983 20486 15747 4237 34473 36603 27704 32668 20060 24044 16930 21435
1948 21435 16153 18475 27298 1970 830 19793 26385 7520 3654 1314 12190 21192 28856 18879
1934 18879 5884 3204 10271 -4178 3646 9775 11513 -17039 -26182 4536 10337 -16540 -16298 -8231
1920 -8231 -14792 12962 20881 -14299 -14270 15560 8059 -6823 -22935 -6876 -6369 4549 39826 36047
1906C6047l1372N841K6139k9190j1802q28N363L967l1688J1697O687L66o282j0959
1892b6014j4687K0295j356K1915K5705k2222m861M345Q952k5268R553m299j9544
1879b7486J6433n41R313n103j3863K5305J2243J96M621j5919O407p697q065o082
1865a0238J5525k4494j246j0550J0390K7939r191k2630L2866j6452K183j7518
1853b3416m471J499m057J72o68L5168k7592R446K5183q242k5886O748k8567M119
1839d0564K916J1506Q240L876M130l797J3096K528R745j08J655J899q453m079
1825B590k7093O706M919K055J85J2852K119l4682K0345K1899P174N429p346q398
1811H754J3555r488j2961j2497Q568J32J4742q786j2173p650j6178J1517J4896
$$ plain form
1906 36047 4675 10516 36655 7465 -4337 -5165 198 4165 -27523 -15826 -9139 -8773 -15055 -26014
1892 -26014 -40701 -20406 -21762 153 25858 3636 -1225 3120 12072 -13196 -3643 -7942 -27486
1879 -27486 -11053 -11594 -2281 -7384 -21247 4058 16301 16497 21118 5199 11606 3909 -4156 -10238
1865 -10238 5287 -19207 -20453 -31003 -20613 7326 -1865 -24495 8371 -8081 -5898 -23416
1853 -23416 -27887 -26388 -30445 -30273 -30941 4227 -23365 -13919 11264 3022 -22864 -16116 -44683 -40564
1839 -40564 -37648 -26142 -17902 -14026 -9896 -13693 -597 1931 11676 11568 13223 15122 6669 2590
1825 2590 -24503 -17797 -12878 -10823 -10638 2214 4333 -30349 -10004 11895 19069 24498 17152 8754
1811 8754 22309 12821 -140 -12637 -4069 -3937 10805 2019 -10154 -17804 -33982 -22465 -7569
1798g569K3996l0852r530L3441q334n020K0012k9819l6314L12N2348L668r204
1785b865q872j4973m28o412q200N366R073j1727J3437O089K961J0308k4k2567
1771b8834k2847K4460J1401l324j3724o386J8365K1693l5930K824j6208J6846
1759c1664J9623l0377J9993q073K892n00K575l6855J283L3551L368j9748m472
1746d8404J5324Q644J2740l31j1417j2757j4197J7981K23j9503o028Q458L1191
1733a8076Q135K925k3723j991K8503k4616k7024j8795K4941K1241l852j4698j1989
1720e9019K3407J5007K832k7343l033R706N027L315Q989n697m884k3109J1917
1707d2885Q602j8806J2898r781K0328M396j7723k1520j0181K8129K4567J0934
$$ plain form
1798 -7569 16427 -14425 -23955 9486 1152 -3868 16144 -13675 -49989 -49677 2671 6339 -2865
1785 -2865 -11737 -26710 -27138 -33550 -41750 -36384 -27311 -39038 -25601 -19512 -16551 -6243 -6267 -28834
1771 -28834 -51681 -27221 -15820 -19144 -32868 -39254 -20889 804 -35126 -32302 -48510 -31664
1759 -31664 -12041 -42418 -22425 -30498 -27606 -28106 -25531 -62386 -61103 -27552 -24184 -43932 -48404
1746 -48404 -33080 -24436 -11696 -12027 -23444 -36201 -50398 -32417 -32194 -51697 -57725 -49267 -18076
1733 -18076 -9941 -7016 -30739 -32730 -4227 -28843 -55867 -74662 -49721 -28480 -32332 -47030 -59019
1720 -59019 -35612 -20605 -17773 -45116 -48149 -38443 -33416 -30101 -21112 -26809 -31693 -54802 -42885
1707 -42885 -34283 -53089 -40191 -49972 -29644 -25248 -42971 -64491 -74672 -46543 -21976 -11042
1695a1042M430o437r803n800j4946J4589k4227M410J8547K4348K354r093j6216
1682b8886k021j5753j4597J8469R059r159J2003L176P592J2764k1253l713k3234
1669e5553k9K1368J0165Q439J3961J3435k1100K751L266j3250P940p150l958r678
1655b9393M477j697q121M742j006j1334J3122l54L430k986q949j7332L7723k810
1641b0488l240r727K398Q585r937q859O236k1785M586K2045K7091k3545j4471
1628d1111J0459M89Q947j0485j0135J0346R952l143n486r069m464M045J0404l0633
1614e9884O552J0915M305J3625K7801l8338k9460J7148J6741J2308q419O023J8671
1601b012m2394M482K0776K735O07j4656J5551R89j0736j1784J4170o556J6298
$$ plain form
1695 -11042 -6612 -13049 -22852 -28652 -43598 -29009 -53236 -48826 -30279 -5931 -3577 -12670 -28886
1682 -28886 -30907 -46660 -61257 -42788 -33729 -42888 -30885 -27709 -20117 -7353 -28606 -32319 -55553
1669 -55553 -55582 -34214 -24049 -15610 -1649 11786 -9314 -6563 -3297 -16547 -8607 -15757 -19715 -29393
1655 -29393 -24916 -26613 -34734 -29992 -30998 -42332 -29210 -29564 -26134 -29120 -38069 -55401 -17678 -20488
1641 -20488 -23728 -33455 -31057 -22472 -32409 -41268 -35032 -56817 -52231 -30186 -3095 -26640 -41111
1628 -41111 -30652 -30163 -21216 -31701 -41836 -31490 -21538 -24681 -30167 -39236 -43700 -39655 -29251 -59884
1614 -59884 -53332 -42417 -38112 -24487 3314 -35024 -64484 -47336 -30595 -18287 -26706 -20683 -2012
1601 -2012 -44406 -39924 -19148 -16413 -15806 -30462 -14911 -13922 -24658 -36442 -22272 -28828 -12530
1588a2530J841n422j0197j5990k1531L310L3679m973p016j5023o160K1610N898
1575c2504o629K2137L849l176j5598P01k4909r82J7087o060r005J0634K8846J2398
1561c211k7236L926j0528K6526j4669k4367Q078j346R662p342j0584q836K4843
1548c5084m113J4111K9926O690k0278j1749L810q107P29j573j8202k517Q984j787
1534c9160P986M165J855j66M871j2162Q333j7590j1725R004K1855Q98m0J2193
1520i683p961q972N110J4072l5525q803J9696K1060J2242p770j7170j722L73P41
1506b4312K998r60J796Q920L057J0041j4780o623K6823l393o743m230j6867K4152
1492a21J6752L156k6681m676r600L99q522l212k949M324Q361J1746o257k0383
$$ plain form
1588 -12530 -10689 -16111 -26308 -42298 -63829 -60519 -26840 -31813 -38829 -53852 -60012 -38402 -32504
1575 -32504 -39133 -16996 -13147 -16323 -31921 -31220 -56129 -57111 -40024 -46084 -55089 -44455 -15609 -3211
1561 -3211 -30447 -26521 -37049 -10523 -25192 -49559 -41481 -42827 -33165 -40507 -51091 -59927 -35084
1548 -35084 -39197 -25086 4840 11530 -8748 -20497 -16687 -24794 -24065 -25638 -43840 -46357 -37373 -39160
1534 -39160 -31174 -27009 -25154 -25320 -20449 -32611 -24278 -41868 -53593 -44589 -22734 -21836 -21876 -9683
1520 -9683 -17644 -26616 -21506 -7434 -42959 -51762 -32066 -11006 1236 -6534 -23704 -25426 -25053 -24312
1506 -24312 -21314 -22274 -20478 -11558 -8501 1540 -13240 -19863 6960 3567 -3176 -7406 -24273 -121
1492 -121 16631 19787 -6894 -11570 -21170 -20771 -29293 -32505 -35454 -31130 -22769 -11023 -17280 -37663
1478c7663J8869K097j9516j91Q365K0012p36l0293N343j1806l0560k7056K6034
1465g7101N0246n665l059n995J338q42k490K0142j6885q205J0585Q083j449k0097
1451e1394K249l426L0473j0633m639N793P315J1581J7646l7530j9488K1275J5501
1438a5277J2108j0799M541j5362n682j812k368m208M775k5221R035n168L9464
1425a5974j7790r233J3928Q1J2472r229k4270K9365N601Q985l9894k843K0029
1412b8772n0J0049k3570K778K0760l0332m256J8221n521l04m924J894q721J8754
1398c3994J850Q08J3012r77k300m417K3751j7394r490K4640k0031j696l648J6022
1384a3864k8664j1809Q525K0207j3996n416N038J9838k1035k417J3976k564o406
$$ plain form
1478 -37663 -18794 -16697 -36213 -36404 -28039 -8027 -8763 -39056 -33713 -45519 -76079 -103135 -77101
1465 -77101 -26855 -32520 -35579 -41574 -40236 -41078 -43568 -23426 -40311 -48516 -37931 -29848 -31297 -51394
1451 -51394 -49145 -52571 -22098 -32731 -37370 -31577 -24262 -12681 4965 -32565 -52053 -30778 -15277
1438 -15277 -3169 -13968 -9427 -24789 -30471 -32283 -34651 -38859 -34084 -59305 -50270 -55438 -15974
1425 -15974 -33764 -42997 -29069 -28988 -16516 -25745 -50015 -20650 -15049 -6064 -45958 -48801 -28772
1412 -28772 -28822 -18773 -42343 -39565 -18805 -49137 -53393 -35172 -40693 -40997 -45921 -44027 -52748 -33994
1398 -33994 -32144 -31336 -18324 -19301 -21601 -26018 -2267 -19661 -29151 -4511 -24542 -26238 -29886 -13864
1384 -13864 -42528 -54337 -45812 -25605 -39601 -45017 -39979 -20141 -41176 -43593 -29617 -32181 -38587
1371c8587R939p596k530R228k2364l095K8413Q994r955k5332P593m55J5012J8315
1357a2420O904r89k7287q097j163j2403M230J9781j3874J2407M1095k8768k6963
1344d7547L6363j0004Q783j7109p199k0158J0725N664J6874j1649k1256Q626K8865
1331a9022j1879p788p727j8114J1080L3793K096k8389J880R988l2805J5600P060
1318d4227j4945n174J2517J1848q680k754j7804L4177R165m376j8928K7071o728
1305b8838k559J4739k374J6781r575n748K2405o443k823k9061J3026l087J3299
1292a0258J1885j6079j2006O588Q833r024n578M813j1635k7327N105M476J5077
1279c5130J2574J962J5072j678N248r708M293J2140k8244o15Q253K2561L096j9296
$$ plain form
1371 -38587 -28648 -36244 -38774 -29546 -51910 -55005 -26592 -17598 -27553 -52885 -45292 -45747 -30735 -12420
1357 -12420 -5516 -6505 -33792 -41889 -43052 -55455 -51225 -31444 -45318 -32911 8184 -20584 -47547
1344 -47547 -11184 -21188 -12405 -29514 -36713 -56871 -46146 -40482 -23608 -35257 -56513 -47887 -19022
1331 -19022 -30901 -38689 -46416 -64530 -53450 -19657 -17561 -45950 -44070 -34082 -66887 -51287 -44227
1318 -44227 -59172 -64346 -51829 -39981 -48661 -51415 -69219 -35042 -25877 -30253 -49181 -22110 -28838
1305 -28838 -31397 -16658 -19032 -2251 -11826 -17574 4831 -1612 -4435 -33496 -20470 -23557 -10258
1292 -10258 1627 -14452 -26458 -19870 -11037 -20061 -25639 -20826 -32461 -59788 -54683 -50207 -35130
1279 -35130 -22556 -20594 -5522 -7200 -1952 -11660 -7367 4773 -23471 -24086 -15833 6728 9824 -9472
1265i472j2418m61J1763q844r72J2195J887k2305j1338P006K353K0845j770k2907
1251c4438K1134j0686J4140J9138q668J0439l2631K869o553L846M935J6932J911
1238B368k0680j5297j3253L2028J4790k9025O672R43J4948j972L473k5088J9625
1225a0468p293j0082k819J7518J6369j0424P243m0620L4655K0820N75m333m407
1212F734p907R351r141j2845L023q038n640j339p081r408L793J9999N230J2650
1198f19P164j8590NJ915m09J1504J792m1418K1453J1649j4060p082l426L828K7170
1183H76k4142n488j5096q100P247L4152J3718k8016R431q57j9266j0819J1327
1170c5033L1512k741k4433J3959J3999N811o926J947q01L192k7655J0584K999
$$ plain form
1265 -9472 -21890 -22351 -10588 -19432 -20404 -8209 -6322 -28627 -39965 -32959 -30606 -9761 -11531 -34438
1251 -34438 -13304 -23990 -9850 9288 620 11059 -21572 -18703 -25256 -21410 -16475 457 2368
1238 2368 -18312 -33609 -46862 -14834 -44 -29069 -22397 -21454 -6506 -8478 -5005 -30093 -10468
1225 -10468 -17761 -27843 -30662 -13144 3225 -7199 44 -40576 -5921 14899 15474 11141 6734
1212 6734 -1173 8178 -963 -13808 -10785 -18823 -24463 -25802 -32883 -42291 -38498 -18499 -13269 -619
1198 -619 6545 -12045 -12040 -10125 -10534 970 2762 -38656 -17203 -5554 -19614 -26696 -30122 -26294 876
1183 876 -23266 -28754 -43850 -51950 -44703 -10551 3167 -24849 -15418 -16275 -35541 -46360 -35033
1170 -35033 -3521 -6262 -30695 -16736 -2737 3074 -3852 -1905 -2706 486 -27169 -16585 -13586
1157a3586J4947M567j125j1730K4634m3134P741k223j5211j489K1998J2026J0988
1144H403j6170K9495j25l6970R855q017J1683n614J5229k3324r059r23M0377j7257
1130b417N234j2376j2533Q676m489j3530j2758J6319n931n224m939M3690K124
1117A846l5821J4134J663j1548M844l221K2782J6206m3076o695K5916J3995j5881
1104a4856m253J5651Q55j2684k1047J9086K0502L57L708n804r619p131O739r89
1090i485k8739P634L124P512r10j5046J8940K6024K426k1066R564J280j2628r924
1076b1294J8708K1486r309l0269j567K6751p23r380j6078J1402P057j1054r469
1063b3739K2160j2713j0042K952J4330K5580j7199J2325j3796k26o410K1534P510
$$ plain form
1157 -13586 1361 5928 4803 -6927 17707 -25427 -17686 -19909 -35120 -36609 -14611 -2585 8403
1144 8403 -7767 21728 21603 -15367 -5512 -13529 -1846 -7460 7769 -15555 -24614 -25537 14840 -2417
1130 -2417 2817 -9559 -22092 -13416 -17905 -31435 -44193 -27874 -33805 -39029 -43968 -278 1846
1117 1846 -33975 -19841 -18178 -29726 -24882 -28103 -5321 10885 -32191 -38886 -12970 1025 -14856
1104 -14856 -19109 -3458 -2603 -15287 -36334 -17248 3254 3611 7319 1515 -8104 -15235 -8496 -9485
1090 -9485 -38224 -30590 -27466 -19954 -20864 -35910 -16970 9054 11480 -9586 -22 1258 -11370 -21294
1076 -21294 -2586 18900 9591 -20678 -22245 4506 3783 -5597 -21675 -10273 -3216 -14270 -23739
1063 -23739 -1579 -14292 -24334 -21382 -7052 18528 1329 13654 -142 -368 -6778 14756 22266
1050B2266l289p873j3424j1688L436J6136k82k0298j157k4257K5035J8186j1765
1037h974L221l3626l259O460L894M3714j3186m5228J1784K4672j954O173m516
1024a0825l054n954r171P677J3012J6873l8463j620j6072R305J8497N28j3601
1011c2868M222J1058n004J2037M230P351j058M022p025j0570q384R585N935q13
997g282K0719j7731j6909O995R009j5952m42J3242j0156M620k081j1164P126P362
983a2644j49r093l779J2230K26r634N413j5162Q556K8890Q149K755q418j3014
969e674q592j7876J7894m283o716L965k145j6801J6686L4174l208m169r311l162
955i218j5429J4556q216l112K175j439k3076J9080J5857J7163J3976P392j9564
$$ plain form
1050 22266 18977 11104 -2320 -14008 -10572 5564 5282 -15016 -16173 -40430 -15395 2791 -8974
1037 -8974 -5753 -39379 -42638 -36178 -32284 11430 -1756 -46984 -35200 -10528 -12482 -6309 -10825
1024 -10825 -13879 -19833 -29004 -21327 -8315 8558 -29905 -31525 -47597 -38292 -19795 -19267 -32868
1011 -32868 -28646 -17588 -22592 -10555 -6325 1026 -32 3990 -3035 -13605 -21989 -12404 -6469 -7282
997 -7282 13437 -4294 -21203 -14208 -5199 -21151 -21593 -8351 -18507 -13887 -15968 -27132 -20006 -12644
983 -12644 -12793 -21886 -25665 -13435 -13209 -22843 -17430 -32592 -24036 4854 13003 15758 7340 -5674
969 -5674 -14266 -32142 -14248 -18531 -25247 -21282 -23427 -40228 -23542 10632 7424 3255 -6056 -9218
955 -9218 -24647 -10091 -18307 -21419 -19244 -20683 -43759 -24679 -8822 8341 22317 29709 10145
942A0145l0696k562m090L609q146K6999Q738L417k8142J9677j4085p928k01r05
928b4170P339m709O018k703j2995K9658K884p33J4390j1741j733o761o489n269
914a7014r562l011J3555J5270j6850k3764L3004q817m512J8056k403J586p336
901a1798P378J0015j8590j7498L963J2524j2241K6439j4217N776K982p964j756
888a4987j818N302j4544j23N863j8440J2287j0771J4365Q669P083j6448k2240
875d5802J4909J0365L943N132J1379j3196K9742l3574j1916J5211K1457J2361
863B0011j1062j8272J9220J3964k7231j7608P376j0395J4570K645K4092k7277
851i967J2164J7585m3099P703Q992O328j2283K5985N748J5053k5961j0054K0520
$$ plain form
942 10145 -20551 -23113 -27203 -23594 -31740 -4741 3997 7414 -20728 -1051 -15136 -23064 -23265 -24170
928 -24170 -16831 -21540 -15522 -18225 -31220 -1562 1322 589 14979 3238 1505 -5256 -11745 -17014
914 -17014 -26576 -29587 -16032 -762 -17612 -41376 -8372 -17189 -21701 -3645 -6048 -4462 -11798
901 -11798 -4420 5595 -12995 -30493 -26530 -14006 -26247 192 -14025 -8249 -5267 -13231 -14987
888 -14987 -16805 -11503 -26047 -26170 -20307 -38747 -26460 -37231 -22866 -14197 -7114 -23562 -45802
875 -45802 -30893 -20528 -16585 -11453 -74 -13270 16472 -17102 -29018 -13807 7650 20011
863 20011 8949 -9323 9897 23861 -3370 -20978 -13602 -23997 -9427 -6782 17310 -9967
851 -9967 2197 19782 -23317 -15614 -6622 -294 -12577 13408 19156 34209 8248 -1806 18714
838A8714k7255J73m671j4017Q401K1631Q50n575m888n564J8267j940j2586k463
824a0923J023J1061L2380n592J0124k1774J1668l3228j3346K3854Q944J1509k4131
811A569j4491J1172J879R008Q528k3346P281j5337J2030r450j2465N331L190M934
797a0167o812J2274M439J1533J0746k4671o45K2825k013k676q235J5076k3045
784a371l4222q054K4316j797j446j0920J2533O200M381J925M1442J1271m1448
771B810j2679k273K3121j917j6182l5064K4325J9631m196n943j0773j6894K7690
758h344P82J9169k286K4606k7440p98J3339P057q770j8465j9897J0254K6503o435
744I275N238J3184k1242j2338J5877q044J6051Q297k0663j0208J015P734j4528
$$ plain form
838 18714 -8541 -8368 -13039 -27056 -18655 2976 3826 -1749 -6637 -12201 6066 4126 -8460 -10923
824 -10923 -9900 1161 33541 27949 38073 16299 27967 -5261 -18607 5247 14191 25700 1569
811 1569 -12922 -1750 129 9137 17665 -5681 1600 -13737 -1707 -11157 -23622 -18291 -15101 -10167
797 -10167 -16979 -4705 -266 11267 22013 -2658 -3303 19522 17509 14833 6598 21674 -1371
784 -1371 -35593 -43647 -19331 -21128 -22574 -33494 -20961 -14761 -10380 -8455 32987 44258 2810
771 2810 -9869 -12142 10979 9062 -7120 -42184 -17859 1772 -2424 -8367 -19140 -36034 -8344
758 -8344 -7562 11607 9321 33927 6487 5689 19028 26085 17315 -1150 -21047 -10793 15710 9275
744 9275 14513 27697 6455 -5883 9994 1950 18001 26298 5635 -4573 -3558 4176 -10352
731a0352l781L6575j1485M989o594N29J6585j5505k0240J4777L035j442j1722
718d631j3071K0683p089n767J3025j8853m493J7291J5091R074k2270o50K570k0443
704a9533J5790J6965k388J3648k3853q610J1048R237l861K926J0796j0503j0108
691A554J3445r612j66K9960j4127j825j2322K345J51j0123Q696J3175k4663k377
677e889J2383k7621j271K570p183J8829R487N318n685P132k12K7206M29j0989
663B4504j5902j792q935J0768p447o277K9107o139J2953J1674k1614q642Q227
650B0485N298J2842Q076l1463j4333k822R29j7033N271K2031n991r363j8882n828
636c0783K5876J4711k172Q064j3314k2263J6255J4169L84J323K458J05k3665k896
$$ plain form
731 -10352 -14133 22442 10957 15946 9352 9881 26466 10961 -9279 5498 8533 7091 -4631
718 -4631 -17702 2981 -4108 -9875 3150 -15703 -20196 -2905 12186 21260 -1010 -1660 910 -19533
704 -19533 -3743 13222 10834 24482 629 -7981 3067 12304 8443 11369 22165 11662 1554
691 1554 14999 5387 5221 35181 21054 19229 6907 9252 9403 -720 7976 21151 -3512 -5889
677 -5889 6494 -21127 -22398 -19828 -27011 -8182 1305 6623 938 8070 7858 35064 35493 24504
663 24504 8602 6810 -2125 8643 1196 -5081 24026 17887 30840 42514 20900 12258 20485
650 20485 25783 38625 46701 15238 905 -1917 -988 -18021 -12750 9281 3290 -6073 -24955 -30783
636 -30783 -4907 9804 7632 15696 2382 -19881 -3626 10543 10927 12250 14708 14813 -8852 -11748
622a1748J8885J1502q88N703k153O31k2257n020Q033q753J0032K5017J039n229
608B4794o915q168j9766J5038Q347K984o414n116P075k675j7925k805J3506j3260
594a1300m307r359J2310j9450J4340K5785L882N855q278J6214r605O856j2101
581A0842o613P205M363j4345J0179j0355o854K2381J1246l5829n995P145K273
568d357j6075J0658J3609K221R089K370n709J3905N55o755o906l335K4264k9672
554C862l467j1756j974J7358J1542J3084K622j1794r118n137l574N35Q843K810
540A3836J6418j6981R101N200p97j1782P877o432j9471J6898n074j1640Q066l235
526A984M185J70O631O06j3775J2210K7928q082j6539j3391J0433J684j7796J9943
$$ plain form
622 -11748 7137 18639 17751 23454 21301 21932 -325 -5345 2688 -6065 3967 28984 30023 24794
608 24794 17879 9711 -10055 4983 13330 16314 9900 4784 11859 9184 -8741 -11546 1960 -11300
594 -11300 -15607 -24966 -12656 -32106 -17766 8019 11901 17756 9478 25692 16087 22943 10842
581 10842 4229 11434 15797 1452 11631 1276 -5578 16803 28049 -7780 -13775 -6630 -4357
568 -4357 -20432 -9774 3835 6056 15145 17515 11806 25711 26266 19511 12605 9270 33534 3862
554 3862 395 -11361 -13335 4023 15565 28649 31271 19477 10359 5222 1648 2183 11026 13836
540 13836 30254 13273 22374 27574 26777 14995 22872 16440 -3031 13867 8793 -2847 5219 1984
526 1984 6169 6339 12970 13576 -199 12011 39939 31857 15318 1927 12360 14044 -3752 16191
512A6191J2412J1117j9574j0923L875m821K118J3782k2441J3721J1130r884K150
499A8853j8467l682M0004o153j0269J0482O71k3061r893J0065P337j8990j8582
486b1685J2327N824Q814N56N759j1206J7314K3847j430J2110r594j2037m991o869
472A8739K5094j2321j2913J6K174J1000k4869n392l633J1506L936l905o395J4213
458A7250K8388r943K775j4532j0177j0984j576K2230K9659k0789Q739J3574k5941
445B8673o875J7589k777L283j1035J595k297j9818j3789L0047r083n415L405O812
431B0315R815n460K058k0766J4885K7112p293R291j3524j8405K889k2606K3407
418B1718j0447J4353L0163k1022j7298K481l2317L0297J8464j0182k0183j4858
$$ plain form
512 16191 28603 39720 20146 9223 13098 8277 10395 24177 1736 15457 26587 16703 18853
499 18853 386 -3296 36708 30555 20286 30768 31439 8378 -1515 8550 15887 -3103 -21685
486 -21685 -9358 -3534 5280 5836 11595 389 17703 41550 40120 52230 42636 30599 25608 18739
472 18739 43833 31512 18599 18615 20789 31789 6920 1528 -2105 9401 13337 9432 3037 17250
458 17250 45638 35695 38470 23938 13761 2777 1201 23431 53090 32301 41040 54614 28673
445 28673 21798 39387 36610 39893 28858 30453 28156 8338 -5451 24596 15513 10098 13503 20315
431 20315 30130 24670 26728 5962 20847 47959 40666 49957 36433 18028 20917 -1689 21718
418 21718 11271 25624 55787 34765 17467 19948 -12369 17928 36392 26210 6027 -8831
406h831K6402J0869k2530O234K0670J181l695k3180L727K3063p226K0001M076
393E0761j5871p154q628J5509j8915k658l180k8851K5564o98j03P169L161J7908
379C4014j3106L857M087l562J911j3133k3948L7787J5016j6413J963j6872K5189
366C6790J7231j1266k5690k6762L1611J4534J3106j4634M4l463k8653j5513J171
353a1494K6923Q124j8490j098J3628j1231J0198r766j0314P300L084l917K1524
340B4471J715o026J230j2771N268K9753o724l979K760j7739r254R961J6268j0657
326B4276j2009J1122p860k947K2483J9067j7541n033K9271J3450o0234j3863R665
313I847j5567K0747J0811M191k7810J6841J5484r312k0222q800J2461M246M983
$$ plain form
406 -8831 17571 28440 5910 12144 32814 33995 30300 7120 10847 33910 26684 46685 50761
393 50761 34890 27736 19108 34617 15702 13044 9864 -18987 6577 5879 5776 12945 16106 34014
379 34014 20908 24765 28852 25290 27201 14068 -9880 27907 42923 26510 28473 11601 36790
366 36790 54021 42755 17065 -9697 21914 36448 49554 34920 34964 31501 2848 -12665 -11494
353 -11494 15429 23553 5063 3965 17593 6362 16560 6794 -3520 3780 6864 2947 24471
340 24471 26186 20160 21390 8619 13887 43640 36916 32937 35697 17958 8704 18665 34933 24276
326 24276 12267 23389 15529 12582 35065 54132 36591 31558 60829 74279 14045 182 9847
313 9847 -5720 15027 25838 30029 2219 19060 34544 25232 5010 -3790 8671 12917 17900
300A7900O830m606P847Q18j7385M081J4793n051J58k0442J4897L144p170m010
286A1804l005R745J9846n284l6978j3760J2345K6424J5067J560j3891l651m553
273A5669M1235p369j6527L1118j3267l2448J0495N392P430k8161L213J4481J6346
260D7607K1038k1075k2168n63Q304n736m773l0357J3698N035K0058j0372L219
247B3915k1388J5577K5223j4772R536j4481N685Q419K9370j9701j2977j3368M370
234B5408K07M079J5895j7170J0865j1171R750K194j2932Q791j89k020o816O850
220C3741J4711j331j4771P854r183K5653K294l4347J4445J081j523l1347Q359
207A5636l666K932Q972j7361q757L0294J6054r57k3193j454m595K3014l319j0889
$$ plain form
300 17900 24730 20124 27971 28789 11404 15485 30278 25227 25385 4943 19840 22984 15814 11804
286 11804 8799 18544 38390 33106 -3872 -17632 -5287 21137 36204 37764 23873 20222 15669
273 15669 56904 49535 33008 64126 50859 18411 28906 34298 41728 13567 16780 31261 47607
260 47607 68645 47570 25402 24839 33143 27407 22634 -7723 5975 11010 31068 20696 23915
247 23915 2527 18104 43327 28555 38091 23610 29295 37714 67084 47383 34406 21038 25408
234 25408 25615 29694 45589 28419 39284 28113 37863 40057 27125 35916 35727 33707 26891 33741
220 33741 48452 47121 32350 40204 31021 56674 58968 24621 39066 40147 38624 7277 15636
207 15636 11970 14902 23874 6513 -2244 28050 44104 43147 19954 18500 13905 36919 33600 22711
193B2711P696j4258l928K1n10l79J1084Q954M196l0591R086k195j0540p986j875
178h514J3146L0950n687k3070j438J4726j6785K5711O058p979j1570j810N075
165A8813k9113k57K5888K746m748J152j5171P83J1290l491k879L767P747P603
151B4130J291j7024M724K795L604p580l0506m935P244K8175n41j5375J2208N585
137A3795L678k937l569r759m362r039M026L1835j4259j9794N269j703J6607j7721
123g933O358J2425j5177j6906K0855J7626j4820K0845r908j4746l1320M742K2386
110e573j8248N431J4656p674R585P75r49j055J0389L548j1646j8552n94J8599
96a308N371J1083j1595Q634K887j0181l699J8164J1434k5676k175P194O615j4259
$$ plain form
193 22711 30407 16149 12221 12242 11732 11353 22437 31391 35587 4996 14082 11887 1347 -6639 -8514
178 -8514 4632 35582 29895 6825 5387 20113 3328 29039 35097 27118 15548 13738 18813
165 18813 -10300 -10557 15331 18077 13329 14481 -690 93 11383 7892 5013 8780 16527 24130
151 24130 25421 8397 13121 15916 19520 11940 -18566 -23501 -16257 11918 11377 -3998 8210 13795
137 13795 17473 14536 10967 1208 -3154 -12193 -8167 23668 9409 -10385 -5116 -6819 9788 -7933
123 -7933 -1575 10850 -4327 -21233 -378 17248 2428 23273 13365 -1381 -32701 -27959 -5573
110 -5573 -23821 -18390 -3734 -11408 -1823 -1048 -1997 -3052 7337 10885 -761 -19313 -19907 -1308
96 -1308 4063 15146 3551 12185 15072 4891 1192 19356 30790 5114 2939 10133 16748 2489
82B489q845M060L1908j2873j9037J5218L265m486k9202L997J5688k1658p306K052
68b4730n824j169K7033p058M173N765r370N13J4180M23p642m161p304R778k2972
53b8365k148J5254Q449j2403k0312k516J9002J6324j0981L799P982j6572j8074
40d0561J2557o56l855o958P358K770k26j3131J1100J6737j9700j519k1390n526
26f3000M416M232K158N904O220J4833k369k665M575p626j9833J6232M267k2678
12e5334R747J0102M74L379k0168p264J715M381J3240k99J656O351
0c2020
$$ plain form
82 2489 -6356 -2296 29612 16739 -2298 12920 16185 11699 -17503 -13506 2182 -19476 -26782 -24730
68 -24730 -30554 -31723 -4690 -11748 -7575 -1810 -11180 -10667 3513 3936 -3706 -7867 -15171 -5393 -28365
53 -28365 -30513 -15259 -6810 -19213 -39525 -42041 -23039 -6715 -17696 -13897 -5915 -22487 -40561
40 -40561 -28004 -28660 -32515 -39473 -32115 -29345 -29571 -42702 -31602 -14865 -34565 -36084 -57474 -63000
26 -63000 -58584 -54352 -52194 -46290 -40070 -25237 -27606 -30271 -25696 -33322 -53155 -36923 -32656 -55334
12 -55334 -45587 -35485 -35011 -31632 -51800 -59064 -57349 -52968 -39728 -40027 -38371 -32020
0 -32020
$$ Imaginary data points
##PAGE= N=2
##DATA TABLE= (X++(I..I)), XYDATA
16383i54226j1563K6293K5087P370K140M980J2103J2624P070J8563K1743P149
16371h20667J4573R888K6597J065j0691Q651K6731O833J5513J1707J2836J6867
16359f80097J0274K3412O675P263O025l80k461J3314K1862J8488p913R923J4632
16346e58983M309K7215J8700J117P607O236P872J3653O474P460R119K2958K0297
16333d05966L769Q196J2951P806L318p55J4434J6589K0966O476O887p2q80j660
16319c07941K2424K8124J757M614k843J9170K6632n485N303n550K8289J2864J2106
16306a60536P496O450K2523Q862Q269p078J3340J3085k29J062J5829J0482J825
16293e8620k907L753K7580J6339p47K5896J4197J1922q594J1784R533J4371O398
$$ plain form
16383 -954226 -965789 -939496 -914409 -907039 -904899 -899919 -887816 -875192 -868122 -849559 -827816 -820667
16371 -820667 -806094 -796206 -769609 -768544 -779235 -770584 -743853 -737020 -721507 -709800 -696964 -680097
16359 -680097 -669823 -646411 -639736 -632473 -626448 -626828 -629289 -615975 -594113 -575625 -583538 -573615 -558983
16346 -558983 -554674 -527459 -508759 -507642 -500035 -493799 -485927 -472274 -465800 -458340 -449221 -426263 -405966
16333 -405966 -402197 -394001 -381050 -373244 -369926 -370681 -356247 -339658 -318692 -312216 -305329 -305401 -306281 -307941
16319 -307941 -285517 -257393 -255636 -251022 -253865 -234695 -208063 -213548 -208245 -213795 -185506 -172642 -160536
16306 -160536 -153040 -146590 -124067 -115205 -106936 -114014 -100674 -87589 -87818 -86756 -70927 -60445 -58620
16293 -58620 -61527 -57774 -30194 -13855 -14602 11294 25491 37413 28819 40603 50136 64507 70905
16280G0905o859j136J3149Q800J6458J2861r389M975J4658L613L195J4807J3897
16267A59934k374J248J7852J6299J7336p986k1539j789J8193K7793J9983M90j2806
16254B32634N485Q70R658J2453P960K469j6251J5555L1361K888N353n599J0772
16241C15608l436L185M537R254J5506k074R451l0K688J9052J3595j0615J935L1099
16227D09755J1222l249j0195L813J1768J613j974J5895J7684p149K3592j1535
16215D61240j2149O002J5483q343K0381K0237j6557j6808J2848O593m187J2715
16203D97455K6679l067K06J290l248L550J2943J4719r676K0052k172j3826K4921
16190E69826j1616k435K4219K3895k1205o669L1459K041m953j0940j4332O861
$$ plain form
16280 70905 64046 62910 76059 84859 101317 114178 104789 109764 124422 128035 131230 146037 159934
16267 159934 157560 158808 176660 192959 210295 202309 180770 178981 197174 224967 244950 245440 232634
16254 232634 238119 238989 248647 261100 269060 271529 255278 270833 302194 305082 310435 304836 315608
16241 315608 312172 315357 319894 329148 344654 342580 352031 352001 354689 373741 387336 376721 378656 409755
16227 409755 420977 417728 407533 411346 423114 424727 422753 438648 456332 449183 472775 461240
16215 461240 449091 455093 470576 462233 482614 502851 486294 469486 482334 488927 484740 497455
16203 497455 524134 521067 521273 522563 519315 522865 535808 550527 540851 560903 558731 544905 569826
16190 569826 558210 555775 579994 603889 582684 576015 607474 609515 604562 593622 579290 586151
16178E86151K735K888o667P076K2750K542R67j2685k1175M617J3729J1046O462
16165F20436J3516K2417R408j5923J4018p336J8197j5833k8660J3305n741L3612
16153F71416n881j1694O981q396J5945j857j10J5609l80o664q350K9138j4445
16140F81312M475j5237J3238K2539P880m463j1684N956O831p142q610j8461J3781
16127F90415J4811j9336n11J3447j012k91q463J2891R005J0067N302Q82J73n444
16113G21936j3067l977J726L529J008J4934J4229j5213J5039j1689k8918l268
16101F96269J8751J9408l016j0006J8855J618M339J3785n225j3295j7228j4411
16089G09844L948J364O635P081J1665J4417K278j920N676k3256j0367Q754o303
$$ plain form
16178 586151 588886 591774 585107 592183 614933 617475 618442 605757 584582 589199 602928 613974 620436
16165 620436 633952 656369 665777 649854 663872 656536 674733 658900 630240 643545 637804 671416
16153 671416 665535 653841 660822 652426 668371 666514 666404 682013 681633 674969 666619 695757 681312
16140 681312 685787 670550 683788 706327 714207 709744 698060 704016 710847 703705 695095 676634 690415
16127 690415 705226 685890 685379 698826 697814 697523 689060 701951 710956 721023 726325 727207 727380 721936
16113 721936 708869 704892 706618 710147 711155 726089 740318 725105 740144 728455 699537 696269
16101 696269 715020 734428 731412 721406 740261 741879 746218 760003 754778 741483 724255 709844
16089 709844 713792 715156 721791 728872 740537 754954 757232 755312 760988 737732 727365 736119 729816
16076G29816j474M836j6248J6732J5241J0061m372M586K27k9134N210J027K4699
$$ plain form
16076 729816 728342 733178 716930 733662 748903 758964 754592 759178 759405 730271 735481 736508 761207
$$ [...]
##END NTUPLES=NMR SPECTRUM
##END=
