##TITLE=1H_73-2024
 CDCl3
 8 sc, 
 6.9.2024
##JCAMPDX= 6.0         $$ Bruker NMR JCAMP-DX V2.0
##DATA TYPE= NMR FID
##DATA CLASS= NTUPLES
##ORIGIN= UXNMR, Bruker Analytische Messtechnik GmbH
##OWNER= root
$$ XWIN-NMR		Version 3.5
$$ Fri Sep  6 14:24:45 2024 Russian Standard Time (UT+4h)  she@DPX200
##.OBSERVE FREQUENCY= 200.1318
##.OBSERVE NUCLEUS= ^1H
##.DELAY= (6, 6)
##.ACQUISITION MODE= SIMULTANEOUS
##.ACQUISITION SCHEME= undefined
##.AVERAGES= 8
##.DIGITISER RES= 18
##SPECTROMETER/DATA SYSTEM= spect
##.PULSE SEQUENCE= zg30
##.SOLVENT NAME= CDCl3
##.SHIFT REFERENCE= (INTERNAL, CDCl3, 0, 15.7039)
##AUDIT TRAIL= $$ (NUMBER, WHEN, WHO, WHERE, WHAT)
$$ ##TITLE= Audit trail, XWIN-NMR		Version 3.5
$$ ##JCAMPDX= 5.01
$$ ##ORIGIN= Bruker BioSpin GmbH
$$ ##OWNER= she
$$ F:/spectra/data/she/nmr/H-F/1/audita.txt
$$ ##AUDIT TRAIL=  $$ (NUMBER, WHEN, WHO, WHERE, WHAT)
(   1,<2024-09-06 14:23:50.54 +0400>,<she>,<DPX200>,
      <created by zg, POWCHK disabled, PULCHK disabled
       configuration hash MD5:
       00 E9 B6 7A A2 85 ED C7 34 08 36 98 17 FE 4E 26
       data hash MD5: 16K
       73 FC 23 CF 43 22 29 10 A7 2A 70 BB E9 B3 63 83>)
$$ ##END=
$$ 
$$ hash MD5
$$ 05 A0 2E 44 55 4E AB D4 10 D6 95 4A FF 3A B4 B4
##$RELAX= 
##$RELAX= 
##$RELAX= 
##$RELAX= 
##$RELAX= 
##$RELAX= 
$$ Bruker specific parameters
$$ --------------------------
##$DU= <F:/spectra>
##$EXPNO= 1
##$NAME= <H-F>
##$PROCNO= 1
##$TYPE= <nmr>
##$USER= <she>
##$AMP= (0..31)
100 100 100 100 100 100 100 100 100 100 100 100 100 100 100 100 100 100 
100 100 100 100 100 100 100 100 100 100 100 100 100 100 
##$AQSEQ= 0
##$AQ_mod= 1
##$AUNM= <au_zg>
##$AUTOPOS= <>
##$BF1= 200.13
##$BF2= 200.13
##$BF3= 200.13
##$BF4= 200.13
##$BF5= 200.13
##$BF6= 200.13
##$BF7= 200.13
##$BF8= 200.13
##$BYTORDA= 1
##$CFDGTYP= 0
##$CFRGTYP= 5
##$CHEMSTR= <none>
##$CNST= (0..31)
1 1 145 1 1 1 1 1 1 1 1 1 1 1 1 1 1 1 1 1 1 1 1 1 1 1 1 1 1 1 1 1 
##$CPDPRG= <>
##$CPDPRG1= <>
##$CPDPRG2= <>
##$CPDPRG3= <>
##$CPDPRG4= <mlev>
##$CPDPRG5= <mlev>
##$CPDPRG6= <mlev>
##$CPDPRG7= <mlev>
##$CPDPRG8= <mlev>
##$CPDPRGB= <>
##$CPDPRGT= <>
##$D= (0..31)
0 1.2 0 0 0 0 0 0 0 0.06 0 0.03 0 0 0 0 0.0002 0 0 0 0 0 0 0 0 0 0 0 0 
0 0 0 
##$DATE= 1725618229
##$DBL= (0..7)
120 120 120 120 120 120 120 120 
##$DBP= (0..7)
150 150 150 150 150 150 150 150 
##$DBP07= 0
##$DBPNAM0= <>
##$DBPNAM1= <>
##$DBPNAM2= <>
##$DBPNAM3= <>
##$DBPNAM4= <>
##$DBPNAM5= <>
##$DBPNAM6= <>
##$DBPNAM7= <>
##$DBPOAL= (0..7)
0.5 0.5 0.5 0.5 0.5 0.5 0.5 0.5 
##$DBPOFFS= (0..7)
0 0 0 0 0 0 0 0 
##$DE= 6
##$DECBNUC= <off>
##$DECIM= 24
##$DECNUC= <off>
##$DECSTAT= 4
##$DIGMOD= 1
##$DIGTYP= 9
##$DL= (0..7)
0 120 120 120 120 120 120 120 
##$DP= (0..7)
150 150 150 150 150 150 150 150 
##$DP07= 0
##$DPNAME0= <>
##$DPNAME1= <>
##$DPNAME2= <>
##$DPNAME3= <>
##$DPNAME4= <>
##$DPNAME5= <>
##$DPNAME6= <>
##$DPNAME7= <>
##$DPOAL= (0..7)
0.5 0.5 0.5 0.5 0.5 0.5 0.5 0.5 
##$DPOFFS= (0..7)
0 0 0 0 0 0 0 0 
##$DQDMODE= 0
##$DR= 18
##$DS= 0
##$DSLIST= <SSSSSSSSSSSSSSS>
$$ [...]
##$SUBNAM2= <"">
##$SUBNAM3= <"">
##$SUBNAM4= <"">
##$SUBNAM5= <"">
##$SUBNAM6= <"">
##$SUBNAM7= <"">
##$SUBNAM8= <"">
##$SUBNAM9= <"">
##$SW= 24.0689170037331
##$SWIBOX= (0..15)
0 0 2 0 0 0 0 0 0 0 0 0 0 0 0 0 
##$SW_h= 4816.95568400771
##$TD= 16384
##$TD0= 1
##$TE= 0
##$TE2= 300
##$TE3= 300
##$TEG= 300
##$TL= (0..7)
0 120 120 120 120 120 120 120 
##$TP= (0..7)
150 150 150 150 150 150 150 150 
##$TP07= 0
##$TPNAME0= <>
##$TPNAME1= <>
##$TPNAME2= <>
##$TPNAME3= <>
##$TPNAME4= <>
##$TPNAME5= <>
##$TPNAME6= <>
##$TPNAME7= <>
##$TPOAL= (0..7)
0.5 0.5 0.5 0.5 0.5 0.5 0.5 0.5 
##$TPOFFS= (0..7)
0 0 0 0 0 0 0 0 
##$TUNHIN= 0
##$TUNHOUT= 0
##$TUNXOUT= 0
##$USERA1= <user>
##$USERA2= <user>
##$USERA3= <user>
##$USERA4= <user>
##$USERA5= <user>
##$V9= 5
##$VALIST= <valist>
##$VCLIST= <CCCCCCCCCCCCCCC>
##$VD= 0
##$VDLIST= <DDDDDDDDDDDDDDD>
##$VPLIST= <PPPPPPPPPPPPPPP>
##$VTLIST= <TTTTTTTTTTTTTTT>
##$WBST= 1024
##$WBSW= 4
##$XGAIN= (0..3)
0 0 0 0 
##$XL= 0
##$YL= 0
##$YMAX_a= 243725
##$YMIN_a= -249822
##$ZGOPTNS= <>
##$ZL1= 120
##$ZL2= 120
##$ZL3= 120
##$ZL4= 120
##$ABSF1= 10
##$ABSF2= 0
##$ABSG= 5
##$ABSL= 3
##$ALPHA= 0
##$AQORDER= 0
##$ASSFAC= 0
##$ASSFACI= 0
##$ASSFACX= 0
##$ASSWID= 0
##$AUNMP= <proc_1d>
##$AZFE= 0.1
##$AZFW= 0.1
##$BCFW= 1
##$BC_mod= 2
##$BYTORDP= 1
##$COROFFS= 0
##$CY= 11.3945322036743
##$DATMOD= 1
##$DC= 2
##$DFILT= <>
##$DTYPP= 0
##$F1P= 15.6554695791079
##$F2P= 12.8336369535428
##$FCOR= 0.5
##$FTSIZE= 0
##$FT_mod= 4
##$GAMMA= 1
##$GB= 0.15
##$INTBC= 1
##$INTSCL= 1
##$ISEN= 128
##$LB= 0.24
##$LEV0= 0
##$LPBIN= 0
##$MAXI= 10000
##$MC2= 0
##$MEAN= 0
##$ME_mod= 0
##$MI= 1.114404
##$NCOEF= 0
##$NC_proc= 0
##$NLEV= 6
##$NOISF1= 3.799351
##$NOISF2= 2.8
##$NSP= 1
##$NTH_PI= 0
##$NZP= 0
##$OFFSET= 15.70392
##$PC= 1
##$PHC0= -25993.71
##$PHC1= 12.78748
##$PH_mod= 1
##$PKNL= yes
##$PPARMOD= 0
##$PSCAL= 0
##$PSIGN= 0
##$REVERSE= no
##$SF= 200.130013532006
##$SI= 16384
##$SIGF1= 3
##$SIGF2= 2
##$SINO= 400
##$SIOLD= 16384
##$SREGLST= <1H.CDCl3>
##$SSB= 0
##$STSI= 0
##$STSR= 0
##$SW_p= 3612.71676300578
##$SYMM= 0
##$S_DEV= 0
##$TDeff= 0
##$TDoff= 0
##$TI= <>
##$TILT= no
##$TM1= 0
##$TM2= 0
##$TOPLEV= 0
##$USERP1= <user>
##$USERP2= <user>
##$USERP3= <user>
##$USERP4= <user>
##$USERP5= <user>
##$WDW= 1
##$XDIM= 8192
##$YMAX_p= 0
##$YMIN_p= 0
$$ End of Bruker specific parameters
$$ ---------------------------------
##NTUPLES= NMR FID
##VAR_NAME=  TIME,          FID/REAL,        FID/IMAG
##SYMBOL=    X,             R,               I
##VAR_TYPE=  INDEPENDENT,   DEPENDENT,       DEPENDENT
##VAR_FORM=  AFFN,          ASDF,            ASDF
##VAR_DIM=   8192,          8192,            8192
##UNITS=     SECONDS,       ARBITRARY UNITS, ARBITRARY UNITS
##FACTOR=    0.0002076,     1,               1
##FIRST=     0,             0,               0
##LAST=      1.7004516,     0,               0
##MIN=       0,             -249822,         0
##MAX=       1.7004516,     243725,          0
$$ Real data points
##PAGE= N=1
##DATA TABLE= (X++(R..R)), XYDATA
$$ [...]
1900a09m7J76ok99L20j2l17J66l2J70k97K81P2LK15l91L22k47k1J50L1j86J08
1923E0L17l28j97lL40k14J28j13l1L3Q8q1K30j79j52J71k24K26l9Q5k89L03o7
1946E4j32O7K65l35K47j00r8Q8k04J42o0n6j22L86L4k28M9J52j64r6J42j1q7L83
1970C16k52R2k44j62K25J63j6j01Qk43L70l62J45k03N22k48j16K02R2j3k48J19
1992D6k59K59Q5k00k4P7R4L1l04NK55jM1n35N39l79R7K49k10jq3L01l38K93p5
2017c7k4K39m95L92J16m98O43k22m58M95l77j09L55J19k71K78L7j99k97K68Q2
2038C7j90K41j19K15j80k66K0O84m41l3L26n13J5J68L7k72O8M9R3J88K35k37j99
2061g4L60k05j53j11Q5J2K50o09M41j23J68L10l70J07N19p26R0j45M2L48m19J84
$$ plain form
1900 -109 -156 20 14 -285 35 23 -294 -128 -160 10 -287 -6 66 69 284 -107 215 -32 -53 97 128 -58 50
1923 50 367 39 -158 -161 179 -35 93 -20 -51 -18 70 -11 219 40 -112 59 -165 61 22 107 -182 121 54
1946 54 -78 -11 254 -81 166 66 -32 56 -148 -6 -66 -122 -244 142 176 -52 -3 149 -15 -111 31 20 -67 316
1970 316 64 156 -88 -250 -25 138 122 21 29 -214 156 -206 -61 -264 258 10 -106 96 188 175 -73 46
1992 46 -213 46 131 -69 -93 -16 78 109 -195 -190 65 64 105 -430 109 -270 -173 76 -134 -135 -218 83 -255 38 -37
2017 -37 -61 178 -317 75 191 -307 336 114 -344 151 -226 -335 20 139 -132 146 183 -16 -313 -45 37
2038 37 -153 88 -31 184 4 -262 -242 442 1 -32 294 -219 -204 -36 1 -271 -203 -154 -61 127 362 125 -74
2061 -74 286 81 -72 -183 -98 -86 164 -445 -4 -127 41 351 -19 88 607 -119 -29 -174 -132 216 -203 -19
2083a9J30j52Oj29L1J80J33P1j42O5k72K08o0k2Q4j43K0J44j10K64k24L8k85J05
2107g9J05N6M0J37k95J19l6K80n41L37J12m32J61j62L40n61K47K19p7K05k28N5
2129BQR5j8j44OJ22j7o1l4j08K19q3k34l5K39k78J56N7n2J49K9j7M87n3j79k85
2155b9K15l06K08k4j1j28J0M38k07j7j69J0R5J2O8MO2R8l11r8N9K13k02P1J46
2180B07j43j23K30O6j56j51r3L84k03J9l24J79K19m0J28J44m89O4K08j09K02l4
2202A85j48l80J58q4J27m7L93j40k21J01J4R7n35M26j18K29j72M91o32M22K49
2223D15k42l28P7j53K64J55m32J01K31J18o11P4L68qr1K39k75M0J92k60k07K88
2245d5j06j19P2L57m3J09q7q3k55j3O7L7LM1L26l90M1J42N6M9j05j1k77N07o31
$$ plain form
2083 -19 111 -41 -35 -164 -133 47 180 251 109 174 -98 110 50 28 112 -31 -11 133 23 287 63 101 -184 -79
2107 -79 26 82 122 259 -36 83 47 327 -214 123 235 -197 -36 -198 142 -419 -172 47 -30 175 -53 2
2129 2 10 105 87 -57 -51 71 54 -7 -41 -149 70 -13 -247 -282 -43 -321 -165 -108 -160 -11 18 1 488 435 256 -29
2155 -29 186 -120 88 64 53 -75 -65 373 166 149 -20 -10 85 97 165 169 231 329 18 -80 -21 192 -10 61 207
2180 207 64 -59 171 237 81 -70 -163 221 18 37 -287 -108 111 71 199 343 -146 -82 126 17 219 185
2202 185 37 -343 -185 -269 -142 -189 204 64 -157 -56 -42 55 -480 -54 -172 57 -115 376 -256 166 415
2223 415 173 -155 -78 -231 33 188 -244 -143 88 206 -405 -331 37 29 -62 177 -98 -58 134 -126 -333 -45
2245 -45 -151 -270 -198 159 116 225 138 55 -200 -213 -146 -109 -106 -65 261 -129 -88 54 110 159 54 43 -234 273 -358
2270c58J76J72n3k72J50K37J20L4j30k33r5M10o8k65O1K61k68K51l24kOj63K05
2293a48L82n7L1j00j34L52k36l30M58j50j14P5j22J50k15L12m3Mj88R8J41p6J49
2316B39q7l01L16J38j39j53P4l42L16o6J1RM6RK38l39j06L7k17L31r2j29K14m9
2340d2j78J13r2j72M67l08N35l24K49l30j23K37k1p8J61J89n81K19M2k6M45k05
2362A77j84J04k14J08k4J23p7j54n3J56R8q8m58M46k04J44K02j97j55N42j46J26
2384B72l50R9k4K74l39r9L44k60p2K21r1K3K58l67n5J00p2J68j07N02k70k91p6
2407b12K9K33R9k55m0P7J2L36j80k00L39k64J83k27l72O42k74K65k88K67L8l65
2429a57J83o4m1J89Qj44J5l60L11R1J44j79k7K15l21j5p9M9J73k4j64R8K65k50
$$ plain form
2270 -358 -182 -10 -63 -335 -185 52 172 206 76 -157 -252 158 90 -175 -114 147 -121 130 -194 -196 -190 -353 -148
2293 -148 234 177 208 108 -26 326 90 -240 218 68 -46 29 -93 57 -158 154 111 115 -73 25 166 90 239
2316 239 152 -149 167 305 166 13 87 -255 61 -5 6 15 61 70 308 -31 -137 -100 -317 14 -78 -207 7 -42
2340 -42 -220 -107 -199 -371 96 -212 323 -1 248 -82 -205 32 11 -67 94 283 -298 -79 -37 -63 382 177
2362 177 -7 97 -117 -9 -33 90 13 -141 -194 -38 60 -28 -486 -40 -244 -100 102 -95 -250 292 146 272
2384 272 -78 21 -3 271 -68 -167 177 -83 -155 66 -25 -2 256 -111 -166 -66 -138 30 -77 425 155 -136 -212
2407 -212 -183 50 149 -106 -146 -69 -57 279 99 -101 238 -26 157 -70 -442 200 -74 191 -97 170 208 -157
2429 -157 26 -38 -79 110 118 -26 -11 -371 -60 31 175 -4 -31 184 -137 -152 -231 -182 -9 -33 -197 -99 166 -84
2453h4j74M96m9k31Q3j90K14r3jl13N44j76%n52N09J68k32K86l40M46l08O3j2
2476E4j89K56j50P0l6J36l07J44K58k34K57l46K6J22k5p9PK47j35J80q5J19o07
2499c17L00k7Q1K35k59M2l84N3M04J36k86O6k3jK60j61J24j56j45q7J25j37R0
2522f7k64O73m40J60L24k86k80K06O2j76K3K7k47L32K9P8Q6j06j07J98j3j18l1
2545F3j34O8L03j80k9J8j48M4Q2o6J35k02J92k67j47P14l21k11j44L85q8q7M4
2568B4j9l14j21L74j40K74j85K03J21l52J57j12p8K47j21K89l42j01K60n2j46
2589a34N7J32J55j7R5j95k41K05M7l54J44k5K19J15k27j79p2M59j04K19l75k61
2611c37N56m11J62L52m84r8N37j88J30m73L22J5k8J30j12Kj92J15j17J17l2P1
$$ plain form
2453 -84 -258 238 189 -42 41 -149 65 -28 -29 -342 202 26 26 -526 -17 151 -81 205 -135 311 3 66 54
2476 54 -135 121 -29 41 5 141 -166 -22 236 2 259 -87 -61 61 36 -43 -36 211 76 256 171 290 -317
2499 -317 -17 -44 37 272 13 55 -329 -276 128 264 -22 44 21 20 280 119 243 87 -58 -145 -20 -157 -67
2522 -67 -331 342 -98 62 386 100 -180 26 88 -88 -65 -38 -285 47 76 154 240 134 27 225 212 94 63
2545 63 -71 -3 300 120 91 109 -39 5 87 21 156 -46 146 -121 -268 446 125 -86 -230 155 67 -20 24
2568 24 5 -309 -430 -56 -196 78 -107 96 217 -135 22 -90 -168 79 -42 247 -95 -196 64 12 -134
2589 -134 -77 55 210 193 288 93 -148 57 104 -250 -106 -131 88 203 -24 -203 -275 184 80 299 -76 -337
2611 -337 219 -192 -30 322 -162 -260 277 89 219 -254 68 83 55 185 73 75 -117 -2 -119 -2 -34 37
2633C7J5l04J41j07j0j0N7K86J55j38k94M10l00L50k49j65K45k39J49j40r7J61
2655d7O5j53L0M58m25R8n56N37K5O1n34M26k2k18L05n2J80m63J81J55p9J65j26
2678A1m8J5j40N6K95j02k03J84j24K76l23J00k32L13P0k4m0k9K89l29p2L7j21
2701a41J74k25K35Q6k04K00r3j06n0j01K19J41j75j06QJ16L61j75l9j44j01J61
2723D1j60JJ10J58k58M39k49n7L3p5O1J69p1k38k37L60L6K01m05m7M73m10K82
2746A57j92J38l21L72J20j33n18L06jJ55m22K71J08j08O1K04q7m9j57J50j49J56
2768F1n4K98k76LK4ok3j52M1L34k63N2J83J8k50j90K85j05l9l9K79k47J53j12
2792b5L44j21l29q4O3J54%j17M7M26Q4n60R1L8J39j9j10J24p1k28K91L9n38L69
$$ plain form
2633 37 52 -252 -111 -218 -228 -238 -181 105 260 122 -172 238 -62 288 39 -126 119 -120 29 -111 -208 -47
2655 -47 18 -135 -105 353 -72 26 -530 7 32 93 -441 -15 -37 -255 50 -2 178 -285 -104 51 -28 137 11
2678 11 -37 -22 -162 -106 189 87 -116 68 -56 220 -103 -3 -235 78 148 124 84 55 344 15 -57 -20 -141
2701 -141 33 -192 43 129 -75 125 32 -74 -124 -225 -6 135 -40 -146 -138 -22 339 164 125 -19 -120 41
2723 41 -119 -118 -8 150 -108 331 82 25 58 -17 44 213 142 -96 -333 27 63 264 -141 -188 285 -125 157
2746 157 -35 103 -218 154 274 141 -377 -71 -72 83 -339 -68 40 -68 -7 197 110 61 -96 54 -95 61
2768 61 7 305 29 32 56 50 27 -125 -84 250 -13 39 222 240 -10 -200 85 -20 -59 -98 181 -66 87 -25
2792 -25 319 198 -131 -215 -152 2 2 -115 -68 358 442 -118 -27 11 150 131 21 145 74 -154 137 176 -362 7
2816GR0o5j2N0J0M3l05K43j88k4L19k28P9J49r0o1M8rlm49L74k8l2K09k03J98
2842A22k42k40P50R6o00K25j69q5N5K56m13L49M8K64l38M2j02j84N44n55J42J46
2864A11j69k2j8P7r8p0L32n1K9k67K15k54K9J97l11L30j92J87Q7m5j77J62j48
2887f6R4l1q0L00j79L1j07J42Pp9j05O0O8j05J49k58K35P6n21M25k21L31l25J41
2911a8pj98K95J37K2k03j55rJ28J21Nj5Q7J27o34K46M51m91j97L33l9k28J93O4
2935A5K16n33M58j84K95k42j41j6K62O6j67J71Pk36J48j58j23K90R6l2m16L73
2957A49k01K1jM2L34k53k02O4K27l24J75k24K78kq1R2k41L74l12N6M6N8o2k09
2981a96N4J3J35k8p5J73M5L7l72R0K3P4J0J94l17K63q6j6r1L17m75K42M6J35n21
$$ plain form
2816 7 97 32 20 70 80 123 -182 61 -127 -151 168 -60 19 168 78 17 65 56 53 -396 -22 -50 -82 127 -76 122
2842 122 -120 -360 390 486 -114 111 -58 -143 -88 168 -245 104 152 416 78 120 18 -166 378 -177 -35 111
2864 111 -58 -80 -98 -21 -119 -189 143 92 121 -146 69 -185 -156 41 -270 60 -132 55 142 97 -80 82 -66
2887 -66 28 -3 -83 217 38 69 -38 104 111 32 -73 -13 55 -50 99 -159 76 152 -369 56 -165 166 -159 -18
2911 -18 -25 -223 72 209 231 28 -127 -136 -8 113 118 103 190 317 -317 -71 380 -111 -308 25 -14 -242 -49 15
2935 15 231 -302 156 -28 267 25 -116 -132 130 196 29 200 207 -29 119 -39 -162 128 224 192 -224 149
2957 149 -52 -31 -32 10 344 91 -111 -47 180 -144 31 -193 85 83 2 94 -147 227 -85 -29 17 75 13 -196
2981 -196 -142 -129 6 -22 -97 76 121 158 -214 -124 -101 -27 -17 177 -140 123 37 21 -70 247 -228 14 60 195 -326
3006c26L46K0m3K25l67J54J57o7j03N6j27J44n5K34j73q1N4j05j06J58K29l08
3028h4K03p6j99Q2J97j79p2j47L3L66nr9j32K01j78J18j19J77r9p2J61J26m77
3051b74K15K25o5N1j74MJ37l06M0l9L35j34P0K47l37J4j03m9J01o5Q2J54m3OJ57
3076B49l20J6J18J44r7p3p1K30j89k8j05K22k21LK6L0Q9K41k97J64j88L66j57
3099A52o3j7q9lJ16P7m6k06L89m71L20l02J06L1j38K58Q4j55J1Q5j10O0j78r0
3123a79J35K43k21r5L30k74j3K19o2p0q2j86K7K23J16J21o9j63n1N7j35J57r5
3146f7j05J12M89o94M13j19j92J59p9M1j74K57Nr0K11N5P7j76O9k12J46l33P1
3169a36Q0K2K40l19j0j4J68r0K86j44Kj15j5l5j19J29K62M1j79J58K74k81o8l15
$$ plain form
3006 -326 20 40 -3 222 -145 9 166 99 -4 52 -75 69 14 248 75 -6 48 -57 -163 -5 224 -84
3028 -84 119 43 -156 -74 123 -56 -128 -275 -242 124 119 20 -112 89 -89 29 -90 87 -12 -84 77 203 -274
3051 -274 -59 166 101 152 -22 -18 119 -187 -147 -186 149 15 85 332 -5 9 -94 -143 -42 -107 -25 129 86 92 249
3076 249 -71 -55 63 207 110 37 -34 196 7 -21 -126 96 -125 -122 -96 -66 23 264 -33 131 -57 309 152
3099 152 89 72 -17 -20 96 173 127 -79 310 -161 159 -143 -37 -6 -144 114 198 43 54 139 29 89 -89 -179
3123 -179 -44 199 -22 -117 213 -61 -74 145 83 13 -69 -255 -228 -5 111 232 163 0 -51 6 -129 28 -67
3146 -67 -172 -60 429 -265 148 29 -163 -4 -83 -42 -216 41 46 -44 167 222 299 123 192 -20 126 -207 -136
3169 -136 -56 -34 206 -113 -123 -137 31 -59 227 83 85 -30 -45 -80 -199 -70 192 233 54 212 486 205 137 -178
3193a78j46N02k19J63K49l02J77l22j0j0R3n6K4r4J02j45R8K64j26L8j77J88N4
3216A67j87l27K68K09k44qM11n12L40o4j62K08j29J8j01J50j68P4o5O5Q6o5L88
3239C52m99n1N16m05m9R0J42j56K86m14L30l85J31J37j19K04j35J85l7l28K13
3260Hj38J77r0L7q8j36L55l23K17J36j92J30n3J30k28J20l24K93k56K85r1J10
3282G9k64J77r0rP2p9J98j30J19q7J02j08o0j04J63J98r7j68K48k64J60l19J74
3305h9M7J52j9l15K62j83o9O36k37k28J32q4j58J30K5j75L8J7K24j80k8L6K09
3328A43p9J8n5m8L8L15n50J30J0r8K20l3j39J18J5J62j10r5O0l10L62P5k06j25
3352a82L48n33J81K11J2j50P6J25p3p7m3K32l01j04M56k66J17j0k4K51q3n2j75
$$ plain form
3193 -178 -324 178 -41 122 371 69 246 -76 -86 -96 -3 -59 -35 -129 -27 -172 -74 190 64 102 -75 113 167
3216 167 -20 -347 -79 130 -114 -122 289 -223 117 53 -109 99 -30 -12 -113 37 -131 -57 -122 -57 29 -36 352
3239 352 -147 -198 318 -87 -136 -46 96 -60 226 -188 142 -243 -112 25 -94 110 -25 160 123 -205 8
3260 8 -130 47 -43 -6 -94 -230 125 -198 19 155 -37 93 40 170 -58 62 -262 31 -225 60 -31 79
3282 79 -185 -8 -98 -107 -35 -114 84 -46 73 -14 88 -20 -80 -184 -21 177 80 -88 160 -104 56 -263 -89
3305 -89 -42 110 91 -224 38 -145 -214 422 185 -43 89 5 -153 -23 2 -173 -135 -118 106 -74 -102 -66 143
3328 143 64 82 27 -21 17 332 -218 -88 -78 -176 44 11 -128 -10 5 167 57 -38 22 -288 74 149 -57 -182
3352 -182 166 -367 -186 25 37 -113 -37 88 15 -62 -105 127 -174 -278 178 -88 29 19 -5 246 163 111 -64
3375f4L09l21j1o9k42N28l01J91j01j50L09k16j9K63j3k23M88k22j0kq7O8k16
3398a11M30n47K65M0M0m8mk29J34N7J34j88m6j46j3N04j40L71o19j66P2n2O1L69
3422A68j15n3K8J2J18j31M0Lj2k01J29q0J2j52K01K72l71n9K75Qj62q1K18J06
3446A73L2k07N9M4m1r4nJ59l9j46Q2r2J35p9p9K19j5j58J3L3q5J9M4L12n76O1
3472b31J97J41m64L98r8K60l87L69j27mJ36j92J30l25o9L74N7j81O1N5j91O2M2
3495A3%L84p25J24Q6j8K78l57M03l02K44J13j27R5l88K9K1J3o4M60j25l76N2J22
3519d5K8R4l5Q8O1j60q4J3l33N12k44R5M0O9l10L20oQ6l03J31J21k62J89M8K6
3544A39j85J41k44J45K46l32M3J7j28J7K00p7J56j08J17j29O1l53L20k22L94J32
$$ plain form
3375 -64 245 -76 -87 -156 -398 130 -171 20 -81 -231 78 -138 -157 106 93 -130 358 136 126 124 37 105 -111
3398 -111 319 -228 37 77 117 69 65 -164 -30 27 161 -27 -73 -219 -232 272 132 503 -116 -282 -210 -262 -201 168
3422 168 53 0 28 40 158 27 67 70 58 -143 -14 -94 -82 -234 -33 239 -132 -191 84 92 -70 -151 67 173
3446 173 205 -2 57 101 60 -34 -39 120 81 -65 17 -75 60 -19 -98 121 106 -52 -39 -6 -91 -72 -28 284 -292 -231
3472 -231 -34 107 -357 41 -57 203 -184 185 58 54 190 -2 128 -197 -266 108 165 -16 45 100 -91 -29 13
3495 13 13 397 -328 -204 -118 -136 142 -215 188 -114 130 243 116 211 -177 -148 -127 -114 -178 282 157 -219 -167 -45
3519 -45 -17 77 42 130 191 31 -53 -40 -373 139 -105 -10 30 99 -211 109 103 189 -114 17 138 -124 65 113 139
3544 139 -46 95 -149 -4 242 -90 -47 -30 -158 -141 59 -18 138 30 147 18 79 -274 46 -176 218 350
3566C50n43J74p7L50j0p1k33k20N47m73K45l38K23QK66j77nj7p1N4k5j03R8j38
3590a86j0J46p3q5J61r6J34m5Q9j16L70m12K7K31j19J80L0k32l58M20l97M55K08
3613C22k67j52L0o1K83l61Q3P2J8O7j59j73M13j58o2Q6j87K29n0J33j27r3J38
3636B4K06j49K36j73l0qJ47l11L6p6J60j56l9R0k0J5K04l44J69J22m35M76p5q8
3660a9j20p8M44k23k46J14j7J83j34j8J91o7J76p5k25L21j00k78j50K45K49k52
3682g9j0K08l55N1J03j7J17l14J48K15j86Q3N0j37L10j98J77K5k68L41n14N05
3704B55j91PM4k20K05j0rNj85J59p5k31R5k12K51L06k02j44O0k38L92j50L6J10
3728E8J48j94K12o6m12L77j42J71j69J57j63Q0R3Kj41l32M07n5k83j3J39N9K93
$$ plain form
3566 350 -193 -19 -96 254 244 173 -60 -280 267 -206 39 -299 -76 -68 198 21 16 -1 -72 -18 -43 -146 -48 -186
3590 -186 -196 -50 -123 -208 -47 -143 -9 -54 35 -81 289 -123 -96 135 16 196 226 -6 -364 56 -341 114 322
3613 322 55 -97 -67 -128 155 -206 -123 -51 -33 34 -125 -298 115 -43 -105 -19 -206 23 -27 106 -21 -114 24
3636 24 230 81 317 144 114 106 253 -58 -22 -98 62 -94 -133 -43 -63 -48 156 -188 -19 103 -332 144 69 -19
3660 -19 -139 -217 227 4 -242 -128 -145 38 -96 -114 77 10 186 111 -114 207 107 -171 -321 -76 173 -79
3682 -79 -89 119 -236 -185 -82 -99 18 -296 -148 67 -119 -36 14 -123 187 -11 166 191 -77 264 -250 255
3704 255 64 71 115 -105 100 90 81 86 -99 60 -15 -246 -151 -363 -112 194 -8 -152 -92 -330 62 -88 -52 58
3728 58 206 12 224 158 -254 123 -19 152 -17 140 -23 57 150 152 11 -321 86 31 -252 -265 -126 -67 226
3751B26k29J8q7J91l40K58j46R3k71J32N18o9r3k52n4N1K49m5R4l14K83k71K9
3774b9l6J77j04m2L18l46J02M1l33K79j7j86K95J32k71K1k14k9J90j62q9J28K23
3797D8k05j66J45J06L7QJ4J23mJ74k36k07K73R3J08k53nK1j91K15q3O9l14L07
3821G7k16P2k82M35kk05O3m16M11j04M43l05O6K15k34r7j97K64q7Q1M5k66K39
3844@P1k6l21J39J69k59p7J87p5J53J28j34K05j35K9j85J9J45O9R1m04J3J05K92
3868A99m85R2J09J06K01j71j40K59k06K58j99k25K09J67j54o2J0k81M40k11J31
3889D7J28j06j17J16m30J90J90k9O2J82l21RJ9J56j95O0r9J49k08N73j98j56q4
3912f2m3K49k61K60j38J44l97L81k17J29N6k27j80J89J21j38K31J45j90J12N3
$$ plain form
3751 226 -3 15 -72 119 -221 37 -109 -16 -287 -155 363 294 201 -51 -105 -54 195 150 244 -70 213 -58 -29
3774 -29 -65 112 8 -34 284 -62 40 81 -252 27 10 -176 119 251 -20 1 -213 -242 -52 -214 -303 -175 48
3797 48 -157 -323 -178 -72 -35 -27 -13 110 106 280 44 -163 110 203 311 58 53 74 -117 98 15 84 -230 77
3821 77 -139 -67 -349 86 84 -121 -58 -474 -63 -167 276 -29 37 252 18 -79 -276 -12 -99 -18 27 -239 0
3844 0 71 45 -276 -137 32 -227 -304 -117 -192 -39 89 -45 160 25 54 -131 -112 33 102 193 -211 -198 -93 199
3868 199 -286 -194 -85 21 222 51 -89 170 -36 222 23 -202 7 174 20 -42 -32 -313 127 -84 47
3889 47 175 69 -48 68 -362 -172 18 -11 51 233 -88 -79 -60 96 -99 -39 -138 11 -197 376 178 22 -62
3912 -62 -105 144 -117 143 5 149 -248 133 -84 45 101 -126 -306 -117 4 -134 97 242 52 164 217
3933B17j26p2J3k03L94l72L76k56O5J9L8k11J52q9M5j47K19K9j07j26j55O67m65
3956i5M6qm7Q5J00m2j15L2R7k03L57j66k80L39k87N15l36PQ3j07pK21l26P5K25
3981A63k33J69J16m46J05L91l96R3Q0j91J32J69j3L9j97R4L16o22K12N3M6k14
4003a34j26N01k66k2P3m6J58k76O9K74j17k6k85J15j30L21j35J22j45R3M4p8J00
4026H4m13M64j47k45J27J12K46j23j13K79o24N54L8l54J66J0N65o80M5j44K23
4047G0P8o35N63N9Ol66K36l44K05L36k63K06l67K17pj00P0m3jK40k75J73k16J68
4071A0K0l01P9K04k00J14K68l43l2R0K40j49j14RJ03J00K60j46m07J56O9j13K6
4094e7N1J44r3M2J66k87l11L03K3Nk03K93K5po2j83J69j7j3L21j69j75P2k44K09
$$ plain form
3933 217 91 19 32 -171 223 -149 227 -29 36 55 93 -118 34 -55 -10 -157 62 91 -16 -142 -297 370 -95
3956 -95 -49 -57 -104 -19 81 39 -76 -44 53 -150 207 41 -239 100 -187 328 -8 -1 82 -25 -32 189 -137 -62 163
3981 163 -70 99 215 -231 -126 265 -131 -38 42 -149 -17 152 139 178 -19 75 391 -231 -19 34 80 -134
4003 -134 -260 241 -25 -47 26 -20 138 -138 -69 205 88 62 -223 -108 -238 83 -52 70 -75 18 62 -16 84
4026 84 -329 135 -12 -257 -130 -18 228 105 -8 271 -353 201 239 -115 51 61 626 -54 -9 -153 70
4047 70 148 -487 76 135 141 -225 11 -333 -128 208 -55 151 -216 1 -6 -106 -36 -79 -80 160 -115 58 -158 10
4071 10 30 -271 -192 12 -188 -74 194 -149 -181 -91 149 0 -114 -105 -2 98 358 212 -195 -39 30 -83 -57
4094 -57 -6 138 45 87 253 -34 -345 -42 -19 -14 -217 76 101 94 32 -151 18 1 -12 309 140 -35 37 -207 2
4119BJ38l55M38k12k34J56L07j09l11R9L5K97k67Q3j41j76L15l6n4j05J21P8m3
4142B6K55l15Q3L6k74J09j71J51j36K68J70l51Q1J08M3P3m60J88K13Q4m49N8J81
4165b9k72J16Q8M4P2J86k10q4j53J16J67n5j11l62N37k10R8K19j76r5J09L28m24
4188a01k3P9J39J94n13K05J01Q5k67K7K12j50J80m14N07k64j07K22Jk94J24J82
4210A25j31r2K02j98k1J90o0J76l24K56J03j7p4m0J39k97m0l4jJ1K00o7j50K39
4234I5O0m37J46MK72p1k89r4L94M3o5j45K34P4l87J98j21n4J66K9o1N3r0j37M07
4259B24l46K98Rp1k86L7M67l06k5P1o9k75L79j94J00R5o15K96J81L02k56M9m6
4282A9L15k55j91J12q6l0j07L43l66L68j34p4k6L6Q6p5q2j19M53jk58j63J11L17
$$ plain form
4119 2 140 -215 223 11 -223 -67 240 131 -180 -81 -46 251 -16 67 -74 -250 65 29 -25 -130 -9 69 26
4142 26 281 -34 49 85 -189 -80 -251 -100 -236 32 202 -149 -68 40 83 156 -304 -116 97 181 -268 -210 -29
4165 -29 -301 -185 -97 -53 19 205 -5 -89 -242 -126 41 -14 -125 -487 50 -160 -62 157 -19 -114 -5 323 -101
4188 -101 -124 -45 94 288 -225 -20 81 166 -101 -74 138 -12 168 -246 261 -3 -110 112 113 -181 -57 125
4210 125 -6 -98 104 -94 -115 75 15 191 -133 123 226 209 135 95 234 -63 -103 -137 -138 -127 73 6 -144 95
4234 95 155 -282 -136 -132 140 69 -220 -314 80 123 58 -87 147 221 -166 32 -89 -143 23 52 -9 44 -46 -183 224
4259 224 -122 176 185 114 -172 -135 332 26 1 72 3 -272 107 -87 13 108 -507 -211 -30 272 16 65 19
4282 19 334 79 -112 0 -86 -116 -223 120 -246 122 -12 -86 -112 -76 10 -65 -147 -266 187 186 -72 -235 -124 193
4306A93j27k43J6J68Nq1o1K50j46K0k14R1L11n17L51k18L99J21k58n5O0j69r2
4329a96Q5r3K73k8k22J15j33M51j64j01k1J54r9L5J66o22M78q1P8q4o6K05j18
4352A2J12J43j60R0m11K86R6l30oK74j56K8J34L4m1j40K3J09l77K52K0K70j67
4375I5j6j11R5R2k4j39j14J87Q5k11J3r0l7J00m4L77j59j46K62l80J85k9L55m45
4399i9J25Q7J64n3qk36k53K01l1J5R6J31o6q9nl15J81J76m78Q07n7m03M71l29
4423C2M9pl72M24Nk74m3j32M37q2p6j61L82k9k34Nl5K40j19K72P3p38K99O7j22
4448a39J79j00p5M24k16j00P6n9L03k53m5J56j2j82L66l64PJ24M0L9k77J99N3
4471A44p2j10nK64j69J07k22o0L86k80L42k48nj2J22k78JM59p30L87k00L15l7
$$ plain form
4306 193 66 -177 -161 7 12 -69 -130 120 -26 -6 -220 -129 182 -335 16 -202 197 318 60 5 65 -104 -196
4329 -196 -111 -204 69 41 -181 -66 -199 252 88 -13 -34 120 21 56 222 -400 78 -3 75 -9 -75 130 12
4352 12 124 267 107 197 -214 72 168 -162 -168 106 -50 -22 112 146 105 -35 -12 97 -280 -28 -8 262 95
4375 95 79 -32 63 155 131 -8 -122 65 150 -61 -48 -138 -175 -75 -119 258 99 -47 215 -165 20 -9 346 -99
4399 -99 26 113 277 224 216 -20 -273 -72 -103 -88 8 139 73 -16 -21 -336 -155 21 -457 350 293 -110 361 32
4423 32 81 74 -298 126 131 -143 -186 -318 119 37 -39 -200 182 153 -81 -76 -111 129 10 282 355 -383 -84 -17 -139
4448 -139 40 -60 -135 289 73 -27 49 -10 293 40 -5 151 139 -43 323 -41 -34 90 130 169 -108 91 144
4471 144 72 -38 -43 221 52 159 -63 -123 263 -17 325 77 72 60 182 -96 -95 364 -366 21 -179 136 99
4494I9n7o4k1k49J26K42J40m90K12r0K27R6k65j9N3Q9J03l00K49J0M9l47K41q8
4518e4K45N0m44K23J7q5j25L49k39j02J44oK89k5k46J44l47N59l34J18k1k6j30
4541d6L69l44R5p1J21P2l2j54M5J15J62p7n55M50k64L43m51K71L0k98M51J48l18
4564F2l6nK74l16j31j66M99m1O0j24k74J53J04P1L37n42o3K24j39m0J92J86N5
4587C40l16n2K36K5k05r2J65p1j56j06L84K7o7q9K9J7J7k05N9R7N2q1k46J75J56
4612I3j26j96K01J14lk22J47r8L18m00K22J37pk86J41r2K87j55r3n8M15m47j48
4635b56K35J51lk7k51j68J61Q2K01n8k54L91l98L78j27j37N96l80l51O8J17L8
4657HO6J28j67j59j9oQP7K08j00j67p1L87j50k98P5L71l24j81M05j93m3K73k73
$$ plain form
4494 99 42 -22 -43 -292 -166 76 216 -274 -62 -152 75 171 -94 -113 -60 29 132 -168 81 91 140 -207 34 -54
4518 -54 191 241 -203 20 37 -48 -173 176 -63 -165 -21 -27 262 237 -9 135 -212 347 13 131 110 84 -46
4541 -46 323 -21 74 3 124 196 164 10 55 170 332 255 -300 150 -114 229 -222 49 79 -219 232 380 62
4564 62 26 21 295 -21 -152 -318 181 140 200 76 -198 -45 59 130 467 -75 -138 86 -53 -93 99 285 340
4587 340 24 -28 208 233 28 -64 101 30 -126 -232 152 179 112 23 52 69 86 -119 -60 37 89 8 -238 -63 93
4612 93 -33 -229 -28 86 83 -139 8 -90 228 -172 50 187 180 -106 35 -57 230 75 -18 -76 339 -108 -256
4635 -256 -21 130 127 100 -151 -319 -158 -76 125 67 -187 204 -194 184 57 -80 516 136 -215 -147 -30 8
4657 8 74 202 35 -124 -143 -149 -141 -64 144 44 -123 -194 193 43 -255 -180 191 -133 -314 91 -102 -145 128 -145
4681a45k6L6J9M4J78Pk33p6J84j83L01K11j45j41k17M14k43o7K10l67L80j12m00
4704c71N39p2k42J3K83%l59J03K59P1n76O14j54j90K37J15k53q6J03k10K81k58
4726a53K14m7k08L14k89j8p9M94Q3l09KQ2j9K1k26K37j9j57K63j43l23L61L50
4749D31m74p8N6j02M29o48L48q8J71J86p8lk27rk88L54j96K12K49M5n8k24L8j84
4773a38K72k27k3J19Q2J55r8m60J82J96L07O2l32j88j28L31K43N0j93k75r0N9
4795i4L43nn2l08R1k5p0l8r3K75q6j75j7J86l8n4K87j94J69j40j26K41j55K5Q
4820d5r6j50M15q6l4p7j35J00L52n54J58J38K7j97J35q8K70q6J20k22qq8L29j04
4844G4Jj61L52pl33O9m5q7K57j40j7P1o7l1k63M92k48L1J0K94k10K08k83K81j01
$$ plain form
4681 -145 -171 -135 -116 -72 106 113 -120 -196 -12 -195 106 317 172 31 -186 228 -15 -82 128 -239 141 29 -371
4704 -371 168 96 -146 -133 150 150 -209 -106 153 224 -352 262 108 -82 155 270 17 -69 34 -176 105 -153
4726 -153 61 14 -194 120 -169 -187 -266 228 311 2 4 86 67 88 -138 99 80 -77 186 43 -280 81 431
4749 431 -43 -121 -65 -167 262 -386 -38 -126 45 231 153 150 -77 -86 -374 -20 -216 -4 245 290 232 8 46 -138
4773 -138 134 -93 -116 3 85 240 142 -318 -136 60 367 429 97 -91 -219 112 355 405 212 -63 -153 -94
4795 -94 249 244 192 -116 -25 -50 -120 -158 -251 24 -62 -237 -254 -68 -106 -160 127 -67 102 -38 -164 77 -78 -53 -45
4820 -45 -141 -291 124 38 4 -73 -208 -108 244 -310 -152 -14 13 -184 -49 -137 133 47 167 -55 -63 -151 178 74
4844 74 75 -86 266 259 -74 -5 -50 -137 120 -20 -37 34 -33 -64 -327 165 -83 -52 -42 252 42 250 -33 248 147
4869A47R6k45l4L9K00k61J02k12j13J93K26p2N0k49J65K37n12J75L16j79jM4j02
4892A0J50J64m42J10K18l52k6O9LO3M1R6p1j00J38J13l29J80r2o4k2M82k22m6
4916G1K55j80l71L1J87L13j40l96N78o21J23J09q1j06L97j53k08J49J23m65N97
4937B12l51L51m16K34M1o5K16m08L36J65j32l5k15r7N0n1K18K27k53J99k75J4
4959c5Nn4K26k9J38k6k29K42K0o92N96k96N38o64K56K66J4k15k03Q2K88m36K56
4982D8L24j12o0m06P3r4l3M48J96j53j8p8l40L40k80K85Q3k24J48k80K28K26m10
5005h9mJ72j7k37K86l58L17k42M80m08J2L57l05k6r6M83k18j21K03m3r3p8J67
5028A42m7n9J7j1P9n6K9K2R5j25k6j36J14j11J61j20J27mk02l1M5J57J83l45l1
$$ plain form
4869 147 243 -2 -36 3 203 -58 44 -168 -281 -88 138 66 116 -133 32 269 -243 -68 248 69 68 112 10
4892 10 160 324 -118 -8 210 -142 -168 -99 -96 -33 8 104 33 -67 71 184 -145 35 -57 -121 -143 339 117 71
4916 71 326 146 -225 -194 -7 306 166 -230 348 -273 -150 -41 -122 -228 169 16 -192 -43 80 -385 212
4937 212 -139 212 -204 30 71 6 222 -186 150 315 183 148 -67 -164 -114 -165 53 280 27 226 -49 -35
4959 -35 -30 -84 142 113 251 225 -4 238 258 -434 162 -134 404 -260 -4 262 276 61 -142 -60 228 -208 48
4982 48 372 260 200 -206 -133 -227 -260 188 384 231 213 135 -205 135 -145 140 223 -1 147 -133 95 321 -89
5005 -89 -93 79 62 -175 111 -247 70 -172 308 -100 -88 269 -36 -62 -158 325 107 -14 189 146 53 -25 142
5028 142 95 36 53 42 121 65 94 116 211 86 60 -76 38 -73 88 -32 95 91 -111 -142 -97 60 243 -102 -133
5053a33N3R9k95K33j8K95j71OL54o69R5o2j50M70j63J6J08j64K06O3k5p8Rl27
5077b48K87J65j40J89l26J42k72j55L37l9L31j99j8n0j87L60K0Q0k89j1K0K62
5099B59j72M7r9p3j24L86n2k63J38j9O2R1j40Lj8P2L72m33qq9L29j27k3J00j94
5124B5J3k32K56r0J9Pr3l6O3J64K79k64O2j11O0j39J98K5k83k10K09j3K81j1k48
5149f9K39j24j63K33j68o3J13J19N5l34J32O4m5RQ9l8j28J09j21k3J02j6j60J68
5173b0K56k81L3q5K82o51L24K26k63L01j12k15J32J04l8k11J36L00j06m30J74
5194a44R9Q4K14m13m7L74q2j6j59J63K02j20l59J76O5j59J96M3J8r0l3J00L1k17
5218g4J39j21J38k0n8P0j84Q4P0j8L6K8Mk17k1J35J35o6k64L29j25j03L25l25
$$ plain form
5053 -133 -80 19 -276 -43 -61 234 63 69 423 -246 -151 -213 -363 107 -56 -40 68 -96 110 173 148 70 79 -248
5077 -248 39 204 64 253 -73 69 -203 -358 -21 -60 271 72 54 4 -183 177 197 277 -12 -23 -3 259
5099 259 87 134 35 -38 -162 224 172 -91 47 28 90 181 41 44 26 98 470 37 29 -60 269 142 119 219 25
5124 25 38 -194 62 -28 -9 -2 -95 -131 -68 96 375 111 173 62 122 -17 181 206 -77 -287 -78 -91 190 179 -69
5149 -69 170 46 -117 116 -52 -115 -2 117 172 -162 -30 34 -11 -2 87 49 -79 30 -91 -114 -12 -28 -188 -20
5173 -20 236 -45 -12 -97 185 -466 -142 84 -179 122 10 -205 -73 31 -7 -218 -82 218 112 -318 -144
5194 -144 -45 39 253 -160 -207 167 85 69 -90 73 275 155 -204 -28 37 -122 74 117 135 45 12 112 143 -74
5218 -74 65 -56 82 62 4 74 -110 -26 44 26 62 90 94 -123 -144 -9 126 60 -204 125 0 -103 222 -103
5242a03j14J74j50J63j74L05k42M89j16l99M63j71m5j68j12L04k3K14m97r6L96
5263I8K45k53j07P0J03O7o33L54M0o5J10K55k99J20l17K54k9j94K63N9m23J99
5285h3j55J21l24K64R2P4l5j47M08j71k32L25m99J23L64j76J64k01K51J46l34
5306b5J00l42M68j77m9j59J97OK4M3j97j61p5M11j06J72L0J1j33j06L1l7J03l6
5330gJ44j44J14m29L02N4P7l6l4q8J44j36J23j79m1K24p1k23Q7J35j91K55l55
5353b75K98J91l25J98Nk34P9K8J53Q1j54k64q2J24K71n0k2k37K31K7r3j54L19
5376A15j27Q1K27k09o7J6J24k02M8P8n9l18K90k29L47R7j70k37k2Q9K02n8j83
5399a67J86j0J32k19L01p5j72J62N2Q8m44M36k54j69K79l70P19m67Q1Nj33L37
$$ plain form
5242 -103 -217 -43 -193 -30 -204 101 -141 348 232 -167 296 125 80 -88 -200 104 81 295 -202 -298 98
5263 98 343 90 -17 53 156 223 -410 -56 -16 -81 29 284 -15 105 -212 42 13 -181 82 141 -282 -83
5285 -83 -238 -117 -441 -177 -85 -11 -46 -193 215 44 -188 137 -362 -239 125 -51 113 -88 163 309 -25
5306 -25 75 -267 201 24 -25 -184 13 19 43 86 -111 -272 -347 64 -42 130 160 171 38 -68 -37 -74 29 -7
5330 -7 137 -7 107 -322 -20 34 111 75 41 -47 97 -39 84 -95 -136 88 17 -206 -119 16 -175 80 -275
5353 -275 23 214 -111 87 92 -142 -63 -35 118 199 45 -219 -301 -177 94 44 22 -215 16 43 -50 -204 115
5376 115 -12 69 296 87 20 36 160 -42 6 84 25 -293 -3 -232 115 212 42 -195 -217 -128 74 16 -167
5399 -167 19 9 141 -78 223 148 -24 138 190 278 -166 270 16 -153 126 -244 475 8 89 94 -39 298
5421B98l53o5L09k92r1J09j04K99n3q8m7r7J73J71j81O1k27K29j8j55K93k48l3
5444a10K91k12J91m13K94j11r8K96k01J40o1oR9n0K30l22K59j69lN3J48q0m68
5467c03L10P9k41N7j06L03j76J20m82M81k1L13m27J98k51l7M59m28O0J57j70J72
5489F7jk18K07q0J29j00O8j56P9K42k32j22K3K09l03Mm2J08R9j3Q5Q0k1k03O3
5514b8j25K14Mm7N7m29L42J1K9p5L8N1K3P9k61K10L2k73m2K37m63J27L96k02k1
5539a16M4j73Q3K03k9O0n5J7J06O1k22o1k5l5K84m19L19K99n75L40l29L38j45
5562c0m4L64l30q9L84l30RJ59j82OK65k6N8l19j53K28K05k72o3M66k76m8K02k70
5586h6l30K48J96N7k51J96q8J2m3j54K6L82k56o9J03J82m51L97j85K02p5J06K44
$$ plain form
5421 298 -55 -120 189 -103 -194 -85 -189 110 57 -31 -78 -175 -2 169 -12 49 -178 51 33 -122 171 -77 -110
5444 -110 181 -31 160 -253 41 -70 -168 128 -73 67 6 0 99 49 279 -43 216 47 44 97 245 165 -303
5467 -303 7 86 -155 -98 -204 99 -77 43 -439 42 21 334 -93 105 -146 -183 276 -152 -92 65 -105 67
5489 67 66 -152 55 -25 104 4 72 -84 -5 237 5 -117 -94 115 -188 -184 -226 -118 -19 -32 53 133 112 -91 -28
5514 -28 -153 61 65 18 75 -354 -12 -1 28 -47 -9 42 65 144 -117 93 125 -148 -190 47 -416 -289 107 -95 -116
5539 -116 -72 -245 -162 41 12 72 17 34 140 201 -21 -82 -107 -142 142 -277 42 341 -234 106 -223 115 -30
5562 -30 -74 290 -40 -129 255 -75 -66 93 -89 -83 182 156 214 -105 -258 -30 175 -97 -160 306 30 -18 184 -86
5586 -86 -416 -168 28 85 -166 30 -58 -46 -89 -243 -217 165 -91 -160 -57 125 -326 71 -114 88 13 119 363
5609C63l35l31L85K42m92q4M08l25J89j5j55J7j1J7l2L4L16j61nk18N4L66l92
5632a65K0J86K1K2M3j57L83k32j60kL3K27j70J8K7j15K37l38PlJ69m6K36k4k98
5657h1R8l42L69j71J07j39j69K72J58k36J47p5n0J62J94m15L63r2NK75m53M5L1
5680Cp0M5m5J13R4k07P4J3J65l51L54j01l2P1j64j35K49r9j68k9N0J25j01Q6j5
5705g5L57k6m8k75L0K01j0j96J72k8JN5k64K45M9j56K3O2m4j29r9J46J09mJ96
5730B92k87K6j55N9j03l30P17j48L2k9Nqj68K6R3j71M7P9L71m86%N0o6k81L70
5755f5K44j18j28qRj82J62O3k28O29n98j05K22L5J3k06K83n0k56J39J23L16l74
5778h0Oo4J71M0j41J68k53L33k20K00m9O3j95n9r8L59j85J26n9j77L24l54K5o5
$$ plain form
5609 363 28 -303 82 324 -168 -252 156 -169 20 5 -150 -133 -144 -127 -159 -125 191 30 25 -193 -139 227 -165
5632 -165 -145 41 62 84 127 -30 353 121 -39 -41 -8 219 49 67 94 -21 216 -122 -115 -118 51 5 241 217 -81
5657 -81 17 -325 44 -127 -20 -159 -328 -56 102 -134 13 -62 -112 50 244 -171 192 100 105 380 -73 -28 3
5680 3 -67 -22 -67 46 140 -67 7 20 185 -166 188 87 55 126 -38 -173 76 -23 -191 -220 -170 -45 -146 -60 -75
5705 -75 282 256 208 -67 -37 164 154 -42 130 102 103 158 -106 139 188 32 55 117 73 -56 -155 -9 100 96 292
5730 292 5 31 -124 -65 -168 -498 219 71 103 74 79 71 -97 -71 22 -149 -102 -23 348 -138 -138 -88 -154 -435 -65
5755 -65 179 61 -67 -75 -66 -248 -86 -23 -251 378 -220 -325 -103 -68 -55 -261 22 -28 -284 -145 -22 294 -80
5778 -80 -74 -138 33 73 -68 100 -153 180 -40 160 111 174 -21 -80 -178 181 -4 122 63 -114 210 -144 -119 -184
5802a84J83m5o8N0o7Q3J67l0OJ07k29j20K64R1l72j67K14M37k35j18o0K01L5l99
5826b56L17p5K59n43J80J75j6k56Q8J04q5J83J37o3l20j3K43L26k68k20J68m4
5848B1k58J95O7q4n8L73n98N37j47pq8j71M76J17l46j56K8L14k42j26O8L25k13
5871B7o7P7j57O2L3J38l26J84J0M1j34J54P5r7j7j95K00J5M24n17o7M29j16m07
5895b31L79k53J58l34K72J28j86o5J70q2j36J07O8j86L45j67j51K74m85M62j21
5916c4k41K28OK22n6%N1k23K6K3L76n47K13M6j54J40k04K88k77k33P6K07lJ53
5940H3j98R8J83k96K37n4J11k5m15M63j57J71j73O3Pj66J11k38J76J20j45n3J74
5963G7k36N9K11m7l96N65k97M3n9r9K43j93k2p0J17N3K03J52k11j42J50j74L67
$$ plain form
5802 -184 -1 -46 -114 -64 -131 -48 119 89 95 202 -27 -147 117 208 -164 -331 -117 320 85 -33 -93 108 143 -256
5826 -256 61 -14 245 -298 -118 57 41 -215 -127 -23 -108 75 212 149 -171 -184 59 385 117 -103 65 21
5848 21 -237 -42 25 -59 -117 256 -342 195 48 41 -47 -218 258 375 29 -127 -99 215 -27 -153 -85 240 27
5871 27 -40 37 -120 -58 -25 113 -213 -29 -19 22 -112 42 117 20 3 -192 8 23 447 -70 -137 292 176 -231
5895 -231 148 -105 53 -281 -9 119 -67 -132 38 -44 -180 -73 -5 -191 154 -13 -164 110 -375 87 -34
5916 -34 -275 -47 -41 181 125 125 176 -47 -21 2 378 -169 44 90 -64 76 -128 160 -117 -350 -274 -67 -70 83
5940 83 -115 -17 166 -130 107 53 164 139 -276 187 30 201 28 91 98 -68 43 -195 -19 101 -44 -97 77
5963 77 -159 -100 111 64 -332 233 -64 -21 -80 -179 64 -129 -151 -221 -104 -51 152 304 93 -49 101 -73 294
5986B94k42l89J86J60J8k25J41L28k87j31Q1Q6j29J70k18L84j46j35q2J52R4J28
6008B38j72m61L37J78n8k23K95N6l34K02o7J93j45j27R5R7j33J99n4l23M94m32
6030a45R9K64l81l4M20j99j74K39J73k22K3K44kl03p5M83L2k71l73J94K3M8l4
6053B9R0k43M09j4k83J61j97m6J33Q7j6J24j25jk19L72j38k48K3n0J31J28L6O2
6077B05j68n0n6NK42k10J6k92K55q9K1L38Qj22l8qk96J89j33M74m80L80j4l75
6101a98M52m14J10n1L47r9k64j47L17j39J26p3K35p9m68M05N3k06J3K0J66j1J2
6124A07J04Mn6k82o4K32O1k68Q6K9r9J14J33j79j16L38m06L32j60J87k70J15o0
6147a18k16M23j71L00nk38P8m0J2j3J76j01j08p1K8K99mr7j66j26J99K25m22N3
$$ plain form
5986 294 52 -337 -151 9 27 -198 -57 271 -16 -147 -66 20 -109 61 -157 227 81 -54 -136 16 110 238
6008 238 66 -395 -58 120 62 -161 134 190 -144 58 -9 184 39 -88 7 104 -29 170 116 -207 287 -145
6030 -145 -46 218 -163 -197 223 24 -150 89 262 40 63 307 305 2 -73 410 442 171 -202 -8 15 63 29
6053 29 119 -124 285 271 -12 149 -48 -94 39 126 110 234 109 108 -111 261 123 -125 -102 -152 -21 107 143 205
6077 205 37 -13 -69 -64 178 -32 -16 -308 -53 -142 -121 217 225 103 65 57 -239 -50 -183 291 -189 191 177 -198
6101 -198 254 -160 -50 -101 246 147 -117 -264 53 -86 40 -33 202 123 -345 60 113 -93 -80 -60 106 95 107
6124 107 211 215 159 -123 -187 45 106 -162 -76 -47 -146 -32 101 -78 -194 144 -262 70 -90 97 -173 -58 -118
6147 -118 -334 89 -82 218 213 -25 53 13 25 12 188 87 -21 -92 -64 235 231 134 -32 -158 41 266 -156 -103
6171a03P7k27J71J40K3N7l87K94k8K05l45N8J11j04l6r5J20l76L09K47j59J55
6193A07l60K94m5P4J38j80N0J60l24N8r5L6M42m04j64L48l38L09m3j12K60j68
6215D3J4j25J48K7K7k35K07k47LK97j99k54R6M13j84j42L6Mk04K19k0j67J06q1
6239b18K16Q8J8j36q0K62k65J89o4l62M99k40j7J06l33J64J35n7N4J99m02J68
6261g6L8J12J41k12j12J94q4J60j30l00J87j33Kr1L94j85j7K46j73K6R3m08R8
6284b30M5J37j92M6J2N57n19q1L14l26J44l7K68l82L24k92K66J23l94K71K75l78
6306d9M49l21l9o4K17m3j8j59L87o23J21n8j38N96j56l5Q9m5l3o3k05K62J18j63
6330B7k26M24k15M00m25k17J46J63k56M15l90O4N19k24j21J08L9k89Q1k17J93
$$ plain form
6171 -103 -26 -253 -82 58 81 138 -249 45 17 222 -123 -65 46 -58 -94 -189 -69 -445 -136 111 -48 107
6193 107 -253 41 -4 70 208 28 78 238 -86 -28 -123 -87 355 -49 -213 135 -203 106 63 -49 211 43
6215 43 57 -68 80 107 134 -101 106 -141 -138 159 -40 -294 -198 215 31 -111 -75 -71 -275 -56 -76 -243 -137 -218
6239 -218 -2 86 104 -32 -112 150 -115 74 10 -352 147 -93 -110 -4 -337 -173 -38 -95 -41 158 -244 -76
6261 -76 -38 74 215 3 -109 85 1 161 31 -269 -82 -215 -213 -304 90 -95 -112 134 -39 -13 80 -328 -230
6284 -230 -185 -48 -240 -194 -182 375 -144 -225 89 -237 -93 -130 138 -244 80 -212 54 177 -217 54 329 -49
6306 -49 400 79 40 -24 193 150 132 -27 360 -263 -142 -200 -338 258 102 67 156 111 78 15 -190 72 190 27
6330 27 -199 225 10 410 -15 -232 -86 77 -179 236 -154 -90 429 205 84 192 231 -58 23 -194 -1
6351aJ22l2l07N07n10J10m1R1K87k96K57q8M5k45%pj39J38N23m86M02l93J41m9
6375B9l83O70l29q5K18q0k3J31Nn64K89J66l00L56k04J20n4p5m2L59R2o2l68K66
6399A32k65J00J14P5k87L48Rj6l05j12p5K33K99r6j05m22P7j7K37%P1K7J23j96
6423e1K29j72r2K73k46J3pr2J27N1j73J08M2j94L28J62n33J82L24j39J51k58k32
6446a99K12j31K44k6J60j23J51m55L65j36j18Q0K17m17J64j25J78K8K27k27k77
6467b08K57N6J20J9l69J95m8L9r5J65k8l23J34L85m78J71k89L25J91k14j15j08
6489b18M09k59J84m79O23j83J55l56L33k97J40l06L50k55M18k46m40L96L21j45
6509A45l95J51o3N18l75J72j50L03k66l10J66lK04J24l91L46j21l54P5L19J61
$$ plain form
6351 -1 121 89 -218 289 -221 -111 -152 -61 226 -70 187 99 144 -101 -101 -108 -247 -109 414 -72 330 -63 78 29
6375 29 -354 316 -13 -98 120 40 17 148 153 -411 -122 44 -256 100 -104 16 -38 -113 -155 204 296 234 -134 132
6399 132 -133 -33 81 156 -131 217 226 210 -95 -207 -282 -49 250 154 49 -373 -296 -313 -76 -76 -5 22 145 -51
6423 -51 178 6 -86 187 -59 -46 -53 -145 -18 33 -140 -32 10 -184 144 306 -227 -45 279 140 291 33 -199
6446 -199 13 -118 126 100 260 137 288 -167 198 62 -56 24 241 -176 -12 -137 41 69 296 69 -208
6467 -208 49 105 225 244 -125 70 22 61 -34 131 103 -220 -86 299 -179 -8 -297 28 219 5 -110 -218
6489 -218 191 -68 116 -363 260 77 232 -124 209 -88 52 -254 96 -159 259 13 -427 -31 290 145
6509 145 -250 -99 -162 356 -19 153 3 306 40 -270 -104 -107 97 221 -170 176 55 -299 -224 95 256
6530B56k08K04j89k09K02J16j01J4J13k39j80K2L91j32o3N6L6M6j84j05J32M3
6552B1l8J56o4J38k25nM9P0j22J16k44O8L19j45k00L15l69J76k02J93O4l26l6
6575b91M57j62K23j14j03L2j87J76l9j05J71J92k21k87K49n2nj49L07l79K21J50
6597H4O0j73J98J77j94J8k27K85l17J04l88N36k38K86j40J3M0q1O1k13J57L5j15
6620c2L25m05L31j14r0Q8k60K78j17J4l14M76k39QoJ04l06M81m13J8L6K5J47k75
6644b40K06J2K78j37j60P9p8J85k66J90L26m26j05N5M58l76J11o6j4L8L19k45
6666A44k01o7N3qJ14k74L46k25K55k85J53N49l23K6J46o26R1k3J91j68K15N8j64
6689b3pj67k26L49J61j54r3M34k81N7R5J0j08k78K79j69NK05nj89J95l78N62m68
$$ plain form
6530 256 48 252 63 -146 56 172 71 85 198 -41 -221 -199 192 60 -3 53 89 135 -49 -154 -22 21
6552 21 -17 139 75 213 -12 -17 32 102 -20 96 -148 -80 239 94 -106 209 -160 16 -186 7 71 -255 -291
6575 -291 166 4 227 113 10 42 -145 31 -8 -113 58 250 29 -258 -9 -61 -66 -215 92 -287 -66 84
6597 84 144 -29 169 346 152 170 -57 228 -89 15 -373 163 -75 211 71 84 124 43 104 -109 48 83 -32
6620 -32 293 -112 219 105 15 103 -157 121 4 18 -296 180 -59 -51 -57 47 -259 222 -191 -173 -137 -112 35 -240
6644 -240 -34 -22 256 119 -41 38 -40 145 -121 69 395 -31 -136 -81 377 1 112 46 32 70 389 144
6666 144 -57 -124 -71 -79 35 -239 107 -118 137 -148 5 554 231 257 403 -223 -132 -155 36 -132 83 141 -23
6689 -23 -30 -197 -423 -74 87 -67 -160 274 -7 50 145 155 47 -231 48 -121 -116 89 84 -105 90 -288 274 -194
6713a94NN29k21j97j30J78J1J2k86M78l69L84k60P1Q3J1k53J53r5J73j04j78M69
6736B70j71k30K54j04k3mj33K96k3j38j10QJ17P8j22J09j11NJ63j48L14l84L08
6759B21j83k16j2J77kP3ppP3j23M2J51j02m4L4j9j07K03j34J60j52j12j02K29
6783D1L26l68O5RPJ52n7j61M5J32j68j0j25O7J13pJ83l40J13M4j19k4J94P6j79
6808IJ95j46J5j39k1L8k2O5L0o9j37L38p6K15k24k7J81l06K14j86K35j51J27m64
6832c06K98J21j31k24J46L27j31k79L73ol11J14r0J66k78J71K59m42J66r1Q4J00
6854C6L2%k8k43K36L4M2N5j71K21k23J08k2O8k84Mj96L60J58k81L01j60j40j08
6878b01M17j64n4p3l9J05m5J47l3nP2m96j8L73j67n7J37K28L5J04n04K74k0j16
$$ plain form
6713 -194 -189 340 119 -78 -208 -30 -19 -7 -293 185 -184 200 -60 11 94 105 -148 5 -90 83 -21 -199 270
6736 270 99 -131 123 19 -4 -8 -141 155 132 -6 -116 -108 9 87 -35 74 -37 -32 131 -17 297 -87 221
6759 221 38 -178 -190 -13 -15 58 51 44 117 -6 36 187 85 41 75 56 -51 152 18 178 26 -86 -188 41
6783 41 367 -1 64 73 80 232 175 14 59 191 23 13 -112 -45 68 61 244 -96 17 61 -58 -82 112 188 9
6808 9 204 58 73 -66 -87 -49 -71 -6 24 -45 -182 156 80 295 71 44 225 -81 133 -53 182 31 158 -306
6832 -306 -8 113 -18 -242 -96 231 100 -179 194 188 -123 -9 -99 67 -211 -40 219 -223 -57 -148 -64 36
6854 36 68 68 40 -203 33 67 109 164 -7 214 -9 99 77 145 -139 -135 -331 29 187 -94 207 47 -93 -201
6878 -201 216 52 -2 -75 -114 -9 -54 93 60 55 127 -369 -387 -14 -181 -238 -101 127 162 266 -238 36 16 -100
6902a00m8N5L31P0l62J95kro4qK6L4m84J43R4j62L56p7L5J45M2j04K26m95M0J02
6928b1L65j21k68n8K19m4L1j10k2J77j24PJ89j5k95m3J23Kj99l7l8J95K98j71
6952D0j56K86j28P8m6k57L8K76j88J55M4K8j5k70K03K43k95l3L0j07K12j60r3
6975a15J13J02j76K60k31K50q2J81n80R1M78k75j87J51j4J16J3J11l49N31k93
6996I5l42K31K17j35n7n0J03p3n6J70k85J51M3p8J14j09N77m06j14Q0k30L03K20
7019C69m53L01k57j79J84o4J5j97L41r7J98j45lL9L07k74k42J78L10k42n4n7j26
7042a48j4j57J72j69M03j14J56kJ0k04K14l26qP91p60Ll33L46K32j82K3K28k09
7065d8J20J08k23K55l46M27p3k34M1k15M25j64K15l84o5l3M04k82J88k11J12j07
$$ plain form
6902 -100 -148 -93 238 308 -54 141 139 130 66 58 84 118 -366 -223 -129 -291 65 -12 23 168 210 106 332 -163 -123 -21
6928 -21 344 223 -45 -103 116 72 103 -7 -29 148 24 31 220 205 -90 -133 -10 -8 -207 -244 -282 -87 211 40
6952 40 -116 170 42 120 74 -183 -145 131 -57 98 142 170 155 -115 88 331 36 3 33 -74 138 -22 -115
6975 -115 -2 100 -76 184 -47 203 121 302 -278 -187 291 16 -171 -20 -34 82 95 206 -143 388 95
6996 95 -247 -16 201 66 9 -41 62 -11 -67 103 -182 -31 12 -66 48 -61 516 110 -4 76 -154 149 369
7019 369 -84 217 -40 -219 -35 -99 -84 -281 60 -37 161 16 13 52 359 85 -157 21 331 89 35 -22 -148
7042 -148 -162 -319 -147 -316 87 -27 129 127 137 -67 147 -179 -187 604 -156 -153 -486 -140 92 -90 -67 161 -48
7065 -48 72 180 -43 212 -134 293 220 -14 27 -188 237 73 288 -96 -161 -194 210 -72 116 -95 17 -90
7087i0L1n2j46p9L44R5J46k07j05j03p3L65j21K28j17O7l09M7L2j88J15K63k4
7110A19q2j22J52J85j38j34m8j45pL83Kj80j79K05L23m04L7K72km38K55k96L6
7133b06L61k15l2K29J18L52m69k4p8r5j18J92J02l5j74J7j34K81j65k8J84j07
7155d4K56m5m3j62J54l29J59k48K83K07l01j24L61m85L86P8j54J40j11k6Q8j96
7177a56K40J66j38r6k68L09l89K35j27J93k04N50l21k05J1J30P5P2n6l16N51m13
7199a57K52q9Q6k07m1J31J70L9m15L82j29k17K29k31KJ84k60K38N7r1r0N1J80
7222G4l56K18J81j25j63K70kQ7j09q9k93J78K3j06L97m0j36J49l34L8J45m6K48
7245B09j76p3Kj31qK46O0l12R4K1m6J03o8K85n08K51K61l64J0J40J38j69j65K42
$$ plain form
7087 -90 -59 -111 -257 -336 8 103 249 42 -63 -166 -239 126 5 233 116 183 -126 -79 -47 -235 -120 143 119
7110 119 37 -85 67 252 114 -20 -68 -213 -220 163 165 -15 -194 11 334 -70 -33 239 237 -201 54 -242 -206
7133 -206 155 -60 -92 137 255 607 138 114 36 -59 -177 15 117 82 -92 -75 -209 72 -93 -121 63 -44
7155 -44 212 167 124 -38 116 -213 -54 -302 -19 188 -113 -237 124 -361 25 103 -51 89 -22 -48 40 -156
7177 -156 84 250 112 16 -252 57 -332 -97 -224 -31 -235 315 -6 -211 -200 -70 5 77 21 -295 256 -157
7199 -157 95 6 92 -115 -156 -25 145 184 -231 151 22 -195 34 -197 -195 -11 -271 -33 24 -67 -157 -106 74
7222 74 -282 -64 117 -8 -171 99 97 184 75 -14 -307 -129 -106 -212 185 145 9 158 -176 -138 7 -39 209
7245 209 33 -40 -38 -169 -177 69 129 -183 -89 -68 -114 -11 -79 206 -302 -51 210 -154 -144 -4 134 -35 -200 42
7269D2n3j0M4J67j63q5J0J83J97j37k22Kr3K65j01Qr1m2J25j91Q1j18J17J28N1
7294A14j76J4J83N1q8j99J04j19M35r7k12J36M1k58j18K30q8L24L2m45J81J4J10
7317A69k47O6J27k80m0J83J18Lk75L10j73J63j54kj36P8J32K06j73L2K9j16j43
7340a23j02P0kL44q4l14L29j95m1J94Pj36Q3Ql9j25P8m0J0J39M5j96J34r7n0K12
7366A09n3J77m40J88J68p3q8J83o3m6l81M04K27k50L5l95K46K2j01J57M4k17L30
7389A83j10M5l30P4J27k2R4lJ4p9r2R7o0k5J1j70L26j72M75q00N20l7J38k9l3
7414A42q4l61L36l70L71j28J81J67ll56J7o1K23n6k79K97K53k37j38K17k60J23
7436fj27K36r8K16l42K24k40j13M01L13n20L51m66J97k3l3N4P2o9l14N4K38m04
$$ plain form
7269 42 -11 -21 23 190 27 -58 -48 135 332 195 -27 -25 -118 147 46 54 -37 -79 46 -145 -64 -182 -65 63 114
7294 114 -62 -48 135 186 98 -101 3 -116 319 222 10 146 187 -71 -189 41 -47 277 309 -136 45 59 169
7317 169 -78 -12 115 -165 -205 -22 96 99 -176 134 -39 124 -30 -32 -168 -90 42 248 75 107 136 20 -123
7340 -123 -225 -155 -157 187 103 -211 118 -77 -118 76 83 -53 30 38 -1 -126 -48 -88 -78 61 106 -90 44 -53 -103 109
7366 109 56 233 -207 -19 149 76 -12 171 108 62 -319 85 312 62 97 -298 -52 -30 -131 26 70 -147 183
7389 183 73 118 -212 -138 -11 -33 61 58 72 -7 -99 -2 -62 -87 -76 -246 80 -92 383 -417 103 66 204 175 142
7414 142 58 -303 33 -337 34 -94 87 254 251 -105 -88 -149 74 18 -261 36 289 52 -86 131 -129 -6
7436 -6 -133 103 5 221 -121 103 -137 -250 151 464 -56 295 -171 26 3 -30 24 96 27 -287 -233 5 -399
7459c99L31L73m02j83M93k74J70j46l4J8R4k7O9J69l07J17j83J5R7j41L03k50
7481i7n6K20M9k10L10j04K1M7P8k39K15l57J15K60p82N26j7K43k22l5K26J45n06
7504a70K5K25p7k73L08n8P6oQ4j32R7P5m61J40P4P4m03N29J22k78J88o73Q24j71
7528A39j16k72J62J56N3k01k69L36K09l58J80N4p2J75k11K93j38q2K6j38J78l16
7550b12l1J07J50k46L36K1R5K24p44K94L0L86n14K23MJ61k65q8j07M07n50K54
7572f5L1k34l0J75m4J7K98j67m6k06L64m9j94J58LO4j82M42m23K0N54o46K45k8
7596E7j39L16j41J06o2N1k97J87q7J61l89J97m9J51n5J21j58L07k4p2l39K60K17
7619C19m23J45k40M45m95J62K48m11J34K40J0N6q0n1l0Q2j10p9R9j5k60K50K00
$$ plain form
7459 -399 -68 305 -97 -280 213 -61 109 -37 -71 -53 41 14 83 252 -55 62 -121 -106 -9 -150 153 -97
7481 -97 -153 67 116 -94 216 112 133 180 258 19 234 -123 -8 252 -530 -4 -21 222 0 -35 191 336 -170
7504 -170 -145 80 3 -270 38 -20 56 50 134 2 99 174 -287 -147 -73 1 -402 127 249 -29 159 -514 310 139
7528 139 23 -249 -87 69 122 -79 -348 -12 197 -161 19 73 1 176 -35 258 120 38 64 -74 104 -212
7550 -212 -243 -136 14 -232 104 125 220 444 -300 -6 24 410 -104 119 123 284 19 -69 -176 231 -319 -65
7572 -65 -34 -268 -298 -123 -167 -150 148 -19 -65 -271 93 44 -150 8 11 75 -107 335 -88 -68 486 -160 85 57
7596 57 -82 234 93 199 137 188 -109 78 -9 152 -237 -40 -89 62 7 128 -30 277 253 181 -158 102 319
7619 319 -104 41 -199 246 -249 -87 161 -250 -116 124 134 190 110 59 29 111 1 -78 21 6 -254 -4 196
7642A96o42M85J18l4k8j02L88n02J12N7n6Q2J5m6P3J31l48j20J23J39q1L58m65
7665a47j97O0J13J21M5j78K04j10N8q5J12J08J51n9m61L19j80J33j07J5l0M07
7687B92l05k77Q4J95m5J96P4N3k73J00k18K36l28J01J14k36L04j99j41L82j5P2
7709A66q0K15l83R5o2p4N7O8l4J23Ol6K29k47j60J56R9J04l66L19k82J62j74Q1
7733a8Q8J18k94J23J62K8k08j32K49l8K33l65q9K68k45K21J33k91R0J39k35N3
7755a0n5K71j74j16J58k66K28o9j30L56R1l27O6q3k63N97k53K08j3l74J69k31
7777b20N35k57j29r9M48k82O1k59M4L62k52M3j29K92L5j50J66j98J99k43j98L43
7799A12l60K31J76j65m1J20K06l21L51j83n9p6j47J13j15p5L14O1l38K02K90m00
$$ plain form
7642 196 -446 39 157 123 95 -7 381 -121 -9 48 -8 74 89 43 116 247 -101 -221 -98 41 -40 318 -147
7665 -147 -344 -284 -171 -50 -5 -183 21 -89 -31 -116 -4 104 255 196 -265 54 -126 7 -100 -85 -115 292
7687 292 -13 -290 -206 -11 -56 140 214 267 -6 94 -124 112 -216 -115 -1 -237 67 -132 -273 109 94 166
7709 166 86 301 -82 13 -49 -123 -66 2 -32 91 97 61 290 43 -117 39 138 242 -124 195 -87 75 -99 -18
7733 -18 70 188 -106 17 179 207 -1 -133 116 78 311 -54 -143 125 -120 101 234 -57 33 172 -63 -10
7755 -10 -65 206 32 -84 74 -192 36 -33 -163 193 284 -43 23 -60 -323 274 21 229 216 -158 11 -220
7777 -220 315 58 -71 -170 278 -4 57 -202 -158 204 -48 -5 -134 158 193 43 209 11 210 -33 -231 112
7799 112 -248 -17 159 -6 -47 73 279 -42 309 126 67 -9 -156 -43 -158 -233 81 142 -196 6 296 -104
7821a04kN8k20L8KK51j32R1J88k02K04J07l46j49K88n7R1m49K03J59M25q29M04
7844A9P3K31l54P6l62M29j44L59l81q7n0M37l8j83J44m55M70l2l40l3j4K13L05
7867B83j79j41J39j00J47k73L31l01r2L12q1j84K77r4k04M86l65K44k41J24k10
7888a22J5K17r5J64q5k56J23K13j63k31L50Q5K4j96J38k70j62L35k5n9k6J96l42
7911a72L23j31k33Q5K19J29j96p8j20J20K01l25J86O1l42K18n9J15j19l3J06k67
7933c12N9J3K29l24M93k42p8L20q6q5K45l44k1j48L15k78J39K6k98N04J39j75
7955I1O0j67l5L31l87j08J53J98Q3q4R3q4l89P49m56R4m2k00k3k45L16J35j98
7978a15n6J45j39R6PJ16p6P3j1k75J86J4l7J82O4n43O24m87J33L78k86k89L27
$$ plain form
7821 -104 -106 -48 -268 -230 -228 23 -109 -18 170 -32 172 279 -67 -216 72 15 106 -343 -140 19 444 -385 19
7844 19 92 323 -31 45 -317 112 -32 327 -54 -141 -191 246 208 25 169 -286 184 152 -188 -221 -235 -22 283
7867 283 104 -37 102 2 149 -124 207 -94 -186 126 45 -139 138 44 -160 326 -39 205 -36 88 -122
7888 -122 -107 110 15 179 94 -162 -39 174 11 -220 130 215 239 43 181 -89 -251 84 59 0 -26 170 -172
7911 -172 151 20 -213 -128 91 220 24 -54 -174 -54 147 -178 8 69 -273 -55 -114 1 -118 -151 -45 -312
7933 -312 -253 -240 -11 -335 158 -84 -162 158 72 -13 232 -112 -133 -281 34 -244 -105 -79 -377 127 266 91
7955 91 151 -16 -51 280 -107 -215 -62 136 219 135 228 144 -245 504 48 142 100 -100 -123 -368 -52 83 -115
7978 -115 -171 -26 -165 -69 -62 54 -22 51 40 -235 -49 -35 -72 110 174 -369 255 -232 -99 279 -7 -296 31
8001C1j96K91k76J94j14L6j12J62Q2l68L42k78N15m75O7K47k13J61l20K57J65
8022A98l64J56q5J57K1j03P4%k70O5K82J24J15l64L23o1n83K68j1M9j39J40R8
8045I0n8J04k52N5L6J2O4k64L50j21Q0Ql73K21K22r9k03K67k92K84k89K55j53
8068e6l9L84k28j82M14ql18J59o0J01m06L44J40K35k02l57L36k01L5J27k89J01
8090C0k77J31K5l2R4l0j04J34J1L6l0J53J85n26K99L1r6l2p1k29M52k29K23r4
8114E4M9j62J29j14Q1n7J65n01J95J51l5p3J7J19J69k74k1N6k17J67j4K50j36
8137bl06q4M62L1j89K67kk65J4k59M71j02j98P6J52l7L12j77m73K44r1mJ43j5
8161c2J09ml22J14J05L8K05m53L88j00K33l28L50l01J14j66L12k12l17K14N52
$$ plain form
8001 31 -165 126 -150 44 -70 -34 -146 16 98 -270 72 -206 309 -166 -99 148 -65 96 -224 33 198
8022 198 -166 -10 -95 62 83 -20 54 54 -216 -151 131 255 370 6 329 268 -315 -47 -58 -9 -148 -8 90
8045 90 32 136 -116 -61 -25 -13 51 -213 137 16 96 104 -269 -48 174 75 -128 139 -153 131 -158 97 -56
8068 -56 -95 289 61 -121 293 285 -33 126 66 167 -239 105 245 480 278 -79 257 56 91 218 -71 30
8090 30 -247 -116 -91 -123 -29 -59 -163 -29 -18 18 -12 141 326 -200 99 130 34 2 -69 -298 154 -75 148 54
8114 54 103 -59 70 -44 37 -20 145 -356 -161 -10 -45 -118 -101 18 187 -87 -108 -52 -269 -102 -116 134 -2
8137 -2 -308 -392 70 101 -88 179 177 -88 -74 -333 138 36 -162 -86 66 29 341 164 -309 -65 -156 -160 -17 -32
8161 -32 77 73 -249 -135 -30 8 213 -240 148 48 281 -47 303 2 116 -50 262 50 -267 -53 499
8182D99q10L4J69N1R0j97K35k68R6
$$ plain form
8182 499 -311 -277 -108 -57 33 -164 71 -197 -101
8191a01
$$ Imaginary data points
##PAGE= N=2
##DATA TABLE= (X++(I..I)), XYDATA
0@%%%%Qj6J6j6K4l2M0n6O4p3R7j20J44j70J97k35K77l20L72m32M96n67O50p41
28c93Q37r45J066j199J346j505J680j874K084k315K569k848L156l494L867m281
44b249M742n257N837o497P253q129R158j0388J1885j3754J6166j9414K4039l1184
58a7792M3736p1896K35931l0883m08918M46368j08642k87629L45951J5611l72083
69b10246K35573J52461k59302O0998J66336k27722L7176K30546j64371r7845J41154
80F4758j00107k4441J05112p0775k8757N7137K1055L9142n9923k5926M4991n8145
92c5879L5284P0810j17967L981J07760o9111j7643P9697p4371l6065J33626j8728
104F1394j08429Q8298K68j16349J10687L0603j53773Q9030P6603j21064N6882
$$ plain form
0 0 0 0 0 0 8 -8 8 -8 16 -16 24 -32 32 -41 56 -64 80 -90 107 -128 149 -171 201 -231 265 -302 348 -393
28 -393 444 -501 565 -634 712 -793 887 -987 1097 -1218 1351 -1497 1659 -1835 2032 -2249
44 -2249 2493 -2764 3073 -3424 3829 -4300 4858 -5530 6355 -7399 8767 -10647 13392 -17792
58 -17792 25944 -45952 189979 159096 -249822 196546 87904 -199725 146226 161837 -210246
69 -210246 25327 177788 -81514 -20516 145820 -81902 -44726 185820 21449 -76396 64758
80 64758 -35349 -59790 45322 -25453 -54210 2927 23982 63124 3201 -22725 22266 -35879
92 -35879 -595 70215 -47752 -43771 63989 -5122 -22765 56932 -17439 -53504 80122 61394
104 61394 -47035 41263 41531 -74818 35869 66472 -87301 1729 78332 -42732 14150
115A4150N4848j23876K9374Q3007p2478j1197N6445m0744j9187N5855j8721m3137
127c5661L7210R900k6133K5678Q90l1922J5626R349j3953R205Lr285J1079K038
141D024n650L338m381k623Q810Q85l609K7l240k762M584M716l816k355N823l338
157D33l65J0185j0395p586J7873o416o115J7849j6575j3618K4324m569j2513J8865
171A1377m531j4123J8643M723k1963J428J2315j3266L774J8149k2295q244K4405
184A0392j1865n188J8406j6221j463K0307j0727p333K776j0646M110R558k764
197f58k359N16M004J494L51j914q088L762Q471l993J400m637o924R454p03k211
213b035N783q091O134J0544j2571q1J560j1935R891O879j1271J681N529l919O57
$$ plain form
115 14150 68998 -54878 -25504 57503 -14975 -26172 30273 -10471 -29658 26197 7476 -35661
127 -35661 1549 11449 -14684 10994 11884 -20038 -4412 4937 -9016 189 192 -9093 1986 4024
141 4024 -1626 1712 -2669 -5292 3518 4403 794 821 -2419 -5181 -597 4119 303 -2052 3771 433
157 433 68 10253 -142 -7728 10145 3729 -2386 15463 -1112 -14730 9594 5025 -7488 11377
171 11377 6846 -7277 11366 16089 -5874 -4446 7869 -5397 -1623 16526 -5769 -14013 10392
184 10392 -1473 -6661 11745 -4476 -5939 14368 3641 -3692 -916 -11562 -7452 2106 -658
197 -658 -3017 -2501 1503 2997 3348 1434 -6654 -2892 5579 1586 2986 -1651 -8575 879 176 -2035
213 -2035 3748 -4343 1791 12335 -236 -317 1243 -10692 -801 6078 -5193 -3512 2017 -1902 -1245
228a245L995n681n882R730M310r692N381p26j0610J0322K353j0563O269K661l698
243c076N801p45n549K01K185J643j350K46N30j984K417J390l981M40J522o52K239
260A277j79j663n31J76J009J19j113J237l05q17J641m71k109J240O50q51J270
277E80J14j407m17J022N75o25j34R24j911J125J334k713l54K034j163J128J452
294A564k495j34J73P2Q74r68M8N98n65J871j342k291J490k54O06J967j852q3M07
313c14L39J78j529m15J401q32K241j50l300J918Lj040K715j553j048K514n60o16
331d8j46j774L49J123Q39J25j184J020k18j095J764j622n57K662r39l93J025j721
349g90k0R19n38M45l53L84O91l12p4m17j492J668J94n98Q67o78j91L31m2L88p82
$$ plain form
228 -1245 2750 -2931 -8813 917 5227 -4465 916 190 -10420 -98 2255 -8308 -2039 622 -3076
243 -3076 2725 1980 -3569 -3368 -1183 460 -890 -644 -114 -2098 319 1709 -2272 -1832 -310 -962 1277
260 1277 1098 -565 -1096 -920 89 208 -905 332 27 -790 851 380 -1729 -489 161 -690 580
277 580 694 -713 -1130 -108 467 -158 -292 632 -1279 -154 1180 -1533 -1887 147 -1016 112 1564
294 1564 -931 -1065 -892 -820 54 -914 -866 -268 -833 1038 -304 -2595 -1105 -1359 -753 1214 -638 -721 -314
313 -314 25 203 -1326 -1741 -340 -1172 1069 919 -2381 -463 -460 -1500 1215 -338 -1386 1128 568 -48
331 -48 -194 -1968 -1619 -496 343 468 -716 304 86 -1009 755 -867 -1424 1238 299 -94 931 -790
349 -790 -810 109 -429 16 -337 47 738 426 352 -65 -1557 111 305 -293 574 -104 -295 36 -6 382 -400
370d00j41J184m49J67J29q59N99j8j22O2k91J31r9K27l80N62p19M67K31k51j95
391a65o6L86k71L44r3k22K57l90m00L32Q5L47m26K32l3K15m10M25r29Q82M01m72
413B9J4j15l45L08m91L20K20m1J77L15l05j5r83M21M94q73J036l39k68P61k38
434H2o72O91n91K03M35k58M28n12j86L07o38P30nKJ015l93o30N06p34j21N85l80
456a36L02KL11J5o63K20N6n07M43J49k78L32k68j84L00k37J93p5K71L1l21O14
478E70l84m28P82n20l29O08k24M73K05n49k1j74l04k6K07L77l36K44N84q78r4
499b17ml42L15M02n59J08L50l51J51q0n9J15m08N96J87m23J25j91l56L58J78J74
521F9O9K24j1rk18j02p03N68J53o48P06j98l15R20m77m70R19n65K6M66m30r2l
$$ plain form
370 -400 -541 643 194 361 490 -369 230 212 90 152 -139 -8 -107 120 -260 302 -417 50 281 30 -165
391 -165 -231 155 -116 228 135 -87 170 -220 -620 -288 -203 144 -282 -50 -83 132 -278 147 -782 100 501 29
413 29 43 -72 -417 -109 -600 -280 -60 -101 76 391 86 71 -912 -491 3 -870 166 -173 -441 320 82
434 82 -590 101 -490 -287 148 -110 318 -194 -380 -73 -711 19 14 16 1031 638 8 514 -220 -341 244 -136
456 -136 166 168 479 494 -169 51 107 -400 43 192 -86 246 -22 -206 94 -143 50 -25 246 277 -44 570
478 570 186 -242 540 20 -309 299 75 548 753 204 183 9 -295 -321 -114 263 -73 171 755 -123 -217
499 -217 -221 -563 -248 154 -405 -297 53 -298 -147 -227 -286 -171 -579 17 204 -219 -94 -285 -641 -283 -105 69
521 69 138 362 351 342 124 22 -681 -113 40 -608 98 -100 -415 505 28 -442 477 -88 -62 404 -26 -118 -121
544a21n77j44J71N25l2J68Q09j183Q6Q13r24j97J021q62K48R4l89L76R2j6M65
565D23K8j58K13k72l94m7M3K53l31M02k72j41P16p09Q9K62o9k50L06J67l26R0
587B3k57J12j98N27n42N08L1r3j37J70j47o1K59L48q13M72p28L1N12L47q23R21
609D62k26o75Q07m57l19L32K2j51L67l53n18L97N80l11J9J92Or8R14j361l45J176
631D60o94k63J484j219NJ182j233L02K44n80K09M05l75L2J42l84L01L89l11l26
651b30O18k3q54Q58k35r73R64n42l9J376j177l24J346o32p18J035k08m24M89r6
671B11l54l00O48n98J40J183j106L1Q15m34l83N52p47j4O02m43J90n7k8K22r2
692C8j4L25j44j04J15J0l90J64l6k6j08O47k97l84N88j95m23L51k68k29N88m2
$$ plain form
544 -121 -698 -842 -671 -146 -178 -10 799 -384 -298 515 -409 -606 415 -447 -199 -105 -494 -118 -26 -42 423
565 423 451 293 506 234 -160 -207 -164 89 -242 160 -112 -253 463 -246 -157 105 36 -214 92 259 -67 23
587 23 -234 -122 -320 207 -335 173 204 111 -26 144 -3 -64 195 543 -270 202 -526 -495 17 364 -459 462
609 462 236 -439 368 -89 -408 -76 -54 -205 162 -191 -709 -312 268 -43 -24 168 174 76 990 -371 -716 460
631 460 -234 -497 987 -232 -227 955 -278 24 268 -312 -103 302 -73 -41 101 -283 18 407 96 -230
651 -230 388 365 -489 369 134 -839 125 -417 -456 920 -257 -581 765 133 -585 450 242 -182 307 211
671 211 -143 -443 205 -393 -253 930 -176 -145 670 236 -147 405 -342 -356 246 -197 -7 -64 -92 130 38
692 38 24 349 205 101 216 226 -164 0 -36 -62 -170 477 180 -204 384 189 -234 117 -151 -380 208 166
714A66n35M48j20k60L14N62n10J66R5k41j98J81k62P5J9L88j67k32R3r5P4p8l
737a20j46K14j1J20j17j41J79p0O5k14O4O2L54j70l35M18j92J10k9j09r7j67N39
760B07Q6l36J02N7k24L24j13j15QJK1q1J69k11q5N25n80M00l1j32LJ18O7k89L19
785B10k10N7r2O0J07O6k37J25o1k43M74k71j03j42M66j6k35J24l03J27N43m28
807A8r0N8j16j8L45j28m12N66j41j77L15k86J09R9j64K36j36m4j5k41J36L82p3
830B23l97K13L27k09m03K70k24M02k59K2k26N43l39L7K32j98L7m87O63L82m81
851A28l31L99Q8k44L69j88k94L67m51J95K25k75j05L16J30l43j88R5j47K49J21
872A16m30L4K52p9K55n7n3J10k61P9J88j2m09J30K72J19j64m54K48K9K62q9k21
$$ plain form
714 166 -369 79 -41 -301 13 575 65 231 326 85 -113 68 -194 -119 -100 288 121 -111 -18 -113 -39 -117 -120
737 -120 -266 -52 -63 57 -60 -201 -22 -92 -27 -241 -177 -115 239 69 -266 152 -40 70 41 -68 -165 -332 207
760 207 293 -43 59 116 -108 216 103 -12 -4 -3 18 -63 106 -105 -190 335 -245 155 124 -8 -5 113 180 -109 210
785 210 0 57 -35 25 132 198 -39 86 25 -218 256 -15 -118 -260 206 190 -45 79 -224 -97 446 18
807 18 -72 -14 -130 -148 197 69 -343 223 82 -95 220 -66 43 142 -22 214 78 34 19 -222 -86 296 223
830 223 -174 39 366 157 -246 24 -200 202 -57 -35 -261 282 -57 -20 212 14 51 -436 227 609 128
851 128 -203 196 284 40 409 221 -73 294 -157 38 263 -12 -117 199 329 -14 -202 -107 -254 -5 116
872 116 -314 -280 -28 -107 148 91 38 148 -113 -34 154 142 -267 -137 135 254 90 -364 -116 -87 175 86 -135
895a35r2L22N8L2l48m9M45k82L31k03n84M04L51l74Mj7L23j38R2j44m7M9J56j68
919a4J83mj24l85N34p0K99l87k15L20J36m1j96l75Q6O00n59K42j02l63O65q5o0
942H5r7r7K44j94n5J96n0p0%O3J11Q0l48J34Q2m1l50K87j64J63J35J28m33K26
966C5j32k1K41l06J4K93J43o3k01J00j79J25j47K77l80K10k41N1L49j49r1J77
988A05j73M9j06J67p4j09M82m60K81j35j20J45R7j3j96K44r8j02J54n30K19j34
1010c07K62j92N25j03j12j20J95l42J98R5l51K24L96m02j61J71R4Q8P5K15l47
1031A01p0j15J12j87J83j18J2NJ90P6k71j8M02j96n4j20P2L5J55j73p0J80j0k85
1055a64K19j61J5M4R5j08m4q5J52J29k03J62j42L36j96k26N90m61P9l88K92J00
$$ plain form
895 -135 -227 95 153 185 -163 -212 233 -49 282 79 -505 -101 250 -124 -120 -137 186 48 140 -4 -51 -2 154 -14
919 -14 169 165 41 -344 190 120 419 32 -183 137 273 232 36 -339 -253 347 -212 30 -72 -435 230 145 85
942 85 -12 -109 135 -59 -114 82 32 -38 -38 25 136 216 -132 2 84 43 -307 -20 -184 -21 114 242 -191 35
966 35 -97 -118 123 -183 -169 124 267 204 3 103 -76 49 -98 179 -201 9 -232 -181 168 19 -72 105
988 105 -68 -19 -125 42 -32 -141 341 -119 162 27 -93 52 149 136 -60 184 86 -16 138 -392 -173 -307
1010 -307 -45 -237 288 185 73 -47 148 -194 4 99 -252 -28 368 -34 -195 -24 70 158 233 448 101
1031 101 31 -84 28 -159 24 -94 -82 -77 113 189 -82 -100 302 106 52 -68 4 39 194 21 -49 131 121 -164
1055 -164 55 -106 -91 -47 48 -60 -104 -189 -37 92 -111 51 -91 245 49 -177 413 -48 31 -357 -65 35
1077C5k05J77J11M2l03L26l68L69l69K43k29L54j85j43L59m85K58n5j58K88k27
1098a65J66K34l33M41o30N31o1j55j41R3N6N0k5M0k42L77j20J6m6j73Q4N3k10
1121a60L18j09J07K08K7k71ll89O26n56J99K94l10k43Q5n9L55j58L06j76o5K19
1143B45n69O14l21l88M64j48J1L31m77k36Q65k72j98o3N52J2l26n2j55n5j0J87
1165A1j51J47K02j46k37O68p73L63K36k93P4k23o6L79l90k1K85l78K66O3O5M7
1187A28J0k20qK61j12m68L95K18j18l36M17j03M5J56j65l3J09n53M12p0NR2J27
1210A89j53L69n82M20k30j61L22j36j82J14j93M06J88o90M63j00j61O97m46k38
1230a04L05m56K51q8kJ92Q8k92J40k1J37j58o1O0l08M38M5n37N27l46k10O72l43
$$ plain form
1077 35 -170 7 118 160 -143 183 -185 184 -185 58 -171 183 -2 -145 214 -271 -13 -68 -226 62 -165
1098 -165 1 235 -98 343 -287 244 183 28 -113 -20 36 86 61 101 -141 236 116 132 86 -87 -3 50 -160
1121 -160 158 49 156 364 391 120 117 -272 354 -202 -3 291 -19 -262 -177 -236 119 -39 267 91 26 245
1143 245 -324 290 -31 -419 45 -103 -92 239 -238 -474 391 119 -79 -142 410 422 96 44 -111 -166 -176 11
1165 11 -140 7 209 63 -174 494 -279 84 320 27 101 -122 -188 191 -199 -220 65 -313 -47 16 81 128
1187 128 138 -82 -90 171 59 -409 -14 204 86 -250 167 64 109 265 100 67 176 -377 35 -35 -30 62 189
1210 189 36 405 -177 243 13 -148 174 38 -144 -30 -223 183 371 -319 144 44 -117 580 134 -104
1230 -104 201 -255 -4 -92 -94 98 186 -106 34 13 150 -8 -69 -9 -317 121 166 -371 156 -190 -400 272 -71
1253g1j51L63K50p15K87n1K9p3j7J26L17l60M6n8J31k41o1O51n87P3P1kl77M71
1277E1k35J08J23q8r9M80m07k26L67k95K31j64L29n06K49l1j45n3k1M62j05Pk2
1300A0j18K56l45L15j12k24K84j7j32k73M54j03J43l39K37j44K98n16K37K59K10
1321C80l29k76K69r1j94K61l18L74J82l70K61l51L4K00l08M97m16r4L25K7r2r3
1343a22J26k54J11K1J94J50m13M28n50L51j20J13j78K64k17j3K85j84O3n2l47
1364c44Q3J15Q7k52R6M48o12M98O8k57K93j52k45M78J19m69OJ70l61J62N2mL47
1387C26l31r1p9J38J36j81J26l5k6q7J6O1J48k24O8Q6j08J84j3l00j23N51n41
1410b99J71P7qJ65p8j95M5K63j33K11k00lk18M09l84J01k5j43L97k34K0p3L86
$$ plain form
1253 -71 -222 141 391 -324 -37 -88 -59 -132 -149 -23 294 -66 -20 -78 53 -188 -249 402 -185 -112 -41 -43 -420 51
1277 51 -184 -76 47 -41 -140 340 -67 -293 74 -221 10 -154 175 -331 -82 -113 -258 -311 -332 130 25 32 10
1300 10 -108 148 -197 118 6 -218 66 49 -83 -356 98 -5 138 -201 36 -108 190 -326 -89 170 380
1321 380 51 -225 44 -47 -241 20 -298 76 258 -112 149 -202 -168 32 -276 221 -195 -289 36 63 -29 -122
1343 -122 4 -250 -139 -118 76 226 -187 241 -309 42 -78 35 -143 121 -96 -109 176 -8 55 3 -344
1364 -344 -261 -146 -59 -311 -215 233 -379 119 187 -70 223 71 -174 304 423 -46 -40 130 -231 -69 -17 -21 326
1387 326 -5 -96 -175 -37 99 -82 44 9 -17 -104 -88 -27 121 -103 -35 51 -57 127 114 -186 -309 242 -299
1410 -299 -128 -51 -59 106 28 -167 -122 141 8 219 19 16 -202 207 -177 -76 -101 -244 153 -81 -61 -134 252
1433B52k52j94K92O7k61J47l08K84j44K06R0l61Q3J25J47j91J21J5r5j91J82L13
1455C27l03j6L87m54j2L07j66K95n66M11j99j37K00j21k01M10q5q7K51j51j71
1476h1j13K64P3j27jK39m68L46k41r6L62l32K99m03K9M36o7k14J83j45M8j49J03
1499e5K65j45MJ24j99J44O0m07K66J95m68R1J01J29j05q6J02k95L1M47j60L2k51
1522a80M2j1Q6K4J49k1j51K60L6m22K54k27K29j0m03O41m04J28l9j50j82K49k2
1545a24J44l27K36R6k6j9K81n29M49l09K51k70K01J03m6R3j57J79k89M07l55l1
1567d2J82m29K68rj08J69J78m02O0K95n3l44J04j2L0q8N43l76j49K12k76K75k0
1590Hj12J30j07j7J32j6r7M64m62R4k2j4NJ54o2k45j57L18K07k87p8O3O5oL14
$$ plain form
1433 252 0 -194 98 165 -96 51 -257 27 -117 89 179 -182 -99 26 173 -18 103 118 23 -168 14 327
1455 327 24 8 395 -59 -71 236 70 365 -201 210 11 -126 74 -47 -248 162 77 -10 241 90 -81
1476 -81 -194 70 143 16 15 254 -214 132 -109 -205 157 -175 124 -279 -250 186 119 -95 88 -57 -9 -158 -55
1499 -55 210 65 69 193 -6 138 198 -209 57 252 -216 -125 -24 105 0 -86 16 -279 -248 199 39 71 -180
1522 -180 -138 -149 -63 -39 110 89 -62 198 234 -188 66 -161 68 58 -345 296 -108 20 -19 -169 -351 -102 -124
1545 -124 20 -307 -71 25 -1 -20 261 -268 181 -128 123 -147 54 157 111 204 47 226 -63 344 -11 -42
1567 -42 140 -289 -21 -30 -138 31 209 -193 -133 162 109 -235 -131 -143 -113 -201 342 -34 -183 29 -247 28 8
1590 8 -104 26 -81 -98 34 18 -79 385 -77 17 -5 -19 -14 140 78 -167 -324 -6 201 -86 -164 -101 -36 -42 272
1615B72k58K88l52k03R0K63j61J08j33L30k24j25L12K08o02L53m87L64l37K15
1635g9K81p9J6k58O2j34K01%m1k58L63k43L19J17j07j5k99J37J50k87j4o9O07
1658C70l54O7K82o54J62Q3j64K93j40oj07j7J51j24L95j60j48J82k25J95j81k23
1680c23K65j6M5J64L1k01N6j37K20j54R5k23J06jR8q2J58m7k9o4j18K81K29l92
1704c9J15J8k55Q5j78R9M38m43qL89k62J19j84K09k7k2q0K5kM3j34J14l09N02
1728B13j36k37J11q4J60p3R0M09k64l25KL52j08k29J98l02M26q6j82n9K28j46
1750d2k23L09k4J05K64n13j43K69k69P0M83m93J83r6k0k23K28J29k21M35L0k16
1772B2k60M33l60L16l37J35R6k7J19p9K72k35L51l08L1k75N0L0R7j6k7K50j52
$$ plain form
1615 272 14 302 -50 -253 -163 100 -61 47 -86 244 20 -105 207 415 -187 166 -321 43 -294 -79
1635 -79 202 123 139 -119 -57 -191 10 10 -31 -289 74 -169 150 267 160 145 -154 -17 133 -154 -168 -237 370
1658 370 16 83 365 -289 -127 -44 -208 85 -55 -61 -168 -185 -34 -158 237 77 -71 111 -114 81 -100 -323
1680 -323 -58 -74 -29 135 166 -35 21 -116 104 -50 45 -178 -72 -73 25 -57 101 54 25 -39 -157 124 353 -39
1704 -39 76 94 -161 -76 -254 -155 283 -160 -168 221 -41 78 -106 103 76 54 -26 -1 -3 40 -94 20 -289 213
1728 213 77 -160 -49 -133 27 -46 44 453 189 -136 -134 218 110 -119 79 -223 203 117 -65 -124 104 -42
1750 -42 -265 44 20 125 389 -124 -267 2 -267 -197 286 -207 -24 -120 -140 -363 -135 -6 -227 208 238 22
1772 22 -238 195 -165 151 -186 -51 45 18 137 58 330 95 446 138 169 -106 -56 -26 71 55 28 278 126
1795A26Q1o1m79J46J21j61R1J25J11l0l05K65J99j69k44mL46q6K7j88k07L69j61
1818h8J4j90J31L5o1j37J82L16m7m28K92j18K36p1m5K4P8j54P7k44L56j15l08
1841b65L71k83j37K20k09J62r2R9J15M6j39K02l72M26k70K41k80j79K85j14O7
1862a06o0N25o51L40P1O5j29q6J38P2j88j38M74m2k67JJ2M0O0q1j89M8J68r4p8
1887i5O6L44m34M6K16k44K75m57Q5M4J12K62j02p7J14m61L74k93L11j6N7Kq1K8
1911G6n6j07K97j52l47L57O5Pn1k17j40J94j45N02n09o5o7O46l46K18j42k30M21
1934B09k75K9j46J71N5J47o23K82K9k3J13K5p0O1J51Q7n3k50O1n8m2O6O5m23L93
1959a9J27l0j05j06k83M52L45m85k22L75j50r0j24M73j92R4Qj07N3J97l36J29
$$ plain form
1795 126 207 146 -333 -187 -66 -227 -136 -11 100 70 -235 30 229 60 -184 -188 158 72 99 -89 -296 73 -88
1818 -88 -74 -264 -133 -98 -159 -296 -114 202 155 -273 19 -99 137 66 21 45 123 -31 46 -198 158 43 -265
1841 -265 106 -177 -314 -94 -303 -141 -233 -134 -19 27 -112 90 -282 144 -126 115 -165 -344 -59 -173 -106
1862 -106 -166 359 -292 48 119 184 55 -31 107 179 -9 -147 327 285 18 19 31 71 131 50 -139 -91 77 -17 -95
1887 -95 -29 315 -119 -73 143 -101 174 -283 -198 -154 -42 220 118 41 155 -306 68 -225 86 70 127 129 48 76
1911 76 20 -87 210 58 -289 68 133 140 89 -128 -268 -74 -219 283 -226 -291 -358 288 -58 160 18 -212 209
1934 209 -66 -37 -183 -12 43 190 -433 -151 -122 -145 -32 -7 -77 -16 135 222 169 -81 -20 -78 -120 -54 11 -412 -19
1959 -19 108 78 -27 -133 -416 36 381 -104 -326 49 -101 -191 -315 158 -34 60 68 -39 14 211 -125 4
1981DK4j75O0o6M3J05K26k8j08q7k02L82k48O0R5p4l3J30j2j2m90M16O1m8k15
2006a92K09J83n8j83q4K4K7L52j33j24R9n4m82L57K59n16P34m95L70k21m70K12
2028a86N3L72k48K51l63M0j25kL59n1k13K23l00O3K06j7L6P0k94M15j59M4L9j34
2052G9J22l06p8J57Q6K14j03j64L21l78j84L07J17k29J47j86J64j18k46M84k95
2073h9J55L9j45k5L50k83k54K78j42OJ64J01J93m72L87l86R5N0j48K96l08R1K62
2096B15j63J72k39l1J73k24K30j19J06P2l04l2K18r6J05j87J81k00K48k08k83
2117c66M0j31M14M7k3Q1k2k1l92P24k90J89k16j2p1K3n1L07j53J41j04k3j38j99
2141b46M21mj49k2MO7k66J16O5K31o2l77K66r4J20N8%k54K8K70k0p5K44l10K1
$$ plain form
1981 4 28 -147 -87 -153 -110 -5 221 193 85 -2 -204 178 -70 -10 85 11 -22 108 96 84 -406 10 71 23 -192
2006 -192 17 200 142 -41 -125 -101 -74 278 145 21 120 66 -416 -59 200 -316 418 -77 293 72 -398 -186
2028 -186 -133 239 -9 242 -121 -81 -206 -208 151 100 -113 110 -190 -127 79 62 98 168 -126 289 130 174 213 79
2052 79 201 -105 -183 -26 60 274 171 7 328 -50 -234 73 190 -39 108 -78 86 -32 -278 206 -89
2073 -89 66 105 -40 -65 285 2 -252 26 -116 -110 54 155 348 -124 263 -123 -28 22 -126 170 -138 -47 215
2096 215 52 224 -15 -46 127 -97 133 14 120 192 -112 -144 74 -22 83 -104 77 -123 125 -83 -366
2117 -366 -326 -457 -43 4 -19 62 40 19 -373 351 61 250 34 22 -49 -26 -77 230 77 218 114 91 -47 -246
2141 -246 175 171 22 0 4 71 -195 -79 -14 217 155 -222 44 -50 70 128 128 -126 -98 172 152 77 321 11 32
2166C2j33J51j36J62K82o53L50J5n28N28r9Q2q9r8K0O7L00l02j76J11K17j09J61
2189A55j53j21M4J12J47Pj56L3K87k45k46n5j59K17K12j31pJ13o6j4Q0j71PK43
2213A33p8j57J42m3j68j1K44N0k25J77j93K99n02N6L87m74K77L9q4J1Q5K38K44
2236D47m68j15L64k61M83k45q5j3j96j5K52r2j20K06j69o2K55j09J94m17Q8L62
2258B84l54qP5K30j35k72j01J04K36o1J4J6K83j68J50j13l04M85m7k78J24j76
2280a6j76LK28O3j44l59N05r8J62l38r4L24J11r9m8j00R8O5O1j01L7Nj20ln4K03
2306A15j50j36j8J62J0N3m3N6k10Q4L4K22k36o2N1K14k16P6J38m2n4K8j07k54
2330b85K62j48O4J45J8k68O8M01k31Q7j65N14n36K06j91J60O0k43J57L0o6J16
$$ plain form
2166 32 -101 50 -86 76 358 -295 55 70 -458 70 -29 53 -36 -134 -114 -47 253 -49 -225 -114 103 -6 155
2189 155 2 -119 -75 37 184 191 35 68 355 110 -136 -191 -350 -133 79 -52 -59 54 -12 -26 54 -117 -110 133
2213 133 55 -102 40 -3 -171 -182 62 112 -113 64 -129 170 -332 -276 111 -363 -86 -47 -131 -120 -35 203 447
2236 447 -21 -136 228 -33 450 205 120 107 -89 -104 148 56 -64 142 -27 -89 166 57 251 -166 -78 284
2258 284 -70 -78 -3 227 92 -180 -281 -177 59 -2 12 28 311 143 293 180 -124 361 314 36 160 -16
2280 -16 -192 -189 39 102 -42 -401 104 6 168 -170 -264 60 171 72 24 -76 22 87 148 47 84 89 -31 -34 -88 115
2306 115 -35 -171 -189 -27 -17 36 -7 49 -161 -77 -43 179 -57 -119 -68 146 -70 6 144 102 48 76 -31 -285
2330 -285 -23 -171 -107 38 56 -212 -144 257 26 113 -52 462 -74 132 -59 101 161 -82 75 105 39 155
2352A55l44L69N0j77j25pJ36m10L90j60m1J85k76J29K34j52n8O5P8l05K25J2k51
2375b78J28K41p5m94K73O0J92k18K63r5Mk30M11j86k11j6K89O5l19p6K58K13m35
2398b36o4P7J82k56M90j43q0j79J79l22M07j81M6J9J91j3o9l17J74p6O8J31k23
2421a95L05j52K33j03j31k23J48K44j32j47K04j61o2k9j03K07K1k09K04Q6r2L23
2443B36m29J57K4j75M4j31L08J28j30k0m3P1k10J44k55J65J00l1J87L1k78K47
2465A40J5j58J53k40K0K08j34j60J12N7j9Q6L9k92K14j97M39m24M40k06J97j00
2487A90k78L23k43Q4l68L50K53l50k72L68l1K5k24L96j89O3M7j19kK5j41M54l08
2510E3j02L05k45j30J96J35k09j03K52j50o34N42K90p9m3o9J87j74K6j97M53j68
$$ plain form
2352 155 -189 180 230 53 -72 -79 57 -353 37 -123 -164 21 -255 -126 108 -44 -102 -37 41 -264 -39 -27 -278
2375 -278 -150 91 16 -478 -205 -145 47 -171 92 -3 1 -229 182 -4 -215 -231 58 123 -196 -272 -14 199 -236
2398 -236 -300 -223 -41 -297 193 50 -30 -209 -30 -352 55 -126 -80 -61 130 117 48 -269 -95 -171 -103 28 -195
2421 -195 110 -42 191 88 -43 -266 -118 126 -6 -153 51 -110 -172 -201 -304 -97 -76 -285 -81 5 -87 236
2443 236 -193 -36 -12 -187 -143 -274 34 162 32 12 -31 40 -170 -26 -281 -116 -16 -47 140 171 -107 140
2465 140 155 -3 150 -90 -70 138 4 -156 -44 13 -6 80 119 -173 41 -156 283 -141 299 93 290 190
2487 190 -88 235 -8 76 -292 58 311 -39 -311 57 26 51 -173 223 34 97 144 25 23 48 -93 361 53
2510 53 -49 256 11 -119 77 212 3 -100 152 2 -632 -90 200 121 78 9 196 22 48 -149 304 136
2532A36j71J79l9m57L83m0M4j37j39j5L71k15j25L03k40J22J64L8Q4p7k27J37
2554G9j31j4k3r8L12k94K23Q2J71j51m08K84k30k17M61r9J37l04PK72m0qj39J24
2578dm21M32K2%R5l09K72J50j65N4K06l69P6O5oj07K22j10j18K06k44JL53k15
2602H6j40r1L45l3Q4ko4m5q5j07J36l26L1J37K64k39j9J33r4J15j2Lj8j38J20
2627D1l63lJ37R6j73L31k30o1J20J11l35K68J92k96r3j69O64k44R4l98J94Q9k
2650c0J12j5j54l4O9n0J76k64J40M45k97j79J97m2K16j83J50o77P02k79rR1j11
2673b6K8j57L71l67K42p0l5k35M01l7k31J30m37M34J59j71k29N16o61M48l54K98
2695A7J42k32L2K27k83L27k28k12L87p2k76J43J03m5k54J96l5P9nJ42p1k6k23
$$ plain form
2532 136 -35 144 105 -352 31 -9 35 -102 -241 -256 115 -100 -225 78 -162 -40 124 162 246 169 -58 79
2554 79 -52 -66 -89 -187 125 -169 54 136 307 156 -252 32 -198 -415 46 -53 84 -220 -213 59 19 11 -128 -4
2578 -4 -425 7 29 29 124 -185 87 237 72 126 332 -37 39 104 98 -9 213 103 -15 191 -53 -52 301 86
2602 86 -54 -145 200 167 251 249 185 140 55 -52 84 -242 -211 -74 190 -49 -68 65 -29 86 74 77 59 -79 41
2627 41 -322 -325 -188 -92 -265 66 -164 -225 -105 6 -329 -61 131 -165 -258 -427 237 -7 87 -311 -117 -28 -30
2650 -30 82 67 -87 -121 -52 -102 74 -190 -50 395 98 -81 116 74 290 107 257 -420 282 3 -6 85 -26
2673 -26 2 -155 216 -151 91 21 -14 -249 152 115 -116 14 -423 11 170 -1 -230 286 -375 73 -281 17
2695 17 159 -73 -41 186 -97 230 2 -210 177 105 -171 -28 75 30 -224 -28 -63 16 11 153 82 56 -167
2718a67K03J40j72Q1j04J88l38K05K6j00J7p2R4J72j67K64m22M34l17j2N4j27
2740a20j66M83k29J76l05l1K59q0j28M48k75k96N95l14P0o5j39N4j52j83K85k49
2762c62L53L65l34K23q8j76j88L24j15j47M3J73K36o5l30R7j35jK62k33p4J27
2784d5p5L76l94j04K87k7m3K17j7j90k89K99MJ91k61K36l00p0N33n11J18j02r
2807a76K88k29N8K50j32Pk21P5p8N3j08M76m75L64k22q7J99L5n7rj06K47k96K18
2831G4k4k23j00J18J07R1L6l30L77o7J77j58n9j03K16j59K39r0J1k78K25L1JJ12
2855B24Ol36K84j61K5j23J81P6j77K5m65K07K20qj65L03L4j88j18J4K7J64j62
2878a13K81j03k25K89m87K23J99j77K31L0n6k82K25J47j55j1j18j96L36j72M57
$$ plain form
2718 -167 36 176 4 85 -19 169 -169 36 62 -38 -21 -93 1 173 6 270 -152 282 -35 -47 7 -120
2740 -120 -286 197 -32 144 -161 -192 67 -13 -141 307 32 -264 331 17 87 22 -117 -63 -215 -398 -113 -362
2762 -362 -9 356 22 245 157 -19 -207 117 2 -145 -102 71 307 242 -88 9 -126 -127 135 -98 -172 -45
2784 -45 -120 256 -138 -242 45 18 -25 192 175 -15 -304 -5 -1 190 -71 165 -135 -205 328 -183 -65 -167 -176
2807 -176 112 -117 -59 191 59 66 -155 -80 -158 -105 -213 263 -212 152 -70 -157 42 77 20 11 -95 152 -144 74
2831 74 50 -173 -273 -155 -48 43 79 -251 126 59 236 78 19 -84 132 -27 212 122 133 -145 80 111 112 224
2855 224 230 -106 178 17 42 -81 100 176 -1 24 -441 -234 -14 -22 -187 116 150 -38 -156 -142 -115 49 -113
2878 -113 168 65 -160 129 -358 -135 64 -113 118 148 92 -190 35 182 27 16 -102 -298 38 -134 323
2899C23l81JJ03J53m27J11J45K69k14j06j40M00q8o8J27l61J5N8K39l14M21l70
2921a04j57L31k22O4K94l20j3N41k23L1n39L76l76L52r8k52K95J98l01J60j11
2942g4R4m8n2J49J18l11M4K95k11J8p2l3J05j13j9L90j97R5p9k28L12j62R9M3
2966A63J46k36Ll25L12j61L06J08j13j95k02K37J60k25j11J01k22MJ74l1J99j22
2988c0j51o1N53j46l87Q0p5p2N75k57o7O3J80l07J68k19M29l09K2J22k25N5K46
3011A87k68mj70L99l83P3p1J57k28K73N3j53R8N3K44k75K6j36J6k1J07L10m05
3034a18K46j12J42k68J52n2%k89J20M4L8R7j45K21k84P4J33j11o3K1l8J36J19
3057F3l69K96J38n5k46M36o0m41R1ON1R6N4j29J42M9L5l66n9N0M63n11M34r2k62
$$ plain form
2899 323 -58 -57 46 199 -228 -117 28 297 83 -23 -163 237 149 81 208 -153 -138 -80 159 -155 266 -104
2921 -104 -261 70 -152 -88 206 -114 -127 414 191 222 -317 59 -317 35 -63 -315 -20 178 -123 37 -74
2942 -74 20 -28 -80 69 187 -124 -80 215 4 22 -50 -83 22 -91 -110 280 83 178 99 -129 183 21 120 163
2966 163 309 73 76 -249 63 -98 208 316 203 8 -194 43 203 -22 -133 -32 -254 -250 -76 -107 92 -30
2988 -30 -181 -242 311 165 -222 -142 -217 -289 286 29 -38 25 205 -102 66 -153 276 -33 -11 111 -114 -59 187
3011 187 -81 -85 -255 144 -239 -166 -237 -80 -308 -35 18 -135 -37 16 260 -15 11 -125 -109 -130 -23 287 -118
3034 -118 128 16 158 -110 42 -10 -10 -299 -179 -135 -97 0 -145 76 -208 -134 -1 -112 -175 -154 -192 -56 63
3057 63 -306 -10 128 73 -173 263 203 -238 -147 -141 -90 6 60 -69 73 122 157 -209 -268 -218 245 -266 168 76 -186
3082a86J42K41k34N7J61k02j77K06q6J32j27k10M08m06M89l51K45l05J02N31m54
3103b4P0K0k22R9K55k84K89j69L21m14o5L30k57p2J24P0k77J86J8o9J38l17K04
3126d6o8K20J8j09k9k78M67n18M15P3N4L2R9l04J04j22j51L75m08OJ64M28n8l56
3150Hj24Q1MK64r5j00K03j39m3J44J26o01L64j47Ql3J50j34j26J54j06J68k6j73
3174a73L38l66O2R4J80j08J26k44m3K81m2NQ8j59m9R6k86J63k19J44k39M01j00
3197e0j66J32L39n78K16K62p6j79M2J96j16j99j9K07K1j63K58L6Jp2lp2J5R6j09
3222A9k80L28J4j15J60j89K23j25l1j78K69P4j76K21k33K18j06J1mm5k64J44J19
3245E4m07N30j77L63m95n5L55l0j51j08K2j01J80J02j03j25o3J30J17L7o2k58
$$ plain form
3082 -186 -44 197 -37 20 181 -21 -198 8 -78 54 -73 -283 125 -281 208 -143 102 -203 -101 430 -24
3103 -24 46 66 -156 -57 198 -86 203 34 355 -59 -124 206 -51 -123 1 71 -206 -20 -2 -71 67 -250 -46
3126 -46 -114 106 124 15 -14 -292 175 -343 72 145 199 231 330 26 130 8 -143 232 -176 -170 -6 422 364 8
3150 8 -116 -35 -31 233 138 38 241 102 59 203 329 -272 92 -55 -47 -80 70 -64 -190 -36 -142 26 0 -173
3174 -173 165 -201 -139 -45 135 27 153 -91 -134 147 105 110 198 39 -10 86 -200 -37 -256 -112 -351 50 -50
3197 -50 -216 -84 255 -323 -107 155 79 -100 -58 138 22 -177 -196 11 32 -131 127 163 164 92 89 17 32 128 19
3222 19 -261 67 81 -34 126 -63 160 35 4 -174 95 169 -7 214 -19 199 93 104 100 55 -209 -65 54
3245 54 -353 177 0 363 -132 -187 168 138 -13 -121 -99 -200 -20 82 -21 -146 -209 -79 38 75 13 -245
3267b45J19K96k49N0j04j20L70O0j08k28Q0r9K23k00M7N3J43k79M08j26n5M5l10
3290b29J58j29J53k58M23jl97N16l37J71L0k50N6j71K22J71j02M4k72J22j81j07
3312c68M53m31L89l3M7l6K83l63k30M55J06k18LJ27j91k53L86k47M92m32r6K86
3334A29J2k9q5k16P2J46J3o5K97m66L07m22N97m58J82O3K34mm90K88k68K21j28
3357g0o1L46l20J84k05J14J21k65K66j35M72o92J55K12j20J39j79N10m79M5j87
3378a49P7l3J32p1n1K12l13K76J76k9k62K45l18O4L9j84N18m12J60M7m23M80k22
3401d1K28l34K52k12L54k83m9o0J88n9L0J08nJ2k86L36r3j6j10k59L26j26J96
3424I7J84l24K23j92p0m2M5l1J12l62J56L36j13j66K92o1LK05n17K4J58j94J96
$$ plain form
3267 -245 -126 170 -79 -29 -133 -253 117 177 69 -159 -79 -178 45 -155 -108 -55 88 -191 217 91 36 81 -229
3290 -229 -71 -200 -47 -305 118 117 -280 236 -101 70 100 -150 -94 -265 -43 128 26 70 -202 -80 -261 -368
3312 -368 85 -346 43 10 57 21 304 -59 -289 166 272 54 57 184 -7 -260 126 -121 371 -61 -157 129
3334 129 141 112 27 -189 -117 29 42 -23 274 -192 115 -307 290 -168 14 77 311 307 -183 105 -163 58 -70
3357 -70 -131 215 -105 79 -126 -12 109 -156 110 -25 447 -245 -90 122 2 141 -38 472 -7 38 -149
3378 -149 -72 -105 27 -44 -95 117 -196 80 256 227 -35 210 -108 -44 -5 -189 329 -83 77 124 -299 181 -41
3401 -41 187 -147 105 -107 247 -36 -85 -145 43 -16 14 122 117 129 -157 179 86 70 -40 -299 27 -99 97
3424 97 281 -43 180 -12 -82 -124 -79 -110 2 -360 -204 132 19 -147 145 84 87 292 -225 -201 -43 -237 -41
3447d1K70k20k55L71M3l87J31J42j68L03l42qL13j65l83O28m40J08L09l44L06
3468A71k00M2p6R0J71k68Q5n0p3J60l55N80j96j91K56l11K30P9q5j84R3K78k01
3491D5j31q5K33o4K88k16j5l4r1O3j88J48J88l11M17k61l75N75j97k31J28n6M98
3514C28l26J07N4j97J33p3j73L10j12l50L43l6l43R0J34m5M9J88k35M96k70n1
3536B1K39k40J81j75K7j52J24k11Pm0K25O1q7n1N9J68M0k42l7r2M46m62K14J40
3560A63L7l11J96P3R8K8m07K49r1P1k28R1P7P0J71l77p8J51o7pj49K77k02R4o1
3585a32J57Mj91K96q1p7J0K56Mm19J23r1o3K56J05J6k63L4K5J94m0j02N3l85M53
3610A42Pk05K06m72M63O7j43L37l93J4k29K26j24J86j57q5Q0N7J35K5J6l9j76
$$ plain form
3447 -41 229 9 -246 125 168 -219 -88 54 -114 189 -153 -161 152 -13 -396 232 -208 -100 209 -135 171
3468 171 -29 13 -63 27 198 -70 15 -35 -108 52 -303 277 81 -110 146 -165 65 144 59 -125 -32 246 45
3491 45 -86 -171 62 -2 286 70 55 21 -70 -7 -195 -47 141 -170 247 -14 -389 186 -11 -242 -114 -170 328
3514 328 2 109 163 -34 99 26 -147 163 51 -299 44 8 -335 -245 -111 -156 -107 81 -154 342 72 21
3536 21 260 20 201 26 53 -99 25 -186 -179 -219 6 67 -20 -71 -12 156 196 -46 -83 -175 271 -191 23 163
3560 163 200 -111 85 158 256 284 -123 126 35 106 -122 -31 46 116 287 -90 -168 -17 -84 -91 -240 37 -165 -71 -132
3585 -132 25 29 -162 134 53 -24 -14 242 246 -173 -50 -141 -204 52 157 173 -90 -56 -31 163 123 21 74 -311 142
3610 142 149 -56 150 -322 141 208 65 402 9 23 -206 20 -104 82 -75 -160 -80 -23 112 137 153 114 -62
3633f2J72j21Q0k89L28m16K74m7k7J93j88J84J15J01k89N0m3l08L43Nn4k66L99
3656A34j92n9L00k78M2M27l63J74j56l50K93j94K71J5j09K6J79j59j7j88K88l40
3678b56L6J82l0L46j90l14L92k15k35J19R3m7k2J44J4J9m1j19K32j23j98L01k78
3701a90L8o9M10m0J00k79j97m6K53J6J53j36k25K49o9J92j08l19L11j25K51n75
3723d05M32j44M7r0j74N60k13J69l92K80P8j43k17M69m10K92j13k53M89k63j23
3744a24P4r8K65r4j01J02L59m54o3J90m22K32J4r9P8L29m5k00j25J33j09k5n8
3767b41J50K6K02k44J82J46m47N68j39k35j42K22p5k9R6l14K24J93l28r6M03k13
3789i1J50N1j74j39K23P1J64j81j33J24o6J34J88k20r7O5k25K88k82k81N12k52
$$ plain form
3633 -62 110 -11 69 -220 108 -308 -34 -81 -108 85 -103 81 196 297 8 58 15 -293 50 55 1 -265 134
3656 134 -58 -117 183 -95 -53 374 11 185 29 -321 -28 -222 49 64 -45 -19 160 1 -16 -204 84 -256
3678 -256 -220 -38 -68 278 88 -226 166 -49 -284 -165 -72 -119 -141 3 17 36 -5 -124 108 -15 -213 88 -190
3701 -190 -152 -221 189 149 249 -30 -227 -273 -20 -4 149 13 -212 37 -32 160 52 -267 44 -81 170 -405
3723 -405 27 -117 -70 -160 -334 226 13 182 -210 70 148 5 -212 257 -153 139 26 -227 262 -1 -124
3744 -124 -50 -148 117 23 -78 24 383 -71 -134 56 -366 -134 -120 -219 -141 188 143 -57 -182 -49 -158 -183 -241
3767 -241 -91 -65 137 -107 75 221 -226 342 203 -32 -174 48 -27 -56 40 -274 -50 143 -185 -281 122 -91
3789 -91 59 110 -64 -203 20 91 255 74 -59 65 -1 133 321 101 4 69 -156 132 -150 -431 81 -171
3811a71J21J75q6mj68K91M9o74M89p2K97n5q7k63L72q6j38J13l39K32J51k23M4
3834c2K55m74L50P3k99J81P7p9o7R5J05M2m56K97j32j08N00m54J76l07R1L48l9
3857A43k97K28k34M06l18J06o6j49L00m06L32k2J00k5J45l59M6J17rkj9J57L8
3880B12j10l7J29l00M24k28l60K8K79J48Om12K60J86k06p7kL21k36P4j48j47L94
3903A98j02j72K04n1r0QM1N8J08p6j95ll08M17L10k32m94M33j10J40k99L31j29
3926a3N0j70j6L43k98jn2K66j13l87M39k27J0K21k45P3J27L3k30R8L61l92Q6J90
3950A53L9k1Ol86K81l3MK25m52q6M54J8m12O5q5K02r9K38k50j0p1K02J93J2L5
3975B22j57J13j36j17J18l60M24Q6k60pJ24N3k15Q3k5K4J56n05K54J63l15P6K53
$$ plain form
3811 -171 -50 125 39 35 -133 158 207 -467 22 -50 247 192 105 -158 214 128 -10 103 -236 -4 147 -76 -32
3834 -32 223 -251 99 172 -127 54 131 52 -15 80 185 227 -229 68 -64 -172 328 -126 50 -257 -166 182 143
3857 143 -154 74 -160 246 -72 34 -32 -181 119 -287 45 23 123 98 243 -116 -70 47 38 36 17 174 212
3880 212 102 65 194 -106 318 90 -270 -242 37 185 191 -221 39 225 19 -58 -60 261 25 99 -49 -196 198
3903 198 96 -76 128 77 -13 -5 36 94 202 126 -69 -72 -380 37 347 115 -379 54 -56 84 -215 116 -13
3926 -13 37 -133 -149 194 -104 -105 -157 109 -4 -391 48 -179 -169 52 -193 -120 7 40 -190 -92 269 -123 -37 153
3950 153 192 171 177 -209 72 39 43 268 -184 -270 184 202 -210 -145 -230 -28 -127 111 -139 -149 -220 -18 175 187 222
3975 222 65 178 42 -75 43 -317 107 193 -67 -74 50 103 -112 -29 -54 -30 126 -379 -125 38 -277 -201 52
3998E2j60oJ99j42j69K89K29o0m68o5K59L5J54l82J39J00K7r1P9o7K24M1j72l42
4022b97M85m92M35l64J49J08j18K07k79J19Q1nk50P8J86J99l49K7L02q9J27J5
4044B75l12P3L16m19j5m3J53n8J56k65J19j49n6J05J15k07J05J40J2j68K14P5
4066A66l6J11k51k09J49m6Q5K37l00Q3p3K01m11M72l02p0j20L71n8J59M4m60J3
4089b45M1k4J96J91j59RJ7k72K73J71l01n0M16l10n1J73j97p6L76O7k39J06j07
4112EM9k60k8M78k21O7O2k51J11J27k01l6N9K61l26m9R7L30O7n06K80j35k3q3
4136a26K55J24m23k65N59K8j66n4K15pM7k03j69J94p3R3rL18n15K69Q3j28P3l17
4160a97M45m82m2K48P7O1k49R3j8L82n32L39l09L57l85M00n6J50m79R9J61j3Q0
$$ plain form
3998 52 -108 -114 85 -57 -226 63 292 232 -236 -301 -42 -7 147 -235 -96 4 31 -60 19 -48 176 217 45 -297
4022 -297 188 -304 131 -233 -84 24 -94 113 -166 -47 34 29 -221 -143 43 242 -107 -80 222 133 260 275
4044 275 -37 36 352 -67 -82 -125 28 -30 126 -139 -20 -169 -225 -120 -5 -212 -107 33 45 -123 91 166
4066 166 130 241 -10 -219 -70 -116 -31 206 -94 -11 -84 117 -294 178 -124 -194 -314 57 -1 158 202 -258 -245
4089 -245 -204 -228 -32 159 0 9 26 -246 27 198 -103 -153 263 -47 -98 75 -122 -198 178 245 6 112 5
4112 5 54 -206 -234 244 23 90 152 -99 12 139 -62 -98 -39 222 -104 -153 -56 274 341 -165 115 -20 -43 -126
4136 -126 129 253 -170 -435 124 152 -14 -68 147 140 187 -16 -185 9 -64 29 20 338 -177 92 175 47 120 -197
4160 -197 248 -234 -276 -28 49 110 -139 -46 -64 318 -214 125 -184 173 -212 188 132 282 -197 -98 63 50 130
4183A30l87K32q3K91k51M4j8k04M53m09M7j79K31p9j9l4R3M12q8j22k76J18J02
4206Dj56j78M56l18M37n46L35M8l28K28j10L42l99O9L17J36j77j90Q7k1J26l65
4228b03J67j81k0K04n2O7k5K68p0J26l29n5L47j12j69J22k38K23n4j7k68M74j21
4251H4M2J75l40rJ10j84j18Jj3J42K72l17L5K76k08J6K46m79K54O0j70K58k45
4274a12j3J86K7k0j15K65J65k27J72j88k5j93K66k49P7j60j94N41n61J89K45o0
4296A6K29k30k44L72n5J9P4j57P3j47NL93o97M63n1K98m36p8J71J4J4n0oO0k60
4321b10K78Q1j58J37Q0j77K17k67J51j47o6R3r6L32l45J62r9K93j50P6j81J2m24
4344d08J43L30m9j18P3J32l5k44K74J6j7L0kJ12n4k57O2J9j20O5P7m0L7j35J26
$$ plain form
4183 130 -257 -25 -108 183 -68 -24 -42 -246 207 -202 -155 -334 -103 -182 -201 -235 -142 270 182 60 -216 -98 4
4206 4 -152 -330 126 -192 245 -301 34 82 -246 -18 -128 214 -185 -116 201 337 160 -30 57 36 162 -203
4228 -203 -36 -217 -237 -33 -85 -18 -43 225 155 281 -48 -103 244 132 -37 85 -153 70 16 -1 -269 205 84
4251 84 126 301 -39 -48 62 -122 -240 -239 -252 -110 162 -155 -120 156 -52 -36 210 -269 -15 45 -125 133 -112
4274 -112 -125 61 88 68 -47 218 383 156 328 140 115 -78 188 -61 16 -144 -338 203 -358 -169 76 16
4296 16 245 15 -229 143 88 107 181 24 97 -50 -45 348 -349 114 63 361 -75 -153 18 32 46 -4 -10 50 -210
4321 -210 68 149 -9 128 208 31 248 -19 132 -15 -81 12 -84 248 -97 65 -34 259 109 185 4 16 -408
4344 -408 -265 65 16 -102 -29 103 68 -176 98 114 97 127 125 237 183 -74 -12 7 -113 -48 29 -11 26 -109 17
4369A7j19K98n6k89N8J14j14J16J1m8L9K1K05k43j41L26J56l46K4q9L37n6m59
4392b38N21m46j65K52r8L48k57J64N3k6j41j78M24J69l44n9K34k20p6k72K61J15
4414B1l45J03K17R5l35K79j99K32J29J38l03j45K79J63l28J13m50N30r7o9J92
4435B20l68j03l0K49K45Ol81L57j84r8J61j80J92k12J42J56k76J93J07q1j95Q6
4457Fj24M33l88K55j58j28L51q0On2j35J58k11J78r7J97m59L73l01J32J25k66
4479a85K03J00j17k23K44k31J91O9J90L8k48k17J77K26m15L08J26l90J93j82R2
4500e1Qj9o2M48n83K02J14J55n91K61M3P2K47j62l15K90K5j26j65j49L96J79l77
4523a60m0J93r9KQ3L52k27Kq9J23jp6L51k60k12J42l56J61K68k05N9K8K37n85
$$ plain form
4369 17 -102 196 140 -149 -91 23 -91 25 36 -12 27 48 253 10 -131 195 351 5 29 -60 277 221 -238
4392 -238 283 -163 -328 -76 -174 174 -83 81 134 108 -33 -211 213 382 38 -21 213 -7 -83 -355 -94 21
4414 21 -324 -221 -4 91 -244 35 -164 68 197 335 32 -113 166 329 1 114 -336 194 97 28 220
4435 220 -148 -251 -281 -32 213 219 -162 195 11 -87 74 -106 86 -126 16 172 -104 89 196 115 -80 6
4457 6 -118 315 -73 182 24 -104 247 167 173 121 -14 144 -67 111 14 211 -248 125 -176 -44 81 -185
4479 -185 18 118 1 -222 22 -209 -18 51 241 279 31 -186 -9 217 -198 110 236 -154 39 -143 -51
4500 -51 -43 -62 -124 324 -259 -57 57 212 -379 -118 -75 -3 244 82 -233 57 82 -44 -209 -358 38 217 -160
4523 -160 -200 -7 -106 -104 -21 331 104 106 17 140 139 63 414 154 -58 84 -272 -111 157 -48 11 39 276 -309
4547c09L97l22Q4o5K5J58J14j85j45M07k60j26O8K01L07m99K85j0J39m3k15K61
4569B67m72L09q0k09J8o3J86m7P2j6O9k9N8K1n0k8L1l48L75p6K0R4k09Q7K31k21
4595a0L9M8j82J37J43k44J5L04j61j06k44L21J30Kl30K02P5j45j25J44n8M2K48
4618B45k82Q4l01J24j4r6K39N6j4j17r3J02L75l81Mj40L86l51K1K05q1J45l66
4641b50J35O0n6Q2N6j31J48m8J42k75K19J71j19j29j06M29k44j01J02j81J63n0
4663A7j53J53j11R0J31j15k78J39L76l69j07L2l9K71J35j66M01l40J42k33P2l66
4685c18N98j08k16M6J10j90R3r3L05q9m37K70K15l41N5q9J83r8o2K39K25l25J6
4708a1J55n7K24j39n2r7j19J34j2p3J13J20j36o8J72j14L65m96K13K3j28N5q5
$$ plain form
4547 -309 88 -234 -150 -215 -190 -32 82 -103 -248 159 -101 -227 -159 42 349 -150 135 125 264 221 6 267
4569 267 -205 104 24 -185 -167 -230 -44 -91 -19 -35 34 5 63 84 34 6 37 -311 64 -12 8 102 -107 -20 211 -10
4595 -10 29 77 -105 32 175 -69 -54 250 89 -17 -261 60 190 192 -138 64 139 -6 -131 13 -45 -3 245
4618 245 -37 47 -254 -130 -144 -240 -1 55 41 -76 -169 -67 308 -73 -69 -209 177 -174 -153 52 -29 116 -250
4641 -250 -115 -55 -111 -29 27 -104 44 -4 138 -137 82 253 134 5 -101 328 84 -17 85 -96 67 17
4663 17 -136 17 -94 -4 127 12 -266 -127 249 -120 -227 -195 -234 37 172 6 407 67 209 -24 48 -318
4685 -318 280 172 -44 2 112 -78 15 -78 227 138 -299 -29 186 -155 -100 -189 -6 -104 -166 73 298 -27 -11
4708 -11 144 87 311 172 120 23 -96 38 26 -47 66 186 50 -18 154 40 405 -91 122 145 17 72 -13
4731a3K6J67q4Mk4J44Jj35J05m39J61j30L27l07L20m71M34l46L97l06K07j19J27
4754D6J37k05k6q8N4J06j85L93j97m13P64n24K32j47M1N5L6J8L8k00N9k16L20
4777I8j55o5K39k49K11n56N71l3j3M9O9r2k31J8r0Q3j89L94j30L5j1K86m86J53
4801i4J69j35%j61N1L62k19K27j53j15Q9q4o2M22k5j91j32K85j54N9k32l5L79
4824B51k91L0L7jK09k88K37pj87K63m29J99o8K88l52P5J20j53K60M1j10m09M4
4847b41K04j89L91j90J23L05j70m14nL15j05OP1q7j51K32k60J91O9L60m28p6J30
4870H1jk23J85m28O0O29l15m6J35jp7j44m9j05K47j43K71j5L09k21j75J53J43
4893B70j49r3N9j47P8M6k7k79L92j65m53K04K19K9j04R5O9k42L70J04l51j28L92
$$ plain form
4731 -13 13 180 96 100 76 220 221 86 191 -248 -87 -217 110 -197 123 -348 86 -260 137 -169 38 -81 46
4754 46 183 -22 -48 -136 -82 24 -161 232 35 -378 386 -138 94 -53 -12 43 79 97 135 -65 -6 -222 98
4777 98 -57 -122 117 -132 79 -477 94 61 48 97 166 74 -157 -139 -229 -146 -335 59 -71 -36 -47 239 -247 -94
4801 -94 75 -60 -60 -221 -170 192 -27 200 47 -68 21 -63 -125 297 272 81 -51 234 80 139 -93 -128 251
4824 251 -40 -10 27 26 235 -53 184 177 -10 253 -176 23 -45 243 -109 -34 86 -67 193 234 124 -285 -241
4847 -241 -37 -226 165 -25 98 403 233 -181 -186 129 24 30 101 14 -137 95 -165 26 95 455 27 -49 81
4870 81 80 -143 42 -386 -326 303 -12 -58 77 76 -1 -145 -194 -299 -52 -195 76 61 370 149 -26 127 270
4893 270 121 28 87 -60 18 64 37 -242 150 -15 -468 -264 -45 -16 -120 -25 44 -198 172 276 -75 -203 189
4916A89K4j36j47J03J14l82K05J76L4j23k50L74P3l97J35J02J5l02K42k03P4%
4938h0J7l5j8m4P2J31k73L14k22O1k4q9M05O2k04K6p5LJ61k17R6m17K51J91j19
4963b7N6K45j01n8r6j51K30n1k54K30M4K26j18l43L73l31L25l70L6LJ08j8k14
4986b56n8J44K78m7Rk15J59j60j39L93k49K4J26k18J34q8K67K00k62r4J96j21
5008B3N1m74N45k55K77j09q7J44k16K10m74M25n0j73L06j3o3J5K4n6J59k27j53
5031a71J79K33k6P0l34J91m22M65k28r6J75j79L21m99K53L2J29j97O3J75j79j92
5053b37L26j65j41M05q5l61M17m10l51P08j51Q3L00l00k15J3J46p8n7J01o9L39
5075B18j07m69M12R5k47r7J63l3k98J65L54k50KR8Ll25L24kor6J9N4j21L45r6
$$ plain form
4916 189 213 77 -70 33 147 -235 -30 146 180 57 -193 181 254 -143 -8 94 109 -193 49 -154 -80 -80
4938 -80 -63 -98 -116 -160 -88 43 -230 84 -138 -77 -101 -190 215 277 73 99 24 27 188 -29 67 -350 -99 92 -27
4963 -27 29 274 173 115 19 -132 98 47 -207 23 67 293 175 -168 205 -126 199 -171 -135 -132 -24 -42 -256
4986 -256 -314 -170 108 61 70 -145 14 -146 -285 108 -141 -117 9 -209 -75 -163 104 304 42 -52 144 23
5008 23 74 -400 145 -110 167 58 -29 115 -101 109 -365 60 10 -163 143 130 67 82 106 50 209 -18 -171
5031 -171 8 241 215 285 -49 142 -280 185 -43 -139 36 -143 178 -321 -68 -36 93 -104 -41 134 -45 -237
5053 -237 89 -76 -217 188 103 -258 159 -251 -602 106 -45 38 338 38 -177 -164 -18 -96 -153 -52 -121 218
5075 218 111 -358 54 149 -98 -195 -32 -65 -363 -198 156 -94 -92 6 9 -316 8 6 0 -96 -77 -23 -144 201 105
5100A05l56M66k70K23%l94J78K28j29j83M62l30L89o20K64J24j96O2o1j29Q4K25
5122A42l14J8N62j11m2k34l32j18K28K27K52k94J95l01m3L70k15k19J93K54j75
5143D3J15j87J01j0j32j91L54k5Q1k24l27J87J33n5K92k36L9J42K47n17J8k2K79
5166A05j44l4K38m50K4K71m1j13P1k54K78J5K29n95O31j59k29J08n7j6L02l0k44
5189i4J64j90J68J4m4o6M0P5j00q7p7J41J73m22L55o4Q2k08M84Q4nm47j37J78
5213A7K0l2N9N7J21m17J75J08k29J21J04j84M7K37k44Q3j23J8q8m4J37J67k35
5236a25L8J55q1K14j52j24L24k51Q8o2k64M09l8K2J05m75M99q9j53j92J76l8n9
5259g3K01j14p9K27Ol08N0l10L34K35l96K71O4o4K79n39P1k9O7K9l9q1j6J69K18
$$ plain form
5100 105 -251 215 -55 168 168 -226 -48 180 51 -132 330 0 389 -231 33 157 -39 23 -38 -167 -83 142
5122 142 -172 -154 408 297 255 21 -311 -429 -201 26 278 -16 179 -122 -165 205 -10 -229 -36 218 43
5143 43 158 -29 72 62 -70 -261 93 68 149 -75 -402 -215 -82 -137 155 -81 -42 100 347 -170 -152 -174 105
5166 105 -39 -73 165 -285 -261 10 -31 -144 -73 -327 -49 -34 195 -400 231 72 -157 -49 -106 -122 180 150 -94
5189 -94 70 -120 48 62 18 -48 -8 67 -33 -120 -197 -56 117 -305 50 -14 68 -140 344 428 423 -24 -161 17
5213 17 37 5 64 121 242 -175 0 108 -121 0 104 -80 -33 204 -40 43 -80 -62 -150 -194 -57 110 -125
5236 -125 -87 68 -13 201 49 -75 249 -2 86 24 -240 169 131 153 258 -217 282 193 40 -152 24 -14 -73
5259 -73 128 14 -65 162 168 -140 -90 -400 -66 169 -227 44 108 44 323 -216 -145 -174 -107 -78 -117 -198 -214 -45 173
5284A73k81J46J08rk58l3J49j76K32j1N3j95P7j87J50J53k3j07J36J11o6n7n3
5307C2l5r7M10n16j60M13j97J62J53M0k51j04N0N8m2l8Mj20N7K10J66k62L04l13
5331g6j75K71j17J01K01m72L60l13K19l4J59j04k2J43l53J80o6L46k76oj80J61
5353e3J36Kk87L23Q3l78L63k18J0J3j30p4K31k5k0K68k68K5p1Q1K7m28K94j59
5377b55j01L11O7j28K3j03L07oM9k25nk05K49qOk11L21j70L69m37K47K00l70M3
5401c2J48l72N10N1l98k86L91Qj7l75J58m3L94p1k97L47N7j97J16j5r2Q4k67k12
5425d10M33R2n1k3j6L4k97Q5J86K73n39J90%j41J08j22N40j55j51N9r7kJ79n91
5449d16M23q5l6k6K77j74L14j97j11L13m19n4J26j2j26O2P3J47q5Q5j18j20M3
$$ plain form
5284 173 -108 38 146 137 -121 -154 -5 -181 51 40 93 -102 -25 -212 -62 91 68 -39 97 208 142 85 32
5307 32 -3 -100 310 -206 -366 47 -150 12 165 205 -46 -150 -100 -42 -84 -122 -118 -238 -181 29 195 -67 237 -76
5331 -76 -251 20 -97 4 205 -267 93 -220 -1 -35 124 20 -2 141 -212 -32 -98 248 -28 -34 -214 -53
5353 -53 83 85 -202 121 204 -174 189 -29 -19 -6 -136 -210 21 -4 -24 244 -24 1 -70 11 38 -390 -96 -255
5377 -255 -356 -45 22 -106 -83 -186 121 115 164 -61 -66 -271 -22 -30 -24 -235 86 -84 285 -152 95 295 -75 -32
5401 -32 116 -256 254 305 -93 -379 12 20 3 -372 -214 -257 137 66 -231 116 173 -24 92 77 -15 69 -198 -410
5425 -410 23 115 64 41 25 59 -238 -153 33 306 -233 -43 -43 -184 -76 -198 342 187 36 95 -2 -4 175 -416
5449 -416 7 -78 -114 -140 137 -37 277 80 -31 282 -137 -191 -65 -77 -203 -141 -68 79 -6 79 -39 -159 -116
5472a16Q4J89k00K19j34k40j62J63o1K92k9K9J6j68O2k02K83q7O1j7l9L1n1j12
5496a89J20M79l22j64K59k9n72L86P0j01J25L1j80J37%n2K16J35m55K69J49k84
5518B8L5j54JK17J96p0k57r9K05k82M29m82L12o0m6k5L55j77j95J23P9M1k22K85
5542B37j77m2k13J65k73L36l23J95k37M41j78L7o2J46k7k44L06nJ10j55J12j98
5564d9k5J69q6l20P3K43J25J0J0k77L55n4k95Q5k19K69J75qj91j92k3K97M2j18
5588dj45M1J33K7k4R4j51J70j13q7J67n0Q5J32k99j10P6J9M9J10j08J38N1k8j67
5613Fk5J50K07k54j94M5J16j53O7q6j07L10j05k1L50j75j41n5J55l32j17M98k25
5636h6l11M07j02K14j12Mj54K33K3k95K66k41K2R4n7O3p9K93q4j56%P3O9j92J05
$$ plain form
5472 -116 -32 157 -43 176 42 -198 -360 -197 -258 34 5 34 50 -118 -56 -258 25 -62 -1 -18 -57 -26 -77 -189
5496 -189 -69 410 88 -76 183 154 -418 -32 38 -63 62 93 -87 50 50 -2 214 349 -106 163 312 28
5518 28 63 -91 -90 127 323 253 -4 -103 102 -180 249 -233 79 19 -27 -52 303 126 -69 54 133 174 -48 237
5542 237 60 18 -195 -30 -303 33 -290 -95 -332 109 -69 -32 -94 52 25 -219 87 82 192 37 149 -49
5564 -49 -74 95 9 -311 -238 5 130 140 150 -127 228 174 -121 -36 -255 14 189 181 -10 -202 -225 72 114 -4
5588 -4 -149 -108 25 52 28 122 -29 141 28 -59 108 58 143 275 -24 -134 -58 -39 10 120 12 150 201 173 6
5613 6 -19 131 338 84 -110 -65 51 -102 -35 -121 -228 82 -23 -44 306 131 -10 -65 90 -242 -359 139 -86
5636 -86 -397 10 -92 122 10 14 -140 93 116 -179 87 -154 -132 -38 -95 -32 -111 182 98 -58 -58 15 84 -108 -3
5661cK16j28j53J50k42L97k67K36K00m94L06j73j46m1J20J38j14J57Q0l15J55
5682G9j8j06r7O8M28j91l58M3L5J03l5K12k60M6R3j46L23m85K08K8J16qj70K09
5706A17j40J14m46J69K20o2N7K23j28L0n2m24L30p4jJ90m83J59Q2J17J4o1R5J52
5730A98l92L25j70J7N2Q0l01J45L67m69L43k85nK91l50J80k05L42j26K28o27K39
5752a23L21m15L29O5%l52J61j01J88p6k39J78R5N8j7j1O9n26J58K77j23K80l03
5775a07J71k22M7K84k64L9l01N12m28M04j91N2j9M7R7J25j29l06J23m4J45j21
5797h6J86j63j31J58j23J5K60J1l90N4QK17J23k79K5r2J68l2L91j94J0j6j59J0
5821b9K35l54J00j88K9J29L02k05j92L37r3l14L21N9J19j25J0n61M03k4K42p5
$$ plain form
5661 -3 213 85 -68 82 -160 237 -30 206 406 -88 218 45 -101 -142 -22 116 2 159 239 -76 79
5682 79 61 -45 -142 -74 354 163 -195 -152 -117 -14 -49 163 -97 -51 42 -104 219 -266 -58 -30 86 78 -92 117
5706 117 -23 91 -355 -186 34 -28 29 252 124 154 102 -322 8 -66 -67 123 -360 -201 -119 -2 12 -49 46 198
5730 198 -194 131 -39 -22 30 110 -191 -46 321 -148 195 -90 -95 196 -154 26 -179 163 37 265 -362 -123
5752 -123 198 -217 112 177 177 -175 -14 -115 73 -3 -242 -64 31 89 72 61 130 -396 -238 39 -84 196 -107
5775 -107 64 -158 -111 173 -91 -52 -353 159 -269 135 -56 -4 -23 24 121 246 117 -189 -66 -110 35 -86
5797 -86 100 -63 -194 -36 -159 -144 116 127 -263 -209 -201 16 139 -140 -115 -207 -39 -71 320 126 136 120 -39 -29
5821 -29 206 -148 -48 -236 -207 -78 224 19 -173 164 71 -243 78 137 256 131 141 -420 -17 -41 201 126
5843A26j65k41L71j12j68p2J84R1J14l20R1K9r0K24j83P9M7J2J72k27J10L6l40
5866b32L08k24K64J6P0o9l23K38j25j35J10J37K58o20N06k26J69l87L0R1n8K86
5888H4J01q7KN4j47M2k94P2J65k50L28k37M57k75K5K20l4j79K2P7l12L00k01J66
5912I9o0J22k00R9J57k09m7J51j63lk04L13k25M0k74L73j5M15n13M6O3J44J46
5935B55l61K6J18nM2l6K60k97J58j79j43J58Q1m84N69l44K06J99l11N6J81l47
5957a98N02k47m9J91j81K93n76O0J60M8q4J15K46k79j20Q6P0M6k23J79l2J0o4
5980d7L99m18J33j52K62J54l43J32k17Q4J37k00k02oL03N3m04L2J19L91j06M5
6002A49l39J89J68j12K43l24J72j31m2K01p8o8K06k97j1l7K22J08l31J26J49j72
$$ plain form
5843 126 -39 -280 91 -21 -189 -261 -77 14 128 -192 -101 -72 -162 62 -121 -42 5 17 189 -38 72 108 -232
5866 -232 76 -148 116 132 202 133 -190 48 -77 -212 -102 35 293 -327 179 -47 122 -265 -235 -144 -202 84
5888 84 185 98 100 154 7 49 -245 -173 -8 -258 70 -167 290 15 40 260 226 47 69 146 -166 134 -67 99
5912 99 39 161 -39 60 217 8 -39 112 -51 -54 -258 55 -170 -130 -404 -31 -46 369 -144 -98 -35 109 255
5935 255 -106 -80 38 33 75 39 299 2 160 -19 -162 -4 77 -407 162 -182 24 223 -88 -32 149 -198
5957 -198 304 57 8 199 18 311 -265 -205 -45 3 -81 34 280 1 -119 -33 37 83 -140 39 7 17 -47
5980 -47 352 -66 67 -85 177 331 -12 120 -97 -13 124 -76 -278 -284 19 72 -332 -300 -181 210 104 149
6002 149 -190 -1 167 55 298 -26 146 15 -27 174 96 28 234 -63 -74 -111 111 219 -112 14 163 -9
6024iQp0m1O7K17l17K39m32L67k27K83R1j83j32J7J86j9k77K81j00j98M47k48
6047e0n49O76O5j27Q9k08M29m87j58K76J11j02J18M5J77n3j70J95n73L77j55j14
6069a88L38m2j04k29L94k47k6M54n14J04K25k52l5K10l1L97o86O33p13M09N0m40
6091b93J00J17R5K26m52Q8Q3J44N0j02R4k67K96k61q3J28p3o4O61m52R2o6k94
6114b33j0L89j37L14q7o88K02L85o3p7O30p66K14r2J05K65n00J12J34J70l03P0
6136C4R5k22k10K16j5j52K33J88j04J22M9m86j6L91k09L77m45o6K23K03J8k89
6158f5K16k06J6J4J4J45j49r2L61k52J96j48m9k20K23k35M40k46N3Q4k51O8k52
6181c35r6M37O5Ll00M17j51k37q6j31N01O0l0M4k08L5K36l00K3J26r9J75k16L75
$$ plain form
6024 -9 -1 -71 -112 -45 172 -145 94 -338 29 -198 85 176 -7 -139 -122 64 45 -232 49 -51 -249 198 -50
6047 -50 -599 77 142 15 104 -104 325 -162 -320 -44 67 -35 83 128 305 252 82 277 -296 81 -74 -188
6069 -188 150 108 4 -225 169 -78 -104 350 -164 -60 165 -87 -122 88 57 454 -232 401 -312 97 147 -293
6091 -293 -193 -76 19 245 -207 -119 -36 108 158 56 150 -117 179 -82 -165 -37 -110 -174 487 35 127 61 -233
6114 -233 -243 146 9 323 236 -452 -250 135 72 -5 625 -141 73 -19 86 351 -149 -37 97 267 -36 34
6136 34 129 -93 -303 -87 -102 -254 -21 167 63 185 234 -252 -268 123 -86 291 -154 -220 3 206 224 -65
6158 -65 151 -55 -39 -25 -11 134 -15 -107 254 2 198 50 1 -219 4 -231 209 -37 16 100 -151 -83 -335
6181 -335 -431 6 71 74 -226 191 40 -197 -283 -414 87 147 117 161 -47 -12 224 -76 -53 73 -26 149 -67 308
6205C08k44O3p5M6k87L20P7k39O3J91m1l75R9Q9Kj12j52M69k16j37L53j77K6j45
6229i4J11m4M9J96p8R4k22L6p7N0L81m36J71k12J48l50L65k55L04l33L50k32n0
6252a28L42j06j78J96p7k72K23j19L57P6j11l17j27R4J8N2L37k19m7J12l27M18
6274A97r0l71R1o1L76k22K49j78o1j03Q4J59j61k4J87ok11L86k11k57L05k55J01
6297g6K49j5k3K5j91M03p8k63k23L04p1j37j02K79l41K59q1j89N6L10J2k39K68
6320A36k24k20L83j82j92N41m07J77l06K78k99K07K78O1k72K10o2l50L39j73R9
$$ plain form
6205 308 64 127 52 98 -189 131 208 -31 32 223 182 -193 -94 -5 -3 -115 -267 202 -14 -151 202 25 51 -94
6229 -94 17 -27 22 218 140 234 12 48 -29 21 402 -34 137 -75 73 -277 88 -167 137 -196 154 -78 -128
6252 -128 214 108 -70 126 49 -223 0 -119 238 314 203 -114 -241 -147 -129 -77 260 41 -6 106 -221 197
6274 197 107 -264 -173 -234 142 -80 169 -9 -70 -173 -89 70 -91 -115 72 66 -145 241 30 -227 78 -177 -76
6297 -76 173 158 135 160 -31 372 294 31 -192 112 41 -96 -198 81 -260 -1 -82 -271 -215 95 107 -132 136
6320 136 -88 -308 75 -107 -299 242 -165 12 -294 -16 -315 -108 170 231 -41 169 107 -243 96 -77 22
$$ [...]
8191E9
##END NTUPLES=NMR FID
##END=
