##TITLE=1H_72-2024
 CDCl3
 8 sc, 
 6.9.2024
##JCAMPDX= 6.0         $$ Bruker NMR JCAMP-DX V2.0
##DATA TYPE= NMR FID
##DATA CLASS= NTUPLES
##ORIGIN= UXNMR, Bruker Analytische Messtechnik GmbH
##OWNER= root
$$ XWIN-NMR		Version 3.5
$$ Fri Sep  6 13:59:51 2024 Russian Standard Time (UT+4h)  she@DPX200
##.OBSERVE FREQUENCY= 200.1318
##.OBSERVE NUCLEUS= ^1H
##.DELAY= (6, 6)
##.ACQUISITION MODE= SIMULTANEOUS
##.ACQUISITION SCHEME= undefined
##.AVERAGES= 8
##.DIGITISER RES= 18
##SPECTROMETER/DATA SYSTEM= spect
##.PULSE SEQUENCE= zg30
##.SOLVENT NAME= CDCl3
##.SHIFT REFERENCE= (INTERNAL, CDCl3, 0, 15.7039)
##AUDIT TRAIL= $$ (NUMBER, WHEN, WHO, WHERE, WHAT)
$$ ##TITLE= Audit trail, XWIN-NMR		Version 3.5
$$ ##JCAMPDX= 5.01
$$ ##ORIGIN= Bruker BioSpin GmbH
$$ ##OWNER= she
$$ F:/spectra/data/she/nmr/H-F/1/audita.txt
$$ ##AUDIT TRAIL=  $$ (NUMBER, WHEN, WHO, WHERE, WHAT)
(   1,<2024-09-06 13:58:40.64 +0400>,<she>,<DPX200>,
      <created by zg, POWCHK disabled, PULCHK disabled
       configuration hash MD5:
       00 E9 B6 7A A2 85 ED C7 34 08 36 98 17 FE 4E 26
       data hash MD5: 16K
       5D 83 55 C4 1D 88 2B 53 14 A0 57 D3 7B 46 20 AC>)
$$ ##END=
$$ 
$$ hash MD5
$$ 61 41 4B C4 D6 08 61 C0 81 97 14 E9 0D 59 38 61
##$RELAX= 
##$RELAX= 
##$RELAX= 
##$RELAX= 
##$RELAX= 
##$RELAX= 
$$ Bruker specific parameters
$$ --------------------------
##$DU= <F:/spectra>
##$EXPNO= 1
##$NAME= <H-F>
##$PROCNO= 1
##$TYPE= <nmr>
##$USER= <she>
##$AMP= (0..31)
100 100 100 100 100 100 100 100 100 100 100 100 100 100 100 100 100 100 
100 100 100 100 100 100 100 100 100 100 100 100 100 100 
##$AQSEQ= 0
##$AQ_mod= 1
##$AUNM= <au_zg>
##$AUTOPOS= <>
##$BF1= 200.13
##$BF2= 200.13
##$BF3= 200.13
##$BF4= 200.13
##$BF5= 200.13
##$BF6= 200.13
##$BF7= 200.13
##$BF8= 200.13
##$BYTORDA= 1
##$CFDGTYP= 0
##$CFRGTYP= 5
##$CHEMSTR= <none>
##$CNST= (0..31)
1 1 145 1 1 1 1 1 1 1 1 1 1 1 1 1 1 1 1 1 1 1 1 1 1 1 1 1 1 1 1 1 
##$CPDPRG= <>
##$CPDPRG1= <>
##$CPDPRG2= <>
##$CPDPRG3= <>
##$CPDPRG4= <mlev>
##$CPDPRG5= <mlev>
##$CPDPRG6= <mlev>
##$CPDPRG7= <mlev>
##$CPDPRG8= <mlev>
##$CPDPRGB= <>
##$CPDPRGT= <>
##$D= (0..31)
0 1.2 0 0 0 0 0 0 0 0.06 0 0.03 0 0 0 0 0.0002 0 0 0 0 0 0 0 0 0 0 0 0 
0 0 0 
##$DATE= 1725616720
##$DBL= (0..7)
120 120 120 120 120 120 120 120 
##$DBP= (0..7)
150 150 150 150 150 150 150 150 
##$DBP07= 0
##$DBPNAM0= <>
##$DBPNAM1= <>
##$DBPNAM2= <>
##$DBPNAM3= <>
##$DBPNAM4= <>
##$DBPNAM5= <>
##$DBPNAM6= <>
##$DBPNAM7= <>
##$DBPOAL= (0..7)
0.5 0.5 0.5 0.5 0.5 0.5 0.5 0.5 
##$DBPOFFS= (0..7)
0 0 0 0 0 0 0 0 
##$DE= 6
##$DECBNUC= <off>
##$DECIM= 24
##$DECNUC= <off>
##$DECSTAT= 4
##$DIGMOD= 1
##$DIGTYP= 9
##$DL= (0..7)
0 120 120 120 120 120 120 120 
##$DP= (0..7)
150 150 150 150 150 150 150 150 
##$DP07= 0
##$DPNAME0= <>
##$DPNAME1= <>
##$DPNAME2= <>
##$DPNAME3= <>
##$DPNAME4= <>
##$DPNAME5= <>
##$DPNAME6= <>
##$DPNAME7= <>
##$DPOAL= (0..7)
0.5 0.5 0.5 0.5 0.5 0.5 0.5 0.5 
##$DPOFFS= (0..7)
0 0 0 0 0 0 0 0 
##$DQDMODE= 0
##$DR= 18
##$DS= 0
##$DSLIST= <SSSSSSSSSSSSSSS>
$$ [...]
##$SUBNAM2= <"">
##$SUBNAM3= <"">
##$SUBNAM4= <"">
##$SUBNAM5= <"">
##$SUBNAM6= <"">
##$SUBNAM7= <"">
##$SUBNAM8= <"">
##$SUBNAM9= <"">
##$SW= 24.0689170037331
##$SWIBOX= (0..15)
0 0 2 0 0 0 0 0 0 0 0 0 0 0 0 0 
##$SW_h= 4816.95568400771
##$TD= 16384
##$TD0= 1
##$TE= 0
##$TE2= 300
##$TE3= 300
##$TEG= 300
##$TL= (0..7)
0 120 120 120 120 120 120 120 
##$TP= (0..7)
150 150 150 150 150 150 150 150 
##$TP07= 0
##$TPNAME0= <>
##$TPNAME1= <>
##$TPNAME2= <>
##$TPNAME3= <>
##$TPNAME4= <>
##$TPNAME5= <>
##$TPNAME6= <>
##$TPNAME7= <>
##$TPOAL= (0..7)
0.5 0.5 0.5 0.5 0.5 0.5 0.5 0.5 
##$TPOFFS= (0..7)
0 0 0 0 0 0 0 0 
##$TUNHIN= 0
##$TUNHOUT= 0
##$TUNXOUT= 0
##$USERA1= <user>
##$USERA2= <user>
##$USERA3= <user>
##$USERA4= <user>
##$USERA5= <user>
##$V9= 5
##$VALIST= <valist>
##$VCLIST= <CCCCCCCCCCCCCCC>
##$VD= 0
##$VDLIST= <DDDDDDDDDDDDDDD>
##$VPLIST= <PPPPPPPPPPPPPPP>
##$VTLIST= <TTTTTTTTTTTTTTT>
##$WBST= 1024
##$WBSW= 4
##$XGAIN= (0..3)
0 0 0 0 
##$XL= 0
##$YL= 0
##$YMAX_a= 227102
##$YMIN_a= -227737
##$ZGOPTNS= <>
##$ZL1= 120
##$ZL2= 120
##$ZL3= 120
##$ZL4= 120
##$ABSF1= 10
##$ABSF2= 0
##$ABSG= 5
##$ABSL= 3
##$ALPHA= 0
##$AQORDER= 0
##$ASSFAC= 0
##$ASSFACI= 0
##$ASSFACX= 0
##$ASSWID= 0
##$AUNMP= <proc_1d>
##$AZFE= 0.1
##$AZFW= 0.1
##$BCFW= 1
##$BC_mod= 2
##$BYTORDP= 1
##$COROFFS= 0
##$CY= 11.3945322036743
##$DATMOD= 1
##$DC= 2
##$DFILT= <>
##$DTYPP= 0
##$F1P= 15.6554695791079
##$F2P= 12.8336369535428
##$FCOR= 0.5
##$FTSIZE= 0
##$FT_mod= 4
##$GAMMA= 1
##$GB= 0.15
##$INTBC= 1
##$INTSCL= 1
##$ISEN= 128
##$LB= 0.24
##$LEV0= 0
##$LPBIN= 0
##$MAXI= 10000
##$MC2= 0
##$MEAN= 0
##$ME_mod= 0
##$MI= 1.114404
##$NCOEF= 0
##$NC_proc= 0
##$NLEV= 6
##$NOISF1= 3.799351
##$NOISF2= 2.8
##$NSP= 1
##$NTH_PI= 0
##$NZP= 0
##$OFFSET= 15.70392
##$PC= 1
##$PHC0= -25993.61
##$PHC1= 12.58748
##$PH_mod= 1
##$PKNL= yes
##$PPARMOD= 0
##$PSCAL= 0
##$PSIGN= 0
##$REVERSE= no
##$SF= 200.130013532006
##$SI= 16384
##$SIGF1= 3
##$SIGF2= 2
##$SINO= 400
##$SIOLD= 16384
##$SREGLST= <1H.CDCl3>
##$SSB= 0
##$STSI= 0
##$STSR= 0
##$SW_p= 3612.71676300578
##$SYMM= 0
##$S_DEV= 0
##$TDeff= 0
##$TDoff= 0
##$TI= <>
##$TILT= no
##$TM1= 0
##$TM2= 0
##$TOPLEV= 0
##$USERP1= <user>
##$USERP2= <user>
##$USERP3= <user>
##$USERP4= <user>
##$USERP5= <user>
##$WDW= 1
##$XDIM= 8192
##$YMAX_p= 0
##$YMIN_p= 0
$$ End of Bruker specific parameters
$$ ---------------------------------
##NTUPLES= NMR FID
##VAR_NAME=  TIME,          FID/REAL,        FID/IMAG
##SYMBOL=    X,             R,               I
##VAR_TYPE=  INDEPENDENT,   DEPENDENT,       DEPENDENT
##VAR_FORM=  AFFN,          ASDF,            ASDF
##VAR_DIM=   8192,          8192,            8192
##UNITS=     SECONDS,       ARBITRARY UNITS, ARBITRARY UNITS
##FACTOR=    0.0002076,     1,               1
##FIRST=     0,             0,               0
##LAST=      1.7004516,     0,               0
##MIN=       0,             -227737,         0
##MAX=       1.7004516,     227102,          0
$$ Real data points
##PAGE= N=1
##DATA TABLE= (X++(R..R)), XYDATA
0@%%%%%%lPj2J6j6K4l2L2m0M8n6P2q8J04j21J44j70J98k30K63l02L46l93M44n02
31b67N70o42P19q06R01j005J120j245J380j529J695j878K079k301K547k820L128
48A646l479L878m333M865n494O252p187Q363r895J1980j4972J9568l6779K51366
62B25779k77237j28933M06527k56132j01396L58494j75941k57203K78448j5029
72E7377j87782K06129K8848k22798J77257J04292k03344M1375M9076j20724Q6383
83A6089M7219q5664k140O767M2518R424p2538N0519q599m2406J32104m4503j45872
96i7082J10138J2684j03425J14518J5492j50837J33620J23822j94479L2974J20026
107A17451k17201P0777K11743k61450J391K51096k06665m959K15949k36995n1472
$$ y = [0, 0, 0, 0, 0, 0, 0, -3, 4, -8, 8, -8, 16, -16, 16, -24, 24, -32, 40, -48, 56, -65, 79, -91, 107, -123, 140, -162, 184, -209, 235, -267, 303, -339, 380, -426, 475, -530, 590, -655, 725, -804, 891, -987, 1092, -1209, 1338, -1482, 1646, -1833, 2045, -2288, 2577, -2917, 3335, -3852, 4511, -5384, 6596, -8376, 11192, -25587, 225779, -51458, -180391, 226136, -29996, -131392, 227102, 51161, -206042, 72406, 57377, -130405, 75724, 104572, -118226, 59031, 163323, -40021, 1354, 50430, -70294, 16089, 63308, -22356, -24496, -17729, 24789, 34213, -38325, 12194, 3595, -38811, 93293, 48790, -97082, 13056, 25740, -77685, 36833, 52325, -98512, 35108, 158930, -35549, -2575, 117451, -99750, -28973, 182770, -78680, -77289, 173807, -32858, -37817, 178132, -58863, -110335]
118a10335K55099j24527r9565J66655r0742j02430J79874l3598j65122J27700
128C009L9238j02696J13473j2081j42212R4100K1518p1797N7285l2791j5915R1476
140D2607k1579j8779M126n4624L7774L8904m8467K504J5082j1261L4229J5282
152C5798o1767j1533N4773j9145N481L8194r0173O672R1649r4016n092P1911j01508
165g8756N6040J14574j25557o782P9496r1132J1509P7846r2145k4652J14163j5661
177A8943n0038O9078l7992o4291J12026o835r3576P4464n860m8442Q3027l6597
189A3907o6633O3129O041l042L5026l3703j8155K5429o08k2268j8743j686N808
202a5498L0884K1263l4541l218J3981j0710J9347j9969k8314L1903j590J1959
$$ y = [-110335, 144764, 20237, -79328, 87327, -3415, -105845, 74029, 40431, -124691, 3009, 42247, -60449, 53024, 40943, -101269, -7169, 14349, -57448, -163, -32954, -48869, 42607, 21028, 2249, 6375, -48249, -10475, 28429, -20038, -17534, -2452, -13713, 20516, 35798, -25969, -37502, 17271, -1874, 3607, 41801, -48372, -41700, 49949, -44067, -49159, 22752, -78756, -22716, 91858, -33699, -40481, 39015, -52117, -40608, 37238, -54907, -79559, 34604, 18943, -31095, 37983, -9, -64300, 47726, 40891, -52685, 21779, 15919, -32523, 50504, 13907, -52726, 10403, 16444, 13402, 48428, 14725, -3430, 21999, 21391, -877, -19620, -21306, -15498, 15386, 36649, 2108, -1110, 12871, 2161, 21508, 1539, -26775, 5128, 3538, 15497]
214A5497J3256n9013J8359L7724l3220L3035N065n0392M6227K3870n2009l856
226e457P745k1677J8974M3921l1441l1133N6304j0786l9757M2734l9166l8977
238d8716P9315r600m1128L3461k1462j4862L6826j0569k6590N651K5440M537j3018
251g15N786k5888j3996M3354q738k1514K1259m005P257J4860j9197j7734p396
264b6667K2853J4634k3203J5580j554k2369L9490j2935m6189K9435N393p187K8757
277A6038j2502k4144J0623J4086r215j6931J3198j351k618L6897k0689l2885K8306
290a187q338m075K5035k1458L93K3043k318q15j8344q689J1750j345J7015j856
304H811j9247K2796K415j2037N540j9727M50K0876J422J259j1909k189J0034r155
$$ y = [15497, 28753, -30260, -11901, 25823, -7397, 25638, 30703, -19689, 26538, 50408, -1601, -5457, 2288, -19389, -415, 43506, 12065, -19068, 37236, 26450, -13307, 29427, -9739, -48716, 30599, 20999, -20129, 13332, -8130, -22992, 13834, 3265, -23325, -17674, 7766, 12303, -715, 5071, -20817, -34813, 8541, -197, -21711, -452, -4457, 2800, 17660, -1537, -19271, -26667, -3814, 10820, -12383, 3197, 1643, -20726, 18764, 5829, -40360, -10925, -5532, -12719, 16038, 3536, -20608, -9985, 4101, -5114, -22045, -8847, -10198, -12816, 24081, 3392, -29493, -1187, -9525, -13600, 11435, -10023, -9630, 13413, 11095, 10280, -8064, -16753, -5003, -6348, 10667, 8811, -10436, 12360, 14775, 2738, 8278, -11449, -10999, 9877, 11299, 12558, 649, -1540, 8494, -661]
318f61Q044p438j4740L4033J515j4273J4715k6545o201K8300j6678m581J2645
331H135m893J0773O426j0082j5323k962J8663o688k072J4800k1959P750K1391
344B3959l1669k022J0145j2532K0840P477j3793J640l774N310l716j4480R788
357b827m616N212K2003j8607q059R512r268N965K400o224M016O91J2614r149k1469
372a7806J3393r617m099K9293j7689n393K6038j4067m725M616j8559K59J0304
385h052N493k928n498J1237o685k991J4780j9328J312K4002j3325M660L837k1671
399a5157P531K911n250P901k459J0289Q170p076M615j4694q643J3190j0546K791
413f427R679r918J1534L139j0268K673o129L780P327n349P125q436n192J2404
$$ y = [-661, 7383, -55, -14795, 19238, 20753, 6480, 21195, -5350, -11551, 16749, 71, -4510, 8135, 3242, 14015, 20441, 10359, -4964, -7926, 10737, 4049, 1977, 16777, -5182, 2568, 23959, -7710, -9732, 413, -12119, 8721, 16198, 2405, 4045, 271, 5581, 1865, -12615, -2827, -7443, -2231, 19772, 1165, -6894, 2618, -6650, -685, 1715, -4509, -493, 198, 12812, 3663, -17806, -4413, -14030, -18129, 11164, -6525, -11918, 14120, 53, -4672, -56, -18615, -18356, -8052, -2559, -5487, -10985, 252, -6433, -9424, 5356, -13972, -12660, 11342, -1983, 2677, 6514, -15157, -7626, -4715, -9965, -2064, -4523, 5766, 13936, 6860, 11475, -3219, -11862, 1328, -9218, -6427, 3252, -6666, 4868, 8007, -2261, 412, -5717, -1937, 5390, 41, 7166, -1270, -6462, 5942]
427E942j5668R52J3970j2004J6168J2177j7070O710l066j1234N034k931Q24K401
441B205O056J0651j1601J324M262j8480J1002N923j6903J4076P60j0888P893p642
455a362l459L306j203J1198n514j985J0367j7940l91Q927j8208R404J2980p529
469a409Q107L132o032n181j876L850j1107O040J6597j7021R306J2666k6142J0015
483I45Q044k2008J3927O619j3923Q128j464q565j97J552K214l396Q895N277j1034
498d986P208o489j5679J1559o077j618J7301p643P480J0423j5581O048k717j2712
512a3483J4224k906n393J1563n145o85N559l509j018K687P800k421l242O065j7256
527g160k890J3265k0098P175J8567j7235J8310J1173k7676R292J843k0773J2538
$$ y = [5942, -9726, -8774, 5196, -6808, 9360, 21537, 4467, 11177, 8111, -3123, 1911, -1020, -196, 2205, 8261, 18912, 7311, 8635, 12897, -5583, 5419, 11342, -5561, 8515, 9275, -1613, 6280, -1362, -4821, -1515, -2718, 8480, 2966, 981, 11348, -6592, -6983, 1944, -16264, -6860, 6120, -1409, 6698, 9830, 3798, -1383, -3259, 591, -10516, -4476, 12121, -4900, 4406, 17072, -9070, 945, 8989, -13019, 908, 7527, -6396, 1732, 268, -8297, -8494, -6942, -4728, -8124, 771, 6048, -4986, 2222, -4267, -19946, -8387, -14464, -16082, 1219, -6424, 1056, 11479, -4102, 1946, -771, -13483, 741, -2165, -7558, 4005, -1140, -1825, 3734, 225, -793, 1894, 9694, 7273, 4031, 10096, -7160, -10050, 3215, -16883, -9708, 8859, -8376, 9934, 21107, -6569, 2723, 4566, -16207, -3669]
540c669K797j2658J0862J0354o184k292Q734q127l357K1364j1248j1264K0808
553A6120j6813o271J9957k2762J571K3929j2400R991R128k0933N430J529j4876
566f400K492m93l696J0082Q477o471n576Q306r005k749J6188j9903k784K5395
580A3863k1031r82J8796k9640R031K6757k1868P314J3588k0516O511Q860j9773
593i090m289J2901p74N80J5596r838j1214J9375j1382j3808J7560j8084j25K9579
607A6987k2104k898J7605k4944R271J8639k6985N688J6916j5823L707R139k0277
620a5079m229K3844m136j0372K2776r693j4413K9487j6947k4951K6658r773m943
633a1771L0296j6500q163K0207j0612k431M624j4518L203J0751k758k165j443
$$ y = [-3669, -872, -13530, -2668, 7686, 1502, -790, 7944, -183, -3540, 17824, 6576, -4688, 16120, -693, -6964, 12993, -9769, -8198, 15731, 3331, 13322, 22450, 1517, 6947, 8476, -6400, -3908, -4401, -8097, 1985, 10462, 3991, -1585, 6721, -2284, -5033, 11155, -8748, -11532, 13863, -7168, -8150, 10646, -18994, -9963, 16794, -5074, 2240, 15828, -4688, 1823, 10683, -9090, -13379, -478, -1252, -672, 14924, 5086, -6128, 13247, 1865, -11943, 5617, -12467, -12592, 16987, -5117, -8015, 9590, -15354, -6083, 12556, -14429, -8741, 8175, -7648, -3941, 5198, -15079, -19308, 4536, 400, -9972, 12804, 3111, -11302, 18185, 1238, -23713, 2945, -6828, -11771, 18525, 2025, -6138, 14069, 3457, 1026, 5650, -8868, -5665, 5086, 2328, 163, -1280]
646a280o047K950J2795q167o826J7287r788k530K0892l2129r804L3066k2212J463
660a0330L2570k9526J347L5856k5644j3805J9647j7004p291K8719o262k4237K2791
673F831P651k3662K0465J351k9538K7091J0035k6346J2006n439j6541J8999j946
686I57q002Q306j208R771N064j4123l598k387l484P451K508r574P15J7168l779
701E785r886J2606j5108o926L3429j5854j8400K7316j7807q678L0508k2542j4565
714b0122K9933k979q175J5516j0463j9380J6669P409k3585P361J3427j7101J8305
727F815J1882l2625O631J3253j6628J2852J654j6313J2300O003m664j842q903
740i585K998P857J393K654n762l861N428L569m771j0662O877O240k945J4932q586
$$ y = [-1280, -7327, -4377, 8418, 251, -6575, 10712, 924, -1606, 19286, -12843, -22647, 10419, -11793, -10330, 22240, -7286, -5939, 29917, 4273, -9532, 10115, -6889, -14180, 14539, 8277, -15960, 6831, 14482, -9180, 11285, 12636, -16902, 10189, 20224, -6122, 5884, 445, -16096, 2903, 957, -7045, 1261, 53, 9824, 14888, 765, -2833, -5220, -8704, -1253, 1255, -8319, -7604, 9564, 5785, -4101, 8505, -6603, -13529, 19900, 4046, -14354, 12962, -4845, -13523, 16985, -5557, -20122, 9811, 6832, -1343, 14173, 3710, -15670, 999, 8408, -15177, -7816, 5611, -11490, 6815, 18697, -13928, -7297, 5956, -10672, 2180, 3834, -12479, -179, 5824, 1160, -682, -9585, -6587, 1270, 2663, 5317, -445, -4306, 1122, 4691, -80, -10742, -3865, 2375, -570, 14362, 5776]
755E776k0810K1150r78j7191J7026q495r968K7396j838j6868N146j642n171R263
769B796L660j4357J159J7520p817m772P165j7436N648K1707j4203j479O736j1707
783e380R152L692j5494M14L918O653P410m931l483l457K497N080p915l931Q55
798d920L609J1520o234o679K011p311J1623O870j8404P246P254r129J0400m789
812C067j8246P567J0853j076r50J651k000k853J1572n022j8954J0057N880m853
826c307J2566p178j1953J1512J065k035j049p791Q039O152j185K28j1411l078
840i425R612J031k341l795L200O530n61M014j0445j2475J7138J587q470J0225
854E825r275l785J6805o079j0372K341L47O395N832j841q155l424R088k400o333
$$ y = [5776, -15034, 6116, 5138, -12053, 4973, -3522, -13490, 13906, 12068, -4800, 346, -1296, -6467, 2796, 6456, -7901, -6742, 10778, 2961, -1811, 5354, -12082, -6434, 15273, 1070, -409, 6327, -5380, 3772, 7464, -8030, -7616, -3698, 2955, 10365, 5434, 1951, -1506, 991, 6071, -1844, -5775, -4920, -1311, 10209, 3975, -2704, -693, -8004, 3619, 10489, -7915, -669, 6585, -2544, 7856, 3067, -15179, -7612, 3241, 2165, 1215, 2866, 866, -1987, 9585, 4563, -14391, -4334, 1546, -3307, 9259, 2081, -9872, 1640, 2705, 670, -379, -8170, -131, 6021, 4836, 5064, -6347, -9425, 187, 1218, -1123, -4918, -1718, 4812, 4251, 8265, -2180, -14655, 2483, 4070, -4400, 5825, -3450, -7235, 9570, 3491, -6881, -4540, -4193, 2202, 8034, 6193, -1962, -5386, 3702, 1302, -5031]
869e031K758o777Q102J3791j0432k272k00o277J1291n56j0314M163K09M639M975
884H069j0701m120K059M272P506l630l885P62K000M803q839o286K890k392J3128
899E636M565j5672O607L639p434R480p043j2331J2095N907k606j008n062k066
913e293L090P802l758q613Q538K847k258N366j3471n950J2115j823L531J468r466
928e875R087M681p190l73o989r75J0505J698k841m088O83M980k620J261n272n581
944h909J3263K543n882J868r113J816R892o509J9j44j824J1773k238r888K26l660
960f767L831P364l515k928J285O678N94p601p0n647j07J5114o381o647Q267n399
976a929L430P022j2357j218O703J247L678n304n786N07J411N162l300l123N905
$$ y = [-5031, -2273, -9050, -948, 12843, 2411, 139, -61, -6338, 4953, 4397, -5917, -1754, -1545, 3094, 8069, -2632, -6752, -4693, -421, 7085, 3455, -430, 332, 2332, 7135, -1704, -7990, -5100, -7492, 5636, 10201, -5471, 1136, 4775, -2659, 6821, -222, -12553, -458, 5449, 2843, 1835, -3227, -5293, -2203, 5599, 1841, -6772, 1766, 4613, 2355, 7721, -5750, -11700, 415, -1408, 2123, 3591, -5875, 3212, 7893, 703, 330, -6659, -7634, 2871, 4569, 1728, -2360, -1677, 3303, 683, 1944, -3328, -8909, 4354, 6897, 1015, 2883, -6230, -4414, 5478, -1031, -1012, -1156, -2980, 8793, 6555, -3333, -3107, -6767, -2936, 4428, 913, -2015, -730, 5948, 6542, -1059, -1129, -6776, -6883, 8231, 1850, -4797, 3470, -1929, 1501, 8523, -3834, -5052, 1651, 2898, 6576, 1272, -4514, -4007, -2596, 2566, -734, -3857, 2048]
991B048J209N532j626j2389J143O0j6P034p553j129J0103j922K309k026r788N214
1007a797M168j203J009o891P71L712k15O80n471J972Q288L39K158n531q251O357
1023I5j794k973L004o567O727J0167n172K42l361n843P735n44m991o6j280M669
1039D8J770k481j925l995P423N669n590K950m410m277R046n646o610N061j159
1054d126O630O085n442q79j772N38K993o857j212K496M41P451k625n812J555j64
1070g00M281l64n105L013j838J857M548j1564p5O203l158P407J544q921M982J406
1086C516l640n62m652M04M405M342K087n657R03K552l768L783m951n194R308r01
1102A975j90K902r471K722O513m805K912j616l409N646j139m313k790k106M929
$$ y = [2048, 3257, 8789, 7163, -5226, -4083, -4023, -4039, 2995, -4558, -5687, 4416, 2494, 4803, 2777, -7011, -1797, 2371, 1168, 2177, -4714, -3943, -231, -446, 234, -5237, -3265, 5023, 5362, 7520, 1989, -6262, 95, -1699, -4672, -1668, -8235, -1508, 8659, 3487, 3729, 368, -5475, 2260, 1716, -3275, -3341, -4621, 48, 1818, -663, -2588, -6583, 840, 6509, 919, 3869, -541, -4818, 4228, -1418, -8028, -2967, -4126, 2504, 8589, 3147, 2268, 496, 1034, 4027, -2830, -4042, -1546, -1105, 6346, 3721, -2091, -536, -700, 3581, 3217, -1888, 1125, -713, 1144, 5692, -5872, -5947, 256, -2902, 4505, 6049, -2872, 2110, 3516, -124, -686, -5338, -4934, -529, 3813, 5900, 243, 1146, 3698, -70, 3713, -1238, -6432, 2876, 1975, 1785, 4687, -4784, -2062, 4451, -354, 2558, 942, -2467, 3179, 2040, -2273, -5063, -7169, -2240]
1117b240J766K213J208n035N027R78p207J536n272r67J0036k852J50K828n242
1132c073N979J535p152K972j023o46N664m037m482M45J359K197M5K818j235j196
1148A70Q124o415q011N377o961K52J1375p793N2Q903m804J750J262o835P0L005
1164d79J618j782j707J778k577L299L054n981M298L580k426N397n408o436N142
1179A370m919J058N749o493M897O245m917J226j594n915K460J888j379j572J949
1194E3J831l325M000j408p468R242P71n448P776n604n029Q563n661k320N888l351
1210a490L469M881l721j284r01j235m74j1J123k729M318L507o300L182j196p358
1226f219Q467j169o318Q398l573l472P433o327k749N020j744J531K370j482j841
$$ y = [-2240, -474, 1739, 2947, -2088, 2939, 3917, -3290, -1754, -7026, -7993, 2043, -809, -659, 2169, -3073, 2906, 4441, -2711, 261, -762, -1408, 4256, 219, -4263, -3818, -2459, -262, -217, 2601, 1366, 170, 8294, 1879, -6132, -755, -7716, -7464, 3911, -3882, -3830, 5073, 269, 2019, 3281, -3554, -3484, -479, 1139, -643, -2350, -572, -3149, 150, 3204, -2777, 1521, 5101, 2675, 8072, 2664, -3772, 1370, -3549, -2491, 3258, -3235, 1662, 7907, 2990, 4216, 2622, -3293, -833, 1055, -324, -1896, 53, 1884, -1441, 2559, 1151, -6317, 2925, 3696, -1752, 6024, 420, -4609, 3954, -1707, -4027, 1861, -1490, 1979, 6860, 3139, 1855, 954, -281, -755, -766, 357, -2372, 1946, 5453, -847, 2335, 1139, -6219, 2248, 1079, -5239, 3159, -414, -3886, 3547, -2780, -5529, -509, -2253, -722, 1648, 166, -1675]
1241a675n24J549l770O8M219l282M961L885p793M025k74p289O761k459m678R252
1257B976k319j873N265n306j789M188j616p73J519R22l036M41K602p100J745O600
1273B446o707N641N310r912M909J541r312N212j43m306O736P69j275K010p36j169
1289A014r91J286o36j680M812k399j996M482o312N89N706o079M564L868o760M949
1305D417j141p029M452j686k905N348J33n91K328j70k690j332K786l018q71O641
1321D672n086n25O971q985N04O895q768M599O231p584L174K477o308P82Q37k389
1337b503k86M634N69m011M148r04o511O239j498n547Q246j963l061O113o057j818
1353d210L968l881K808J978k522L543l58k209K09k084o27R27K256o7k384M669
$$ y = [-1675, -2199, -650, -4420, -4352, -133, -3415, 1546, 5431, -2362, 1663, 1389, -5900, 861, -1598, -6276, 2976, 657, -1216, 4049, -1257, -3046, 1142, -474, -1247, 272, 1194, -1842, -1401, 1201, -5899, -4154, 2446, -4261, 1380, 6690, -3222, 1687, 3228, -6084, -872, -1015, -5321, 1415, 2184, 909, 2919, 2183, 1014, 23, 1309, 673, -1007, 3805, 1406, -590, 3892, -2420, -1831, 3875, -2204, 2360, 6228, -532, 4417, 3276, -3753, 699, -987, -3892, 1456, 1589, 998, 3326, 3156, 466, -866, 1920, -1098, -1969, 4672, -414, -939, 6032, -2953, -2449, 4446, -4322, 277, 6508, -1076, 2098, 4575, -1733, -951, -114, -2503, -2789, 1845, 2414, -1597, 2551, 1647, -4864, 1375, -123, -5670, 2576, 613, -2448, 3665, -2392, -4210, -242, -4123, -1315, 663, -1859, 1684, 1326, -883, -674, -2758, -3385, -2458, -202, -269, -2653, 2016]
1369B016k286l898O819n994l059J0951n274k122Q388q693j688P479o070j471N738
1384H36p11m82L593k84o073J687L808o336L313L878p126O035K577p431M068j565
1400b13l501P469k387j602L869m115R99J832n132O34K740L72O85J583n98m472
1416a837L638J321p541N274K167o415R807o20j0128P679j146n710P352j825l745
1431a729N571P19k717j061k54j990P75M914l783j548M556m022R92J944p332L845
1447a120L046m000O411k768o155O873l092l849M872l124n39P127l45l963P44Q60
1463I78l789J939L478p605K651P757q086K319L415r966N802N896p490L617N22
1478A438m922M028j107m777K20J808K117J519J163k033j547L660k920l064K821
$$ y = [2016, -270, -4168, 2651, -3343, -6402, 4549, -725, -2847, 5541, -3152, -4840, 2639, -3431, -4902, 836, 125, -357, 3236, 2952, -3121, -1434, 2374, -3962, -649, 3229, -3897, 2138, 4715, -2716, 1352, -213, -3714, 3755, 1368, -234, 3635, -480, 519, 2351, -2781, -2147, 593, 965, 1650, 3233, 2635, -1837, 1801, 3122, -4419, 855, 3022, -3393, 6414, 5794, -4334, 3345, 2199, -3511, 3841, 2016, -1729, 3842, 4561, 1844, 783, 529, -1461, -686, 4228, 445, -1103, 3453, -569, 423, 2367, -4965, -1120, 1926, -2074, 4337, 1569, -4586, 2287, -805, -4654, 218, -2906, -3445, 3682, 3337, -626, 118, 978, -2811, -872, 2606, -4999, -2348, 5409, -2677, -358, 3057, -6909, -1107, 4789, -2701, 916, 1438, -3484, 544, -563, -5340, -5120, -3312, -1195, 324, 1487, -546, -2093, 1567, -1353, -4417, -1596]
1493a596m231L261O079o169J804K421n616O313J342o979N099O83k796L600l224
1508im531K798K930m0n6K625k184j98N294p381l795N593m767K456O589q310K170
1525h16M978n416K911k76m773L910K631j587j129j477R3L91K898k60l181M938
1541C835Q24j649K954o569k200N972l558J671K785n612M787K789n355P83k475
1556a018k187M841L4k293n74L08J149r70R70k969j562P044j661k932L476o320
1572d664L00P052n458r8M506k486L729J560n141j395l36J875L78j222J239n49
1588g10K236K496m488j034m73j137M756k515k574K691l449K692K755p195K658
1603c291L633j933L802j979m786J093J066n7j042K94K542R43M227m29o099K489
$$ y = [-1596, -5827, -2566, 3513, -2656, -852, 1569, -4047, 2266, 3608, -3371, 1728, 2411, -385, 3215, -9, -4540, -1742, 1188, 1148, 1092, 3717, 1533, 1335, 6629, -752, -4547, 1046, -3721, -1265, 5324, -2986, -816, 4162, -1254, 1657, 1381, -3392, 518, 3149, 1562, 433, -1044, -951, -560, 2338, 2078, -1103, 3835, 4659, 3010, 5964, -605, -2805, 3167, -391, 1280, 4065, -1547, 3240, 6029, 674, 1457, -1018, -3205, 1636, 1670, -623, -1197, -889, 260, -710, 260, -2709, -4271, 2773, 1112, -1820, 1656, -4664, -4364, 2688, -2770, -2868, 1638, -848, 2881, 4441, -700, -2095, -2431, -556, -178, -1400, -161, -710, 1526, 4022, -466, -1500, -1973, -3110, 1646, -869, -3443, -752, -4201, -1509, 1246, -5949, -3291, 342, -1591, 2211, 232, -4554, -3461, -2395, -2452, -3494, -3200, -658, 285, 4512, 4083, -2016, 473]
1619D73L03k168M047m180j154N562j397O45K7m335L555K273j124N81l692k77J547
1636F86j413n63k486J172M526N48J188j452m137L896j223k671J453l458K668N307
1652D041k395Q2m34j606M076j58k022M35j569K561L8k780n90j727L239L519k417
1669B293R30j355j654L570l830l422J670j980L913K875m571J127J88p16K235k764
1685a491k085J505J205K973k732k004J242j070L248J467m348J858J576m79J785
1700B650m558j655K318K84L237j168l306L677o07j204J98m512K70L326O41N66
1716A57k312j30J844j027J467k445k613M973L48j472J394m408J216M084j635J329
1732G70r55P3L405j049j920j320k464L389J708p77Q87j552K201J825l395k83k063
$$ y = [473, 776, -1392, 2655, -1525, -2679, 2883, 1486, 2131, 2158, -2177, 1378, 3651, 2527, 3108, -584, -861, 686, -727, -1290, -3776, -2604, 1922, 2470, 3658, 2206, -1931, 1965, 742, -1929, -476, -3934, -1266, 4041, 1646, 1728, 1294, -312, 3764, 3606, 1584, 2019, 450, 3011, 3049, 269, -321, -2048, 1191, 4710, 2293, 3223, 1868, 214, 3784, -46, -3468, -1798, -3778, 135, 3010, -1561, -434, -246, -962, 1273, -1491, -3576, -2071, -866, 2107, -625, -2629, -1387, -2457, 791, 2258, -2090, -232, 1344, 865, 2650, -1908, -3563, -1245, -961, 2276, 1108, -2198, 1479, 872, -332, -134, -4646, -4376, -1050, -409, 157, -2155, -2285, -441, -1468, -1, -2446, -5059, -86, 262, -1210, 184, -4224, -3008, 1076, -559, 770, -185, -112, 3293, 2244, 324, -996, -3460, -71, 1637, 860, 1747, 195, 2396, 4221, 826, 543, -1520]
1749a520p94M943j810j693J185j809K297J531l312O83L86J410K301k897j630j173
1765a902j44L538j430q49K474j21L353p5m997O61j050Q19L012l554P0K032o93
1782A144K512j864l566K177P09J316j31l058L28m60L38J083l781R69L500q98K694
1799C012k014m308L056m37j102J317k565J377L118m42r0k968L3K342o24J276j461
1816d80k013L895q57j664O33l762K501L500k107R38j036j932L304j565j730n7
1832b432o18L115P57r92o31k261K127J053k039J111r13M52M256k542j452M82k301
1849b828L126J462l318J947O4j90K231k871j473J046J226J812j232l55k63j245
1865h61L431k050l481L641n82O79M357m865j531L432k268N22N13k444J667J984
$$ y = [-1520, -2314, 2629, 819, -874, 311, -1498, 799, 2330, -982, -299, 87, 1497, 3798, 901, -729, -1902, -2046, 1492, 62, -787, 1687, 1566, 4919, 4844, -153, 508, -542, 277, 3289, -265, -195, 1837, 1144, 3656, 1792, -1774, 403, 1112, 2428, 2297, -761, -433, -893, -555, 528, -3253, -2284, 1216, 318, 3012, 998, -3310, -254, -691, -1793, -476, -3041, -1664, 1454, 1012, 922, -2046, -2013, 329, -295, 981, -480, -2493, 1402, 545, -1119, -486, -4248, -1747, 1753, -354, 584, -452, -2384, 920, -645, -2375, -2432, -3050, 65, 822, -170, -801, -3062, -935, 118, -1921, -810, -1723, -1271, 2985, 443, -1009, -527, -2828, 298, 1760, -1558, 389, 453, 263, 2494, -377, -1850, -804, 422, 2234, 1002, 647, 384, -861, 2570, 520, -2961, 680, 98, 777, 5134, 269, -1262, 2170, -98, 424, 937, -1507, 160, 2144]
1881B144L46r47k069J010m83R74J713l444J411K018j983J253k281k589L953m32
1897E94K38K038l915J440K587l638L26j99j423K605J405r24k107P34R13j891J748
1914E31l3l483M725J059m455K803k426k326M740j510k147L012j260J062J185k580
1930a103j157J14J229O66l82J19j633J332J639l608J335L15k244N627n29m530
1946b810L906j570k547M039k825j665L935J87j25Q77j226j584J015J711k444j69
1962a295K430k554J666J459n129K129J930k228M130r16l333L862j571k184J894
1977B90k369m56L846K78j091J075J17j536J241J312m406J580L426l783K170J355
1993C049n793L676K149m078L382N6k746L393o94l265L09m58J59J138Q50q22O3
$$ y = [2144, 2490, 1543, -526, 484, 1, 975, 2688, -756, 655, 2673, 690, 1943, -338, -2927, 1026, 594, 832, 2870, -1045, 395, 2982, -656, -330, -529, -1952, 653, 2058, 1134, -973, -239, 674, -1217, 531, 498, -2985, 1740, 2799, -1656, 1147, -1279, -3605, 1135, -375, -2522, 490, -770, 292, 1477, -1103, -2260, -2146, -917, -251, -633, -514, -2147, -815, 824, -2784, -1449, -1134, -3378, 2249, 1720, -2810, 1096, -474, -3021, 1018, -1807, -3472, 463, 650, 525, 1402, 176, -1408, -393, 1318, -1126, -1295, 1135, -1419, 247, 1706, -3423, -1294, 636, -1592, 2538, 1622, -1711, 2151, 580, -1604, 290, -2079, -2535, 1311, 1589, 498, 1573, 1690, 154, 1395, 2707, -1699, -119, 3307, -476, 1694, 3049, -2744, 932, 3081, -997, 2385, 2441, -305, 3088, 2394, -871, -562, -1020, -861, 277, 1127, 305, 368]
2010C68J918j476j104R36l553K247K682l449K280O69m197M387j57m226M147j1
2026A461k232L358j241l355J628R47j614N83J911j805K97L382l655j584K770l905
2042c054J111L679m253J661K725l788J934P6l721K197P07p65J053k20o87L67P33
2059b45p71m93K217j093K82K671l992O2K418l804K057K804m130L505J657l798
2075f53J676l30k883J514O24j338P47J540r83m04J932k009j265L263k029q51L629
2092B180l530n86L526l954J146L044k555K684J372k496N37n28j268J37J23J88
2108B0J29J804L64j251J348j255j524K468k042o18K501l029L50K342l531J572
2124c52J643k209K217P52j938L84l57j620n21R84J43n07K940K23j989K966j910
$$ y = [368, 2286, 810, -294, 642, -2911, -664, 2018, -1431, 849, 1518, -2679, 1708, 1551, -2675, 1472, 1461, -771, 2587, 1346, -2009, -381, 566, -1048, -465, 1446, -359, -62, 3320, -335, -1919, 851, -3054, -1943, 1736, -2517, -856, 1869, -1919, 15, 91, -3630, -1433, -726, -1491, -438, -658, -1345, -978, -245, -1016, -1509, 708, -385, -103, 2568, -1424, -1362, 1056, -2748, -691, 2113, -2017, 1488, 3145, -653, 1023, 693, -2190, -676, -52, -1390, -643, 897, -86, -490, 1442, -567, -1832, 1431, -598, -1449, 2180, -1350, -1936, 1590, -2364, -1218, 1826, -729, 1955, 3327, 831, 1368, 840, -428, -291, -168, 20, 149, 1953, 2317, 1066, 2414, 1159, -365, 2103, 61, -557, 1944, -1085, -735, 1607, -1924, -352, 1291, -918, 1299, 2051, 113, 497, 140, -1480, -2001, -1017, -874, -1381, 1559, 1782, -207, 2759, 849]
2141H49k091K650k134o38K795k134K80J813k308J329J13r93J418l31m92J12j071
2158h33pj134P88K01p46K343l63j083K209k526j516K667k128j9K729j947J072
2175b93J653k196O1N51m13M19L39O45j082k7J266j915M80J304j719J961Q81k143
2193b28J344j573r42J366j744R44J222q40J792R9k004P26q98m17P99n50N34M2
2211c28R71N58j544R21P1j244K608p33j904K284j403p40J570j854N80J596m3R46
2229B312o22q23j03j162L61n43q62J617k3M85J023j919P73K36j322J284j057o41
2247i86J556j098j81N65j595J552R03j6J013j417K35N24j808L08r89j46J697J65
2265B82M82K58j062R13k27j382Q79j332N39J365j426J82j48j036J613N3o33R27
$$ y = [849, -1242, 1408, -726, -1364, 1431, -703, -423, 1390, -918, 411, 524, -469, 949, 618, 126, 238, -833, -840, -1974, -1186, -985, -1731, 612, 249, -834, 1375, -1151, -2667, 0, -2128, -2147, 582, -1365, -293, 1360, -836, -775, -224, -637, -218, 121, 766, -316, -343, 923, -992, -512, 792, -927, 1034, 1915, -228, 1116, -457, -1399, -33, -1777, -833, 389, -451, 1341, 1440, -564, 162, -736, -1153, -354, -904, -370, -328, 643, 1201, -343, 578, 649, -595, 2013, 1280, -624, 1660, 257, -483, 1087, -767, -187, 1409, 1366, 2312, 1690, 867, 764, -398, -37, -580, -1442, 175, 152, 637, 1660, -259, 514, 750, -572, 712, -345, -986, 570, -528, -709, -144, -1739, -187, 716, 700, 1713, 296, 531, 1055, -753, -445, -1434, -1580, 117, 282, 764, 1022, -40, 873, 646, -736, 143, -1189, -650, 715, -711, -529, -677, -1713, -100, -47, -680, 247]
2283B47m49P47p4j650K15j133P49K090j080L60P11r06J031p26j176M77l40J136
2301B29M16j023P43o32j74J556j942N1J319n22J004m01j631M47j27L29L76o77
2319f59R51K85j50O47j999l30J260p96J524J84j398J496n17j51Mj849J011J287
2337H00p57J395q34j055J596p69k05O6r56J525L36n24Lj713N45J167r81O76j33
2356A82k56K092j266k68p75j703J623R00j248J278p83K07J481j308o82QK45J157
2374H84m67m41n0j073J732k37j504J040k47N12K025k002m56l1p58J198m02q92
2392a169J138R5Q44O53k476M32J15K92O48r41m0O55m57J002j666r72J764m74R82
2411D25P70j798N14N96j161R09j302m54J927j53L30k80j251J120k7k8J1j160J211
$$ y = [247, -202, 545, 471, -1179, -964, -2097, -1348, 742, -338, 22, 733, -173, 858, 132, -1044, -567, -907, 229, 645, -378, 365, -267, -441, 1115, -827, -776, 543, 21, 1025, 624, -1007, -560, -687, -358, 18, -659, 292, 577, 427, 1074, -925, -1255, 5, -791, 733, 917, -481, 1015, 498, 347, 351, -1498, -487, 800, 43, 1438, 604, -451, 1145, 376, 171, 237, -719, 806, 1142, 618, 621, -1092, -547, 620, -361, 315, 182, -74, 2018, 752, 484, -291, -1994, -371, 529, -719, 559, -224, -17, 1464, 156, -526, -518, -273, 884, 417, -24, -74, -1147, 585, 348, -1156, -116, -363, 149, 2174, 172, -284, -315, -1073, 125, -277, -1169, -31, 64, 908, 1561, -915, -483, -368, -76, 572, -369, -409, 246, -211, 791, -875, -1847, -83, -557, 425, 1195, -603, -89, 507, -654, 255, -1047, -1501, 426, 273, 603, 323, -928, 192, 165, 137, 148, -1012, 199]
2430A99P38n87M01j921j24J779r45J023L26j600K123mj587L16j443N01J537n15
2448B17j87r3j95J198o79jn99n87K214k79q89J67j173L38J447k064Q58N15n55
2467c47K660j272j870J092j134K94J171j228o1J133L04p4q82J87n25L55K002j872
2485f7p36J650j618R29N42k679J312J252l64J301j195q04O64n85N29p84o99J176
2503a76Q13M2j17j409N21k26P76O52k130J066J253j417J257p72k709K930P25j491
2521d12J147p33p23J396j04j351l50P50R33k99Q82j480r75K198r79r12J279j481
2539a214J105J914j858J93k34j037J837k36j292P17j01M18P65j411k15l6J234
2556E49N46o80N02j519M10J722k708J24J114j386K393Q00k638J121N39j094J073
$$ y = [199, 937, 350, 751, -1170, -1294, 485, -460, 563, 889, -711, 1412, 1408, -179, 137, -1306, -805, 732, 217, 30, -63, -258, 940, 261, 260, -339, -926, 1288, 1009, 120, 287, -886, -548, 899, -1165, -307, 208, -347, 2313, 1041, -829, 263, -871, -577, 594, -634, -695, 438, 742, 668, -214, -27, -552, -197, 1805, -67, -803, 847, -771, 158, 700, -1979, -667, 585, 221, 1522, 327, -477, 187, -398, 131, -653, -1352, -176, 637, 679, 562, -847, -326, -552, 224, 876, -1254, -188, 1065, -352, 905, 133, -2576, 354, 1079, -412, 735, 2, -721, 675, 571, -780, -1130, -380, 553, 254, 1136, -344, -1319, 879, -100, -1012, 267, -1214, -109, 1805, -53, 140, -94, -1131, 706, 470, -822, -105, -206, 212, 977, -434, -649, -685, 549, 1095, 415, 917, -602, -192, 1530, -1178, -1054, 60, -1326, 1067, 1867, -771, 350, 889, -205, 868]
2573H68j388p48R90L97K38n62j97o1R5J695q81q52J356q92j44J270k968p8K262
2592D00j332J685L77j553J699m3j091j13r76j90R03Q55m93r27R05L20l40J024
2610A110j279p97K356j132n11P66k372J059J603j697R52O54j003J862m37j588
2626d54j67q5K41M07L31l82o30J804j50j311Q89j099Q2J972j495o15J383j711
2644i90J192P08j663O17P33k39J047q86q91m32O54L78j054O27M65l37J796j084
2662F41j878J543r88J06J815k023k12J991j081M98kj397O17P19L9k93m00j21Q4
2681c42M48R3j254R02R03o89J453j655j197J750j057o5J165j499R79J900j628
2698B07P3k71p12M92M91l30q02K90Q69p61K83M96j438J804P50j868J358j092p74
$$ y = [868, -520, -1268, -278, 119, 357, -205, -402, -463, -368, 1327, 446, -406, 950, 58, -86, 1184, -1784, -1862, 400, -932, 753, 1130, -423, 1276, 1233, 142, 29, -947, -1137, -234, 621, 128, -799, 106, 426, 86, 1110, -169, -966, 1390, 258, -253, 513, -1859, -800, 803, -894, 58, 712, -291, 1571, 1134, -454, -621, -706, -465, -58, 273, -109, -739, 1065, 915, -396, 493, -606, -524, 1448, -47, -662, 721, -990, 202, 910, -753, -136, 597, 358, 1405, 519, -372, -804, -150, 228, -826, -199, 266, -71, 1725, 641, -1237, 306, -682, -576, 1239, -784, -996, 995, -86, 412, 410, -987, -370, 349, 388, 95, -305, -426, -342, 106, 199, -1055, -153, 750, 61, 1514, -141, -1338, 412, -645, -710, 455, -1044, -65, 1835, 207, 280, 9, -703, -211, 280, -50, -852, -562, 307, -454, -171, 325, -1113, 691, 1441, -427, 931, -161, -935]
2717i35J156r73l08N20j07J416O61r83l1m66K9M03p27o2k23L85J142j152J66M18
2737C29p76J616k57j484J448p14o23J056j695j37J152k16R99j49n06L38l28Q01
2755H54j177q90Q79j08P32P83j424L78P43q80R24q13o98J596r14J87J52j314L01
2774f89R91k47M24m78J87N12l27m1j118j32Q77o65N60Q08j465R24N64j206L72
2793a49l92k13J394m48L9m53o39J127l34m32O02m89Q99J96j010N24r99j42J202
2812B83n81L51M20r17J066l69j375R52n46K13P21j96Q2k33K17M87j224L00L58
2831Ip77J279J29j398J261n75k50J024j140N64M97n56Q15q28n87M76o81Q46K3
2850A31j29P95k64k4O23j856N02L26r60J125j87n95J170p98K38K55p33O12J07
$$ y = [-935, 221, -752, -1060, -540, -647, 769, 1430, 447, 416, -50, -21, 382, -345, -407, -630, -245, 897, -255, -89, 329, -447, 1169, 912, -572, 876, 162, -461, 595, -1100, -1237, -85, -301, 698, 549, 43, 381, 53, 854, -323, -1213, -334, -442, 290, 1073, -351, 27, 770, -110, 814, 1, -697, 899, -15, 172, 324, -990, -689, 302, 55, 479, 1, 188, 700, 373, 332, -786, -918, -41, -706, -146, 662, -803, 121, 685, -521, -149, -541, -754, 640, 192, 231, -222, -861, 266, -68, -500, 102, -387, 512, 708, -302, 222, -777, -919, 283, -298, 53, 473, -444, 622, 253, -1122, -170, -716, -503, 218, 22, 104, -129, 88, 575, -649, -349, 9, -768, 511, 640, -758, 503, -72, -322, 702, -438, 126, 623, 67, 882, 54, -533, -57, -738, 108, 131, 2, 797, 533, 509, 1132, -724, -222, 104, -856, 269, 82, -513, 657, -141, 97, 352, -381, 231, 338]
2869C38J2J31q61J98K02p24P65k79j37J406p37K44L74j465Q79m60o40J106n46
2888a94nR89r33kL88p93N57K12m67L17j04M15l03q87O38l28r9J421r78L53L88
2909E85j242Q65j71r49R92k71N9M75p28N45m92j06P02p54L38L92m92P87m54q56
2929g75Q37p11J55R13j086Q75K05j097P91j12o77R64m90K49J32m17O11o17P7K37
2949F4o34P73J02m85J046r02l10R45j373M15O68q91J044K18q87P61n86j15O29
2968D82m71K27QK14M2p55J89K09l92P15J14n20J118j219q7O84j162L44P40p66
2988b86P80m6k18L82o12l7K07n41Q09j23n82O16n17O6r0m64R34n47K77P16j056
3009c32P0O19j012P53K04q43P80J38l67K63o06O1J0J8M34m82L96J40l15K89k80
$$ y = [338, 350, 481, -380, -182, 20, -704, 61, -218, -355, 1051, 314, 558, 932, -533, 346, -114, -754, 352, -194, -199, 790, -143, -145, 243, -550, 7, 219, -248, 69, -35, 380, 77, -810, -172, -500, -599, 822, -156, 197, 585, -657, 208, 37, -912, 80, -191, -132, 343, -385, 160, -332, -438, 264, -490, -152, 240, -252, 535, 81, -775, 62, -649, -494, 419, -667, 208, 413, -684, 107, -5, -682, 282, -208, 41, 173, -244, 367, -250, -173, 64, -570, 203, 305, -180, 866, -36, -346, 599, -774, -359, 309, -582, 462, 680, -207, 554, -32, -147, 482, 11, 238, 246, 460, 502, -253, -64, 145, -247, 468, 582, 62, 1180, -39, -126, 558, -604, -260, 480, -286, 494, 448, 230, 612, 0, -37, 170, -371, 438, 315, -267, 349, -168, -102, -192, -656, 278, -269, 8, 724, -332, -262, 357, -655, 98, 302, -541, 239, 377, 10, 273, -333, -272, -262, -244, 190, -292, 104, 244, -71, 218, -62]
3030f2q03O17m07N34N86r45L34N55j077N79j63l91Q61k02l38N28p64Q8J09RM64
3051A12m14P83J60p86P27j020k96R13p36O9O63m51P48nr28J045o16q5P32o23j15
3072a23r0l67O41m82J11N3j6R39k31m54O56p91k26O56j069L17Q94n50R44R1p07
3093A96J08k54L82m5m36L11m2KN30r55K2N91m29Q27k33n67O45q95k29M94q38P09
3115a06R4l10J051m92m05N36n93Q3J21l79L80K01L8J7q52O91J60m23Q16o96k50
3136c18J062p99j93M11j104O50N11k27K93l89j65J45m95K72m73K34P91m19K43
3155C0Qo29O57m15n62Q37r18N34J049q55J22M4m75J141l59m56M84k74K24J27p98
3176d84mj64P76N9j11Q20l86n50Q06q28o59Q39n22L72M43j052P32K43k19K88l27
$$ y = [-62, -865, -248, -655, -121, 465, -480, -146, 409, -668, -89, -252, -643, 218, 16, -322, 206, -558, -470, -361, -352, 112, -302, 481, 641, -145, 582, -438, -734, 179, -557, -488, 175, -276, 472, 467, -461, 584, -32, -117, 615, -8, -123, -213, -580, 61, -421, -310, -257, -273, 666, 435, -19, 637, -154, -380, 276, -793, -476, 418, -132, 812, 903, 196, 304, 50, 432, 387, -49, 262, 220, 222, 752, -203, -181, 410, -19, 808, 575, 8, 653, -242, -471, 23, -815, -106, -12, -322, 729, 237, -168, 368, -225, -142, -21, -400, -20, 181, 219, 236, -616, 75, 235, -188, 628, -68, -318, 744, -55, -248, 163, -941, -291, 220, -7, 286, -103, -268, -123, -618, -346, -819, -585, 206, -213, 30, 38, -591, 66, -349, -911, -74, -992, -458, 591, -264, -142, -98, -573, 568, 209, -247, 237, -37, 187, 314, -484, -488, -652, 124, 183, 72, 892, 506, -44, 762, -66, -725, 114, -408, -36, 407, -645, 87, 330, 111, 399, 72]
3197G2k8M0L5R7m49l99M01j50O21M99p36O49J70m55M72j101R5L99l62M76J42o68
3219a80Q58L4k62m0m05K57o8j16Q5o16L13K55n89O33l14n67J367k50n58M32r69
3240g00K99M97m31J15K89j64P64k26m3j93n64M96m6m10K21k88M76K06p02M02m06
3261d08J68P36o98n0K87p78N90K32q66K11M28k1M40m35J40k04J6J80l61l53J007
3282B61o37P10L30j201N13K70j66J22k22j88M65j66L68l42o43O87J20J42K61r15
3302b31L1K30j59J75o39L22P31m20M90k24p11O98l34m17M65l24K10M88j58K14
3322D37l00k0P02p73K23J61n71P69l50n24K68k94M42M61m36L14l10k85N72m99
3342a3k26J03k72O63Qm97L02l67J45O26q94M59k38k07J046p78l58M71k64N99o8
$$ y = [72, 44, 84, 119, 216, -233, -632, -231, -381, 240, 739, 3, 652, 822, 367, 839, -262, -167, 232, -130, 346, 488, -180, 678, 712, 450, 410, 5, 262, 194, 78, 163, -453, -140, 115, -474, 159, -155, -722, 645, 395, -163, 269, -700, -401, 96, -335, -220, 69, -95, 669, 443, 400, 207, -357, 139, 93, -317, -96, -384, 92, 298, -404, -2, -408, -240, 496, -202, -252, 35, -743, -153, 79, -787, -576, -148, -169, 271, -164, -24, -228, -212, -32, -393, -746, 261, -376, 334, 664, -537, -24, 246, 80, 202, -20, -208, 257, 91, 459, 117, -526, 161, 281, 423, 684, -231, -200, 30, -129, 46, -593, -271, 460, 40, 530, 306, -405, 293, -41, -458, 7, -317, -107, 381, 223, 437, 137, 117, 819, 46, 269, 430, -141, 628, 278, -246, 22, -272, 170, 631, 195, 509, 199, -86, 486, -13, -239, -136, -408, 255, 263, -234, 68, -299, -154, 472, -422, 37, -201, -408, 638, -140, -498, -27, -291, 308, 240]
3363B40n25M10K3l2J60p99J29J61j61O60l49r3N37l67N8J36p26M06n3l3M82n59
3385b95l32L82Q1K15j83k26M91R8j53k55n85R08l77N3N90q17L15N52n68K07l66
3406b65l79P08R3l57K46k42J40O01m88Q0n89J53N51k5J00l99j97O91k86l73N84
3427C47p16P51L56r72K69K9l79P52j89k86L74m15M70K0m04j51j60L43N09m20K72
3448D00l87q6N79n47k08O56o39P55q2p77N59k69K1J49k9l03O56j67J8l24J4O1
3470E0k50K89k89m51Q35j63j99M64n23m3N02n19N30j55p28P23l35p9J64j91O3
3491c05Q7N74l99j96O1K35m00L76m69j77R70q31N23O2o68L90K61l72N23l02k77
3512c34O45k50k14j98J73K74j97jJ14p6K36K31o76L47l68K40L86m38m9J40k18
$$ y = [240, -285, 125, 148, 116, 276, -523, -394, -233, -394, 266, -83, -176, 361, -6, 52, 188, -538, -132, -185, -218, 264, -295, -627, -245, -164, 51, -132, -358, 133, 231, 78, -177, -762, 146, -231, -178, 412, -405, -90, 462, -106, 101, -265, -644, 64, 157, -200, 46, -196, -56, 545, 57, 137, -452, -299, 252, 227, 327, -72, -269, 422, 136, -237, 347, -369, 382, 738, -234, 35, 64, -315, 437, 248, -38, 336, -79, 391, 411, 7, -144, -304, 39, 548, 128, 400, 13, -73, 506, -41, -249, 407, -232, 523, 441, -336, 223, -46, -25, 124, 95, -208, 448, 281, 299, -25, -11, 50, -200, 89, -200, -651, 184, 21, -178, 286, -237, -280, 222, -297, 233, 78, -650, 73, -262, -341, -177, -368, -305, -218, 356, -43, -239, -178, 57, -343, 33, -436, -613, 357, -474, 49, 111, -557, -167, 94, -278, 245, -57, -334, 311, 61, -153, -351, -178, 96, -101, -102, 12, -64, 172, 403, -273, 74, -294, -54, 332, -106, -155, -15, -233]
3533b33J93L71o94P03j61j75M81l17k75N7j47N68m14K84J57j75N88n55n21M47
3553A82j79n8K64p18N80L35o52N53l54j13K33Q3Q2J33o57M3K93j78K03l63K77
3574a1L54l34N26l77l96P36n46j59L81l62J88L30l40L22j48m03M85k66K49l59
3594a30l22N07l21M9m7P2N7L91n44O64p05n3O45n18j25L81j08L49j97k52J49q8
3616a46J23qj70R0l9J42K74m84J6J73j71L83j02l25L00l8j75L90o14K28J02q5
3638a36M43k8n07L65k35J00l04j21L20L7L38j26l93N23K20n94N02l19j85K67k23
3659e6N8K23k59J81J0L4R7k36K87l94J49M0l06p3M15k43R0M33m28L74m06k56J97
3682f9m47M54Q4l99M74k51j98O64r1k64K23j28O5N0k55J24k76P2J4MM01j41P5
$$ y = [-233, -40, 331, -363, 340, 179, 4, 485, 168, -107, -50, -197, 371, -43, 241, 398, 223, 811, 256, -265, 182, 3, -55, 209, -509, 71, 406, -246, 307, -47, -160, 73, 156, 238, 371, -286, -243, 50, -128, 75, -288, -11, 343, 9, 535, 158, -238, 498, -48, -207, 174, -188, 0, 330, -10, 312, 164, -239, 246, -20, 229, -130, -452, 55, -266, -217, -264, -192, -135, 256, -288, 376, -329, -382, 263, -255, -380, 1, -107, 242, 45, -207, -58, -146, -23, -31, -201, -111, -150, -8, 266, -218, -202, -29, -200, 183, 81, -244, 56, 18, -157, 233, -381, -153, -51, -136, 307, 279, -228, 137, -98, 2, -302, -423, -103, -66, 272, 146, -247, 276, 496, -98, 404, 85, -100, 167, -56, 2, 225, -34, 147, 157, 191, 288, 52, 339, -55, 94, 134, -172, -245, 170, -73, 17, 450, 22, 396, -10, -266, -69, -516, -62, 22, -377, 97, -154, -352, 312, 221, -43, 180, 52, 117, 167, -88, 36, -240, -168, -154, -150, 251, 110, 185]
3705A85J01p9n12M14k80n2J17k84M59n1j60L15m58J11K17j46J77k22l35K51k46
3726d78J14O1J14L52q0j90M43n25J88M1l40J67K1P8J77j30o2L30m22q8N56l11
3748A6L22k16k33K59l29q2L17o81M66J47k40K85m7O9k72P9J16J4m6M70m26K78
3770B66k19Kj00J24j79K08j99J51L42j36n2n2l93N36j03k30L49m08Q6p1j00K66
3792H8J18k99M46m62L23r7l68K69m67K56M35l94J92L50n21J00J16k89J88J79o0
3813A03J39m16L37r0l01M22j99n2N46m02r1K26n22J14p1J9J38M2m5J27P5N2m45
3836b94j59M12k10J3J80j90J91q5M3K82l23K46m8j67L96j45l67J35n1j69J25j04
3858b89L12q9K00j17k9j12L72n94N36k34k59N21j16j91J67j95K02M7k58L76k06
$$ y = [185, 286, 207, -305, 109, -171, -223, -106, -390, 69, 18, -142, 173, -285, -174, 43, -103, 74, -148, -483, -232, -478, -364, -303, -189, 163, 83, -107, 336, -189, -1, 40, -300, -133, -112, -34, 143, 13, -49, 281, -141, -229, 327, 16, 338, 122, -111, 148, -181, -263, 54, -627, -161, -14, -254, 31, -16, 53, -219, -140, -24, -10, -56, 414, -12, 266, 47, 49, -51, 73, -106, 102, -97, 54, 396, 260, 208, 156, -237, 299, 196, -34, 315, -93, -7, -78, -178, 88, 206, -93, 353, -109, 214, 117, -251, 18, -449, -193, 242, -152, 40, 390, -131, -31, 85, -204, -16, 163, 103, 242, -174, 163, 73, -228, 194, -5, -57, 489, 87, -4, 222, -300, -186, -257, -238, -100, -58, -103, 24, 99, 151, -294, -453, -41, -251, -238, -58, -248, -57, -142, -99, 183, -140, 106, 58, -109, 287, 142, -225, -90, -141, -310, -185, -289, 23, -66, 134, 17, -12, -124, 248, -346, 190, -44, -303, 218, 102, -89, 78, -117, 85, 132, -126, 250, 44]
3879D4j23Q3k63K24j69K42P4ll5R9j34J9J15j81L7k76K73K30m66J27K48m20K56
3902AK49n06M23N2O8k11j94P3J86l54K28q8o3L03j31o6m5r8M10k05j65M88m17
3925f2J3J42j67o8p1J43Q0R6n9L5k34J31M39l76J03k04K30N7k39k17K53q8L9o9
3949i3ML49n97M68l3n04L79k15q9M42l21L08r2O0k7n0j71L06l87L62J10m70M07
3972A46n16K51J73j65j63M09q2L32j0m48Oo5O9J45O6J10j57l0q0j51R8o8j77K97
3996a0Q5k28K12n6r6L57p03L44M71k74M25k16k40M04n31J79k98n3L47r5j4pj33
4019a30L44k68q8L44j84k45N40m57J17K2l31L77K93l86Q2M8L7p6j40J23j41j34
4041b53O13m04j33K75l93K28nj27M17j83J48J14m73q8K07k76K66J17j44k7J30
$$ y = [44, -79, 4, -259, -35, -204, 38, 112, 109, 74, 173, 39, 58, 173, -8, 29, -247, 26, 256, -210, -83, 165, -255, 1, 250, -256, 167, 219, 287, 76, -118, -45, 141, -213, 15, -73, -136, 167, 36, -30, -75, -173, 237, 32, -133, 355, -62, -49, 93, -74, -142, -213, -70, 10, 106, 47, 82, -152, -21, 418, 42, 145, -59, 171, 228, -11, -228, 25, -63, -24, -93, -89, 260, -337, 131, 98, -406, -27, -242, -331, 111, -210, 98, 6, 66, 39, -11, -182, 124, -263, 99, 209, -261, 146, -370, -119, 54, -111, -274, 135, 53, 385, 375, -73, -67, -132, -63, 82, 148, 258, 101, 71, -9, -160, -62, -130, -307, -10, 75, -153, 59, 3, -93, 264, -439, -95, 376, 102, 527, 311, 71, 475, -56, 123, -175, -228, 119, 24, 10, 3, -130, 214, -54, -142, 202, 18, -227, 313, -144, -27, -5, -336, 41, 334, -52, 30, 78, 115, 39, -101, 22, -119, -253, 360, -44, -177, 98, -295, -67, -72, -199, 218, 35, 183, 297, -176, -264, -57, -333, -67, 50, -94, -121, 9]
4062Ik9J95k07n8l3k02K47l9J82j51k88O21m02j83O00k84LJ92m08O3K9j10K42
4085a1N7n5J60m25N17j26k95K63j37K32j8j05J50j33JL30o90K7L54j72J99K42
4107C65m95L45r0J31j36l64L92j44m9L5kl93N97l20O4L16l57J30M1rq3j08j99
4130c33L08J9l6J63l47L66N5l57K16q9K38q8l39J11K30l09K33k33J17J65j02J25
4152A13K8k72l7j80K38o1q0J98K65l72J75j14o0M9N8J53LJ04j10j95J25L04l91
4175e9k2J70O1p7j58J21K5p2o0p2m7K9M14j23K99m64N8q0J1J80l23m6M40l77J32
4200d0J97l53J74l7J5J46n5N9J5j03k5j7j02L92k52J3J71j89J78K2m64K76k92
4223b71L18k5q7L42k39k2J64k98j75L70k12M51j88j06rk46n8M10k32P8O6j08L35
$$ y = [9, -20, 175, -32, -90, -123, -325, -78, -117, 65, -86, -374, 247, -155, -338, 262, -22, -19, 173, -235, -172, -143, -253, -11, 46, -9, 151, -274, 243, 117, -178, 85, -52, 180, 162, 57, 207, 74, 75, 405, -285, -258, 96, -76, 123, 365, -130, 215, 125, 256, 120, -244, 148, 4, -45, -10, -12, -405, 192, -128, -64, 252, -105, 25, 66, 57, -26, -134, -333, -25, -6, -42, 121, -226, 140, 195, -162, 54, -35, 203, 115, -224, -113, 117, -192, 41, -192, -75, 90, -12, 113, 141, -131, -168, -348, -110, -171, -251, -53, 212, -160, 15, -99, -159, -110, -52, 101, 104, 208, 98, -97, 28, 332, -59, -81, 89, 150, 73, -85, 36, 61, -11, -71, -143, -190, -161, 253, 130, 429, -35, 23, -57, -46, 134, -189, -235, 205, -172, -40, 157, -196, -22, -59, -44, 102, 47, 106, 121, 18, -7, -24, -126, 266, 14, 27, 198, 9, 187, 209, -255, 21, -271, 47, 22, -65, 277, 38, 16, 180, -118, -293, 77, -135, 316, 128, 22, 13, -233, -291, 119, -113, -35, 31, -77, 258]
4246B58l94JJ25K21k59J64k5J38l22J49J35m08K29j2l11L28J13k63J56k24K50
4267D9M12p94K47p1l6K80j14j12K10P7J83n00j90N31j45j8J08n75L79j46K54l8
4289ik16M24Mj24j51M2l09J60M01j52l7j81J95J83l23j62K94p9Q3K6j35r0P9M03
4313C26l55L7OJ32L7j9l4k88Mp2K23j07K7pJ68r5J92k61J59J01j72L2P4m03K78
4338a7k08L46j27k37L14j65J80l5j88K55J36l77P5J8Q7Op6K54k7k75J2m8J56L
4362F2j80O5K14j74J14j95l0K26j26J02k03J25L5q1m0J46o7K12mj67j29k1m9J7
4386a48o3K46J33l83K30J91K5q8m46L43P4r2M5Q0j38K49k36L1L28n85L04j21R2
4409G1M4j68M1Q7l53K89J76l01K71j19j6j16K5j4kk05K44j18J7K32j87J98l18
$$ y = [258, -136, -135, -10, 211, -48, 116, 91, 229, -93, 56, 191, -217, 12, 0, -311, 17, 130, -133, 23, -201, 49, 461, -333, -86, -157, -193, 87, -27, -139, 71, 148, 331, -169, -359, 172, 27, 9, 117, -458, -79, -225, 29, -9, -225, 199, 203, 79, -72, -30, -339, -179, 222, 70, 33, -148, 47, 230, -93, -255, 39, -40, 43, 69, -66, -156, -77, 326, -29, 8, 14, 146, 183, 164, 130, -158, -154, -226, -3, -110, -83, -90, 78, -17, 175, -86, 73, 174, 2, 34, 108, -295, -17, -225, 121, -6, -243, 71, -94, 86, 51, -137, 118, 254, -123, -48, -30, 57, 63, -13, 241, 214, -61, -49, -97, 59, 62, -118, -53, 161, -13, 101, -94, -124, 102, -24, 78, -125, 0, 35, -46, -86, 60, -7, 205, 201, 34, -95, -116, -165, -148, -211, 35, 168, -215, 15, 206, 231, 143, -303, 40, 114, 22, 67, 147, 9, 258, 22, 53, 381, -204, 100, -21, 71, 115, -53, -12, 75, -278, 11, 187, -114, 157, 38, 22, -94, -69, -83, -85, -290, -46, -164, -147, 85, -102, 96, -222]
4432b22lR9J09M9kL8r2j71K22J00k59K08N0J54l00O6K4l0j21O1K64k87o3P6J4
4457a6L6j41q0K95k68J33o5L17j21j48n1R7q1ML72m87L73k66q2L40k27q3K68j11
4481HL2j52q1L80k07l8J94j12kL5j17J96l13J40K01l16L37r4j85K64k43j52K55
4504C0j70M1M7N3K77k81O8j83j73J61K8j1L09j38k06K33j03q5L16p7j2j43%J08
4528H9j25j64J37r4J60r7N6L09l61PR6j6j24J1K16J07k49M7K9J51k91J76k97N4
4552a73M75k19j33R6k8M4n6%r5K9J44j56k0mO6K0o2l10N20j83j36M57l19o8K03
4577I2k49K67k44OO6J59n6K71l82J8p5QL23j53O6J47l14L3n0j15L76k48jK05j01
4602D9j25K3n5J1R8m7K01l3p6O3rJ5j3o8J32j25p0J51o3L8J50k73Qj65KL43n7
$$ y = [-222, -225, -126, -17, 32, 30, 68, -24, -195, 27, 127, -132, 76, 126, 280, -20, 46, 70, 40, -81, -20, 244, -43, -106, -30, -16, 20, -121, -201, 94, -174, -41, -106, 211, 90, -58, -109, -12, -93, -89, 283, -204, 169, -97, -179, 161, -66, -149, 119, 8, 40, -112, -193, 187, -20, -58, 136, 24, 22, 57, -60, 136, -177, -37, 164, -152, 185, 91, -94, 170, -73, -225, 30, -140, -99, -52, 1, 278, -3, 65, -118, -291, -130, -102, -113, 196, 58, -148, 85, -18, -103, 213, 136, 124, -19, -19, 89, -36, -200, -63, -157, 3, -94, -38, 271, -90, -83, 13, -3, -127, -116, 100, 207, -42, 5, 34, 185, -106, 70, -227, -173, 302, 83, -50, 46, 18, 62, 6, 6, -89, -60, 84, -72, -92, -96, -30, -10, -72, -382, 138, -45, -181, 276, -43, -111, 92, -157, 110, -134, -128, -62, 97, 41, 312, -70, -52, -127, -119, 204, 51, 117, 264, -50, -17, -67, -182, 194, -54, -55, 150, 49, -76, -53, -108, -97, 1, -46, 155, 122, 46, 109, 100, 115, 102, 34, 166, 41, -29, 122, 59, 97, 247, -26, -18, -183, -181, 162, 105]
4629A05j58K09k34R5J57l95L15k78J53N7j30K15J4j38O2k69M19J1L8j17k26O4
4651c1l5KM4p9K35J03J06k69o1l4O9Lj72L30m05Q6J40o4K30L7j73l5k04L9N11
4676C73l50m9J93j78L7rj37L90m73k3K76n2P0k15J29O9N5J0p7j4j31p2K53j42
4700f7L89l68Q4k77J65J25k7Q2n5j24NK08j03p6rj80j15L55q0j12J89L8k86L28
4724H9l42K64J8op1M0K6q5O8R1j09P2q6L3j07Q5n3p8L4k2lK04j45J57j16j40J3
4751a69K1j20M31l50K16Q4j7j63K8J70k12R4J87L3m18o7K23M7Q1j04j39M10l11
4774d5J33oN1M2k56M6O6r9J85Oj13K0%P8j34O7j62J84j61l1K00l09J62J03K04
4799B31j11j29P8J23k93L28j50PN4m27K99J55j14j24j66J96K51m4pk81O0q3j28
$$ y = [105, -53, 156, -78, 17, 174, -221, 94, -184, -31, 26, -104, 111, 125, -13, 49, -220, 199, 210, 248, 131, -95, -31, -66, -64, -20, -99, 136, 239, 345, 76, 15, -19, 50, 53, -119, 211, -194, -108, 32, -32, 198, 235, 62, 27, -177, -138, 373, 23, -26, 167, -11, 26, 17, -120, 270, -203, -226, 50, -2, 68, -147, -18, 51, 106, 116, 39, 25, -106, -178, 75, -67, 322, -46, 38, -239, -74, 51, 24, 106, 51, -73, -68, 140, 37, -39, -48, -228, -343, 12, -68, -180, 9, 47, -239, 89, -253, 11, 29, 23, -48, -8, 18, -67, 1, 92, -17, 55, -31, 2, -105, -20, -73, -151, -117, -139, -142, 62, -83, 74, -42, -182, -169, -148, -268, 163, -187, 29, 113, 96, -67, -39, 131, -81, 13, 200, 233, -185, -252, -29, 18, 99, -5, -144, 266, -45, 88, 82, 133, 175, -81, -35, 31, -68, 117, 123, 10, 30, 30, 108, -26, 41, -121, 63, -98, -129, 71, -238, -76, 27, 231, 120, -9, 69, 192, -101, 227, 77, 84, 138, -289, 10, 165, 51, -73, -239, -43, 208, 164, 157, -124, -64, -147, -275]
4822b75P8L6J21J27j36J25o1j15J8j6j0J5P0J51j09j20k9J42J71m5j80J23J01
4845A82k37r7J65j22P4J11k76L25j74J66o1j31K02M5m01J06K60n19N03j77j42
4866a98J54K6o2k2q5J55J8N7j16m3K61k10j44J51k4K06j40K13P3k18j7o2J16q9
4890@N1lj11J29J01j12j3j16K11j82K36K8l52j3J28j68J06J35k5J35k50J06L4
4913E5j61P6j8J7J92j92kK08j2k02m8J38K16k21j89K21k3N7m6k06J10O7J73n3
4937A57J10k43L4l7m7Q6k15J71j8j67Q0j03M9P3j12J58K9m3j00o9L06P2l70L11
4961A12j48R5j5j05L6J07n9j20j8r3j95J01K82O3k3j7J54j2j50k24K15J43k07
4984g8J46j58o2K2j16K95K7j53o1K92j19J6j52K75j89j46J84l8Q7K46o4k83J90
$$ y = [-275, -197, -161, -40, 87, -49, 76, 15, -100, -82, -98, -108, -93, -23, 128, 19, -101, -130, 12, 183, 138, -42, 81, 182, -55, -152, 13, -109, -35, 76, -200, 125, -49, 117, 56, -75, 127, 172, -229, -123, 137, -382, 121, -56, -198, -44, -18, -80, -102, -187, -32, -14, 43, -73, -116, 145, -65, -209, -58, -82, 124, -16, 197, 270, 52, 35, -27, 89, 0, 51, 48, -63, 66, 167, 55, 42, -74, 137, -45, 191, 219, -133, -146, -18, -186, -80, 55, 30, 165, -85, 21, 55, -106, -30, -48, -31, 161, -31, -33, 175, 163, -39, -87, 51, 267, 46, -143, 78, 55, 112, 66, -140, -30, 37, 210, 157, 267, 24, 58, 21, -26, 60, -155, 16, -2, -169, -89, -192, -143, -70, -182, -24, 5, -38, -138, -207, 99, 171, -199, 112, -36, 59, 44, -61, -25, 82, 23, -97, -115, -208, -403, -302, -20, 43, 20, 3, 157, 145, -5, -229, -14, 129, -78, 68, -90, -152, -130, -246, 49, 76, -77, -138, 154, 35, 51, -101, 174, -15, -161, 23, -15, 72, 318, 254, -29, 161]
5007A61ok38J80k71K72O3k22J71j27K4j25J88J5j41j44J33J45j30L1j32L56m00
5029a97K12k62O1K20J22q1j47km2K6J48l0J82k75J08k1k11K63M9j37j02J30k42
5052b28N3J05J50j31K9J00j48P8p8m5L03l23J51k56J87J34j20j15J42l6P5K08
5074B35l43L5K56m4l15J23j1J52l05J56m4J94N1r9K9j37J04J4K6k19J47p4p8J46
5098aK2q5L4K27k87J86j94O3J54q6o4M7j4Np7pK8O0R9k80L4O1m1N0j91M39j88
5125fj53J11l7J91j74%R3j21J19K5p9J22j42nP2L65l23n6K6Qk13L3L77j33k13
5150a13j56M70j65k41M28k61J10K7J1j0k62K13j5J6p0r8j07M50j47j89p0K18o3
5173b4J28k44K71j41R0j84j04L45l28J51J35r1j96P8K2j84K69k05J26m3N0R3K
$$ y = [161, 155, -83, 97, -174, 98, 161, -61, 110, -17, 7, -118, 70, 85, -56, -200, -67, 78, -52, -21, -153, 203, -197, 15, -247, -186, 34, 156, 75, -72, -74, -116, -90, 58, 28, 210, -65, 43, 22, -189, 74, 123, -14, -116, 14, -228, -175, -70, 80, -51, -22, 78, -70, 8, -70, -115, 188, -135, 16, -240, -53, 81, -39, -154, -12, -48, 27, 235, -108, -73, 183, 139, -176, -53, -64, 88, -217, -61, -105, 89, 140, 41, 70, -67, 37, 51, 77, -142, 5, -69, -147, -1, 21, -64, -30, 197, -90, 96, -98, -35, 119, 33, -31, 16, 2, 7, -70, -77, -49, 11, 110, -170, -136, -75, -116, -66, -257, 182, -6, -159, -48, -85, 106, -68, -68, 25, -96, 23, 48, -31, 91, -51, -56, 16, 381, 58, 2, 28, 36, -177, -144, 233, 100, -113, -269, 201, 36, -205, 223, -38, 72, 99, 110, 100, -162, 51, 36, 52, -18, -116, -223, 227, 80, -109, -179, 39, -24, 104, -140, 131, -10, 80, -104, -208, 137, -191, -40, 95, 4, -192, -114, -92, -276, -7, -212, -86, -129, -79, 14, 16]
5196A6Q1n6k74N7n0J73K20l8r5j59j1l2RK43K49l30k1Q9L3o4J0k01J01M0l5J11
5222F6j4L08m58j7j85J33K46j95K19q9j26n0J85K72k73j06j77K75L9j24o7K7P
5245a04J17J33K12l64P0j52K89l11M9r2J69Q7k9N8p0p4Q8R4j80R7j25J95j44J0
5269B3j20J37L4m7J5M8q7j72J79k8j05J83J9m2j34J26K17n37M84q2Nk31J87K8
5293A00j82k8N7O0k23K79j9j84K14l05K12K67l78K0Or8J3K03j38L32l94R9j01
5316a88J2J83k26K92N8j22j10J44m2P7k6n3l15M54k61L18k38q9K84j26q2L3k8
5339e1J22O8j45o1K0J30N6j23J86k93O9J00MM6j94J28k7r7L5K09l09J30P0pN3
5364A19j41q2J09J37j51RN0l8k8J29J80m06J03l2j5K11m86L13J28k94K85P7p5
$$ y = [16, 97, 41, -233, -176, -226, -53, 167, 129, 34, -125, -136, -168, -159, 84, 333, 3, -18, 71, 104, 40, 50, -151, -50, -10, -45, 66, 52, 360, -98, -115, -300, -167, 79, -116, 103, 14, -112, -162, 23, 295, 22, -84, -261, 14, 53, -71, -138, -111, -104, 13, 146, 358, -6, 64, -88, 201, -110, -61, -153, 16, 103, 74, 132, 62, -12, 76, 170, -10, 87, -38, 157, 13, 23, -97, 40, 74, 27, 42, 90, 3, -169, 10, -18, -123, 60, 79, 37, -97, 29, 246, -291, 193, 111, 116, -115, 72, 100, -82, -110, -53, 7, -216, 63, 44, -140, 74, -231, -19, 248, -130, -110, -104, -202, -189, 14, -124, 208, -186, -87, -188, -176, 7, -219, 73, 131, 9, -101, 43, 1, 78, 52, -1, -316, 138, -123, 195, -43, -132, 152, 26, -56, -23, -51, 71, 139, -6, -67, -47, 83, 139, 16, 202, -91, -22, 78, 82, 128, -66, 62, 35, -62, -27, 182, -127, 3, 73, 66, 119, -22, -104, 5, 142, -9, 0, 50, 12, -16, 113, 293, -113, -10, -42, -57, 154, -332, -19, 109, -185, 100, 177, 102]
5387A02J81K3l56mK1%l2j9K32k18Q5j1j7K25j88r5J96Rk40K87k35J54j60j18O6
5412a12J47j87J81o2J67o5J4j5k26J19l1k6Q0r6J70k00q3J71N7j16J26K11l38
5435a14J48j49q1J63lm2Q5J19j89r2m1K54j88L14j75j79L64j53r5J79j96J4J35
5458G8m88L54L31k01j59K33l45J0P2J09R9m9M1p8M3L4j13J29P6k79J69R7n4Jj10
5483@M3J98k93J07n9O2k39P2J32j41O1q0K21j2j4j04J8K3j07R1J41k12K34L0j24
5508D8j5j61L1J24P1j43J33l82M40j41J63M1j87j50R1K99j41k41O9J87j31L7m4
5531bp5K75l33K57r0j56j04N9J7J73O4j21K53k52L4p3k21L13L6k34L45j90N8j5
5555A8k47O9O9j24r0L44J5j42J45n2L2k65L02j42R1j08n3L26j04n9J16n2j22M03
$$ y = [102, 283, 306, -50, -54, -33, -33, -65, -84, 148, -70, 15, 4, -13, 212, 24, -71, 125, 134, -106, 181, -54, 100, -60, -178, -112, 35, -152, 29, -33, 134, 69, 83, 68, -158, -39, -70, -96, -16, -112, 58, -142, -225, -54, 3, -113, 13, 224, -114, 34, -115, -196, -33, -36, -78, 7, 126, -63, -155, -196, 58, -130, 184, 9, -170, 194, 41, -54, 125, -71, -57, 78, -410, -56, 275, 74, -85, 148, -197, -187, -115, -6, 93, 44, 85, 7, 50, 84, -29, 100, 176, -103, 66, 163, 109, 110, 0, 43, 241, -52, 55, -4, 58, -181, -109, 23, -118, -57, -137, 84, 72, 58, -46, -28, -5, -112, -21, 120, -92, 142, 172, 48, 33, -128, -97, 27, 98, -45, 88, -294, 146, 5, 168, 209, 22, -128, -37, 262, 121, -120, -51, 136, 5, 42, -2, -77, 198, -135, 122, 32, -124, -228, -169, -152, 21, 85, -36, 217, -35, -1, -74, -295, 18, 54, -180, 165, -25, 33, 18, -229, -160, -91, -215, -305, 39, 54, -88, 57, 5, 37, -228, 74, -68, 23, -85, -138, 188, 84, 25, 141, 89, -33, 370]
5579C70p63L19K3n4K42Mj23j19K55j40K3j29K36l0j02K61l36M6J1o9K72q7p5M
5603C9l41M23j22l4L26k70k69L0L85j37k40K81j07m5J78j47j87M54j17O9j9j56
5625fj81J86L6j28O3j16K06J47l27L73k53MJ8kP5j63jR9p9N1j3j78N3J42l0J19
5651I5O8k96L12j31k01R9J18l9J49n10L68%j17L21m42J80J40j19l6j74K81m4p0
5674d8p4JRL53j11k18J11k8l1J54Qk60L48k73K59j51oJ8J99k28N0o6l0o5K98q3
5700A36k07L41l40m4K59k25J17p5j00K76j77J6k1P7j08J97p5K65J6m25O6p5m9
5723a55J05j12K50Qn1j38J15q8R9k81M05k34Q2j19J48M4R9j23R2p5%q3J25j85
5747g2N7j4n2J04k25L27m3k55K16m1p7K90m40K61N9l16J75J67l07L28j50p8N48
$$ y = [370, -393, -74, -51, -105, 137, 141, 18, -101, 154, 14, 37, -92, 144, 114, 12, 273, -63, -17, -6, -75, 197, 110, 35, 39, -302, 121, -1, -35, 291, 21, -248, -218, 167, 30, -210, 71, -36, -81, 97, -50, -237, 217, 100, 169, 150, -6, -187, -1, 35, -93, -30, -146, 60, 207, -120, 253, 0, 4, 22, 20, 95, -68, -69, 30, -49, 2, -11, -189, -136, 6, -24, 95, 163, -133, 179, 48, -153, -54, 64, 25, 174, -336, 32, 32, -85, 236, -206, -26, 114, -5, -41, -215, 66, 22, -48, -122, -121, -112, 241, 130, -88, 23, -5, -36, 118, 126, -134, 214, -59, 200, 49, 43, 61, 260, 32, 82, 16, -14, -79, 219, 136, -71, 270, -70, -114, 145, -80, 37, -38, -138, 138, -39, -23, -44, 33, -75, 122, 47, 312, 328, -97, -31, -106, -155, -50, -162, 88, 96, 45, -93, 22, -66, 33, -248, 157, -77, 5, -114, 34, 78, 177, 54, 146, 71, 71, -12, 113, -72, -15, -29, -81, 23, -202, 125, 82, -173, 43, 2, -75, 215, -225, 36, 95, -221, -46, 121, -186, 142, -8, -86, 462]
5770D62m69J14k79L02j42L4k61M66l96j7L52r9J44r7j51Q5j89o7L02p1J5P1k26
5793a17J16J32o7L8n6J61m92L1M05k04p2J73j44j36K70K3J27k64K13j36k40L14
5815G5l6j28M31k71p0L7j25K27j25n0J15q3n1lO5j25K08k08K06j12J84J55l40
5838b4J20J63j62j28J74k04K02r1J90k33l8j23K03j56J75L9k04N0Q1O8j63p2L23
5861A90j00l8j33J5r5J41N3j53m3R3L51m11O0J43m3K06k73M2J3j23L16j11j03
5884cM1O0j49K82k71J5K6j53M30m08J5J89j89K63j92J31J82m57J45L87l95J72
5906A21J12m50K51j32NJ87j60J30M6q6N7o0l1K55k92J84l9l44N20l59J41M8j88
5929h4j62L17J8M8K6N7M3m26j00L73l04R9K73k53J62q5J05L0o1L6j12O4N7M2j11
$$ y = [462, -7, 107, -172, 130, -12, 22, -239, 227, -169, -186, 166, 67, 211, 114, -37, 48, -141, -208, 94, 23, 38, 109, -117, -1, 131, 64, 102, 46, 207, -285, -254, 151, -53, -125, 48, -96, -232, 38, 61, 188, -76, 137, 1, -239, 75, 39, -89, 342, 71, 1, 38, -87, 140, 15, -35, 80, -3, -54, -57, 8, -117, 91, -117, 89, -23, 161, 316, -24, 96, 259, 97, -31, 143, -61, 141, 50, 240, 7, -31, -154, 49, -107, 68, 107, -97, -47, 34, 102, -61, -133, 190, 90, 52, -81, -66, -161, -20, 33, -120, -163, -70, 281, -130, -70, 73, 30, 236, -37, 5, 18, -105, 211, 100, -3, 38, 98, -51, 231, -40, -25, 1, -152, 278, -130, -115, 74, -115, 148, -44, 87, 269, -188, -43, 344, -51, 121, 233, -217, 34, -98, -93, 94, -66, 64, 110, 24, 81, 21, -10, 245, -47, 137, 98, -246, 274, -85, 56, 104, -84, -246, 71, 89, 137, 163, 220, 263, -163, -263, 110, -194, -95, 178, -75, 87, 2, 107, 137, 76, 112, 0, 64, 121, 163, 52]
5954E2N2k29L60J19l87J73j33j57L58k62M1J58n7j93J96j99L91k02Q1j13j65L76
5976B60l14K5J94l3j85Q4l20K41j86L9J75j61M38j29l17K16J13l01J40n8oJ40
5998E5m70M48J19j06J13j82N0J51l06O7J53j81J59p4k65K25j81L63k79L01J9j35
6020D4j96K59r0N9p5l19M56q8l53M00j18l94O37l83K39J21k46J24k35O5J17p7
6042e3j67L42j94J90j36m2K40l54K12n8j20L25k85r9M44k88N18l42k91J34m2m3
6064a09J75j12k69K15k9L81k17K50l37J54j48J09K17k80M2m26L62k5kj3R7j71
6086a36L30l73N21Ln04J44k8r0K06q5K42l26j73M46k53Q0K19l28J18k52j5K50
6108dl04K62L79m73K36k9k38K1p6K06K41l67J34j99L50M0m14J66K58j45O4K72
$$ y = [52, 104, -125, 235, 354, -33, 140, 7, -150, 208, -54, -13, 145, 88, -105, 91, -108, 283, 81, 162, 49, -116, 260, -54, -29, 165, 132, -53, 31, -289, -48, -234, -195, -20, -181, 257, 128, -189, 27, 140, -161, -21, -79, -85, 55, -415, 33, 152, 46, 159, -23, 27, 178, -128, -61, 92, -89, 70, -4, -269, -44, -225, 138, -141, 160, 179, 44, -152, 107, 17, 76, 1, -318, 138, 50, -303, 97, -21, -415, 222, -161, 78, 199, -47, 77, -158, -93, 24, -53, -220, 122, -72, 118, -18, -60, 180, -174, 38, -20, -140, 185, -100, -199, 245, -43, 475, 133, -158, -24, -66, -109, 66, -46, -315, -100, -129, 252, 35, 285, -52, 102, -46, 63, 280, 0, 42, -384, -22, -47, -49, -62, 35, -136, 194, -179, 342, 345, -159, -15, -43, -133, 73, -12, 230, -96, -269, 177, -76, 4, 223, -105, 13, -239, -254, -4, -308, -46, 333, -140, 96, 67, -171, -150, -226, -20, 221, -146, -12, -211, 139, 179, -235, -69, 189, 44, 108, 380]
6130C80l52Q3j31k19J66j82K01J27k31M18k58k42L41k28K02j05k19J20j4K57j02
6151A2j29K12j66j9L2K29m26N85n84J36M01n68K81K38k64O3mL7m9mrm8J8P9j20
6176f7Q2J01l38J45K62m50M27k03J18J0N4l7O3k37N7j74O0L0J82j97j02J39P5
6199@J12k55M51j65k18L9n1J20q3k37K94K8L9J79k79Q7o4j44J5K64k84L04j26
6222B6m7O3k1N4k29L6L06k20J11k2j14Mpj38J8N8R7J82j68L87j93k27J95j77R6
6247G0j25P7J80l7k54K02o6o9J60l93K44j27j64J86kQ1K5j4k5L38k13j18k6J78
6271A08j3j57J17J57n15M35j88q4J16l3p5L20l16K66k35J63J19j83N4j42LJ58
6293G5l8j27P3k61L3L45l69L78J26k16J31j59j5P1l80Q5K68r9J80j74P5L17m23
$$ y = [380, 28, 111, -20, -239, -73, -255, -54, 73, -158, 260, 2, -240, 101, -127, 75, -30, -249, -129, -143, 114, 12, -117, 95, -71, -90, -58, 171, -255, 330, -254, -118, 283, -285, -4, 234, -30, 33, 29, 66, 17, 13, 4, -44, -26, 53, -67, 15, 116, -222, -77, 185, -265, 162, -41, 77, 87, 141, 104, 167, -70, -13, -187, -127, -97, 85, -112, -214, -75, 0, 112, -143, 308, 143, -75, -36, -87, 33, -50, -287, 7, 35, 74, 253, -26, 61, -3, -147, -132, 132, -152, 152, 26, -21, 42, 21, 75, -154, -118, 188, -32, 79, 57, -57, -53, -60, -198, -180, -122, -25, 157, -11, 376, 183, -44, 151, -26, 70, -55, 22, 202, 165, -89, 113, 47, -22, 138, -255, -11, -138, -302, -116, -118, -37, -12, -26, -51, 287, 74, -44, -70, 108, 95, -62, 55, 212, -303, 132, -56, -140, -24, -57, -132, 188, -128, 138, -97, 66, 185, 2, 56, -86, -83, 75, 37, -90, -17, -278, -245, 100, -269, 109, 235, 19, 150, -9, -24, 47, -333, -248, 20, -79, 101, -73, 2, 319, -104]
6316a04L34k57jK0j95J97P8j08OQJ8m3O9J98l8j32%j98P3J96j33j54L56k18r7
6341a25J47pP6j4n6K09k96j67K76k85K90J03k40P7r4K3R3q5K9K0j94L77k68J30
6365A9Nj80J23J70j63K63l31J31J67p2j57J68k14J37J12k27K39k38nO7J13l09
6387a82K40j06M9j34J64Q8l34J80K78k55K21j76Pj04O8j82K35j15k20L31K3K72
6409C48m95M43n1l47K13l26L98k51M7p3L5k11M34j56j05J98j38p4q9M58j40J02
6431B20m47K61j66L42k56j49J55Q5L9k0l03J49L05m14L35k78N1L46j45p1m1k1
6453b3o6Ol0R2J94j80R0j00m6j13R3N1l9P9p6o3K54J20m16J64k7K8K09l43O0J1
6479g1q0R2J89k41O2J60q6n4m5r7J19L42q9o5l13L00j89K31J61l52K5j06J2L43
$$ y = [-104, 230, -27, -28, -8, -203, -6, 72, -36, -30, -22, -4, -47, 22, 220, 182, 50, 50, -148, -75, 121, -12, -166, 190, -28, -125, 22, 15, 91, 77, 21, 230, -66, -233, 43, -242, 48, 151, -89, -12, -106, -83, 10, -75, -46, -26, -220, 157, -111, 19, 24, -156, -33, 137, -26, 237, -94, 37, 204, 132, -25, 143, -71, 66, 178, -49, 190, -48, -53, 14, 127, -182, 58, -48, 1, -133, 31, 119, -215, -35, 243, -12, 209, 33, 40, -64, 4, -178, 57, -58, -278, 53, 76, 348, -147, 296, 245, -102, 111, -215, 183, -68, -21, -94, -59, -270, 164, 8, -97, 101, -37, -111, -200, 258, 118, 220, -227, 34, -132, 210, -46, -195, -40, 45, 84, 64, -239, -90, 215, -199, 136, -142, -91, 255, 110, 39, -2, -23, -89, -83, -113, -21, 173, -7, 83, -17, -63, -176, -83, -32, -71, 8, -68, -131, 123, 243, -173, -9, -36, -8, 201, -142, -82, -71, -151, -59, 130, -111, -49, 111, 25, -29, -74, -171, -52, 290, 201, 136, -177, 123, -66, 165, 326, -26, -1, -107, -95, 248]
6503B48m36K90o7r3J41M1k23J56o6K12k6j42K14k52R7j84R1O5k95K41J09k85Q2
6526h2J73K2j89J08q2j61K50J9Pq4L3k6M7J64j53j15j7K84k47J74o57M64J12k77
6550b33L48k07l6K78k90J6J60r3J76j21L30k14k07R2J0l42M24J0j4j26O8j40Q7
6573b4j13k22J19k8O35k96m1j6k06L51j4k66J61j56j2K52m8kk1k43K38k15K78
6596A11r4Q6j68K87j76J6j83J68o1k66N56j37k24J60n4j57M47k00l5J31l56l9
6618a88O4O3O0j87R5K49oN5j90j02L95l38k83M16k98L2K20r4P9l56K75J61k54
6641a32L10q4l42M65m27J15L62m04K29j5j92R3K7l38L17l9J1nl32M85M9J4j58
6664Ij03J7J48L4r8j9M4l9Q0k20%j23K13J43k37K53j03k45K66K1j05J82Q6M7l53
$$ y = [248, -188, 102, 35, -58, 83, 124, -99, 57, -9, 203, 177, 35, 249, -3, 94, -90, 1, 66, -229, 12, 121, -164, -82, 91, 113, -76, 32, -50, -211, 39, 58, 65, -19, 14, -12, 35, 199, 46, -69, -86, 198, -49, 125, -532, -68, 44, -233, 115, -92, -128, 150, -140, -124, 36, -57, 119, -2, 328, 114, -93, -1, 9, -333, 91, 101, 87, -39, 29, -111, -24, -137, -359, -240, -268, 367, 71, 30, 14, -192, 159, 145, -121, 40, -116, -128, 124, 76, 74, 53, -190, 48, -167, 111, 17, 103, -65, 222, 46, 62, -121, 47, -14, -280, 276, 139, -85, 75, 21, -136, 311, 111, 76, 207, -149, -188, -124, -61, -1, -188, -93, 156, 150, 205, 15, -87, 308, -30, -313, 103, -195, -163, 57, -37, 42, -314, -39, 122, -132, 178, 94, -248, 217, -210, -95, 267, -137, 92, 77, -115, -22, 5, -333, -16, -55, -44, -49, -381, 104, 153, 167, 9, -94, -77, 71, 105, 7, -12, 32, -7, 73, -147, -147, -270, -57, 86, -151, 102, -1, -246, 20, 41, -64, 118, 204, 251, -102]
6689a02J24l1l62M41j39M9L26j17q1L6l89R4K42l01K76r0m0KoJ85J08l47J69J14
6713A61l54J79o1L6J01n21L06J94k26L26lk43L43k02j59P2n2J76j14q9M02m37
6735a65J41J88j61J12k55j49L42j94q9J99k45K74M4j12L7L8J95K4l41O8K03k11
6757e7K78O8j57k16lN9K14l49M72k57j95L15k69K10j37j24K33P3k43J17j06K45
6779A71j60j40J81j7L3P3j14K23j28o47O22l41o7K06j65K66K84n29P1L33r3qM7
6802A01j93K08j51q6Q9N0P1l30J46K39l95J03K83k83J92j23O0JR0k25L17k90M33
6825C07O0m17P6j32J80nk78L40j52j73L45j86k9J46j8R6j77k31L58j42K52L1n61
6848c10L04j16j71K73j0J97j81j02K80Ql33K38L6n3n8j51J02L12m35O7J76m0K4
$$ y = [-102, 22, -9, -371, 70, -69, -20, 306, 189, 108, 144, -245, -151, 91, -210, 66, -24, -64, -62, -68, 117, 225, -122, 47, 161, -193, -14, -75, -39, 62, -459, -153, 41, -185, 141, 138, -105, 238, 36, -123, -51, -103, 73, -41, -130, 272, -165, -24, 164, 3, 115, -140, -289, 53, -141, -230, -31, -276, -2, 42, -70, -33, 5, 200, 224, -117, -49, 154, -57, 221, 289, 132, -84, -87, -28, 186, -163, 309, 52, -143, 172, -97, 113, -24, -148, 85, 158, -85, 32, -74, 171, 11, -129, 52, 35, 68, 141, 27, 250, 122, -525, 97, -244, -311, -105, -270, -4, 280, -249, -178, 155, 62, 54, 101, -92, 116, -35, -121, -32, 18, 89, -241, -95, 144, -251, -148, 135, -148, 44, -79, -19, -18, 72, -153, 164, -126, 307, 367, -50, 26, -106, 74, 69, -209, 131, -21, -194, 151, -35, -64, 82, 64, 160, -17, -248, 110, -32, 220, 251, -310, -6, -122, -293, -20, -30, 167, -14, -116, 164, 172, -161, 77, 113, 60, 2, -149, -47, 265, -170, -103, 73, 33, 57]
6871E7j61J97r3k43P2l2J79J1J20o1j39K8Q4Rk14J54K2M57n97k0J55pM2K82k83
6896A9k67K05j66J68M3k18M16l20K73j14NJ55k9m31K04r7K09j18J50n0j29m7K53
6919A14m13R3L91J5p5j69n3k9L55l45L91l66k2J8J46J26j47j75L28m60J70J62
6941E5j09K40l41J55j36L29l73J67qK18K2l76P7J88K7J01j02j89K3l5M3jL1J74
6965A80k11J03K72l97J94j28N2m3j43j7L35l71J81j34j66M21Qpo1k70J51l6K8
6988e9J28l51L61r7k33L82j95k60O61k63l08K92j05O9p3O4N3k22n9J19j86K85
7010CK2j0j61M7J59n2l1J15n3k03K98j63j51K26q5K15q8j38L19j72q0n4k67jN67
7035B62m95K85m4M3k16N6J96M1k34K01k6l16J22J80R0k05k7k1J38K52O5k31l28
$$ y = [57, -104, 93, 0, -243, -171, -203, -24, -13, 107, 46, -93, -65, 19, 28, -186, -32, -10, 447, -150, -170, -15, -22, 20, 302, 19, -248, -43, -209, -41, 2, -216, 200, -120, 153, 39, 44, 199, 170, -261, -57, -154, 55, -63, 87, 37, -92, -139, 114, -299, -206, 185, 200, 125, -44, -97, -126, 229, -116, 275, -91, -113, -95, 51, 177, 30, -145, 183, -277, -107, 55, -54, 186, -155, 0, -136, 193, -180, -13, -21, 197, 219, -157, -80, 108, 135, 236, 134, -55, -32, -67, -24, -25, 6, 180, -31, 72, 344, -53, 141, 13, 65, 22, -121, -138, 197, -174, 7, -127, -293, 128, 136, 129, 68, -202, -51, -87, -59, 69, -282, 79, -18, -251, 131, -64, -324, 337, 74, -234, 58, -47, 22, -51, 13, 66, -156, -215, -96, -282, 3, 25, 15, -146, -99, 60, 8, -23, 92, 39, -164, 134, -29, -180, 46, -39, 176, 88, -50, 269, 97, 17, -37, -304, -305, 262, -233, 52, 8, 51, -165, -109, 87, 128, -106, 95, 69, -247, -125, 55, 145, -60, -87, -108, 30, 282, 347, 116, -212]
7058b12L12l32l3M38l18J87j88N3K51m16M21K12m50K47k13mM48n03J46l7j35J81
7080E5J86m91N88l47K0K04k38K82m7r9N7j89J52j27l15M88J1j43K16m42K08J10
7102A39j52R5O6l32K20j11q4L03k75O3M3j0L0r7KJ38k45J33j30n8K33R9o3k5k36
7127b54L26J89m74K14M7m03M51l64k9K18L5j00K87k50K57k85PL6m3K0K03l5j22
7150f9j37K20J53l72K06L3k30J92r4m0J39j13qJ40k9K77l5k54n0q5J34J04k73
7173a91J33o1q6N41m58K09P0k68K27k31P0J81j84M8N4k1j52K30m22L40K7j8L06
7196C44k99p2J38q6K7O8l87L13k57M00j41j6J82k93NJ04k17K85Ol58J85j00J7
7219a52L54k27n0L18l02n3J93k48L54m3j3l5l11J74q1m0n4j05N49J66n55K43o7
$$ y = [-212, 100, -232, -265, 173, -145, 42, -146, -93, 158, -258, 163, 375, -75, 172, -41, -45, 403, -100, 46, 9, -126, 55, 241, -250, 338, -9, 11, 215, -23, 259, 212, 113, 170, -19, 133, 6, -309, 179, 190, 47, 263, -179, 29, 139, -13, 82, 148, -184, 36, -75, -159, 144, -131, -68, -25, -35, -5, -102, -100, 38, -207, -74, -204, -262, -29, 70, 7, -18, -254, 72, 261, -213, 1, 48, -355, 96, -268, -297, -79, -44, -144, 143, -107, 150, -135, -128, -92, -135, -115, 88, 53, -69, -206, 14, 167, -205, 1, 34, -196, -4, -98, -138, 1, -112, -120, 20, -9, 268, 233, -21, -71, -156, -22, 82, -191, -58, -119, -205, 336, -122, 87, 157, -111, 116, -115, -45, 136, -48, 0, 54, 33, -119, 111, -311, 29, 56, 38, 344, 45, -27, 111, 25, 52, 120, -267, 46, -211, 189, 48, 32, 214, -79, -74, 30, -187, 98, 104, -254, -69, -169, -152, 202, -25, -75, 243, -59, -112, 81, -167, 187, 144, 131, 96, -215, -41, -122, -162, -216, -321, 228, 394, -161, 82, 15]
7242A5k07M7L44k42J56l69K86R8n6k46M55k74O7k5l7O3j75M10k43k46M03j40j55
7265g1J43j88L6M41l15n6k46n0M32l70L25k11k16O10l01J27J48l32R5L2k49J66
7287e0j21J35K09j34j41J51q7M8J70j53J22j93K86k01NN3j66k0Q4k8N0m3j04K91
7311A63k66J4K34j26k9oj13P5l6q9L51p6j70M04n31K51j09j63M08l42q5L83k71
7334a29K27k42L1K07k03m1L09j72J54J39j71m0r7M1R3l02L28j98o1O20k96l41
7356a44J15j50J76J5l16M76l57J18K34j38N6N6k30K89j30o3K14m56L55j33k66
7377b79K63m0Q7K15k66o6K36j70k3J41o6qJ44k43N19n28m2K33j01l4J40k13L29
7400B28k07P2r0j96N8Q1N3J09Mj10K71j92k00Q9j21L21j56j67K11k76J96J94k02
$$ y = [15, -192, -145, 199, -43, 113, -256, 30, 128, 72, -174, 281, 7, 74, 49, 12, 75, -100, 310, 67, -179, 224, 84, -71, 72, -116, -80, 361, 46, -10, -256, -306, 126, -244, 81, -130, -346, 264, -37, 90, 238, -94, 1, 33, -216, -50, -171, -36, 173, 39, -102, 49, -38, 10, 180, 27, 149, -44, 242, 41, 46, 99, -67, -87, -3, -31, 19, -24, -128, 163, -103, -89, 145, 19, -10, -16, -129, -54, -90, -179, 172, 96, -74, 330, -201, 50, -59, -222, 186, -156, -241, 142, -129, 98, -144, -113, 94, -109, -150, 159, -13, 141, 280, 109, 69, -28, 13, 106, -196, 132, -66, -127, 493, 197, -144, -29, -179, -3, 12, -304, 172, -185, -67, 167, 29, 85, 141, -89, 200, 70, 7, 221, -235, 120, -13, -279, -16, -56, 31, 246, -20, -86, 150, -20, -43, 98, 32, 24, 168, -75, 444, -84, -126, 107, 6, -28, 112, -101, 228, 21, 93, 3, -193, -135, -54, -1, 108, 112, 2, 273, 81, -119, -30, -151, 170, 14, -153, 58, -218, -22, 172, -30]
7423c0J47r9M7J84k88o7N5j45J46q8J08r2P1K09j88j50M00l12R1K18l77Q6J54
7446H0M5J80k29j79J47J1J64r9q5J87j55k40m8K66j10K15j90Q4m9L4P1l9k21K66
7470A06k02j7J45j63K6K18L7k32J55r7K91k84J06m2O4L2k82J87k45k31M08Q6j99
7493a33L78l82J93mj00Q3j29p8K94No4k78J70L68n6l07J70k3j05J82k86K69m2
7516A25l10K86q7j3J51Kj80J51k17J95l3j49J23j93J53J18m4Nl9nJ80j48j72q3
7540a84J02Q4J27k47K58j5J41N2k97n9J32k39R7K7J3O3j23J50M8j59R6k78N7M11
7564B57l06J71K8j86J63oj68pp1J18J54j82J80k18K90j88L4O6k94j23M70j62k33
7587b13K05j37J50Q1k83L22j71K5p8P2o9L4j09L87Pj79k18J44j35K88j84J61J12
$$ y = [-30, 117, 18, 65, 249, -39, -106, -51, -196, -50, -138, -30, -122, -51, 158, -30, -180, 220, -92, -1, 217, -160, -74, 80, 125, 305, 76, -103, 44, 55, 219, 120, 35, 222, 67, -173, -221, 45, -65, 150, -40, 44, -5, 29, 100, 61, -160, 106, -96, -113, 32, -131, -105, 113, 150, -82, 73, -24, 267, -17, 89, 47, 111, 143, -139, 48, -197, -428, -20, 66, -133, 245, -137, 56, 52, -48, 35, -94, -172, 122, 127, 63, -215, -45, 323, 267, -40, 130, 107, 2, 184, -102, 167, 125, -185, 101, 14, 1, 152, 154, -26, 125, -92, 103, 70, -79, 44, -149, 4, 122, 78, 83, 44, 39, 219, 71, -101, -184, -82, 2, 129, -118, 140, 125, 266, 318, 21, -38, 94, -145, -48, -21, -8, 55, -68, 82, 130, -29, 67, -211, -154, 257, -49, 122, 150, -36, 127, 121, -47, -54, -125, -7, 147, -35, 145, -73, 217, 29, 63, 129, -165, -288, 182, 20, -213, -8, -145, 5, 86, -197, 125, -46, -21, -99, -27, -96, -62, -171, 216, 223, 44, -174, -30, -165, 123, -61, 100, 212]
7610B12j43P7j05j07J11l19K03J92l58L63k96m6M81l52j28L14q3pp5%L00j52k38
7633a56K38j98K19ml06L03k24J60j00j47L07N8l90J90r5J80k14J87Q2p6k5k11
7655b22K87q6r6K02k8j47o0J92j08J42K01m65J04N24o90M17l86Q0J07l39L42K16
7677A87k77R2j89j0M12k98L76m80J12L11k27k03K78J40LPl92J86j76J45K17l29
7699a15J01lj39K4J34J38J12k76L1K80l04QK50k63L09m10J42Jl06M33j80J53o1
7722E9K27j66j71J89l2J56j32k4l7L7k23q7J98J55k40L32j67P5k04k6L02j37k52
7745a68L74k46j32J47k20J69J20j78J52P6l65K83K84n97R6p5K17K66j45M5n1K13
7767B65j07m06K70Q0j54P6j60J71L2j38N7M44n17L12j56j89K35k57K13Kl2p1N
$$ y = [212, 69, 146, 41, -66, 45, -274, -71, 121, -237, 126, -170, -216, 265, -87, -215, 99, 16, 9, -66, -66, 234, 82, -156, 82, -116, 103, 99, -207, 96, -128, 32, -68, -215, 92, 150, -240, -50, -145, 35, -179, 8, 90, 14, -11, -222, 65, -21, -117, 85, 57, -90, -150, 42, -66, 76, 277, -188, -84, 440, -250, 167, -219, -139, -32, -371, -29, 187, -90, 2, -187, -197, 215, -83, 293, -187, -75, 236, 9, -194, 84, 224, 227, 234, -158, 28, -148, -3, 214, -115, -14, -17, -156, -132, 2, 140, 252, -24, 7, 287, -17, -9, 241, -22, 287, -123, 19, 20, -286, 147, -33, 120, 59, 286, 120, -51, 138, 106, 262, 130, 106, 69, 106, -117, -204, -6, 149, -91, 241, 74, 149, -55, -81, 221, 84, -168, 206, -40, -172, -25, -245, -76, 44, -134, 18, 94, -271, 12, 296, -301, -205, -280, -63, 203, 58, 103, 52, 265, 158, -248, 22, 102, -52, 24, -136, 35, 67, -71, -14, 430, -87, 225, 69, -120, 115, -142, 71, 73, 41, -30, -25]
7790b5Q1m9j55J86L4K6j86J21j32J43k29K8K70K5m2L37m85L61j47l56K16n5K2
7813a1K02j72l0kj28L02m55K03L26k58K59r3m04N25l54k43M72o8K79n13P8L34
7835B49l58K49p8R7q9J39l94j3K26K23j37j17L9J17k04J41q1J63q4p7JK3k14L12
7859A33k59kJ62l5J31K1q2J42j88j23J07n4J46l3mJ51j57o1J53m52M68q4k5n8
7883cJ9l58N38k05J33j0Q5k71L12k05j7K01k80N1Jj49J40J24m66N43j30J62k96
7906h1L5J66k14L32k12l12L88j34j12K16j00L90k83m0J18j22k10K17j85L14n8
7927A13o2J69m16J31L28n13M08k35J3K44j79Q8J46j07k99L07j30J10J58k36j78
7948a40J10O7P1j90L7l4j56M01k12o4L21l49M25m96K31J64o7j99j9m4K56N4l04
$$ y = [-25, 56, 7, -148, 38, 72, 98, -88, 33, -99, 44, -185, -157, 113, 138, 96, 433, -52, 309, 162, -194, 22, -33, -11, 191, 19, -11, -13, -141, 161, -294, -91, 235, -23, 236, 143, -261, 264, -90, -333, 139, 71, 350, -163, -85, 249, -109, 140, 62, 159, 70, 209, -185, -198, 28, 251, 114, -3, 36, 153, -51, 90, 9, 172, 88, 11, 12, 35, -179, 133, -126, -128, 34, -1, 130, 151, 69, 211, 23, -100, 7, -47, 99, 66, 62, 213, 56, -5, 148, -304, 164, 80, 55, -3, 16, -342, 196, -9, 124, 114, 199, -72, 240, 35, 18, 219, -61, -10, -9, -158, -18, 106, -360, 183, 53, 215, -81, -46, 120, -94, 238, 26, -286, 102, -32, -144, 72, -28, 362, 79, 39, 157, 35, -175, 42, -143, 171, 113, 51, 220, -196, -65, 263, -250, 158, -77, -64, 180, 1, 89, 235, 128, -171, 136, 6, 116, 274, 38, -140, -30, 37, 108, -82, -45, -79, -235, 166, -46, -110, 211, -138, 287, -209, 22, 186, 119, -80, -99, -143, 113, 167, -137]
7971a37K49j37P8j15J53j94L67l30P6J0j15K58k08M4J53k07k5J89m3L12n52K51
7993G7K75m41J9L04j30k31Q9Kj0k0J40k51K65J39k84k4L07k71J93j95j43K92k39
8016a37K25j13J51j53J34m4O5j71k40M94l47J74m3J9j88J30K70k19j13L0N4j46
8038a68K90k09j27K80j83P3j81N2J08J74l09K35J10o2j34k59L11Ql29K75p4J97
8060G8k46J48M29k56k25K30n2j34J72k20K16J05j61j48j6J66R0j51M9q4l4J40
8082I6m6j25J33r5M0K9j79M5J13QO9q9J89o8k23L03k99Q4J52k52N8R6l63L52j62
8107a34K43k68k7L61Kk43L29k57l5j21j5J79L4j69r3K55K9J33j88K0J81m14L29
8130A31n7n6K1L4p7J30Jn46M95j98J23j39n9K46k16J13J47k53K22M0q7J87j22
$$ y = [-137, 112, -25, 53, -62, 91, -103, 264, -66, 10, 20, -95, 163, -45, -1, 152, -55, -80, 109, 66, 378, -174, 77, 352, -89, -70, 234, 104, -127, -38, -36, -46, -66, 74, -177, 88, 227, -57, -81, 226, -45, 148, -47, -190, 102, -137, 88, -25, 126, -27, 107, 63, 128, -43, -283, 211, -136, 38, -5, 14, -174, -44, 226, 7, -106, -76, -22, -168, 122, -87, -214, 66, -117, -44, -225, -173, -65, 109, -200, 35, 145, 83, -51, -310, 1, 9, -320, -45, -119, 78, -168, -20, 409, 153, -72, 158, 106, -28, 144, -76, 140, 245, 84, -64, -80, 86, 176, 25, 74, -10, -44, 96, 50, -75, 58, -37, 3, 32, -147, -102, 11, 19, 88, -1, 188, 120, -103, 200, -99, -15, 137, -115, -57, 39, -324, 28, -134, 109, -159, -186, 175, 177, -66, 263, 6, -29, -150, -165, 14, 48, -121, -214, 41, 70, 203, 15, 35, 216, -198, 131, 74, 18, 39, 73, -4, 126, 127, -419, 76, -122, 1, -138, -197, 49, -167, -54, 93, -160, 62, 102, 15, 202, 80]
8153H0p4n1j84L39j59LK95k97o7M99l25P5j19oR9j11j15l0L6K97j48k7J61k18
8177d7j13K80k05K00K9k56J39p1k38L04J33j20O0k34
$$ y = [80, 6, -45, -229, 110, -49, -46, 249, -48, -115, 384, 59, 134, 15, 9, 108, -3, -118, -148, -112, 185, 37, 10, 171, -47, -160, 120, -85, 115, 144, -112, 27, -44, -282, 22, 155, 35, 95, -139]
8191a39
$$ Imaginary data points
##PAGE= N=2
##DATA TABLE= (X++(I..I)), XYDATA
0@%%%%Qj6J6j6K4l2M0m8N6p2Q8j06J30j55J80k14K54k98L46l97M55n21N96o81
28c63P71q70R82j104J239j385J546j724J920k132K362k620K904l217L562l940
44b069M361m838N375n982O677p483Q431r561J0938j2661J4880j7862K2112k8672
58a6354M0175o5918K13469l1289l67820M17312j21551k53095L37041k3970l35695
69b07695K66284J04556k57862J05513J16244k38871J00341J85714k03946l4117
79f3839J29772j21956J7278Q2179r7544l28O7786K9208K1714p7077N050K6928
91A9171p0198P5079J5796j43253J02084R6615j20998M6538N4933j54005N9284
102a8954J57969j64943m6865J80232j41334m9825K28174j93345j24833K97564
$$ y = [0, 0, 0, 0, 0, 8, -8, 8, -8, 16, -16, 24, -24, 32, -40, 48, -58, 72, -83, 97, -117, 137, -161, 185, -212, 243, -278, 318, -363, 408, -462, 520, -584, 655, -730, 816, -908, 1012, -1120, 1242, -1378, 1526, -1691, 1871, -2069, 2292, -2546, 2829, -3153, 3524, -3959, 4472, -5089, 5849, -6812, 8068, -9794, 12318, -16354, 23821, -42097, 171372, 140083, -227737, 189575, 68024, -185071, 151970, 128000, -207695, 58589, 163145, -94717, 10796, 127040, -111831, -11490, 174224, -29722, -63839, 65933, -56023, -38745, 43434, -54110, -54438, 13348, 42556, 64270, -12807, -7757, 19171, -51027, 24052, 39848, -103405, -1321, 95294, -25704, 20834, 75767, -78238, -18954, 139015, -25928, -72793, 107439, -33895, -83720, 144454, -48891, -173724, 123840]
112A23840j06397j32162K47034j38952j60323K57972o2467j96438J68707J2101
122A2915j29945J60465L8505j95664P7617J00611j36949M8951O3261j34173P5970
133a8436R3867j04758K0864J0436n2011Q1495K240n0949L1594k4594J0672M2443
145D2863o3833k4184L7418K16K5061K4956m7515k2017N0014j6268m1761L2842
157b208m2945j2085J18193m7848n9488R2354o6084k1239J23920r8065n5865J27212
169E5852m5594l6329Q7431o8286n9670J12035J2098p6671N7678J5343p7991P2231
181D8127K0651j28754M3086N2519o3555O6866J4992q5091N5393K4700n1178J4355
193A2111k1436k3146M3300J2515k2549j4452J723O735J1236J3139k7552m355L7006
$$ y = [123840, 17443, -114719, 132315, -6637, -166960, 91012, 28545, -167893, 814, 12915, -117030, 43435, 81940, -113724, -36107, 64504, -72445, -23494, 39767, -94406, -18436, 75431, -29327, -8463, 1973, -50038, 31457, 33697, -17252, 14342, -10252, 420, 42863, -20970, -45154, -7736, -7520, 17541, 42497, -5018, -27035, 22979, 6711, -35050, -2208, -45153, -57238, 60955, 13107, -46381, 45973, -20111, -41350, 82570, -15495, -71360, 55852, 10258, -26071, 61360, -6926, -66596, 45439, 57537, -19134, 38544, 53887, -24104, 48127, 68778, -59976, -16890, 35629, -27926, 38940, 53932, -31159, 24234, 48934, -2244, 12111, -9325, -32471, 10829, 23344, 795, -13657, -11934, -5199, 6037, 19176, -8376, -12731, 24275]
206B4275o301j924j2702m1767K5604J5990p689K5699k9276M428N5438m0882j3869
219b976J5587n2599K7612M8726m8088p948K9262j6773j967K5975k6682l8488N4085
232E726K1782n1759K8500n632n9211N9943J3320o4278L7620J8042k0571L6684
244B0166p254m1580J926K0916M759j4363R662K734j1124L4834m287m5011J5558
257a3064Q879k194K1947j0689j3404L350J0614P282l1276p03K1534j5571L0165
270A6870J0771n2725J9016J9215k8165J6071K42k0025K2687K2146j0203k3214
282g314K372M878j1804K5572J29l2198L4593J2851k5463J4217j8875j6659K9665
295A1964J793l668k281p168J4387m707n085k80k0266K0257K0828j6536M381r557
$$ y = [24275, 17974, 16050, 3348, -38419, -12815, 3175, -4514, 21185, -8091, -3663, 51775, 10893, -2976, 12611, -39988, -12376, 36350, -11738, -19686, 9576, -7197, -9164, 16811, -9871, -48359, 5726, 27508, -24251, 4249, -1383, -60594, -651, 12669, -51609, -13989, 4053, -16518, 20166, 12912, -28668, -26742, -5826, -1067, -15430, -5768, -3034, -14158, 20676, 16389, -28622, -13064, -4185, -6379, 15568, 4879, -8525, -5175, 5439, 12721, -18555, -19258, 2276, -13295, 16870, 27641, -25084, -6068, 13147, -15018, 1053, 1295, -18730, 3957, 26103, 15900, -7314, -4942, -64, -11868, 13704, 13833, -18365, 16228, 29079, 3616, 17833, -1042, -17701, 11964, 13757, 10089, 7808, 640, 15027, 10320, 5235, 4955, -15311, 4946, 25774, 9238, 13619, 4062]
309D062j1945J6820n945q548l3L271K0982k878n428k954k3534J8388J0461k5197
323a2478J6894j111j1478L0332j3923k5513J3082l544M673J3430o952o379m96
336c463J2105p769k0182J1875p277Q84L3015j8893j3159K0243j6115J363R658
349B285j8941N657J0919N081K572j7733J343M87p641J9282p887r862K2893k199
363F256n077O64j6290o38L318P914M216j4972J5186N898j7624J7301j0765k0729
377b5342L0994l34j1497J4344j2357o503J0102k477l916k394J5007Q044o640J2717
391A9748j3969j7130K0514j1183q410J7733r937P315J4774j3187o44m230k088
404f94R526o502L647l10r886J2630p643j2030J1700o295P689J5409r712K437k197
$$ y = [4062, -7883, 8937, 2992, -5556, -5589, -2318, 18664, 15786, 10358, 7404, -16130, 2258, 12719, -12478, 4416, 3305, -8173, 22159, 8236, -17277, -4195, -7739, -3066, 10364, 3412, -2967, -3463, 8642, 873, -19309, -7434, -14711, -13827, 19188, 295, -12864, 7379, -8736, -7373, 2285, -16656, -10999, -80, 5001, 7573, -10160, -8817, -8330, -15971, 3311, -4576, -14438, 8455, 6256, 1179, 1843, -14447, -15085, -11767, -3853, 363, -14609, 577, 6475, -11149, 6152, -4613, -25342, 5652, 5318, -6179, 8165, -4192, -10695, -593, -3070, -6986, -9380, 5627, 13671, 7031, 19748, 5779, -11351, 9163, -2020, -10430, 7303, -2634, 4681, 19455, 6268, 5624, 1394, -694, 8832, 2330, 5977, 5667, -4219, 8411, 768, -11262, 438, -5857, 1832, 17241, 7529, 9966, 7769]
419G769p115K547j0132J088M515k282J9313l023j0242J4014j4601k260J4065j7014
433c358L052J2085r811L905j970q370Q82O85Q718l094k330J2322j4396l058Q047
448C309k2190M207J3437j0061J2112M789p677M177o816l22l554p096J5580l382
462c487l136J7498j4034m039J3628j2986J73R862l463J077N56J956q886o436J4260
477B543j1104q35K4124j6898j236J7258k5930j568J2191j7083O937J2242m291
490c650M977L180k877p155j767N329q918N876R200j1484J1400K237j3240J2777
504E885m135l251J7299j0168K15O938j7134N115J159j3249J2822M552o43J1128
518A6533l375o850l129j828m783p520Q501j614k541J9778j1204q811J9903j6921
$$ y = [7769, 654, 3201, -6931, -5843, -1328, -3610, 15703, 12680, 2438, 16452, 1851, -409, 13656, -3358, -306, 11779, 1968, 5873, 3903, -4467, -3585, -2900, 5818, 2724, 394, 12716, -1680, -4738, 3309, -18881, -14674, -1237, -11298, 814, 5603, -2074, 2103, -4713, -5035, -8589, -15685, -105, -3487, -6623, 10875, -3159, -7198, 6430, -6556, -6383, 3479, 16, 1093, 1649, 3605, -5281, -11717, 2543, -8561, -9396, 14728, -2170, -3406, 13852, -12078, -13646, -1455, -18538, -11601, 641, -3650, 1327, 4507, 1630, -5525, -7292, -1963, -10881, -5005, 4195, -7289, 4111, 6348, -6892, 5885, 1750, -1501, 15798, 5630, 5845, 12783, -4351, 764, 1923, -11326, 1496, 6048, 5405, 16533, 13158, 6308, 3179, 1351, -3432, -10952, -2451, -4065, -6606, 13172, 1968, -6843, 13060, -3861]
532c861j6K1354k3280K554J7867k1424K438Q755j6563Q100J6425k748j763Q966
546A6804m469j2995R101p390k0792K1177K219j1835K5429j0177j4731K3032j3561
559A812r617J4226j5981K450J3688j3394j507K645o344O257Q313l083l196J0221
573F490j514j1875Q857j2265j4613K8614n092j0318K9015j5941q099K8972k3912
586a681j3222K0991j4522J401J9292j3856p713J3490k075q696Q543j965j1624
599a1637J9103J636k2215J2844o437j4810K8736r178j3928K9090j1672o112K2113
612A7533k6662j0523K4259j0687j138J8541r807o523K0703l244k2337J2476L401
625E992j8661K5651K263l1906K3287M398k2783K3533n723j8766K6593j116j3316
$$ y = [-3861, -3877, 17477, -5803, -3249, 14618, -6806, -4368, 4387, -12176, -4076, 12349, 9601, 7838, 16804, 12335, -660, 8441, 1051, -19741, 1436, 3655, -8180, 17249, 7072, -7659, 15373, 1812, -7805, 6421, -9560, -7110, 6578, -6816, -8323, -5678, -12022, -5765, 2548, -535, -3731, 6490, 4976, -6899, 1958, -10307, -24920, 3694, -1398, -11716, 17299, 1358, -6741, 22231, -1681, -14903, 6088, -8434, -7033, 12259, -1597, -9310, 4180, 2105, -6591, 1952, -13, -11637, 7466, 9102, -13113, -269, -6706, -21516, 7220, -1958, -15886, 13204, 1532, -4580, 17533, -9129, -19652, 4607, -6080, -7218, 11323, 1516, -5007, 15696, 12452, -9885, 2591, 5992, -12669, 12982, 15245, -16661, 6626, 11024, -11759, 11774, 6051, -12715, 13878, 12762, -554]
638e54O988j3432m587J2042l230j994N817K271L378P809q865j6844J1274j313
652a240j0504K2563j1459j7254L7073r611k2303L0290j7973j5369M0650j3571
664A1292k5989K3388o356j8425K1733N50k5197K0017K2047k3583N385J0968l4137
677a8307J0171K0581l0405O272J5945j3902J6111N084j9411N038M63J038P531
690F209j1204j971O946l215K279j86r125R53J7188L410j2453R166m077j7360K2707
705I267o178l0253K7910M946j7271K9830r267k8529K6421J710k0837J2727Q85
718A361j4984J5726J3314k4075m474J9053j3746M067K1408k5295j195K5378j7915
731a377k865P397j8450R981J5754o659J70l262k22O242n278l835k918l50J0460
$$ y = [-554, 6434, -6998, -11585, 457, -2773, -4767, 1050, 3321, 6699, 14508, 5643, -11201, 73, -1240, -11744, 10819, -640, -17894, 19179, 9568, -12735, 17555, -418, -15787, 24863, 11292, -14697, 8691, 2335, -16090, 5643, 6193, -19004, 1013, 23060, -523, 4862, 15830, -18307, -8136, 12445, -17960, -11688, 4257, -9645, 6466, 11550, -7861, -2823, -2360, -1322, 6209, -4995, -6966, -20, -3235, -956, -1142, -10267, -9314, 7874, 11284, -1169, 7997, 3920, -13440, 9267, 3089, -27164, 746, 5692, -11579, 18251, 8984, -19545, 6876, 8586, -12251, 476, 1361, -13623, 2103, 15417, -8658, -13132, 5921, -7825, -3758, 17650, -7645, -8840, 16538, -1377, -4242, 3155, -15295, -5314, 10440, 3781, 3951, 689, 467, 6709, 1431, -2404, -5322, -5672, 4788]
746D788N541m360r791J848P122p674M524J622j7355J8490J2769k4466P703J629
760B390j8069K1689O972k1719Q415P947p170L041Mj4295j571K0146n50r723J1082
775H589q043n459J9210j4725j3612J4511l837N038J0775j4975l144P010l0K499
789C807n467l247M524L943M739q532q824K740K233P873j744p150Q634q50J482
804D161O136k1299j949J6141p719N978N551j5768O333J2207p729p355R81K563
818a768Q56Q851O79j9074M458J1611j1071M686J454j0856J4851P383r186k280
832E94p914K618P718m413L18j961o34J1615r12r430m343J770P872M97J054k070
848B379j0793J2479N133j7946M893J098n813J9022J36j4701M104J005m13K054
$$ y = [4788, 10329, 5969, -3822, -1974, 5148, -2526, 1998, 3620, -13735, 4755, 17524, -6942, 761, 2390, -15679, 6010, 12982, -8737, -322, 7625, 455, 3496, 3500, -10795, -12366, 7780, 7230, -2493, 8589, 546, -4913, 14297, -428, -14040, 471, -3366, 1672, 12447, -2528, -5672, 1338, 1308, 3807, -1660, -4907, -383, 3560, 8299, -233, -9057, -6317, -4084, 3789, 2045, -5105, 3529, 2679, 4161, 10297, -11002, -12951, 3190, -4529, 1449, 7000, -8768, -2435, 9772, 2043, -5312, -4331, -1768, -912, 7939, 8618, -10456, -5998, 5613, -5458, -772, 682, -10174, 4677, 12060, 2874, 594, -7320, -4702, 3016, -1397, -1079, -3040, -3674, 7941, 7029, -2401, -6744, -4974, 2898, 3395, 4449, 2379, -8414, 4065, 9198, -8748, -3855, -2757, -8570, 10452, 10588, -4113, -9, 996, 583, 2637]
862B637m726m345J681J1313J773j0780R34l149N93J3221q238o120R346l300M866
877E706Q27j6184J598N887J577P385o201l197O770M99L02o700o985M793M711N521
893F309m263p869N527q68K675M680j4704M005J4116q071L510j929j6150Q612Q831
908D411o886K80J139K038M538K762o058j2150N110P648m998N528l887o765J3789
923F499q55p897K091p727O081J1798q233j552j417l827P845m44o506p43L761Q273
939G147j046l676l284p418Q133M616r704L980O11O60J0972p625q374K461l112
954e659Q152K816j0236M184K378k02M294o972n639L983O471L376o954r16k55l495
970d674R667m071j1713J1966K833j197Q095j1653o809P874j599m06j087l369O471
$$ y = [2637, -2089, -6434, -4753, 6560, 8333, -2447, -1513, -4662, -4069, 9152, 914, -5206, 4140, 840, 5706, 6533, -9651, -8053, -2166, -589, 6796, 595, -2602, 4168, 4667, 4969, -1731, -8716, -3923, 788, 6309, 2046, -5823, -296, -1164, 1511, 6191, -8513, -4508, 9608, 1537, 5047, 3118, -13032, -4420, 4411, -2475, -2195, -1056, 982, 5520, 8282, 2224, -9926, -4816, 2832, -2166, 3362, -525, -7290, 6499, 5644, -2253, -162, -7889, -1808, 9990, 1757, 205, -1212, -5039, 2806, 2362, -4144, -4887, -1126, 7147, 6101, 2425, -859, -8277, -144, 4472, -5232, -1252, -641, 19, 10991, 3366, -5008, -2547, -5659, 2493, 5309, -4927, -743, 1635, 1433, 5727, -1245, -6884, -2901, 3570, 6946, -8, -924, -1179, -4674, 4993, 922, -10791, 1175, 4008, 2811, 10906, -747, -7556, 318, -1281, -1687, -2774, -6143, 328]
985C28M471J856m356p923M088J991O40J375q677K362O456m191K500m972m681J2767
1001D034J599j940J599r022J613M902o601j193j814K470J0160L33j234l900l128
1016b122N910k449l327j34m989Q274L879p088J726l929P56J1587n281l193L098
1031B718m887M803q4j0217M21K178N393N398k067p82j876K267L319r883j587K836
1047b050k523J0296K59r909N430K45n05M938o673j186M287rK298o617m970M262
1063b427M0M827J306n248L932K001r39k430p882J209K716J168O774n683k574R353
1079F143m895j106K066r433M831P182l960L73k329j605L906L63o9l683J271O405
1095E460l395n10k612q301P190K815l899N637l205J20Q285p089m532M97m713N726
$$ y = [328, 4799, 6655, 2299, -5624, -1536, 455, 1095, 2470, -6207, -3845, 2611, -1580, 920, -4052, -8733, 4034, 5633, 3693, 5292, -3730, -2117, 2785, -3816, -5009, -6823, -4353, 5807, 6140, 4906, 1006, -2122, 3788, 1339, -1988, -2122, -7111, 1163, 5042, -2046, -320, -4249, -3493, 8094, 2813, -380, 2718, -2169, 2634, 2550, -7667, -7246, -5068, 325, 5723, 3656, 2874, 998, 3265, 6584, -3299, -4886, -2050, -4573, 5723, 5982, -3927, 1503, 1748, 1243, 6181, -492, -1678, 2609, 2600, 4898, -1719, -6689, -2427, -2387, 2440, 3746, -1502, 2430, 4431, 3492, 1062, -6820, -5611, -2895, -1727, 5047, -636, -3210, 6143, 1248, 142, 2208, -7225, -2394, 4788, 828, 1201, -1128, -2733, 1173, 1536, 1467, -2216, -945, 5460, 2065, 1555, -1057, -9358, -2168, 647, -3252, 2385, -820, -700, 7585, 496, -4036, -3539, -8252, -2526]
1111b526L327l414J120M86L042L93l509R6l129L319N985o378r9J08m392Q026j468
1128I87m230O873j741K829L982r951j632J084l858N065J02l157N220K971M23k702
1144B265k470r95l091O010k23q078P236k95n178R843n256n668J1831j400j893
1159B638L864o829k666K892j002j305l67M561K313J234L493p058k448M307n537
1174a910K087N49n961P503P23m458M967n865o88Q457m801p29K995n392J148J473
1190I8l701j548J640N327q20K358K108q292L497K841j0036M878J647n797J0552
1205D752k34p251N694l300k456N213l273j481L127j37l59j584o29k855J688N480
1221B395m592J268M242p700L809J812j0447O234K672m534Q593j187n708N444k446
$$ y = [-2526, 801, -2613, -1493, -1007, 2035, 2428, -1081, -985, -4114, -795, 5190, -1188, -1287, -1179, -5571, 2455, 987, -3243, 3630, 1889, 4718, 8700, -1251, -2883, -1799, -5657, -592, -490, -3647, 1573, 4544, 4967, 2265, -205, -1200, -4291, 1719, 1496, -6582, 654, 359, -4819, 5024, -232, -5900, 5931, 4531, 2638, 6502, -327, -2993, -101, -1103, -2408, -2775, 1786, 4099, 5333, 8826, 1768, -680, 3627, -1910, 177, 726, -5235, 2268, 2991, -1467, 3500, -2365, -3053, 5404, 603, -126, 2869, -2523, -1375, 98, -3603, -5151, -3511, 1816, 996, 3354, 5462, -2830, 667, 3508, -6528, -1650, -3, -5800, 4752, 4518, -2733, 2961, -339, -2795, 2418, -855, -2336, 791, 654, 295, -1289, -1918, -4773, -3085, 2395, -2197, -929, 3313, -4387, -578, 1234, -9213, -2979, -307, -4841, 3752, 2565, -3143, 2301, -145]
1236a45l203K081j416L40K285L314j653k480L344l152p95N571o164J358O065p463
1252b113L271J120q952O617J889m579P231j470l829M344k704m128J11J358k36
1267b070J311N474l066j941O723o543k433P439q057J940P816q126K227L781p618
1282c143L863K349l355L113J391r17o02j022j471l846K683J194k607O084r81k901
1298a68N881n921k638N278o329J918N431o660L693J953o097L321L43k379L278
1313I04J230r61r30J327j874m599M864k119k824R278l351l724Q833p268l357P817
1329C246p648l0P261m651M01L448l665k121K310J026l618L101L924n299L297J786
1345B768r096M403K042o233O978J83l893O227l037k436K586l811K107K630k054
$$ y = [-145, -3348, -1267, -2683, -2343, -58, 3256, 1603, -877, 2467, -685, -1480, 4091, -2073, -715, 5350, -2113, 1158, 2278, -6674, -57, 1832, -2747, 4484, 3014, -815, 3529, 825, -3303, -3192, -1834, -2070, -759, 4715, 1649, -292, 6431, -112, -2545, 4894, -3163, -1223, 6593, -1533, 694, 4475, -3143, 720, 3069, -286, 2827, 4218, 3301, 2699, 1677, 206, -3640, -957, 237, -2370, 3714, 2733, -168, 5713, -208, -2846, 2432, -3897, -1979, 3452, -3208, 485, 2438, -3659, -338, 5, -2374, 904, 2134, 1173, 243, 1570, -304, -4903, -39, -2158, -4982, 4296, 945, -2779, 6054, -1214, -4571, 3246, -4402, -4432, 2829, -1822, -1421, 2027, -1638, -3759, -1449, -423, -4041, -940, 2984, -2315, 982, 2768, -6328, -1925, 117, -6116, 862, 1045, -2848, 3379, 342, -2094, 492, -3319, -1212, 1418, -636]
1360f36J790k71j439J58m90l77j935L765K771m453N482j476p539P721k033p377
1376f339R747k223m680R971l322n840N007j350k502L282J427l402P63N223n895
1391a33k103N058n810K122P431p116K065L632o636L545o74n755M893l96L52M203
1407D678l682j580K416j551j167R08O26j403K921L505p316J72M585p874M858N375
1423E471j0322N928N129r274L862Q38p746M727L745l266M88J174j549r89K004
1438B20k862l710N889K83j551N145n792m02N130o363J756J980n955P449K274o684
1454c193L842j439l378N684o3m064K245L023k512j611K725n979j540R783m379
1469h56j814Q211p023k49P439r670j616N375m196L743L218m565O53K198k02l70
$$ y = [-636, 1154, 883, -556, -398, -888, -1265, -3200, 565, 3336, -1117, 4365, 2889, -4650, 3071, 1038, -6339, 3408, 1185, -3495, 6476, 3154, -2686, 2321, 971, -1531, 1751, 3178, -224, 539, 5762, -133, -2236, 2822, -2988, -866, 6565, -551, 1514, 5146, -1490, 2055, 1381, -4374, 519, 123, 475, 4678, 996, -584, 1832, 281, -886, 22, 648, -755, 2166, 5671, -1645, -1473, 3112, -4762, 96, 5471, -4851, 1077, 6206, -3068, 794, 1632, -6114, -1387, 2358, -908, -420, 754, -795, -1784, 220, -2642, -6352, -463, -180, -1731, 3414, -2378, -2780, 2350, -4013, -2257, -277, -6232, 1217, 3491, -3193, 649, -790, -4168, 1516, 1453, -2611, -366, 2657, 145, -1466, 1259, -4720, -6260, 3523, -856, -2670, 5541, -1482, -1731, 5708, -3962, -5578, -203, -4399, -656, 2562, -2003, -1350, 848, 646, 276]
1485B76j81j03q08L913K04n417K575j898q60P025m093q80O775m170J947K264r726
1502c157J271L824l816L580J031l848L181K796k616k810R87l14j124N154l054
1517A085o452P098j874l415P113n352r67R453l991j459K191o648J625L278k795
1532a110l8J270J816J459P22j511m610J591K510l323K863j794l652O789k411l678
1548c107L397m456K041O150n389n56P94l372K954k17l288J055K544K628j15n14
1564E49j889l139M041O04n289M955n37j338Q055m306n374M842k030J28L667m538
1580a599m17K309N55m40l105L32J029J400L290l170k180J324k052J929j759l590
1596f144M975J113J361L838n924j101M690l871P42O37l631L683L207m83j708j430
$$ y = [276, 95, -8, -816, 3097, 3301, -2116, 459, -1439, -2299, 4726, 633, -247, 6528, 2358, 4305, 6569, -3157, -1886, 1938, -1878, 1702, 2733, -1115, 2066, 4862, 2246, -564, 423, 109, -1015, 4139, 1085, -5367, 1731, -143, -3558, 3555, -1797, -2764, 6689, 2698, 1239, 3430, -3218, -1593, 1685, -1110, -1148, 122, 1938, 3397, 4119, 2608, -2002, -411, 2099, -1224, 1639, -155, -3807, 2982, 571, -3107, 290, -4166, -2125, 4025, -1364, -1920, -1126, -4498, -1544, -1761, -5049, -3994, -1450, 1178, 1063, 549, -1340, -4479, -438, 166, -5123, -168, -705, -2043, 6012, 1706, -3668, 1174, -856, -728, 2939, -1599, -2016, 293, 848, 408, -2697, -2365, -1336, 64, 3354, 184, -1996, -672, -2724, -795, -2554, -6144, -1169, -56, 1305, 5143, -781, -1882, 2808, -1063, -321, 316, -3315, 368, 3575, 3092, 1384, -46]
1612d6K024Q67Q45J314n306J477L141m518R49j515l553O831R59j089J726l624
1628D82N73K166m367j230j163M38M396j3p08p82m95L396q30j691N30k468L472
1645A706J583m836J181j504l2O318k331j206K565k156K262m35n871j76K79J574
1661a079K718k314J40J24P25J884l951k030J334o97L539j018m296K573m41R45
1677a844K986m464O74M261j130J215k362l642J466J638J765q06j532L509K98r4
1693A938M93n644M2L641q44J287j194k194L548o02m26p14l711L652K362k316J012
1710C30k556j215L690n84q27m28O98L692m75n41j520m074L910K087k805K546j009
1727I19O04M560k929k620k26j171L192L82k397N84r31K084J533l702j02O1J246
$$ y = [-46, 1978, 2845, 3690, 5004, -302, 1175, 4316, -202, 747, -768, -4321, 2510, 3469, 2380, 4106, 482, 1055, 3221, -1146, -2376, -3539, -3101, 1295, 1282, 574, -208, -703, 2693, 1863, 172, 702, -1766, 1706, 3289, -1547, -366, -1870, -1902, 4416, 2085, 879, 3444, 1288, 3550, 3115, -2756, -2932, -2653, -1079, 1639, -675, -535, -411, 314, 2198, -1753, -3783, -2449, -3146, 393, -625, -4921, -2348, -2789, -1844, 1142, -3322, -2648, 1613, 483, 1698, -664, -4306, -2840, -1202, 563, -243, -1775, 1734, 2032, 1938, 2431, -3213, -3171, 470, -374, 913, -281, -2475, 1073, 471, 45, -669, -4380, -728, 1634, -682, 330, -2226, -3441, 249, -335, -1162, -1590, -892, 2800, 2325, 1784, 264, -3810, 100, 2187, -618, 1928, 919, 1523, 6083, 3154, 534, 308, -863, 2329, 2711, 314, 898, -33, 2051, 3584, -118, -220, -159, 1087]
1744A087L241l446j628m0j722L521j090l209L449M35K110K180m779j041M66m01
1760h67J882j917j217K599N74K529j467l760K135L60O40J589m455K53J728j426
1776h20J321l039j479M254N11J084k84l912J079O06j008n53k621J694L172R3J156
1793A254l091j022L492j447KM51l247L411K178l168J18j602j93L881k76j75m55
1810A11n51K583k044j362p13j973L916K012k658J854j989l42L628l623r14J361
1826g04r26L702n6l142N00q77J482J277k006R90M2J352K162l560q93O53r50L534
1844B580o43k545K727r08O81J056m481J13K987n52K288j341k401J441J93J31j899
1861e73q75J807K79K349m3m947K700M74k398L595k235k564N129o14k029P52k882
$$ y = [1087, 4328, 882, -746, -786, -2508, 1013, -77, -3286, 163, 598, 2708, 4888, 109, -932, -466, -867, 1015, -902, -2119, 480, 1054, 3583, 2116, -1644, 491, 851, 1491, 3080, -1375, -1122, 606, -820, 501, -2538, -4017, 237, 748, 1832, 1548, -2364, -1285, -679, -1687, -2240, -4861, -3167, 5, 98, 1254, -1837, -2859, 633, -814, -812, -361, -3608, -197, 1981, -1187, -1069, -2671, -2864, 1017, 741, 566, 111, -440, 2143, 99, -1263, -1976, -3949, -33, 1979, -679, 1175, -814, -1156, 2472, -1151, -2065, -704, -1630, 2072, 2016, -1126, -626, -1503, -21, 1256, -750, 240, 282, 1634, 3796, 236, -657, -4, -954, 2580, 1937, -608, 2119, 1211, 1892, 2948, -1533, -1420, 1567, 1015, 3303, 1962, -439, 1002, 1195, 1326, -573, -1448, 359, 638, 2987, 2944, -2003, 697, 1171, -1227, 2368, 133, -2431, 2698, 2084, 55, 807, -2075]
1878b075M98K661J07m46j129J534L09j428L82l193l76M077j374P86O62l399L319
1895I15j12l229K163j988R0M915k657j511J153k021J022J435j284o80J282K290
1911A783j544q51N56l791K474L141m767J939J918l585M053l55m566K441M30k16
1927i40K537j695j065R59L32o43j440O18jJ172L067k557o64K214l412K364J671
1944B517n576L409K155l509L189j179l896L560O44j222J137P0o56O68R55k904
1960f38k076K877q27M69L371l521M05L529l769O86J002m533L759J721l325K709
1976A839j059k050L241k45j992J312J335o85J3P36l728j071L892k876M22L868
1992B952m073J627M339n757O3J761m042K564J529l074J329R16q83M61j07p55m79
$$ y = [-2075, -1577, 1084, 1191, 745, -384, 1150, 1459, 31, 413, -2780, -3156, 921, -453, 333, 995, -2404, 915, 803, -2426, -263, -2251, -2161, 2754, 97, -1414, -261, -2282, -1260, 175, -1109, -1789, -507, 1783, 239, -612, -56, -3847, -1373, 1768, -2999, -1060, 858, -2727, 1326, 971, -3595, -1154, -724, -940, 1597, -98, -1163, -204, 128, -515, -1955, -1337, -1338, -166, 2901, 344, -320, 1894, -1518, 846, 2517, -3059, 350, 2505, -1004, 2185, 1006, -2890, 670, 1314, 92, 1229, 1299, 643, 1311, 2266, -638, -2714, 163, -664, -195, 3176, -345, 60, 3589, -180, 506, 1508, -3025, 734, 2455, -870, 1839, 780, -1270, 1971, 1726, -266, 1046, 2381, 1696, 1709, 2445, -1283, -2354, 1538, -1338, -916, 2952, -1121, 506, 4845, -912, -849, 912, -3130, -566, 963, -2111, -782, 134, -749, -288, -395, -1150, -1629]
2009a629K569k84j227J172k276l49L018l085O7L802k962K297K635n936J192J918
2025I22l849K455R32k641J821K084k070r16J037j189j257L711j395k585M095j923
2041g68k317M318l393o71M725k706P79K073l623P88J358k141R17R02L2J232Q55
2058B360q51j507R24o30j342K422j485j086M513k557j117L351m274L18L794l906
2074a073Q94K049k926O10J445k704N48J854J0o7J907j066k459K292j067k945L276
2091E78m38j394M578j428j946L409l039n79K469k549K13J607j646K74P2m28l44
2108e91R66R20j069J191L4k575J222j172k629L085r35p36M261j885n73K558l398
2125a326j50J766k231N08J680p58L5O51K13j247J365Q00j921J981L15l344J991
$$ y = [-1629, 940, 656, -571, 601, -1675, -2024, 994, -2091, -2024, 1778, -1184, 1113, 3748, -2188, -996, 922, -2927, -472, 460, -2181, -360, 1724, -346, -1262, -225, -1414, -2671, 1040, -355, -2940, 1155, -768, -3085, 1233, -2160, -2831, 1894, -812, -33, 2040, -1583, -795, 563, -1578, -661, 241, 273, 1505, 2360, 1509, 2, 926, 296, -1046, 1376, -109, -1195, 3318, 761, -356, 2995, -1279, -961, 2833, -1073, -179, 1870, -1056, -446, 999, -1705, -1157, 697, 707, 640, 2547, 1481, -978, 1314, 247, -2698, 578, 140, -1254, 3324, 1896, -50, 3359, 320, -259, 2210, -339, -126, 1481, -165, 109, 181, -247, -591, 375, 1295, 226, 1417, 1451, -1124, 98, -1074, -3703, -618, -1553, -2289, 1972, 87, -486, 2072, -1326, -1476, 290, -1941, -1433, 247, -511, -476, 175, 388, -859, 506, 1306, -615, 1366, 1681, -1663, 328]
2142C28m95l111L200q35p62L068q91m66J046k169o5J72j310R10L25L08L79K0O45
2161B97j419P53P82k101K259J84k235K647q79k221L163j515o44L431j369l96R43
2178A680j424n23R5j50p7L01J987q68l80J045k287J19J410k224P37J100j129J937
2196A349q69j195J348j051N60J228j482M31M83j175N01n78KN69R90R82r89J42
2214A246O09k300Q38J62k726K091P57q93K117j107r33R86q92k28k25n12R63n35
2232e82k5K40j609J356M80l80J546p68j06J006k141P4j41j751K237O07k77J490
2250A256j018K76Q14j813J43n35q9J377q23K2K28j062J406j22r01J158m14N29
2268D32M27j781k12k15n81J990p59P0J622p40P34L8k084M17l16L24J014j224J054
$$ y = [328, -167, -3278, -78, -913, -1675, 1393, 502, 36, 1082, -1087, -1152, -980, -2290, -1380, -1055, -747, -368, -348, 297, -1122, -369, 413, -1688, 571, 755, -1480, 1167, 288, -1933, 1230, -285, -929, 2502, 1133, 737, 1680, 256, -267, -172, -322, -399, -98, 1889, 1021, 641, 1686, -601, -482, 928, -1296, -559, 541, -588, 1349, 480, -715, 633, -418, 142, 1370, -112, 319, 802, -373, 128, -450, -448, 121, 1111, 2093, 1104, 1246, 1855, -445, 393, 555, -2171, -80, 677, -216, 1901, 794, -139, 847, -45, -273, -498, -1010, -47, -582, -607, -367, -1976, -620, -140, -520, 1026, 258, 152, 1158, -983, -909, -1050, -2801, -564, 43, -234, 1256, 238, 514, 1328, -485, -342, -877, -966, 411, -412, -390, -162, -1224, 182, 60, -841, 317, -97, 432, 859, -922, -1134, -1349, -1930, 60, -699, -629, 993, 253, 987, 1025, -1059, -642, -958, -634, 380, -844, 210]
2287B10K64m65J210j420o28J727n07N86M42j953N98j56M0M05j228Q57J119o10
2305D91J304j628j350J604q55J32R49j249J025P69q06L1j335J48J274l71O53j62
2323F24j054J579m50p39L00j380J486R61r54O74j489k78J487j274J61M06o84J914
2341A290Q1j367lj218O34O84j133Q91j79K0J919j565n95O9q60J905k13j197J132
2360B95r74Q28P57k208M28R50m31K014j186j072K55j06K33l24j203J119L2J391
2378G98Q07k294K91L74r22J609j212o63J717l84L67j97k001J225M22KJ220j458
2396b99O5J245q27m2j167m16J532J55P75k80j295J013J3o86P78j617N53K053j188
2415C65M77p26j246J403J62o99N51m31P55P99j206j65j124M97J069o58O86n02
$$ y = [210, 474, 9, 1219, -201, -829, 898, 391, 977, 1419, -534, 64, -92, -52, 353, -875, -18, 1101, 491, 1795, 167, -1183, 421, -434, -302, 647, -602, 423, 1192, 386, 417, -918, -770, 504, 133, 786, 624, -430, 1149, 699, -40, 260, -1120, 366, 1327, 373, 1047, -442, -720, 767, -507, -346, 60, -624, 1290, 1371, 4, 1, -1217, -583, 101, -1032, -141, -320, -300, 1619, 54, -541, -472, -1332, 573, 360, -837, 295, -679, 149, 906, -1302, -874, 76, -355, 1659, 473, -599, -344, -450, -217, -541, -1744, -625, -593, 798, 1605, -689, -398, -24, -946, 663, -549, -1212, 505, 121, 488, 291, -1710, -485, -63, -61, 1159, -299, -234, 1011, 184, 142, -1025, -1441, 91, 246, 1021, 741, -554, 459, 472, -214, 564, -1053, -500, 1553, 365, 842, 116, -1130, 273, 435, -264, 287, -144, 611, 1410, 204, 39, -1085, -588, 481, -177, 509, 7]
$$ [...]
8191a4
##END NTUPLES=NMR FID
##END=
