##TITLE=1H_72-2022
 CDCl3
 8 sc, 
 1.09.2022
##JCAMPDX= 6.0         $$ Bruker NMR JCAMP-DX V2.0
##DATA TYPE= NMR SPECTRUM
##DATA CLASS= NTUPLES
##ORIGIN= UXNMR, Bruker Analytische Messtechnik GmbH
##OWNER= root
$$ XWIN-NMR		Version 3.5
$$ Thu Sep  1 09:55:02 2022 Russian Standard Time (UT+4h)  she@DPX200
##.OBSERVE FREQUENCY= 200.1313499994
##.OBSERVE NUCLEUS= ^1H
##.ACQUISITION MODE= SIMULTANEOUS
##.ACQUISITION SCHEME= undefined
##.AVERAGES= 8
##.DIGITISER RES= 18
##SPECTROMETER/DATA SYSTEM= spect
##.PULSE SEQUENCE= zg30
##.SOLVENT NAME= CDCl3
##.SHIFT REFERENCE= (INTERNAL, CDCl3, 0, 15.7645)
##AUDIT TRAIL= $$ (NUMBER, WHEN, WHO, WHERE, WHAT)
$$ ##TITLE= Audit trail, XWIN-NMR		Version 3.5
$$ ##JCAMPDX= 5.01
$$ ##ORIGIN= Bruker BioSpin GmbH
$$ ##OWNER= she
$$ F:/spectra/data/she/nmr/H-F/1/pdata/1/auditp.txt
$$ ##AUDIT TRAIL=  $$ (NUMBER, WHEN, WHO, WHERE, WHAT)
(   1,<2022-09-01 09:53:45.14 +0400>,<she>,<DPX200>,
      <created by zg, POWCHK disabled, PULCHK disabled
       configuration hash MD5:
       00 E9 B6 7A A2 85 ED C7 34 08 36 98 17 FE 4E 26
       data hash MD5: 16K
       49 9F 41 E9 59 8C 49 17 50 7D F3 CA 3B 19 D7 95>)
(   2,<2022-09-01 09:53:47.60 +0400>,<she>,<DPX200>,
      <Start of raw data processing
       efp BC_mod = 2 LB = 0.24 FT_mod = 6 PKNL = 1 PHC0 = -18037.77 PHC1 = 11.20069 SI = 16K 
       data hash MD5: 16K
       72 68 87 1B 1B 1D A8 9F C2 1E 04 FD FD 25 B4 A6>)
(   3,<2022-09-01 09:54:10.57 +0400>,<she>,<DPX200>,
      <pk PHC0 = -0.1659565 PHC1 = 0.6000003 
       data hash MD5: 16K
       8B 39 62 27 3A 60 74 73 83 59 9B 2C BA 3A 7D 6C>)
(   4,<2022-09-01 09:54:13.51 +0400>,<she>,<DPX200>,
      <abs ABSG = 5 
       data hash MD5: 16K
       79 C3 A2 CD FA D7 69 E9 02 C0 3A BD 68 27 12 79>)
$$ ##END=
$$ 
$$ hash MD5
$$ 23 15 B4 19 E1 5D CE 60 84 E1 ED E9 B5 B7 B2 4E
##$RELAX= 
##$RELAX= 
##$RELAX= 
##$RELAX= 
##$RELAX= 
##$RELAX= 
$$ Bruker specific parameters
$$ --------------------------
##$DU= <F:/spectra>
##$EXPNO= 1
##$NAME= <H-F>
##$PROCNO= 1
##$TYPE= <nmr>
##$USER= <she>
##$AMP= (0..31)
100 100 100 100 100 100 100 100 100 100 100 100 100 100 100 100 100 100 
100 100 100 100 100 100 100 100 100 100 100 100 100 100 
##$AQSEQ= 0
##$AQ_mod= 1
##$AUNM= <au_zg>
##$AUTOPOS= <>
##$BF1= 200.13
##$BF2= 200.13
##$BF3= 200.13
##$BF4= 200.13
##$BF5= 200.13
##$BF6= 200.13
##$BF7= 200.13
##$BF8= 200.13
##$BYTORDA= 1
##$CFDGTYP= 0
##$CFRGTYP= 5
##$CHEMSTR= <none>
##$CNST= (0..31)
1 1 145 1 1 1 1 1 1 1 1 1 1 1 1 1 1 1 1 1 1 1 1 1 1 1 1 1 1 1 1 1 
##$CPDPRG= <>
##$CPDPRG1= <>
##$CPDPRG2= <>
##$CPDPRG3= <>
##$CPDPRG4= <mlev>
##$CPDPRG5= <mlev>
##$CPDPRG6= <mlev>
##$CPDPRG7= <mlev>
##$CPDPRG8= <mlev>
##$CPDPRGB= <>
##$CPDPRGT= <>
##$D= (0..31)
0 1.2 0 0 0 0 0 0 0 0.06 0 0.03 0 0 0 0 0.0002 0 0 0 0 0 0 0 0 0 0 0 0 
0 0 0 
##$DATE= 1662011624
##$DBL= (0..7)
120 120 120 120 120 120 120 120 
##$DBP= (0..7)
150 150 150 150 150 150 150 150 
##$DBP07= 0
##$DBPNAM0= <>
##$DBPNAM1= <>
##$DBPNAM2= <>
##$DBPNAM3= <>
##$DBPNAM4= <>
$$ [...]
##$SUBNAM3= <"">
##$SUBNAM4= <"">
##$SUBNAM5= <"">
##$SUBNAM6= <"">
##$SUBNAM7= <"">
##$SUBNAM8= <"">
##$SUBNAM9= <"">
##$SW= 18.0517283424941
##$SWIBOX= (0..15)
0 0 2 0 0 0 0 0 0 0 0 0 0 0 0 0 
##$SW_h= 3612.71676300578
##$TD= 16384
##$TD0= 1
##$TE= 0
##$TE2= 300
##$TE3= 300
##$TEG= 300
##$TL= (0..7)
0 120 120 120 120 120 120 120 
##$TP= (0..7)
150 150 150 150 150 150 150 150 
##$TP07= 0
##$TPNAME0= <>
##$TPNAME1= <>
##$TPNAME2= <>
##$TPNAME3= <>
##$TPNAME4= <>
##$TPNAME5= <>
##$TPNAME6= <>
##$TPNAME7= <>
##$TPOAL= (0..7)
0.5 0.5 0.5 0.5 0.5 0.5 0.5 0.5 
##$TPOFFS= (0..7)
0 0 0 0 0 0 0 0 
##$TUNHIN= 0
##$TUNHOUT= 0
##$TUNXOUT= 0
##$USERA1= <user>
##$USERA2= <user>
##$USERA3= <user>
##$USERA4= <user>
##$USERA5= <user>
##$V9= 5
##$VALIST= <valist>
##$VCLIST= <CCCCCCCCCCCCCCC>
##$VD= 0
##$VDLIST= <DDDDDDDDDDDDDDD>
##$VPLIST= <PPPPPPPPPPPPPPP>
##$VTLIST= <TTTTTTTTTTTTTTT>
##$WBST= 1024
##$WBSW= 4
##$XGAIN= (0..3)
0 0 0 0 
##$XL= 0
##$YL= 0
##$YMAX_a= 874971
##$YMIN_a= -986919
##$ZGOPTNS= <>
##$ZL1= 120
##$ZL2= 120
##$ZL3= 120
##$ZL4= 120
##$ABSF1= 15.73257
##$ABSF2= -2.31928
##$ABSG= 5
##$ABSL= 3
##$ALPHA= 0
##$AQORDER= 0
##$ASSFAC= 0
##$ASSFACI= 0
##$ASSFACX= 0
##$ASSWID= 0
##$AUNMP= <proc_1d>
##$AZFE= 0.1
##$AZFW= 0.1
##$BCFW= 0
##$BC_mod= 2
##$BYTORDP= 0
##$COROFFS= 0
##$CY= -3
##$DATMOD= 1
##$DC= 0
##$DFILT= <>
##$DTYPP= 0
##$F1P= 0
##$F2P= 0
##$FCOR= 1
##$FTSIZE= 16384
##$FT_mod= 6
##$GAMMA= 0
##$GB= 0
##$INTBC= 1
##$INTSCL= 3.70164e-10
##$ISEN= 128
##$LB= 0.24
##$LEV0= 0
##$LPBIN= 0
##$MAXI= 10000
##$MC2= 0
##$MEAN= 0
##$ME_mod= 0
##$MI= 1.114404
##$NCOEF= 0
##$NC_proc= -4
##$NLEV= 6
##$NOISF1= 3.799351
##$NOISF2= 2.8
##$NSP= 0
##$NTH_PI= 0
##$NZP= 0
##$OFFSET= 15.76452
##$PC= 1
##$PHC0= -18037.94
##$PHC1= 11.80069
##$PH_mod= 1
##$PKNL= yes
##$PPARMOD= 0
##$PSCAL= 0
##$PSIGN= 0
##$REVERSE= no
##$SF= 200.130001405071
##$SI= 16384
##$SIGF1= 3
##$SIGF2= 2
##$SINO= 5.538805
##$SIOLD= 16384
##$SREGLST= <1H.CDCl3>
##$SSB= 0
##$STSI= 16384
##$STSR= 0
##$SW_p= 3612.71676300578
##$SYMM= 0
##$S_DEV= 0
##$TDeff= 16384
##$TDoff= 0
##$TI= <>
##$TILT= no
##$TM1= 0
##$TM2= 0
##$TOPLEV= 0
##$USERP1= <user>
##$USERP2= <user>
##$USERP3= <user>
##$USERP4= <user>
##$USERP5= <user>
##$WDW= 1
##$XDIM= 16384
##$YMAX_p= 355103029
##$YMIN_p= -142673
$$ End of Bruker specific parameters
$$ ---------------------------------
##NTUPLES= NMR SPECTRUM
##VAR_NAME=  FREQUENCY,     SPECTRUM/REAL,   SPECTRUM/IMAG
##SYMBOL=    X,             R,               I
##VAR_TYPE=  INDEPENDENT,   DEPENDENT,       DEPENDENT
##VAR_FORM=  AFFN,          ASDF,            ASDF
##VAR_DIM=   16384,         16384,           16384
##UNITS=     HZ,            ARBITRARY UNITS, ARBITRARY UNITS
##FACTOR=    0.220516191357247, 1,           1
##FIRST=     3154.95334800362, 0,            0
##LAST=      -457.763415002163, 0,           0
##MIN=       -457.763415002163, -142673,     0
##MAX=       3154.95334800362, 355103029,    0
$$ Real data points
##PAGE= N=1
##DATA TABLE= (X++(R..R)), XYDATA
$$ [...]
6482G219412J77851J34640J13697J05351J38130J20324J02743J06438J05523Q2391
6472H406500M3065N0313L6829q353m9894p0887o1930n4758q4859j13140j33452
6461G959434r4859q0222r6125j08169j20653j12829j16855j38408j70019j58078
6451F763217r1002j13917j32198j31396j39234q4836j93188j76189j02714j65245
6441E433298j17201j17367j34610j23030j28869j41798j25078j05759j41244j31325
6431D167017l4627q2958j41409r4524q2364m5885p9790j01888n7555p2056k7760
6420C346201q1606m6752m7146r1275n2878l6195o0351n2473m8107r5754m2226
6409B691438n9384k1349m5503n4486j5796p123l2876p762l709k9250m5273m170
$$ y = [7219412, 7397263, 7531903, 7645600, 7750951, 7889081, 8009405, 8112148, 8218586, 8324109, 8406500, 8449565, 8499878, 8536707, 8528354, 8478460, 8407573, 8345643, 8290885, 8206026, 8092886, 7959434, 7864575, 7784353, 7688228, 7580059, 7459406, 7346577, 7229722, 7091314, 6921295, 6763217, 6672215, 6558298, 6426100, 6294704, 6155470, 6070634, 5877446, 5701257, 5598543, 5433298, 5316097, 5198730, 5064120, 4941090, 4812221, 4670423, 4545345, 4439586, 4298342, 4167017, 4132390, 4049432, 3908023, 3813499, 3731135, 3685250, 3605460, 3503572, 3446017, 3373961, 3346201, 3264595, 3217843, 3170697, 3079422, 3026544, 2990349, 2929998, 2877525, 2829418, 2733664, 2691438, 2632054, 2610705, 2565202, 2510716, 2494920, 2487797, 2454921, 2447159, 2443450, 2414200, 2368927, 2364757]
6397B364757l1290o172J7313j9460k7941m1755J5506k5702l2079n7585o6901k2327
6385B066364m0392m3213j02784n7847m9804J6021o7068p9610K405o0884m5340
6374A537848k6090k6428O502k3922m4968l5082l9799p473J1306O742n1424l2315
6362A274897j9338q889O092m3765k2527l8196j4189o847k1797J8531l9659n097
6350A079216k7664j1986K3176O586m8182k5167l5387j5056K6523J0274j2371j2741
6338I57221k8495j1794K4827L954m2511r064j786k4703n392j183J1548j2490q241
6325H51891j056m4270j7537J7907K6762j5802l6215k8563J0241M4780j7050l6987
6313G54101k1502q01k2150k5203O276j8935K1456p531J7158o025m9392M789k096
$$ y = [2364757, 2333467, 2327295, 2344608, 2325148, 2297207, 2255452, 2270958, 2245256, 2213177, 2155592, 2088691, 2066364, 2025972, 1982759, 1879975, 1822128, 1772324, 1788345, 1721277, 1641667, 1644072, 1583188, 1537848, 1511758, 1485330, 1491832, 1467910, 1422942, 1387860, 1348061, 1340588, 1351894, 1358636, 1307212, 1274897, 1255559, 1246670, 1252762, 1208997, 1186470, 1148274, 1134085, 1127238, 1105441, 1123972, 1084313, 1079216, 1051552, 1039566, 1062742, 1069328, 1021146, 995979, 960592, 945536, 972059, 982333, 969962, 957221, 928726, 916932, 941759, 945713, 903202, 894138, 892352, 867649, 862257, 861074, 872622, 860132, 851891, 850835, 806565, 789028, 806935, 833697, 817895, 781680, 753117, 763358, 808138, 791088, 754101, 732599, 731798, 709648, 684445, 690721, 671786, 693242, 685711, 702869, 696844, 647452, 652241, 650145]
6300F50145P722J2610m597k3738j8120J6390k8939J0278J5076L53k042j4301Q430
6287F29267Q016J8089m022p983l2633q385j9396j31j6425M3468l381m3298L769
6274E66955J3242M493n083J590J669J6132J4149O178q069R887J5068L7816j8300
6261F55727K3621J2615l636k3835L1755j496r791R427P996L1769R372L0846k6960
6248G47410j4814L6149J4973k8196M5107j0684L8315M1601M4564P976L909L0602
6236I56912L1120L1924J2213L5037l205M0534M4175k1819q580q679n7896m1161
6224A010575n2446L9051m4036p1958N739k8111R154k467l6522j8348J2827M013
6212H27471l9232J440r667m7769j2434M1215k910l5658L9563j7028K0170p474
$$ y = [650145, 657867, 670477, 665880, 642142, 624022, 640412, 611473, 621751, 636827, 637180, 635138, 620837, 629267, 637283, 655372, 651350, 643367, 610734, 602349, 582953, 582822, 566397, 609865, 606484, 563186, 566955, 580197, 584690, 579607, 581197, 582866, 598998, 613147, 619325, 611256, 621143, 636211, 674027, 655727, 679348, 691963, 688327, 664492, 696247, 694751, 684960, 694387, 702383, 734152, 743524, 774370, 747410, 732596, 768745, 783718, 755522, 800629, 789945, 828260, 869861, 914425, 922401, 926310, 956912, 988032, 1019956, 1032169, 1067206, 1064001, 1104535, 1148710, 1126891, 1118311, 1109632, 1051736, 1010575, 958129, 997180, 953144, 881186, 886925, 858814, 867968, 865501, 828979, 810631, 823458, 827471, 788239, 789679, 780012, 732243, 719809, 761024, 758114, 722456, 762019, 744991, 765161, 757687]
6200G57687K1880J9146k6989J6826L3588M924j0364j262J5673k150j1918K7327
6188H44368L6658j690Q997j185J1048n649M9124K1127k778J7169J9332p84j3645
6175I82092K0352M8065k0347M142O7012L8637N0432Q716j799K0320j0248k2213
6163A185161N7294J5884j889L6295J9229L7893L2699N700K0870N1807M7360O5190
6151A573493P0850K8925L7643K7518O3765M9395P5093R7836L0283L8587Q7228
6140B180616O9333N8074P7286L9455P8118M3419M8069J10368Q7204Q2094K7072
6129B901108R0520R6207J20727O5452O1197J11089J13428J41373J31910P4805
6119C907816J21673J28056J31468R8164J23457J48730J26386J87636J87521J91678
$$ y = [757687, 779567, 798713, 771724, 788550, 822138, 827062, 816698, 815436, 831109, 828959, 817041, 844368, 881026, 879336, 888333, 887148, 898196, 892547, 941671, 962798, 960020, 977189, 996521, 995737, 982092, 1002444, 1050509, 1030162, 1034304, 1101316, 1139953, 1190385, 1199101, 1197302, 1217622, 1207374, 1185161, 1242455, 1258339, 1256450, 1292745, 1311974, 1349867, 1382566, 1388266, 1409136, 1460943, 1508303, 1573493, 1644343, 1673268, 1710911, 1738429, 1802194, 1851589, 1926682, 2024518, 2054801, 2093388, 2180616, 2249949, 2308023, 2385309, 2424764, 2502882, 2546301, 2594370, 2704738, 2791942, 2874036, 2901108, 2991628, 3087835, 3208562, 3274014, 3335211, 3446300, 3559728, 3701101, 3833011, 3907816, 4029489, 4157545, 4289013, 4387177, 4510634, 4659364, 4785750, 4973386, 5160907, 5352585]
6109E352585K06798K57468K71284K50754K49690K79062L42173L48186L83318M06267
6099H347585L52893L62371M18468L89079M98754N12175M73893M75359N37363N56820
6089A2924760O16989P10084P95592Q87110J022118J208853J417813J654888J843471
6080B3081678K103571K374698K759883L223218L775351M369339N039864N780861
6072E2508463O342731O701271O752054O185865M854228K359651j209704m887741
6064G9606818p668498q852686q543060p465332o200223n046384m103381l320790
6056B8406464k710038k303897j972576j684550j504370j263550j104124j003359
6048A4860000r28079q86057p78722p90545p20207o50553o19786n74789m25562
$$ y = [5352585, 5559383, 5816851, 6088135, 6338889, 6588579, 6867641, 7209814, 7558000, 7941318, 8347585, 8700478, 9062849, 9481317, 9870396, 10369150, 10881325, 11355218, 11830577, 12367940, 12924760, 13541749, 14251833, 15047425, 15934535, 16956653, 18165506, 19583319, 21238207, 23081678, 25185249, 27559947, 30319830, 33543048, 37318399, 41687738, 46727602, 52508463, 58851194, 65552465, 72304519, 78490384, 83344612, 85704263, 84494559, 79606818, 71938320, 63085634, 54542574, 47077242, 40877019, 35830635, 31727254, 28406464, 25696426, 23392529, 21419953, 19735403, 18231033, 16967483, 15863359, 14860000, 13931921, 13045864, 12267142, 11476597, 10756390, 10105837, 9486051, 8911262, 8485700]
6039H485700l72670l44150k94138k86521k88515k36342k32971j92342k12780j68173
6029E857098k06098j86487j12980j56253j57427j28217j46029j25096j39517j45285
6019D353709j15986q8400r7305j08634q7406j12689r0705p7272q1279m5710n1723
6008C396600n7450n5005l9277l2134o3418r3855q9297l7294m9927m8301n3001
5997B777641k9972q0174m0930j0604p5294n9418l4787j7668O4727L2989m016J2826
5985B535320J5888l870K3725N781K5554Q3587L4851M80O5968P6592M9185K4726
5973B937787K6029L4492L2982K1190N1613K9982L8975R3163J9057M0945O7936
5962C394151L0081O4011N2882M3046J05916O4461R9776J27980P8197J20174J01622
$$ y = [8485700, 8113030, 7768880, 7474742, 7188221, 6899706, 6663364, 6430393, 6238051, 6025271, 5857098, 5651000, 5464513, 5351533, 5195280, 5037853, 4909636, 4763607, 4638511, 4498994, 4353709, 4237723, 4149323, 4052018, 3943384, 3855978, 3743289, 3652584, 3575312, 3494033, 3448323, 3396600, 3339150, 3284145, 3244868, 3212734, 3149316, 3055461, 2966164, 2928870, 2878943, 2830642, 2777641, 2747669, 2667495, 2626565, 2615961, 2540667, 2481249, 2446462, 2428794, 2493521, 2526510, 2522494, 2535320, 2551208, 2547338, 2571063, 2576844, 2602398, 2685985, 2720836, 2721316, 2787284, 2863876, 2913061, 2937787, 2963816, 2998308, 3031290, 3052480, 3104093, 3134075, 3173050, 3266213, 3285270, 3326215, 3394151, 3424232, 3488243, 3541125, 3584171, 3690087, 3754548, 3854324, 3982304, 4060501, 4180675, 4282297]
5951D282297J22590J14313J08853J06779J21774J51492J19721J67546J95364J83385
5941E674114K63038K37019K49383K95803K95666L37356L00164L06712L45790L56396
5931H661441L66725M11753L68220M05518M70032M68324M69640N15398N18904O02984
5921A3258939O63907P23834Q25850J038642J226839J423828J643356J881945K145270
5912B4832410K488327K892566L399403M088277M839396N739096O663581P252034
5904F2195090P525624P583721P483910O384356L221712j527709o828446j0852974
5896G5185284j1925974j0639079q450782o427518m869221l720293k975647k452871
5888B3723899k071649j823513j629907j384807j254028j014723q98103p87361
$$ y = [4282297, 4404887, 4519200, 4628053, 4734832, 4856606, 5008098, 5127819, 5295365, 5490729, 5674114, 5937152, 6174171, 6423554, 6719357, 7015023, 7352379, 7652543, 7959255, 8305045, 8661441, 9028166, 9439919, 9808139, 10213657, 10683689, 11152013, 11621653, 12137051, 12655955, 13258939, 13922846, 14646680, 15472530, 16511172, 17738011, 19161839, 20805195, 22687140, 24832410, 27320737, 30213303, 33612706, 37700983, 42540379, 48279475, 54943056, 62195090, 69720714, 77304435, 84788345, 91172701, 94394413, 92866704, 86038258, 75185284, 63259310, 52620231, 44169449, 37741931, 32872710, 29152417, 26176770, 23723899, 21652250, 19828737, 18198830, 16814023, 15559995, 14545272, 13647169, 12859808]
5880A2859808q40468q20279p64389p02436o33524n81538m58605l82630k92210
5871G383729k67012k61885k28756k18587k52039j75007j81785k26738k40416k35051
5861E096453j58036j53649j45279j83751j35440j18951j34709j63745j03857j26409
5851C672627j14864j25805j69861j15832j27742p5527o8588o3704m8129p0167
5841B692408p0225r2582o4828p2154m1433q8564p1676p6111r3179j8698j15556
5830A887402n4750l9301l4407n8939r1163p0758k6645j735j8935l6316m1725o3643
5818A349085P097l433J2646j4219m9652l9710j6054k94p808n2126L103l6634n9673
5805A092328j767n7231j7963p662j2190l6154l3406o9854j943r443l0442R670
$$ y = [12859808, 12019340, 11199061, 10434672, 9732236, 9098712, 8517174, 8058569, 7675939, 7383729, 7116717, 6854832, 6626076, 6407489, 6155450, 5980443, 5798658, 5571920, 5331504, 5096453, 4938417, 4784768, 4639489, 4455738, 4320298, 4201347, 4066638, 3902893, 3799036, 3672627, 3557763, 3431958, 3262097, 3146265, 3018523, 2942996, 2874408, 2810704, 2762575, 2692408, 2622183, 2529601, 2464773, 2392619, 2351186, 2262622, 2190946, 2114835, 2021656, 2002958, 1887402, 1832652, 1793351, 1758944, 1700005, 1608842, 1538084, 1511439, 1509704, 1490769, 1454453, 1412728, 1349085, 1356182, 1352749, 1365395, 1351176, 1301524, 1261814, 1245760, 1245466, 1237658, 1185532, 1188635, 1152001, 1092328, 1090561, 1033330, 1015367, 1007705, 995515, 959361, 925955, 856101, 854158, 844715, 814273, 823943]
5793H23943n0541j0290k5738p819k6494n0861J2421J020q651j7782o906m4702
5781E87600n440L2385J9160l7911n4622R85l4145K1397m4510l230j404m488l1168
5768D44609K0021L6830m8238J6898j8964J4708L584r253j3251o2908j7079j9775
5756C47182J7346M9905K3054Q85l4547k648l0656k220N435j9379K6675L3944K568
5743D17544K8538J5093P315J7668J5083o320j4061n4608m0862k5707o4457k2978
5731B72248j6307k4346J3292Q09l2697l7598m7078K8495o014r125n468j4871o378
5718A14962J7593j0953M97k3055j3970M618k8774J7434L8380K7829j2730J8576
5706A50407j8631r225N1468k477k7423k5799N512N586L6360J1039n7741M2481
$$ y = [823943, 773402, 763112, 737374, 729555, 703061, 652200, 664621, 665641, 656990, 639208, 632302, 587600, 582160, 614545, 633705, 595794, 541172, 542157, 508012, 529409, 484899, 481669, 480265, 475777, 444609, 464630, 501460, 453222, 470120, 451156, 465864, 469448, 460195, 446944, 384036, 366957, 347182, 364528, 414433, 437487, 438372, 403825, 401177, 370521, 368301, 373736, 354357, 381032, 414976, 417544, 446082, 461175, 468490, 486158, 501241, 494921, 480860, 426252, 385390, 359683, 295226, 272248, 255941, 231595, 244887, 245696, 212999, 175401, 128323, 156818, 150804, 141679, 136211, 121340, 114962, 132555, 121602, 122099, 99044, 85074, 89692, 60918, 78352, 116732, 144561, 131831, 150407, 131776, 122551, 174019, 171542, 144119, 118320, 123832, 129418, 165778, 176817, 119076, 161557]
5694A61557J0966n7940K3852r067l1594L0255j7732J0320N7122m9539m9173K3643
5682A02670j2808J1577L726j5889N360J52J3362k4432J3310K8462m6104J749K9156
5669A10291J568n1132j6020j5354O0778k894l2665l7222K0024J4748M1212k9817
5657F3517p8389J5235L353K4966k779l1304O004L0415r83J3014r143J427J4863
5644E0196m9968K801j275l8369K0087L997J7438J8335N001n014J5636j2229j1764
5631A4872j8890M9410j9870Q656p098R125P388j5512L645j5060L0658l0338m8117
5618c1131J1100M2664J713M0776p471k2176l3322J6532M758J4454m532J9824L3510
5605H6699N146M038o0244j6344K6919l5392l5515K3654L8349j3282P00o091L0581
$$ y = [161557, 172523, 114583, 138435, 129368, 97774, 128029, 110297, 120617, 177739, 128200, 79027, 102670, 89862, 101439, 105165, 89276, 94636, 94788, 108150, 83718, 97028, 125490, 79386, 81135, 110291, 111859, 60727, 44707, 29353, 90131, 87237, 54572, 17350, 37374, 52122, 93334, 63517, -14872, 363, 3716, 28682, 25903, -5401, 603, 31018, 30035, 43049, 33906, 35333, 50196, 228, 3029, 1754, -36615, -16528, -12531, 4907, 23242, 28243, 23229, 38865, 26636, 14872, -4018, 45392, 25522, 34178, 27080, 36205, 43593, 28081, 31726, 16666, 47324, 16986, -31131, -20031, 22633, 24346, 65122, 57651, 35475, 2153, 18685, 23443, 37897, 33365, 53189, 86699, 91845, 95883, 35639, 19295, 46214, 10822, -24693, -1039, 37310, 24028, 24728, 18637, 49218]
5592D9218J2935l1662J4547R948k0057L7103K5209k7812K8022K7939L254J246
5580A29890J0348Q48K6054J12R896K6067P6198L685K1788K4060N2915J2630L85
5567C94876k9865n784O846n7192p0761k2570K0343m7640k5338n1445J126L0140
5555A42736o596m5424j0932R628o122k3416j2606j5416l9749J3710M6497J2570
5543F4880j921p854k0726j0150R178N303j4740R973R588J4257n5938m1046j4658
5530e3854M6777p036J7394m3938r539K0282L2775J2904k8248l5515K9216K9896
5518A1114k333K3121N921K1392j7996j6241m114L844m5998j2317J2314m0558j3564
5505g5415J3501J7430K4336K0231J7222R28N427O090J2386n5992J3230j5177K6226
$$ y = [49218, 62153, 30491, 45038, 54986, 34929, 72032, 97241, 69429, 97451, 125390, 128644, 129890, 140238, 141086, 167140, 167252, 177148, 203215, 279413, 283098, 304886, 328946, 381861, 394491, 394876, 365011, 359227, 366073, 308881, 238120, 215550, 235893, 188253, 162915, 111470, 112596, 142736, 136140, 90716, 79784, 89412, 83290, 59874, 47268, 31852, -7897, 5813, 52310, 64880, 62959, 55105, 34379, 24229, 33407, 38710, 23970, 33943, 43531, 57788, 1850, -39196, -53854, -7077, -14113, 3281, -40657, -50196, -29914, 2861, 15765, -12483, -47998, -18782, 11114, 8781, 31902, 37823, 59215, 41219, 24978, 20864, 24708, -21290, -33607, -21293, -61851, -75415, -61914, -44484, -20148, 83, 17305, 18233, 23660, 29750, 42136, -13856, -626, -15803, 10423]
5492A0423l0270K6554M4273n0442J3792K3949k4047O770l5980j3767K4565J7486
5480A3306L9065J2578J2082k5856j3004j4256j6916J1900j459M7258J2465m2090
5468C5073J0157L1804j6052K0625J4065J5976l3432J3648l310l7724K3624j0713
5456F3741J8262j9064r377K3466K0913k553m5970Q107M5028l1315j2569r660l8836
5443A0173J1495M6892J9035m438j4066j6029M3791j7266j4837K2799M4659L227
5431A35435P537J9702j1290M933j0477J2492k1059J7913K3054n1673n791P1321
5419A92097O14m083j9681l9346Q808l908J5734k0193M257J3234l793j0994k4624
5406A08122j0209M676M1217m247k5736k9165K5680J1620j0504j5364J4927j5845
$$ y = [10423, -19847, 6707, 50980, 538, 14330, 38279, 14232, 21002, -14978, -28745, -4180, 13306, 52371, 64949, 77031, 51175, 38171, 23915, 6999, 18899, 17440, 64698, 77163, 35073, 45230, 77034, 60982, 81607, 95672, 111648, 78216, 91864, 88554, 50830, 74454, 63741, 82003, 62939, 53562, 77028, 97941, 95388, 49418, 57525, 102553, 71238, 58669, 49009, 10173, 21668, 68560, 87595, 83157, 69091, 53062, 96853, 79587, 64750, 87549, 132208, 135435, 142972, 162674, 151384, 156317, 145840, 158332, 137273, 155186, 178240, 126567, 120776, 192097, 192711, 188628, 168947, 129601, 138409, 134501, 150235, 130042, 134299, 147533, 143740, 132746, 108122, 97913, 102589, 143806, 139559, 113823, 84658, 110338, 121958, 111454, 96090, 111017, 95172]
5394I5172j6485j0071M0070J7139L3030J483m9361K7939k5090J9798L7062m0263
5382A30423l7784J0786m0908J6009L5413q207k7593k9665J6890L1038j6365j919
5370G8118j4588J6541R69K2842K996J0613j5177k252M562j7109L1529j6726m971
5357I7347k4246n53J8545J317k3840K8444R434N772m8393j5835J197N1263K5871
5344A26323M470j8868k8809Q170L6754J1828j8872K4303K4021l9249J2326O180
5332A48577n8523J9214L9046j6928J1481j6107j7294k6579L5812L7307j9142N3430
5320A90294j7130l3266K3210K4591J5472j1809j0498K0773O866J51J1596m343
5308B15907K1802m2047j31O755L5191K5778n548J9331r770K7732l3768Q947p734
$$ y = [95172, 78687, 68616, 108686, 125825, 158855, 160338, 110977, 138916, 113826, 133624, 170686, 130423, 92639, 103425, 62517, 78526, 113939, 105732, 78139, 48474, 65364, 96402, 80037, 78118, 63530, 80071, 81040, 103882, 106878, 117491, 102314, 100062, 104624, 87515, 119044, 102318, 97347, 73101, 72548, 91093, 92410, 68570, 97014, 106448, 112220, 63827, 47992, 49189, 100452, 126323, 130793, 111925, 83116, 91286, 128040, 139868, 120996, 145299, 169320, 130071, 142397, 148577, 90054, 109268, 148314, 131386, 142867, 126760, 109466, 82887, 118699, 156006, 136864, 190294, 173164, 139898, 163108, 187699, 203171, 191362, 180864, 201637, 208503, 208654, 220250, 215907, 237709, 195662, 195531, 202286, 237477, 263255, 257707, 277038, 267268, 295000, 261232, 270179, 262445]
5295B62445J4832j4127L6164j4969J205q642l0263M3329O174L8353k8507m608
5283C01386N7074o1319J9259K3875k4435k0623M2212M9088m1173M2699K8849K2583
5271D39475L414o390q448J0713M8552j3089J2468n4530J888M3578K0203j7802
5259D80032j0515M1901k404J130K4044M595j1451L2451P594k2339M1504O5781
5247F52323J338j7609K3939k2165L7163J2892M5691N675K8770J8016j686K1517
5235H05864o270K9472j3703L7626K2363O864l540k2274O4429M6288J3072j3579
5223I66612p260M3956L2760M6430Q755K7919M0989N337L0027N1414Q664M2574
5211A298177K6663N0318j232L3179J1765M6170M1129N9081N9335M0146N9762K2426
$$ y = [262445, 277277, 263150, 299314, 284345, 285550, 276908, 246645, 289974, 296148, 334501, 305994, 301386, 358460, 297141, 316400, 340275, 315840, 295217, 337429, 386517, 345344, 388043, 416892, 439475, 442889, 436499, 428051, 438764, 487316, 474227, 486695, 432165, 434053, 477631, 497834, 480032, 469517, 511418, 509014, 510144, 534188, 538783, 527332, 559783, 567377, 545038, 586542, 652323, 653661, 636052, 659991, 637826, 674989, 687881, 733572, 739247, 768017, 786033, 784347, 805864, 799594, 829066, 815363, 852989, 875352, 882216, 878676, 856402, 920831, 967119, 980191, 966612, 959352, 1003308, 1036068, 1082498, 1091253, 1119172, 1160161, 1165498, 1195525, 1246939, 1255603, 1298177, 1324840, 1375158, 1373926, 1407105, 1418870, 1465040, 1506169, 1565250, 1624585, 1664731, 1724493, 1746919]
5199A746919L0783J3238N6208Q0798Q6607N5671J8834M5090O9104Q2337O5676
5188B351265J01157O1559Q5429Q7382R2167J17915J32173R7204Q0545R6124J32487
5177C435407J75148J67680J13590J27937J33869J64833K08661J65375J88183J73219
5167E053902K31275K38844K77709K79518L56371L34746L70173M90019M61769N36584
5157H630910O44243P14144P58947Q35376R49043J062037J097958J133563J205446
5148A7031667J183474J080564Q73075O53186L69628l0184l77356o38003q21223
5139A9324828q71255q38446p33499o05691m63688k78879j50273l2549P5535K15918
5129A5642001L52032M48666N62016O77053P82223Q90155J028629J024188J061814
$$ y = [1746919, 1777702, 1790940, 1847148, 1927946, 2014553, 2070224, 2089058, 2134148, 2203252, 2285589, 2351265, 2452422, 2513981, 2599410, 2686792, 2778959, 2896874, 3029047, 3126251, 3206796, 3302920, 3435407, 3610555, 3778235, 3891825, 4019762, 4153631, 4318464, 4527125, 4692500, 4880683, 5053902, 5285177, 5524021, 5801730, 6081248, 6437619, 6772365, 7142538, 7632557, 8094326, 8630910, 9275153, 9989297, 10748244, 11583620, 12532663, 13594700, 14692658, 15826221, 17031667, 18215141, 19295705, 20168780, 20821966, 21191594, 21161410, 20784054, 20146051, 19324828, 18453573, 17615127, 16881628, 16275937, 15812249, 15533370, 15383097, 15350548, 15426083, 15642001, 15994033, 16442699, 17004715, 17681768, 18463991, 19354146, 20382775, 21406963, 22468777]
5120B2468777J100850J062400J000368R27496P42743O27201M88956M16164K90829
5111B9125784K04139p052j76782l55709n38956o15456o99025p01569p37404p28037
5101B4769933p19913p82013q57536q95594r70727r76866r36289q07820p79756
5092A7043419o59193m83397l10975j73322q5408K9933K03082L72476M26772N12922
5082A6876309O38123P32066Q08210Q13636P46041O03997M11664J19772k30880
5073B1518938o57675j000211j259358j435133j484558j418785j279933j108961
5065A1874324r88688p97834p55823o74472n25525n06478n03556m35786l15864
5056F370298l22537l23121k67331k49214k38635k02548k32062j84228j47086j67451
$$ y = [22468777, 23569627, 24632027, 25632395, 26559891, 27302634, 27929835, 28418791, 28834955, 29125784, 29329923, 29322871, 29146089, 28790380, 28251424, 27635968, 26936943, 26235374, 25497970, 24769933, 24050020, 23268007, 22410471, 21514877, 20544150, 19567284, 18630995, 17823175, 17043419, 16384226, 15900829, 15589854, 15416532, 15331124, 15361057, 15564139, 15936615, 16363387, 16876309, 17514432, 18246498, 19054708, 19868344, 20614385, 21218382, 21630046, 21749818, 21518938, 20861263, 19861052, 18601694, 17166561, 15682003, 14263218, 12983285, 11874324, 10885636, 10087802, 9331979, 8657507, 8131982, 7625504, 7121948, 6686162, 6370298, 6047761, 5724640, 5457309, 5208095, 4969460, 4766912, 4534850, 4350622, 4203536, 4036085]
5046D036085j72328r6861r9451j41631o5896j22036j14295p3455q9613r6828l7949
5035B925742m3715j08628p1521o2337n0974p527o8261m2632k5472p3183q6181
5024B285311o3318J984J2400l7288l1871l5575n1297r236k7243j3737N222o1824
5012A973528l4805j5367j3841L5640p949k0172J6189k1205m912k8620M615J2801
5000A895902m2382N7030R064M858J598K9943J7138k1599J5749K7540O024K0405
4988B021270k4779O6392J6895L7362Q0552J5178M1954K6171K0178J3182N8360
4977B372715P1262N1844M7731L0338K2829O0337Q7418N2638M8843O6505R4367
4966C006827J35143J20263Q7575J04830P8928J53835J21840J28021J44970J30928
$$ y = [4036085, 3863757, 3766896, 3667445, 3525814, 3459918, 3337882, 3223587, 3150132, 3060519, 2963691, 2925742, 2882027, 2773399, 2701878, 2639541, 2588567, 2581040, 2512779, 2470147, 2444675, 2371492, 2285311, 2221993, 2223977, 2236377, 2199089, 2167218, 2131643, 2080346, 2071110, 2043867, 2030130, 2035352, 1973528, 1938723, 1923356, 1909515, 1945155, 1937206, 1917034, 1933223, 1912018, 1907106, 1878486, 1883101, 1895902, 1853520, 1910550, 1919614, 1924472, 1926070, 1956013, 1973151, 1951552, 1967301, 1994841, 2000865, 2021270, 1996491, 2062883, 2079778, 2117140, 2197692, 2212870, 2254824, 2280995, 2301173, 2314355, 2372715, 2443977, 2495821, 2543552, 2573890, 2596719, 2657056, 2744474, 2797112, 2845955, 2912460, 3006827, 3141970, 3262233, 3349808, 3454638, 3533566, 3687401, 3809241, 3937262, 4082232, 4213160]
4956D213160J17070J57185J87148J67328K33936K15454J85412K40470K54170K66813
4946F238146L53440L54849M11599M68664N45757N41686O60998P24385P58703R00673
4936A1958900R90404J052369J132286J211444J211122J146695J011295P64381
4928B0478896M18177j4494l35368o67210p91660q70383p83284o86404o04710m14652
4918A5728908k95842j98281r2552Q4926J59014K34619L94566M68969N78342O95730
4908A7758399P26055Q04405Q97773R87144J073477J054135J076709J094325R53404
4899B6425826Q46372O80752N61708M59596K58966L9745j01947l44077n09118o55806
4889B7662017p21273p44628p81801p62622q43752q74403q45917q65823q40263
$$ y = [4213160, 4330230, 4487415, 4674563, 4841891, 5075827, 5291281, 5476693, 5717163, 5971333, 6238146, 6591586, 6946435, 7358034, 7826698, 8372455, 8914141, 9575139, 10299524, 11058227, 11958900, 12949304, 14001673, 15133959, 16345403, 17556525, 18703220, 19714515, 20478896, 20897073, 20882579, 20547211, 19880001, 19088341, 18217958, 17434674, 16748270, 16143560, 15728908, 15433066, 15234785, 15142233, 15227159, 15386173, 15620792, 16015358, 16484327, 17062669, 17758399, 18484454, 19288859, 20186632, 21173776, 22247253, 23301388, 24378097, 25472422, 26425826, 27272198, 27952950, 28514658, 28974254, 29233220, 29272965, 29171018, 28826941, 28317823, 27662017, 26940744, 26196116, 25414315, 24651693, 23807941, 22933538, 22087621, 21221798, 20381535]
4880B0381535p99876p97845p06850o74866o14326n17205m60957k86312j74556
4871A5348742j4472O0372J41643L31391M25770N41018O34146P51872Q08869Q17626
4861A9846977P92445O66591L72142N3421l32550q61776j159761j394447j479772
4852A6503270j412757j343643j172500j075725r11142p69951p21644o43565n90086
4843G862257m53752m32139m36048l28771l10969l25466k69124k25581k43370k38714
4833D598323k11265j74921j55294j79068j36819j43242j46770j46108r4462r3038
4823C117336j52074r3011r3640n3440p1408j01428r6271m5514l6825j14444o7426
4812B191855m1377n7646m9840q5246n9142m2719J3723k8754o5616k0782k7721
$$ y = [20381535, 19581659, 18783814, 18076964, 17402098, 16787772, 16270567, 15809610, 15523298, 15348742, 15334270, 15394642, 15536285, 15867676, 16293446, 16834464, 17468610, 18220482, 19029351, 19846977, 20639422, 21306013, 21678155, 21731576, 21399026, 20537250, 19377489, 17983042, 16503270, 15090513, 13746870, 12574370, 11498645, 10587503, 9817552, 9095908, 8452343, 7862257, 7408505, 6976366, 6540318, 6211547, 5900578, 5575112, 5305988, 5080407, 4837037, 4598323, 4387058, 4212137, 4056843, 3877775, 3740956, 3597714, 3450944, 3304836, 3210374, 3117336, 2965262, 2872251, 2778611, 2725171, 2653763, 2552335, 2456064, 2410550, 2373725, 2259281, 2191855, 2150478, 2092832, 2042992, 1957746, 1898604, 1855885, 1869608, 1840854, 1775238, 1754456, 1726735]
4801A726735j0687k5746j2577p1443l2977J4421o6329l0341J33k4456m1460j5637
4789A409636j2038l7383n6380m4036k2213k1681k9836M7973m1290l7933J6202
4778A171021j1834o546k278k9635j7850J6067m0045J5360M5964J6357k8006n460
4766A123115K8227N803j6229j5048Q373p89m994k5254l7692m1692k850r90q798
4753A011182k5679J9743l3083k5228k6018k0616L8331j4677m9253K4049j4980
4742H83771m0646J7582M762j5542N057L1030n833P223Q586J3642N50m632j3640
4729H91910j0892j5544L5613j8043O904k4617j1080j7420j0236r84j7270k5648
4717G82693l0387k202n802j6049j3450j5185j6610l244J2905l3525o113j4111
$$ y = [1726735, 1716048, 1690302, 1677725, 1606282, 1573305, 1587726, 1521397, 1491056, 1491189, 1466733, 1425273, 1409636, 1397598, 1360215, 1303835, 1259799, 1237586, 1215905, 1186069, 1234042, 1192752, 1154819, 1171021, 1159187, 1152641, 1150363, 1120728, 1102878, 1118945, 1078900, 1094260, 1140224, 1156581, 1128575, 1123115, 1151342, 1157145, 1140916, 1125868, 1134241, 1133452, 1128458, 1103204, 1065512, 1023820, 1020970, 1019980, 1011182, 985503, 1005246, 972163, 946935, 920917, 900301, 938632, 923955, 874702, 898751, 883771, 843125, 860707, 865469, 849927, 854984, 886014, 880181, 887404, 895990, 909632, 910182, 905550, 891910, 881018, 865474, 901087, 883044, 889948, 865331, 854251, 836831, 826595, 825611, 808341, 782693, 752306, 750104, 744302, 728253, 714803, 699618, 683008, 679764, 692669, 659144, 653031, 638920]
4705F38920K838r516L442l2840m4678L4443K8095j2690k1083l0676L558R082J5156
4692E84051J9548j6855n1825o934m2402M850k8090k7643k1484L4077l2414o7602
4680C47277P476j376j1943m5900L7844k3711k2262k3088r12l24m0466k3444M7361
4667B46532J8290l5438j9410K3928l285j3117j9240j818m5203j6823n684L5254
4655A63986m2136O277n857L838K6126k5450O488K216k8136K8796R410q74N393
4642A50077l01N875k9921j6796k0581j8199r390K2393K706k9095K8855R493J5856
4629A10972q2k4346j9055r808L0742J6663J0190j3444j8488J8827N209J5411r128
4616A13663j9101J893L6593M012R62j7672l3903j9655l655l2777j3102K2251k4993
$$ y = [638920, 641758, 632242, 635684, 602844, 558166, 592609, 620704, 608014, 586931, 556255, 559813, 568895, 584051, 603599, 586744, 534919, 527985, 485583, 490433, 462343, 434700, 413216, 447293, 414879, 347277, 354753, 353377, 341434, 295534, 333378, 309667, 287405, 264317, 263405, 263081, 222615, 199171, 246532, 264822, 229384, 209974, 233902, 230617, 217500, 198260, 196442, 151239, 134416, 128732, 163986, 121850, 128127, 122270, 126108, 152234, 126784, 133272, 135488, 107352, 136148, 145558, 144684, 150077, 149776, 155651, 125730, 108934, 88353, 70154, 60764, 83157, 85863, 56768, 85623, 95116, 110972, 110890, 86544, 67489, 57681, 88423, 105086, 115276, 101832, 83344, 102171, 107380, 122791, 113663, 94562, 96455, 133048, 137060, 138022, 120350, 86447, 66792, 63137, 30360, 17258, 39509, 14516]
4603A4516J7147J1376R650R044j6289L7219K1001j2419r769l054K5133K968K2341
4590A28864K484L1781q557j6206l357n940k4043J4153j186k668j0305l8414k5349
4577D1257M1964p773K6700o184j0103m247l3164j4625J8145J3631k1727k117R090
4564E0847l0918l058j891j9299M0376j1248q519J9026q542L316M1797k0192m5207
4551F488O879L8008P097L114k8490k1332K0427K5552l6574k2624r873J2052k389
4538a665R39r180r272J0175J7281k2668J1760p600k7974k1840J6392K0960k6243
4525d8935J2881j2287k1577k4882N6M5264J8055j9265M535j5021j1953L9449N851
4512b7829j5011M3056k5976k3168k2167l0069j8332K8423M887K4144J2291j5933
$$ y = [14516, 31663, 43039, 52689, 61733, 45444, 82663, 103664, 91245, 81476, 78422, 103555, 106523, 128864, 131348, 163129, 154572, 138366, 135009, 129069, 105026, 119179, 117993, 115325, 105020, 66606, 41257, 83221, 75448, 102148, 95964, 85861, 81614, 48450, 33825, 51970, 65601, 43874, 41757, 50847, 19929, 16871, 14980, -4319, 36057, 24809, 16290, 35316, 26774, 30090, 71887, 51695, 6488, 13367, 51375, 58472, 61586, 33096, 11764, 32191, 57743, 21169, -1455, -11328, 724, -1665, -726, -9906, -19178, -9003, 8278, -14390, -2630, -10230, -38204, -60044, -43652, -22692, -48935, -36054, -48341, -69918, -94800, -94744, -49480, -31425, -50690, -46155, -61176, -73129, -33680, -27829, -42840, 216, -25760, -48928, -71095, -101164, -119496, -91073, -86186, -62042, -49751, -65684]
4500f5684M203k9516O692j4360J7977l812P896J5060K6620m5297m080o021L930
4487h6392P0849o143k1639j3299j7365k300L8997k1033k3824q952K8247m533k0523
4474h7910l687M4065l2818q890o559L4457M4337j5114m674Q036k6087k6690r562
4461i1096J6869j9154l733K3050K0667j128k7747l4668k4032j269m32N4201J0373
4448g8099j6045N5062j3188J5129m703p3804q75M0801O588K7608l2347k7807K4451
4435g7229j4333p211R823M8990j3167O802j3354m0440k2462M155L2040k381L3477
4422e5290K4533r524j4954k2291J6933k270J6424l6099L5414j8936m6710j3955
4410a26725M9418K0150j1364L917Q13k8471J7745J7047J118j3354J5408M9213
$$ y = [-65684, -61481, -90997, -84305, -98665, -80688, -84500, -76604, -61544, -34924, -80221, -84301, -90322, -86392, -15543, -21686, -43325, -56624, -73989, -76289, -37292, -58325, -82149, -91101, -62854, -67387, -87910, -91597, -47532, -80350, -89240, -95799, -61342, -17005, -32119, -36793, -28757, -54844, -81534, -91096, -74227, -93381, -97114, -74064, -53397, -54525, -82272, -116940, -140972, -142241, -142673, -88472, -78099, -94144, -39082, -52270, -37141, -41844, -115648, -116523, -75722, -69134, -41526, -73873, -101680, -77229, -91562, -98773, -88950, -39960, -53127, -46325, -59679, -100119, -122581, -118426, -86386, -88767, -55290, -30757, -40281, -55235, -77526, -60593, -62863, -46439, -82538, -47124, -66060, -112770, -126725, -77307, -57157, -68521, -64604, -63791, -92262, -74517, -57470, -56352, -69706, -54298, -5085]
4398e085j5699n0356R896J1281R329j240j4548j8074l053L028J2404m917J3766
4385e3268j8527l158M2068L534j2812J906L556l2092j6523J7624p869m000j0851
4372i0412J2340J2787j0636N6373K0718m1354n902j2529L2827J1407m5248O94
4360e8935l8392J5793r761J1758j6441M266O2858K7979k5347n3332J0871j1443
4348h0126K9889K054K0469J5742k6634l4192j8111K2024j1913n295J7666r965
4336g8392l6504K0547K777J9103k9592Q50J5859j5946K5167J7490K1515Q359k0082
4323d8849j141j0700j0816l071J6025j7403L3093k1990l7591n330J3031M459J7195
4310g3088j3721K211k2074j6026K5669k8487Q751M1520k4792J5608L0358j2210
$$ y = [-5085, -20784, -71140, -61244, -49963, -40634, -41874, -56422, -74496, -77549, -74521, -62117, -67034, -53268, -71795, -74953, -32885, -29351, -42163, -40257, -36701, -68793, -85316, -67692, -75561, -79561, -90412, -78072, -65285, -75921, -19548, 1170, -40184, -46086, -58615, -25788, -14381, -59629, -58935, -97327, -81534, -91295, -79537, -95978, -91712, -28854, -875, -26222, -79554, -68683, -80126, -50237, -48183, -27714, -11972, -38606, -72798, -90909, -68885, -80798, -86093, -68427, -78392, -114896, -94349, -91572, -72469, -102061, -101211, -85352, -101298, -76131, -58641, -37126, -28767, -48849, -49990, -60690, -71506, -74577, -58552, -75955, -42862, -64852, -102443, -107773, -94742, -90283, -73088, -86809, -84598, -106672, -122698, -97029, -125516, -116765, -75245, -100037, -84429, -54071, -66281]
4298f6281k0414q643j4893J1074K5195O916J4183k3362k424L3188o0391k3547
4286a29399N398N5640J7404M708j3388j3998j9629l1630R921J8344L7066k2019
4274h1582J2200j1050R853J3044k184q472K2291j2749M2858k7479o1798j6546
4262a21614K3282J9970j8372j5274k0775J4968k274N1688R345n8719K384K4466
4250i0925L4528J6115k1881j6031J0676j4224k09P858j909L4422J8232k8479k623
4237e4450O454j4642l0526J2725L0542J2650j3848q338j2868k931j557j9328K6224
4224f9893J3474k1894j8809j1967Q096K8898J6448N853l3445k3596j4250K5812
4212i5273K0482j93K8934J9356K9265J1381k4411l7971M030J0050k9057r656R344
$$ y = [-66281, -86695, -95338, -110231, -99157, -73962, -67046, -52863, -76225, -78649, -45461, -105852, -129399, -124001, -68361, -50957, -46249, -59637, -73635, -93264, -124894, -114973, -96629, -59563, -81582, -69382, -80432, -70579, -57535, -59719, -68191, -45900, -58649, -15791, -43270, -105068, -121614, -98332, -78362, -96734, -112008, -132783, -117815, -120089, -68401, -59056, -117775, -115391, -90925, -56397, -40282, -62163, -78194, -67518, -81742, -81951, -74093, -76002, -41580, -23348, -51827, -54450, -47996, -62638, -93164, -80439, -49897, -37247, -51095, -59433, -72301, -75232, -76789, -96117, -69893, -56419, -78313, -97122, -109089, -100993, -72095, -55647, -49794, -83239, -106835, -121085, -95273, -74791, -74984, -46050, -26694, 2571, 13952, -10459, -48430, -44400, -34350, -63407, -73063, -63719]
4199f3719j132j846J4855j4023j121K9431J756k2393k6173O019j0652L3357j55
4186e5796J015l226k5J4402N976Q739k8363k7125j2431K1675N306l260O1828p273
4172a8558k0810l3264j1936q744J1786q695p496N5686p560j4003J7891l777j0048
4159e9528K0981J9319l1166q277K386r480P689L429Q717k1331k4802N675j8327
4146a04715M227M0472M527o612J0345J4019M784J0111j5620J0647l5041l0091
4134i2947l907L1290N011N474L1877J0101n0239q807K722m566L0824K680j4927
4121e5414J0238L714K7520J9130o029J4488j6802k1412n837N8405n7018l4883
4109f3900K2808L4680L1394k7198k3056R345J3237l8948j9006l145J035M8980
$$ y = [-63719, -64851, -66697, -51842, -65865, -66986, -37555, -35799, -58192, -84365, -78346, -88998, -55641, -55796, -54781, -58007, -58032, -43630, -37654, -28915, -57278, -84403, -96834, -75159, -69853, -73113, -11285, -18558, -39368, -72632, -84568, -93312, -81526, -90221, -97717, -42031, -49591, -63594, -45703, -49480, -59528, -38547, -19228, -50394, -58671, -56285, -65765, -58076, -54647, -45930, -67261, -92063, -86388, -104715, -100488, -60016, -55489, -62101, -51756, -37737, -32953, -22842, -38462, -27815, -62856, -92947, -96854, -65564, -60553, -55079, -23202, -13101, -63340, -72147, -69425, -73991, -43167, -40487, -55414, -45176, -41462, -13942, 5188, -841, 13647, -3155, -24567, -30404, 28001, -29017, -63900, -41092, -6412, 24982, -2216, -25272, -15927, -2690, -41638, -60644, -63789, -62754, -13774]
4097a3774j4472j1094n406k8839L805K3249N584k1538k8896J8428L9427R605p846
4084c1767J7127j7624M154J6558m2193P641j4999K4167m369j9124J3535J4738
4072c2156j9650R560N311K4876j0415L506j600k9918L3504J5991k9508j0644j381
4059d2524J4378n09j801j6923K9248R147l8425j8127K2603L4147L5982r301J4000
4046C1895k9920J3539j6280k0932J299k1421J6945L0550m1215j3569N7593j754
4034F730J6500n2668k7821j605p089J7923L278K4972M3144k0312j7758j9494j4686
4021d8886L370J1796K8246r734J832J2046l7791P180K7527m0224k7565J7421q734
4008f3516L0451N369k097n380j761j5649l72r128K8219l0957P33K9209o952K869
$$ y = [-13774, -28246, -39340, -44746, -73585, -69780, -46531, -40947, -62485, -91381, -72953, -33526, -23921, -31767, -14640, -32264, -28110, -11552, -53745, -46104, -61103, -36936, -41305, -60429, -46894, -32156, -51806, -42246, -36935, -12059, -22474, -18968, -20568, -50486, -16982, -991, -30499, -41143, -42524, -28146, -28655, -30456, -47379, -18131, -8984, -47409, -65536, -42933, -8786, 27196, 17895, 31895, 1975, 15514, -766, -21698, -20399, -41820, -24875, 5675, -35540, -49109, 8484, 6730, 23230, -29438, -57259, -58864, -65953, -48030, -44752, -19780, 23364, 3052, -14706, -34200, -48886, -45516, -33720, -5474, -15208, -13376, -1330, -39121, -31941, -4414, -44638, -72203, -54782, -63516, -33065, -27696, -29793, -35173, -36934, -52583, -52955, -62083, -33864, -64821, -64088, -34879, -41831, -38962]
3994c8962J1237k7366K3072J4659j7468q124j9466R614L339J3703J3685k6861
3982d8938N246M5678Q35k4365J4692J1371o983k0893k2326K1906K7371l413J5957
3969A6138K1966L342k4192n478l875J4383M2593l4676K9503n0409J3490q806K2213
3956C6192j2761m9769J9741J7070l8341J3458J4152L0511R818j6093M6172r223
3944F0927J104j2856J3880l9819k775m274L2706J9404J3972l6822P735p226J242
3931D7198j9338k3636K4575M632J6584j6052N858k880j4897K3839j2550k4475
3919H858J9870J0635L927P108m823K623o866k8441r605J4085O1847L9300o9963
3906D8555K1369J1465J7637j2517K7585R135n2942J4353J2253r199Q66o157j6106
$$ y = [-38962, -27725, -55091, -32019, -17360, -34828, -42952, -62418, -52804, -49465, -35762, -22077, -48938, -43692, 1986, 2821, -21544, -6852, 4519, -2464, -23357, -45683, -23777, 3594, 181, 16138, 38104, 41446, 17254, 11776, 7901, 22284, 64877, 30201, 59704, 9295, 22785, 13979, 36192, 23431, -26338, -6597, 10473, -27868, -14410, -258, 30253, 40071, 23978, 70150, 60927, 62031, 49175, 63055, 23236, 20461, 16187, 48893, 68297, 82269, 45447, 53182, 45956, 47198, 27860, 4224, 28799, 33431, 50015, 33963, 39821, 36941, 22044, 45883, 33333, 8858, 28728, 39363, 43290, 50398, 45575, 48198, 41332, 12891, 3286, 17371, 79218, 118518, 48555, 69924, 81389, 99026, 86509, 114094, 123229, 70287, 84640, 96893, 87694, 88560, 82403, 66297]
3893F6297k2034J5583n451j9275L4484l475J0368m105k3759R491K8466kL2999
3880A19587n876J918m196k294J4979k1594j0341L207K734K6097m0283l6837L5601
3867H2702K0685J9465L5792j3455j9305k6496k9617j3062l749o482J50K0699M3616
3854A10943j0140L496j3273J395j2472M4654k6846P094K3760r345K0646r654N644
3841A35902L957j3164j4976k061K6641J1362L6112K4589K0695j9586j5449k5520
3829A68502L8947k6176J3911K3428k7299J0997Q11M1461L8866n3723q565k492
3817B18668k9205K1523L3586K0391k134K5896N156J6172p031L014p459j2523k247
3804B83807J4753K9718L9106m2399p393K6912j7118O851N0056k7139j1334K4890
$$ y = [66297, 44263, 59846, 54395, 35120, 69604, 66129, 76497, 72392, 48633, 58124, 86590, 86588, 119587, 113711, 115629, 111433, 109139, 124118, 102524, 92183, 95390, 98124, 124221, 83938, 47101, 82702, 103387, 122852, 158644, 145189, 125884, 99388, 69771, 56709, 52960, 46478, 46628, 67327, 110943, 100803, 104299, 91026, 92421, 79949, 124603, 97757, 104851, 128611, 119266, 139912, 130258, 135902, 139859, 126695, 111719, 109658, 136299, 147661, 183773, 208362, 229057, 209471, 194022, 168502, 207449, 181273, 195184, 218612, 191313, 202310, 203121, 244582, 283448, 229725, 221160, 218668, 189463, 210986, 244572, 264963, 262829, 288725, 293881, 310053, 303022, 306036, 298577, 286054, 283807, 298560, 328278, 367384, 324985, 317592, 344504, 327386, 334237, 384293, 357154, 345820, 370710]
3792C70710l0428j6256M798K8424J5148k2027r69J1966o639k2369L2187J1699
3780C76244J2910n360J5672k1176J1024l342J1670K185M104m182j060k9421l967
3767C65301k4472K1660l802K3330L2785J484K953k0131q735N099l1056j4601K7464
3754C77279l729L2220j6675L9153J7344l847k9720K383R066J444r030k5846Q488
3741C98530j3491J0259N991n785j360K2799k4772J3840M2487k0994n93q81K4958
3728D50988M701K1884L0097K754p692J3628j9843n292L7359M404L220k1705j8020
3715D96483Q992J8270K8736J5847M219k972J9585K0838J6961J6903j2196J1854
3703F43520K610J6666J2643n0090J9421N3195K1953M0822l2907J607j7460K3820
$$ y = [370710, 340282, 324026, 328824, 357248, 372396, 350369, 349400, 361366, 354727, 332358, 364545, 376244, 389154, 383794, 399466, 378290, 389314, 385972, 397642, 399827, 403931, 399749, 398689, 369268, 365301, 340829, 362489, 358687, 382017, 414802, 416286, 419239, 399108, 390373, 395472, 364416, 349815, 377279, 373550, 405770, 389095, 428248, 445592, 441745, 412025, 414408, 423474, 424918, 415888, 390042, 398530, 385039, 395298, 401289, 395504, 394144, 416943, 392171, 406011, 448498, 427504, 426911, 426030, 450988, 455689, 477573, 507670, 510424, 502732, 516360, 496517, 491225, 528584, 532988, 536208, 514503, 496483, 505475, 523745, 552481, 568328, 572547, 569575, 589160, 609998, 626959, 643862, 631666, 643520, 646130, 662796, 675439, 625349, 644770, 697965, 719918, 760740, 727833, 729440, 711980, 735800]
3691G35800J9705j5751L5364j6643L7203K3129O2112M0246k2422K7135K4119L0212
3679I80209o709P507k567L2866K1705P5189j1696j202Q631r072N122M3586O8400
3666A211969j8219L7107K8147K6501M9980M2189j6316O522J7537L7306J7328K2279
3654A462330K2469L6241M7418M4212j0663o409L4634l71j939K5232L7639O8368
3642A759161L1412M2451J4024K7803j5845N7307J2176P632J5448K6021J6301R915
3630B003806L6315M7569K3103O0866K7388M0133P0132P349K1009P506K2815M9211
3618B417202J1274M0351J9590N7021P0058n050M0723K6569M8069N7819M1168K8910
3606B853704L9569N6227J05626M1022N4025Q3540L7574Q9352O9559Q9348J11207
$$ y = [735800, 755505, 739754, 775118, 758475, 795678, 818807, 880919, 921165, 898743, 925878, 949997, 980209, 973500, 981007, 978440, 1011306, 1033011, 1108200, 1096504, 1095302, 1103933, 1094861, 1099983, 1143569, 1211969, 1193750, 1230857, 1259004, 1285505, 1335485, 1377674, 1361358, 1367880, 1385417, 1422723, 1440051, 1462330, 1484799, 1521040, 1568458, 1612670, 1602007, 1595598, 1630232, 1629861, 1627922, 1653154, 1690793, 1759161, 1790573, 1833024, 1847048, 1874851, 1859006, 1916313, 1928489, 1936121, 1951569, 1977590, 1993891, 2003806, 2040121, 2087690, 2110793, 2171659, 2199047, 2239180, 2309312, 2316661, 2337670, 2345176, 2367991, 2417202, 2428476, 2468827, 2488417, 2545438, 2615496, 2610446, 2651169, 2677738, 2725807, 2783626, 2824794, 2853704, 2893273, 2949500, 3055126, 3096148, 3150173, 3233713, 3271287, 3360639, 3430198, 3519546, 3630753]
3595C630753Q3344P8042P9903J35123J10522Q1406J17291J06517J09008J30984
3585D662893J05975J10153J20672J21612J50874J99722J73897J68384J92895K13040
3575F220117J96632J94587K26548K59559K69435K36915K86741L05169K95448L17743
3565H808894L54020L15522L30288L52691L26899L35884L30217L64533L17899L39759
3555A2176606L42548L42649L27866L94327L98579L70334M21098L86673L39183
3546A5499863L98267M09341M36623M26290M43302N05894N36019N39943N14302
3537A9709844N50454O69777O32001O41701O15235O68745O91096O74363O91638
3528B5544854O55618O22657N99390O45826N77273N59288N44283N58091N27599
$$ y = [3630753, 3714097, 3792139, 3872042, 4007165, 4117687, 4199093, 4316384, 4422901, 4531909, 4662893, 4768868, 4879021, 4999693, 5121305, 5272179, 5471901, 5645798, 5814182, 6007077, 6220117, 6416749, 6611336, 6837884, 7097443, 7366878, 7603793, 7890534, 8195703, 8491151, 8808894, 9162914, 9478436, 9808724, 10161415, 10488314, 10824198, 11154415, 11518948, 11836847, 12176606, 12519154, 12861803, 13189669, 13583996, 13982575, 14352909, 14774007, 15160680, 15499863, 15898130, 16307471, 16744094, 17170384, 17613686, 18119580, 18655599, 19195542, 19709844, 20260298, 20930075, 21562076, 22203777, 22819012, 23487757, 24178853, 24853216, 25544854, 26200472, 26823129, 27422519, 28068345, 28645618, 29204906, 29749189, 30307280, 30834879]
3519C0834879M90407N06519M79535M63958L86608M15051L69413L25913L50711
3510C4622994M08832L79678L42667L37183L48583K96541L36805L55034L19395
3501C7747712L19657L17082L53936L61767L34844L20570K84341K74995K54360
3492D0569264K48895K14889J50239J19712J12276M9886j6259j2290m7535p7724
3482D1311353j23798j06766j74866j98555j63213j32322k47844k65970k86330
3473C9611689k77328l00591k96483k94124l45690l11713k88776l20036l30496
3464C6846452l21842l44635m14938k99939l35554m02881m22242l98986l85260
3455C3520175m42409m08641m05241m65375m50814m67111m63831m57504m95022
$$ y = [30834879, 31325286, 31831805, 32311340, 32775298, 33161906, 33576957, 33946370, 34272283, 34622994, 35031826, 35411504, 35754171, 36091354, 36439937, 36736478, 37073283, 37428317, 37747712, 38067369, 38384451, 38738387, 39100154, 39434998, 39755568, 40039909, 40314904, 40569264, 40818159, 41033048, 41183287, 41302999, 41415275, 41465161, 41448902, 41436612, 41389077, 41311353, 41187555, 41080789, 40905923, 40707368, 40544155, 40411833, 40163989, 39898019, 39611689, 39334361, 39033770, 38737287, 38443163, 38097473, 37785760, 37496984, 37176948, 36846452, 36524610, 36179975, 35765037, 35465098, 35129544, 34726663, 34304421, 33905435, 33520175, 33077766, 32669125, 32263884, 31798509, 31347695, 30880584, 30416753, 29959249, 29464227]
3446B9464227m91946m87650n48129o25962n68749n64251n41554n48186n47653
3437B4540147n43808n35023n09568m98126m94004m65792m80323m61188l91410
3428B0160905m15945m40261m29604l91677l77252m41618l78114l76513l80050
3419A6529871l47415l46424k88551l54846l59583l37205l67109l68094l18235
3410A3442409l12033k92695k90431k78568k79509l03320k80249k01907k04935
3401A0998762k14793k01103j74900j94031j74033j34733j20826j20862j29288
3392I534193p0788j04111r1451n2988p0533o5651l6391p3925p1067l8305m618
3381H854365r573l3746J1518j139L2789M7681N5387l86N0244M7598O0838J14438
$$ y = [29464227, 28972281, 28484631, 27936502, 27310540, 26741791, 26177540, 25635986, 25087800, 24540147, 23996339, 23461316, 22951748, 22453622, 21959618, 21493826, 21013503, 20552315, 20160905, 19744960, 19304699, 18875095, 18483418, 18106166, 17664548, 17286434, 16909921, 16529871, 16182456, 15836032, 15547481, 15192635, 14833052, 14495847, 14128738, 13760644, 13442409, 13130376, 12837681, 12547250, 12268682, 11989173, 11685853, 11405604, 11203697, 10998762, 10783969, 10582866, 10407966, 10213935, 10039902, 9905169, 9784343, 9663481, 9534193, 9463405, 9359294, 9267843, 9214855, 9144322, 9078671, 9042280, 8968355, 8897288, 8858983, 8854365, 8844792, 8811046, 8822564, 8821425, 8854214, 8901895, 8957282, 8956896, 9007140, 9054738, 9115576, 9230014]
3369I230014N1776M4553R9931J24220J13363P5074J36458J03461J17527J41344
3359A0237721J43790J46464K04271J94281J40150K42254K00346K23740K43726
3350A1976743J96921J70248K58693K84853K80845L30832L09263K78944L37278
3341A4424620L38317L88760M04572L91078M46619M41721M19491M57220M87454
3332A8199852M97396N06655N33499N48274N68821O17150O20691O38628P04898
3323B3435864O78170P70044P91841Q60607Q51387Q74587Q84836R56291J034515
3314C1138142J014409J073867J116339J118479J213353J229888J224935J275477
3306D0404889J293663J300696J334135J333346J369973J358013J388159J501358
$$ y = [9230014, 9281790, 9326343, 9426274, 9550494, 9663857, 9738931, 9875389, 9978850, 10096377, 10237721, 10381511, 10527975, 10732246, 10926527, 11066677, 11308931, 11509277, 11733017, 11976743, 12173664, 12343912, 12602605, 12887458, 13168303, 13499135, 13808398, 14087342, 14424620, 14762937, 15151697, 15556269, 15947347, 16393966, 16835687, 17255178, 17712398, 18199852, 18697248, 19203903, 19737402, 20285676, 20854497, 21471647, 22092338, 22730966, 23435864, 24114034, 24884078, 25675919, 26536526, 27387913, 28262500, 29147336, 30103627, 31138142, 32152551, 33226418, 34342757, 35461236, 36674589, 37904477, 39129412, 40404889, 41698552, 42999248, 44333383, 45666729, 47036702, 48394715, 49782874, 51284232]
3298E1284232J534765J561956J678491J717416J801925J935484K077887K185949
3290F5778105K334881K541549K616555K849869L012834L197397L414319L573969
3282H9319478L769085L981362M228785M504564M700639M956781N193024N376300
3274A26030018N579440N765981N993027O079414O194466O271951O439910O528826
3266A74883033O544872O739581O926754P147662P350304P620697P925295Q201859
3258B33340057Q417617Q666281Q829976Q926312R014519Q903926Q795036Q536474
3250C03430198Q126981P703384P137306O468933N771040M984808M101571L267160
3242C50991381K362353J396165L53130q07711k019146l186447m474939n712968
$$ y = [51284232, 52818997, 54380953, 56059444, 57776860, 59578785, 61514269, 63592156, 65778105, 68112986, 70654535, 73271090, 76120959, 79133793, 82331190, 85745509, 89319478, 93088563, 97069925, 101298710, 105803274, 110503913, 115460694, 120653718, 126030018, 131609458, 137375439, 143368466, 149447880, 155642346, 161914297, 168354207, 174883033, 181427905, 188167486, 195094240, 202241902, 209592206, 217212903, 225138198, 233340057, 241757674, 250423955, 259253931, 268180243, 277194762, 286098688, 294893724, 303430198, 311557179, 319260563, 326397869, 332866802, 338637842, 343622650, 347724221, 350991381, 353353734, 354749899, 355103029, 354295318, 352276172, 349089725, 344614786, 338901818]
3234C38901818o894378p995692q973652r784406j0363312j0726585j0964617j1052402
3226B62146774j1020502j0952057j0759993j0373522r915859r432062q863402
3219A90829377q294778p730936p227964o865300o455445o154948n894542n655692
3211A36549772n455942n272772n109924m898454m747383m620669m471917m389842
3203I7582869m160933l977038l793145l602014l380972l255158l020808k823120
3195F9569681k708764k572845k464359k300230k178008k066006j980689j856465
3187E1442315j809054j689807j627232j590019j489728j423667j360906j331109
3179C9120793j271743j258964j198784j140495j089797j036780r66350r34922
$$ y = [338901818, 332007440, 324011748, 315038096, 305253690, 294890378, 284163793, 273199176, 262146774, 251126272, 240174215, 229414222, 219040700, 209124841, 199692779, 190829377, 182534599, 174803663, 167575699, 160710399, 154254954, 148100006, 142205464, 136549772, 131093830, 125821058, 120711134, 115812680, 111065297, 106444628, 101972711, 97582869, 93421936, 89444898, 85651753, 82049739, 78668767, 75413609, 72392801, 69569681, 66860917, 64288072, 61823713, 59523483, 57345475, 55279469, 53298780, 51442315, 49633261, 47943454, 46316222, 44726203, 43236475, 41812808, 40451902, 39120793, 37849050, 36590086, 35391302, 34250807, 33161010, 32124230, 31157880, 30222958]
3171C0222958r34168q97633q72446q10346p38860p30743p08575o72165o44154
3162B3213868o39256p22180o20910n60997o56082n72793n43689n22487n04731
3153A7870743n30081n08896m66446m46813m82313m60064l91326l83513m10418
3144A3790873l47404l72891l12820l54212l22972l45866k79544k97375l28784
3135A0829005k93356k36330k58235k75440k57550k35847k37780j92340j85527
3126H656600k32938k14124j82120j77818j83094j88755j76759j70712j62354j81486
3116F786440j57648j43865j52970j46697j26176r8084j61118j50851q3485n6503
3106E509043r9483j83633j48896r3417r2382r2225j21736p0651r8655q1423j20166
$$ y = [30222958, 29288790, 28391157, 27518711, 26708365, 25969505, 25238762, 24530187, 23858022, 23213868, 22574612, 21852432, 21231522, 20670525, 20014443, 19441650, 18897961, 18375474, 17870743, 17340662, 16831766, 16365320, 15918507, 15436194, 14976130, 14584804, 14201291, 13790873, 13443469, 13070578, 12757758, 12403546, 12080574, 11734708, 11455164, 11157789, 10829005, 10535649, 10299319, 10041084, 9765644, 9508094, 9272247, 9034467, 8842127, 8656600, 8423662, 8209538, 8027418, 7849600, 7666506, 7477751, 7300992, 7130280, 6967926, 6786440, 6628792, 6484927, 6331957, 6185260, 6059084, 5961000, 5799882, 5649031, 5565546, 5509043, 5409560, 5225927, 5077031, 4983614, 4891232, 4799007, 4677271, 4606620, 4507965, 4426542, 4306376]
3095D306376j59133n5144n3690q6537q9527j20640o4671m1335q3886q1167k6857
3084C443789r1625q7502l7386p1773q7441q084m3979m5088o1740l2956m0968k9021
3072B806226k1955j3244k1657n7992n0503k0440m6050j949J5850O226j3277j9888
3060B561347Q921j6052r477k5113q810K5150N3936j9494j9421M211L8984L9205
3048B633387O111j4319Q715n521R013N5648N8689k7832L9090J3405J4370J1256
3036B802012M7503K5361j54L5259K066K6629J0322M5476P670m580O9671K7193
3024C094428K3299L201L780M1587J8599k0251L1807L7676K0654N3101J1121L4545
3012C353547N8228N561O1135L9551J1501J2320O0733N8736m8217M5422Q6978j161
$$ y = [4306376, 4147243, 4092099, 4038409, 3951872, 3862345, 3741705, 3677034, 3635699, 3551813, 3470646, 3443789, 3352164, 3264662, 3227276, 3155503, 3068062, 3059978, 3015999, 2970911, 2909171, 2876215, 2835247, 2806226, 2784271, 2771027, 2749370, 2691378, 2640875, 2620435, 2574385, 2572436, 2588286, 2594512, 2581235, 2561347, 2570268, 2554216, 2544739, 2519626, 2510816, 2535966, 2589902, 2570408, 2550987, 2555198, 2594182, 2633387, 2639498, 2625179, 2633894, 2628373, 2637386, 2693034, 2751723, 2723891, 2762981, 2776386, 2790756, 2802012, 2849515, 2874876, 2874722, 2909981, 2912047, 2938676, 2948998, 2994474, 3002144, 2997564, 3067235, 3094428, 3117727, 3120928, 3124708, 3166295, 3184894, 3164643, 3196450, 3234126, 3254780, 3307881, 3319002, 3353547, 3411775, 3417336, 3478471, 3518022, 3529523, 3541843, 3602576, 3661312, 3613095, 3658517, 3745495, 3744334]
3000C744334J7771O1680P8491L7422O7217O9569N4333L2589N6024J17087N4290
2989D390807O7345O4281P0294N1045R3688J06604P9834P1442J33805R9943R8408
2978E327496P3283R0579J12054J27663J06674J72132J74082J10251J05993K18262
2968F618469J71786J60360J83201J81311J95109J89863J64267K22502K15608K20866
2958H523342K09138K15289K19749K37719K76063K47630K97653K88425K88015L21732
2948A1124755L40549L20195L59175L48614L40014L84520M55092M49339M62042
2939A4584295M72116M57885M86694N83116O32076N73889O73696P67979P93241
2930B0024987Q70087R23340J006499J068470J202040J285575J389099J503191
$$ y = [3744334, 3762105, 3823785, 3902276, 3939698, 4006915, 4076484, 4130817, 4163406, 4219430, 4336517, 4390807, 4458152, 4522433, 4592727, 4643772, 4737460, 4844064, 4923898, 4995340, 5129145, 5229088, 5327496, 5400779, 5491358, 5603412, 5731075, 5837749, 6009881, 6183963, 6294214, 6400207, 6618469, 6790255, 6950615, 7133816, 7315127, 7510236, 7700099, 7864366, 8086868, 8302476, 8523342, 8732480, 8947769, 9167518, 9405237, 9681300, 9928930, 10226583, 10515008, 10803023, 11124755, 11465304, 11785499, 12144674, 12493288, 12833302, 13217822, 13672914, 14122253, 14584295, 15056411, 15514296, 16000990, 16584106, 17216182, 17790071, 18463767, 19231746, 20024987, 20895074, 21818414, 22824913, 23893383, 25095423, 26380998, 27770097, 29273288]
2922B9273288J673476J793389J880869K058910K205794K314681K407125K520327
2914D6127859K624322K537533K504966K374975K160359J907902J678515J490519
2906F3406950J225310J022767P79793N61331L72259K67878K26036K88510L98134
2897F8548968N25124O57936P22953R57112J222834J556797J934705K367682K848022
2888H1342133L327994L742116M097043M444316M692533M535807L596716J895031
2880A11673689l2390j580098k182036k376120l125847m419244n805817o625601
2872H5526536o348134n434845m502428l668983k944401k392262k023426j686579
2864E6525478j470296j209378r62101p53561m95742k24557n1034J12876J92586
$$ y = [29273288, 30946764, 32740153, 34621022, 36679932, 38885726, 41200407, 43607532, 46127859, 48752181, 51289714, 53794680, 56169655, 58330014, 60237916, 61916431, 63406950, 64632260, 65655027, 66434820, 66996151, 67368410, 67636288, 67862324, 68150834, 68548968, 69074092, 69732028, 70454981, 71412093, 72634927, 74191724, 76126429, 78494111, 81342133, 84670127, 88412243, 92509286, 96953602, 101646135, 106181942, 109778658, 111673689, 111641299, 110061201, 107879165, 105503045, 102377198, 97957954, 92152137, 85526536, 79178402, 73743557, 69241129, 65572146, 62627745, 60235483, 58212057, 56525478, 55055182, 53845804, 52883703, 52130142, 51634400, 51409843, 51358809, 51471685, 51664271]
2855E1664271K94347L14140K42349R1600j32120l92541p05406j080772j402601
2846D8893267j651779j951996k163435k374055k439130k462112k388459k186219
2838C1276082k069544j906807j681124j585424j438348j302201j244868j110930
2830A8936836j035229r66212q87145q23548p30986o75239o74417n92381m74423
2821A2077256n43152m86396m50774m31617l63220l58909l70302l22862l01164
2812H448860k46043k63337k55729k66503k70759k10245k45131k19889j61833k40327
2802F069064j85457j80571j60044j23594j14557j79528j57151j05019j10468j11186
2792D641489j14962j38432j16971j00710r5236o1699j19983j25650j44127o9291
$$ y = [51664271, 51958618, 52272758, 52515107, 52606707, 52474587, 52082046, 51376640, 50295868, 48893267, 47241488, 45289492, 43126057, 40752002, 38312872, 35850760, 33462301, 31276082, 29206538, 27299731, 25618607, 24033183, 22594835, 21292634, 20047766, 18936836, 17901607, 16935395, 16048250, 15224702, 14493716, 13818477, 13144060, 12551679, 12077256, 11534104, 11047708, 10596934, 10165317, 9802097, 9443188, 9072886, 8750024, 8448860, 8202817, 7939480, 7683751, 7417248, 7146489, 6936244, 6691113, 6471224, 6309391, 6069064, 5883607, 5703036, 5542992, 5419398, 5304841, 5125313, 4968162, 4863143, 4752675, 4641489, 4526527, 4388095, 4271124, 4170414, 4075178, 4013479, 3893496, 3767846, 3623719, 3554428]
2782C554428r8065p5609j38665r3627q2734m1019p1368n6502o7781q8349j17174
2771B623535o6377m8838j8604n1255n1340q0223l5435O327q2804l2403m7853r2386
2759B022344l9077l9728k3302n9370q1012o2154J4829r068l4582l0628o4177l7489
2747A556586p263k307o0884l5681o7174k6184K0539M908o1607n2361k9649l1984
2735A206939n5255l074j0949l0767m7962k6992j0398n541o771o3121l0832M6616
2723I61893k2743n2973r466r818N775l6408j4522l7896k3331J528j8087l4449
2711G09503k7749j5071K9051r46m3451j0759J1780m1513j9686l070j7051J6918
2699E87956j310j477J4443l2151o5201k728j1626j5974M661N9187m7442O031J1509
$$ y = [3554428, 3456363, 3380754, 3242089, 3148462, 3065728, 3024709, 2953341, 2896839, 2829058, 2740709, 2623535, 2557158, 2508320, 2489716, 2438461, 2387121, 2306898, 2271463, 2277790, 2194986, 2162583, 2114730, 2022344, 1983267, 1943539, 1920237, 1860867, 1779855, 1717701, 1732530, 1723462, 1688880, 1658252, 1594075, 1556586, 1549323, 1547016, 1486132, 1450451, 1383277, 1357093, 1377632, 1382540, 1320933, 1268572, 1238923, 1206939, 1151684, 1148610, 1137661, 1106894, 1058932, 1031940, 1021542, 1016001, 1009230, 946109, 915277, 961893, 939150, 886177, 876711, 866893, 872668, 836260, 821738, 783842, 760511, 762039, 743952, 709503, 681754, 666683, 695734, 694788, 651337, 640578, 652358, 610845, 591159, 588089, 571038, 587956, 586646, 585169, 599612, 567461, 502260, 499532, 487906, 471932, 476593, 535780, 488338, 494369, 505878]
2686E05878P261P638n7573L4692k753k4359M734k8137Q926N634J8132M3633k9051
2673D94655n449J8384l5563m466J256J4056K9818q609k8998N366K0471j5163j3845
2660D71913L395J0708L1714l0005m654R50j4065q933J224J2388m516L3147k458
2647E00808l5573j9375M3135L231k2996M4296O179l049K650j9534Q193Q185k947
2634E13203L5365r20J0116K8078j8152l2103O987M605J5618o45M2952J4095k2193
2621E97006J376N0037j7195m8894j4531m3674J0739K0614k6248R292K9545k6263
2609E41804K2749j5817M1110K1395P958M9103k8742K9843M3764k570p066L7729
2597G41260K3705n942k9266J4873k3285R92m5336p6637K347n2417n1203n2122
$$ y = [505878, 513139, 520777, 463204, 497896, 495143, 470784, 475518, 447381, 456307, 461941, 480073, 523706, 494655, 489206, 507590, 472027, 467561, 468817, 482873, 512691, 504082, 475084, 480450, 500921, 485758, 471913, 475308, 486016, 517730, 487725, 483071, 484021, 469956, 461023, 462247, 474635, 470119, 503266, 500808, 465235, 445860, 488995, 492226, 469230, 513526, 519705, 516656, 519306, 499772, 507965, 516150, 513203, 548568, 547648, 557764, 585842, 567690, 535587, 542574, 547179, 562797, 562152, 605104, 619199, 597006, 598382, 648419, 631224, 582330, 567799, 524125, 534864, 555478, 529230, 538522, 568067, 541804, 564553, 548736, 589846, 611241, 619199, 668302, 639560, 669403, 713167, 710597, 703531, 741260, 764965, 759023, 729757, 744630, 721345, 722337, 677001, 600364, 602711, 550294, 499091, 446969]
2585D46969K0381J7065j2351m9307j7376K1286K4741o2181N58M082j8346J6595
2573C92116p457j8110J0043p829K9977J5628r195K3047N618m9041j0189j8086
2561C56522j0410l0538k0929J4600p018N165l4214j8606o135n3791l995k7583
2549A63068P382L5048m4136m9264k4255R79J8646J6054j6327k35j2591n109M6671
2536A35931l169m3112N7664N778M231k3159l8447J4860j522P569K731l9627Q84
2523H0612Q535P706L2600j3167o931K4690j0710l9201Q877j5962k024L189K3796
2510A02010k4650j0643o798L0091K24m4681L304K1493J3121J5582J0221m5060
2498F4214J5289p152j7227j0040M6435k0071J1399l4679L951O021j3448L408j7373
$$ y = [446969, 467350, 484415, 472064, 422757, 405381, 426667, 451408, 389227, 389785, 393867, 375521, 392116, 384659, 366549, 376592, 368763, 398740, 414368, 405173, 428220, 433838, 384797, 374608, 356522, 346112, 315574, 294645, 309245, 302227, 307392, 273178, 254572, 248437, 194646, 190651, 163068, 170450, 205498, 161362, 112098, 87843, 88822, 107468, 123522, 107195, 106960, 94369, 89260, 135931, 132762, 89650, 147314, 153092, 157323, 134164, 95717, 110577, 109055, 116624, 119355, 79728, 80612, 89147, 96853, 129453, 116286, 109355, 134045, 123335, 84134, 93011, 77049, 75025, 78214, 102010, 77360, 66717, 59919, 90010, 90234, 45553, 48857, 70350, 83471, 99053, 109274, 64214, 79503, 72351, 55124, 45084, 91519, 71448, 82847, 48168, 52119, 58140, 44692, 48100, 30727]
2485C0727j2715j2515k420j2284K2898J4520J4001j3597O71K3521m927j6206l8616
2472f942L5795o177j8200N1406j315l2388l0384J611L0530j7999K2979R678q901
2459B9693k2507j4017Q548Q219J7753J8705l8674J4727Q379n365p253k6426P3111
2446F4893M1994l7753o9416n795P837J7774o486k6217j4485P2085J8033k1683
2434D0781j9118K710j5730J7552J0656r555P735K3116k2248r319N102R107O478
2421D7267j1730k8472O859J622p667p223l1564L9487J5959K1489q089l2939l443
2408A556J6815J4895M065j7814M81M5192l1114K320j9458k4093P970K4118L3909
2395E8842n0348J62J7329k2476O776r36O79O050l5680Q183L608k1074K6411r58
$$ y = [30727, 18012, 5497, 3077, -9207, 13691, 28211, 42212, 28615, 29286, 52807, 47880, 31674, -6942, 28853, 22676, 4476, 55882, 54567, 22179, -8205, -6594, 23936, 5937, 28916, 38594, 29693, 7186, -6831, 1717, 9936, 27689, 46394, 7720, 22447, 30826, 25461, 18208, -8218, 64893, 106887, 69134, -282, -6077, 1760, 19534, 13048, -13169, -27654, 44431, 62464, 40781, 21663, 24373, 8643, 26195, 36851, 27296, 35031, 58147, 35899, 26580, 31682, 40789, 47267, 35537, 7065, 13924, 15546, 7879, 656, -30908, 8579, 24538, 46027, 37938, 4999, 1556, 18371, 33266, 37331, 19517, 19998, 65190, 34076, 36396, 16938, -7155, 815, 24933, 58842, 8494, 8656, 25985, 3509, 10285, 9349, 10028, 16078, -19602, -11419, -7811, -28885, -2474, -3432]
2381c432L9129J4476l0033J622L9988l3549m4048L4263K3279N787p8462J8595
2369a2385J2478k6446J2828L2951L6636O988j9030j3022k0768J6860j6881R442
2357A9651m010K2083R135J0021j614j5666L5861l7512K3136K6037m0225J2072
2345E8969L6133j1864q032o337K865j4097l9134j3853p910J3384j555K2463L5485
2332F6517k9988k3210k5632L589J3394j7211K3560J7777k5098m2042K0891j5193
2320c2646L480j9151q222p645M9026J9145q279J3854j7834l372j9613K017j6391
2307d5631O441L2632L7302m9756j2469K6920M0814j5728m9285K5447P266l6835
2295c2882j163Q572l7012K0843M6873o729j9393m099K8557k2043k541R262L1591
$$ y = [-3432, 35697, 50173, 20140, 21762, 61750, 28201, -15847, 18416, 41695, 47482, -30980, -12385, 93, -26353, -13525, 19426, 56062, 63050, 44020, 30998, 10230, 27090, 10209, 19651, 15641, 37724, 46859, 56880, 55266, 39600, 75461, 37949, 61085, 87122, 46897, 58969, 95102, 83238, 75206, 68869, 71734, 57637, 18503, 4650, -3260, 10124, 8569, 31032, 66517, 36529, 13319, -12313, -8724, 4670, -12541, 11019, 28796, 3698, -38344, -17453, -32646, -29166, -48317, -56539, -64184, -15158, 3987, -4292, 9562, -8272, -11644, -31257, -29240, -45631, -39190, -6558, 30744, -19012, -31481, -4561, 36253, 20525, -28760, -3313, 3953, -32882, -34045, -25473, -62485, -41642, 5231, -1498, -20891, -24990, 3567, -18476, -21017, -11755, 19836]
2282A9836k6165K3424j0401q349M147K8065n471j6396Q574j9666k6236J7360J4891
2269C613j4301l1939k5923J1073k615J9764N2797L2653q7o748k1812l0920j2821
2256b7266Q182J0972N9622J921l9304p635q060P063K1494r256j9174J6987m112
2243A1434J1423J2327m221l7123K324K4834m7867k1144J1050K8448l865K0418
2231H038j8526k5501j9619m964k039M1194L0387L027k6740M0244P934J358L151
2218C7944l712K0228k8612J127j1091K36l2467L732O8722j3669m9050j5471N3029
2205C0946J902k3399k2981J9277L1371j757l9571N4370K3158l5353M988k6452
2193A6499N993o025R341o528J0261K9595k731k2469q071n958K6419k5844K2704
$$ y = [19836, -6329, 17095, 6694, -1655, 2492, 30557, 25086, 8690, 17264, -2402, -28638, -11278, 3613, -10688, -42627, -68550, -57477, -60092, -40328, 12469, 45122, 45035, 38287, 16475, -14445, -27266, -19084, -8112, 51510, 53431, 14127, 6492, -1568, 5495, 26989, 17733, -1441, 15546, 11434, 22857, 35184, 30963, -6160, -3836, 20998, -26869, -48013, -36963, -8515, -12380, 8038, -10488, -35989, -55608, -60572, -62611, -21417, 8970, 11997, -14743, 25501, 33435, 34793, 37944, 34232, 54460, 25848, 26975, 15884, 16120, -16347, -12615, 56107, 42438, -6612, -22083, 30946, 32848, 9449, -13532, 5745, 37116, 35359, -4212, 50158, 73316, 37963, 42951, 16499, 22492, 16467, 25808, 19280, 29541, 59136, 56405, 33936, 25865, 19907, 46326, 20482, 43186]
2180D3186K280L9028k760j0492l0143m6692J7574J6217k3387J4659P3735J96l158
2167I0243o8Q84k4044J8892M375k352J5984Q475L568K7803L7819p143n5894K803
2153A21345J0706M3749J7638l004J4763P183j1074K719l302J1848J3656P351K2919
2140B56497L5481o010k7315L946J8605M0237J564J7090L5331J7039k9379K4981
2128C88067M6428r581M534Q746K5124O314O3328N6049j3698k2207L5579N2379
2116F41062j3452L0895P5826O098J2818P7969N2057Q4687L5166L8548L1703O1559
2104A134936M7673P5723L5471P3224O1253N7898R6582Q8161J15757J52106J27192
2093B065976J53234K77330K21826K53796J84467K39365L53812M23511N56211O86404
$$ y = [43186, 45466, 84494, 81734, 71242, 41099, -5593, 11981, 28198, 4811, 19470, 93205, 93401, 90243, 90175, 91059, 67015, 85907, 90282, 87930, 103914, 112389, 115957, 143760, 181579, 174436, 118542, 121345, 132051, 175800, 193438, 190434, 205197, 212380, 201306, 204025, 200723, 212571, 226227, 233578, 256497, 291978, 285968, 258653, 262599, 281204, 321441, 323005, 340095, 375426, 392465, 363086, 388067, 434495, 424914, 429448, 438194, 463318, 469632, 532960, 589009, 575311, 553104, 588683, 641062, 627610, 658505, 734331, 740429, 753247, 831216, 883273, 967960, 1003126, 1041674, 1073377, 1134936, 1182609, 1258332, 1293803, 1367027, 1428280, 1486178, 1582760, 1670921, 1786678, 1938784, 2065976, 2219210, 2496540, 2718366, 2972162, 3156629, 3395994, 3749806, 4173317, 4729528, 5415932]
2083E415932R17867J109224J068444J106138J123028J406094J287271L76511o68225
2074A3142284j885247k442397j998539j344115q82990o07955m61870l65962k53360
2065B899849k01690j99463j28275j40518j04300j50251j22643j25681j25922j19708
2055A481398j28151j30800j20944o7741n6995o2703l2600k6343j5821k4056J010
2044H16254o1831k7239k9176j4129j7426n2901J3956p405k7759j8374l4657j3054
2032E26259j6817j0168l8144l2704q815l3410L4463k6565J4722p479l8501m6883
2020C15958l391K5521k3982J3247j8153k3991P00l1306m571J3925j1388J576l9826
2007B14319j6148J2087J6067L2951k6240k3961j7259n909p0000J056Q798K3279
$$ y = [5415932, 6333799, 7443023, 8511467, 9617605, 10740633, 12146727, 13433998, 13810509, 13142284, 11257037, 8814640, 6816101, 5471986, 4588996, 3981041, 3519171, 3153209, 2899849, 2698159, 2498696, 2370421, 2229903, 2125603, 1975352, 1852709, 1727028, 1601106, 1481398, 1353247, 1222447, 1101503, 1033762, 976767, 914064, 881464, 855121, 839300, 815244, 816254, 754423, 727184, 698008, 683879, 666453, 613552, 627508, 620103, 592344, 573970, 539313, 526259, 509442, 499274, 461130, 428426, 419611, 386201, 420664, 394099, 408821, 401342, 362841, 315958, 312567, 338088, 314106, 327353, 309200, 285209, 285909, 254603, 250032, 263957, 252569, 254145, 214319, 198171, 210258, 226325, 259276, 233036, 209075, 191816, 185907, 115907, 116963, 125761, 149040]
1995A49040O664k7790Q769O934o731k3476J0775Q047k0124q931l3522j00P074
1982G6629Q559R846K5836m2735m517k1860P003K4682J406k3569O994O268o651
1969F7891j272j969L1466j2121j0051j6520O564j6815l090l2871J7905J4440L2544
1956G6101j7003j4720j3330J0984j901l2171j7283K7436J098Q507p172j8988L5235
1943C6793k3067K4657j2704j0552J584L0644L783k352r754j4258m5581L037J1408
1930f362N080J1077J4657k1605K9139N528j9981r542q231O780m6203j940j0557
1917e2160Q763j0961j4434M903J2672k1166K2673L2441J9506p401J6866L7275
1905D8977l4683l2882Q378m1400O033O0338K015k6030R624o1473N2881q039k5536
$$ y = [149040, 155704, 127914, 136683, 143617, 136886, 113410, 124185, 132232, 112108, 103177, 69655, 69555, 76629, 85188, 95034, 120870, 78135, 73618, 51758, 58761, 83443, 84849, 61280, 68274, 74542, 67891, 66619, 64650, 96116, 83995, 73944, 57424, 63988, 47173, 44083, 11212, 29117, 43557, 76101, 59098, 44378, 31048, 42032, 40131, 7960, -9323, 18113, 19211, 27718, 20546, 1558, 36793, 13726, 38383, 25679, 15127, 16711, 47355, 51138, 48786, 39032, 24774, -20807, -17770, -6362, -1282, 9795, 24452, 2847, 31986, 37514, 17533, 7991, -240, 6540, -39663, -41603, -52160, -43397, -54358, -68792, -63889, -51217, -72383, -49710, -17269, 2237, -5164, 11702, 48977, 14294, -18588, -10210, -51610, -45577, 14761, 16776, -9254, 370, -61103, -8222, -16261, -41797]
1892d1797K9450J3851n631K4404j0865j0021j4584k8129j8890j0544K6642L3498
1880a2616K3916l1844j0300J6318j7019L4659J3752q650k3433j0117N7096J1376
1868D3138j7913l8678J0679j0998p0766K2519M1305m883L5109k965Q797M609M787
1855B4740l9598K1634J6746k2124j5111r362j9344L0786J6706j2656O578k5355
1843b6360j3049j2275K0786l812J602J5221O431J9605l571J3735k6333m390o381
1830a8791j9265k1253O1639j4304m401l821j8220k2633K948K5542m362K0318L1246
1817A4643k3459j8506J8463J9249j1829M3811L2876j1189j5533N796j5036q643
1805C0643R389j5476K4889j3877J9864k5660o519j4117j4747l9427j844M319J1833
$$ y = [-41797, -12347, 1504, -4127, 20277, 9412, -609, -15193, -43322, -62212, -72756, -46114, -12616, 11300, -20544, -30844, -14526, -31545, 3114, 16866, 8216, -15217, -25334, 31762, 43138, 25225, -13453, -2774, -13772, -84538, -62019, -20714, -25597, 9512, 6547, 15344, 19953, 24740, -14858, 6776, 23522, 1398, -13713, -23075, -42419, -11633, 5073, -7583, -1005, -26360, -39409, -51684, -30898, -34710, -33108, -17887, -11456, 8149, 4578, 18313, -8020, -12410, -18791, -38056, -59309, 2330, -11974, -16375, -20196, -38416, -61049, -58101, -32559, -36921, -16603, 14643, -8816, -27322, -8859, 10390, -1439, 42372, 75248, 64059, 48526, 54322, 39286, 30643, 40032, 24556, 49445, 35568, 55432, 29772, 23253, 9136, -5611, -45038, -46882, -42563, -30730]
1792c0730j1855R234M211j8554J0559J7602k139J326q359J9550K3688L457k5292
1779g302j8803R274L188J9125k4119p901J712J233J9305K7451k7489m9691l8970
1766i2987K7589P9145k4857j1416m356J6686j3113O052L063k5019p907M487K1363
1753b1270l8240j1410M0139J9126K7695k3248l8701L4082k722L657q077p225l5222
1740f1416K4378q015Q865K6645m3012K8470O418o280K1837k6174m9996J1396l905
1727g0789O631J3389M1686j3648o477j2348K4001m873k2065Q843j3976K0523K0248
1714h855R258M161L492l0182j0704j253j2706j0000J3085j7037L1066K7911j9441
1701b1205K5605R171j6553k4413l7349L2344K8761n8574k3607p471L3872L0374
$$ y = [-30730, -42585, -33351, -29140, -47694, -37135, -19533, -21672, -20346, -28705, -9155, 14533, 17990, -7302, -26105, -16831, -13643, 5482, -18637, -26538, -24826, -23593, -4288, 23163, -4326, -54017, -92987, -65398, 13747, -11110, -22526, -26882, -10196, -23309, -17257, -14194, -39213, -47120, -42633, -21270, -59510, -70920, -30781, -11655, 16040, -7208, -45909, -11827, -14549, -10892, -18969, -26194, -61416, -37038, -45053, -36188, -9543, -52555, -24085, -17667, -23947, -2110, -28284, -78280, -66884, -70789, -64158, -50769, -9083, -22731, -29208, -41556, -17555, -22428, -44493, -35650, -49626, -29103, -8855, 403, 4564, 8056, -22126, -32830, -34083, -46789, -56789, -43704, -60741, -29675, -1764, -21205, 4400, 13571, -2982, -27395, -64744, -32400, -3639, -62213, -85820, -93291, -59419, -29045]
1689b9045j8349J3099K9963n843m4707K9984j4181J257j1996K2392k1620n423
1677e4469l5885k227N1063L1334j6557p411m931Q003m0036R19N6443k5161j5107
1664e4022m701m141L4562K0350o894k899k0189p435k6824N0971m056l4248k0776
1651h0302K9069N1265q131j6025L4476R535l3063l2466P229J7504J7203j9395
1639b3101k6457k4936Q963j6887J2179M5080l1992j1318O95M3078N271l359P376
1626a5408j2352j657J5097P437n9601j6857M6196J0179J4737j6613p702l28r194
1613d6066l708K3268J1644J8703M0957m7328k4202j0040J7667J317L7579l3070
1601a3279k2780J0810j512P648k3625j7982J4523r895K4777J7869q670l617L22
$$ y = [-29045, -47394, -34295, -4332, -10175, -54882, -24898, -39079, -37822, -49818, -27426, -49046, -54469, -90354, -92581, -41518, -10184, -26741, -34152, -39083, -31080, -71116, -70197, -13754, -38915, -54022, -58723, -62864, -28302, -7952, -14846, -17745, -37934, -45369, -72193, -21222, -25278, -59526, -80302, -51233, 32, -8099, -24124, 10352, 19887, -13176, -45642, -38413, -20909, -3706, -23101, -49558, -74494, -65531, -82418, -70239, -25159, -57151, -68469, -67774, -24696, -19425, -22784, -15408, -27760, -29417, -14320, -6883, -66484, -83341, -37145, -26966, -12229, -28842, -36544, -36872, -46066, -49774, -26506, -14862, 3841, 44798, -2530, -26732, -36772, -19105, -17788, 19791, -13279, -36059, -25249, -26761, -19113, -42738, -60720, -46197, -56092, -31315, -13446, -22116, -25733, -25411]
1588b5411k546K6290q331J634K9521n5427K4491j058m78P759m75J4324N190j4785
1574F98k2738M408k6766m160j5029j007L7879p923K3935j3444k8498J8095j2267
1561d6817P289m337L7433l3589M5694j2286m0008L2664N5265J2731m2653j0858
1549E28l8313k3582K4076K9995l571m9353k7810R421J6535J5498K578O855l1838
1536f8981J895L577J9144J3526N4965l3098J5914k8690m546j8433J683o557L752
1523d5849N3895j1149j6516J6757L144k1253m3936o822J0237K8140M6903j6676
1511c125k0077j8231k2868J0288N0429K0769k7157j4829L2909L641k1174l824
1499a3249n0437n7290L3868L8489j3218J0825q920J3782M838Q156j7598o365J3921
$$ y = [-25411, -27957, -1667, -9998, -8364, 21157, -34270, -9779, -10837, -11315, -3556, -4031, 10293, 15483, 698, -22040, -17632, -44398, -48558, -63587, -64594, -26715, -34638, -10703, -24147, -52645, -34550, -46817, -39528, -43865, -6432, -40021, 5673, -6613, -46621, -13957, 41308, 54039, 11386, 528, -37785, -61367, -37291, -7296, -10867, -60220, -88030, -78609, -62074, -46576, -43998, -37143, -68981, -67086, -63509, -44365, -30839, 24126, -8972, 6942, -21748, -26294, -44727, -43044, -49601, -45849, 8046, -3103, -19619, -2862, 282, -20971, -64907, -71729, -61492, -33352, 13551, -3125, -23202, -41433, -64301, -54013, -3584, 17185, -9972, -24801, 8108, 11749, -9425, -13249, -63686, -120976, -87108, -48619, -61837, -51012, -59932, -46150, -41312, -33156, -50754, -57119, -43198]
1486d3198q514l4311Q41O366J1774J1428J7800j9248l55J9358j7226J0645P502
1473c7138J4557j545J4625o2318L0210K1376l3492k0177K5847L079j3844K4253
1461c4567K376l72J8439j815R22j9448K4882Q161n452j0763M104j3218k2620k6367
1447g5738J1169K5574N243K6054P055j151M172j359K89j613N441k7095r368j2215
1433d3542N109M0156l1233J4594M3389l4192k9953r091Q415q273P13J15m3485
1420h7278K7511O5817L7831m5204K5242l414j0156j8061k9171J8347j8146L8132
1408A450j3699k5583L3133J0578j5239l8236M105K4742l0990L5960j2598k594
1396b8971k1006q491o302K3358M0459q464J2146j4556k4575k9269M8182l3929
$$ y = [-43198, -51712, -86023, -85182, -78816, -67042, -55614, -37814, -57062, -57417, -38059, -55285, -44640, -37138, -22581, -24126, -9501, -71819, -41609, -20233, -53725, -73902, -48055, -44976, -58820, -34567, -32191, -32563, -14124, -15939, -15017, -34465, -9583, -1422, -6874, -17637, -13533, -26751, -49371, -75738, -64569, -38995, -33752, -7698, -643, -1794, 2378, 1019, 1308, -305, 5136, -21959, -31327, -43542, -38433, 1723, -29510, -14916, 28473, -5719, -35672, -44763, -36348, -44621, -43908, -43793, -87278, -59767, 6050, 43881, -1323, 23919, 20505, 10349, -7712, -36883, -18536, -36682, 1450, -12249, -37832, -4699, 5879, -9360, -47596, -43491, -18749, -49739, -13779, -26377, -28971, -49977, -58468, -64770, -41412, -953, -9417, 2729, -11827, -36402, -65671, -17489, -51418]
1384e1418l1781K2684J5143j9012J1305j1297j157o00K1674K1020K3582O549q118
1371a426j0553K652L3928J4028m070k2418l6802l9237L5140m96J9955M776k2250
1358b6773r97J9363l757j5993k227k2322k28j5425j1789J9402l408K9041J0921
1345b4192j7741K1596k493L4395n231q337k4542l3595N7490K4102k6565j461l388
1332i962j947J3093j47k2158j1436K2351P049j6351k9285o170O648K9677M520
1319a4118j1808R66K7343l3244q662K4858l34J5254k5050J6450j4096k1433L0823
1306a3051O532j755J0406l1688j2043N88L3270j5444n869p326j9829J7567J3461
1293b5181M7664j1544j5579K2409n709l4515Q069J3042n1374J7644n737L2381
$$ y = [-51418, -83199, -60515, -45372, -64384, -53079, -64376, -65533, -66133, -44459, -23439, 143, 6692, -1426, -11979, -9327, 24601, 38629, 34559, 12141, -24661, -63898, -28758, -29254, -9299, -4523, -26773, -27770, -8407, -12164, -28157, -30384, -52706, -52934, -68359, -80148, -60746, -64154, -35113, -24192, -41933, -20337, -22830, 11565, 6334, -2003, -26545, -60140, -2650, 21452, -5113, -6574, -9962, -11909, 1184, 1037, -21121, -32557, -10206, -3157, -19508, -48793, -54963, -48315, -18638, -14118, -25926, -24960, 2383, -30861, -39523, -14665, -14999, 255, -24795, -8345, -22441, -43874, -13051, -6519, -8274, 2132, -29556, -41599, -41011, -7741, -23185, -29054, -36380, -56209, -38642, -25181, 22483, 10939, -4640, 17769, 12060, -22455, -14386, -1344, -52718, -35074, -40811, -8430]
1281h430K3293k0498l6649k2708J3438L7837M055l2925L5574k1123J5989l029
1269a5176K3895J2902q397n554k3204p329P143r003J6192l871l0854J5443Q339
1256a9474l1047K8329K7389R600k2031J5574k9946l1191K6944K1368J7554k429
1244A0640j5084K3018K7413k3318l2379r922L496J1296J345L3333j4477k8942
1232a3581j3329j1925J6912r479L8919P803j9925J2945Q233n50l08k076N14p642
1218F511J1129j9897J6128J5105k2551k7548Q723o431J3229j9203M253j582K6461
1205D327j880J713o331k2153j6265L3249Q547J5688k7254o073P237k2688j944
1192c3827J5868R727n291k0619J6861J3945l0805N920P694l186O459k2974k1297
$$ y = [-8430, 14863, -5635, -42284, -64992, -51554, -13717, -9662, -42587, -7013, -28136, -12147, -15176, 8719, 21621, 13224, 7670, -15534, -22863, -15720, -24723, -8531, -12402, -43256, -27813, -19474, -50521, -22192, 5197, 14797, -7234, 8340, -21606, -52797, -25853, -4485, 13069, 10640, -4444, 18574, 45987, 22669, -9710, -19632, -16136, -4840, -3495, 29838, 15361, -13581, -26910, -38835, -21923, -31402, 7517, 15320, -4605, 8340, 16573, 16023, 15715, 13639, 14153, 6511, 17640, -2257, 13871, 28976, 6425, -21123, -12400, -18831, -5602, -24805, -20552, -22134, 4327, 2447, 4160, -2171, -24324, -40589, -7340, 1207, 16895, -10359, -16432, -9195, -31883, -33827, -17959, -8232, -13523, -34142, -17281, -3336, -34141, -28221, -20527, -23713, -17254, -40228, -61525]
1179f1525N6944L0777k4016j9366J6614J2117n313k5310O581k8984Q02L1977L4130
1166B5428k7067j3328k6158L5575j9684J8121J2658k9895k3088J1921Q902J8353
1154h262L9394j5523k5791k4456l7841M3251j8279l1967M3566L9871j3251J3478
1142D190J057j2335L3922j6787o099L504O529k2713p697K5659k187K3139K3263
1129E3445m3958k9593j9912J5063k901m9147M3243K7854J623q832l6551L8532
1117a1134L5528m1079l1277M4587Q191j2031J3918J1039k9763K0084l2567k9940
1105e4444J2712J1321l425J6575J8316j9646M072J9845P199K3429j110k6762m3911
1092c5829M642L9647J202l6438l4342R806L3926J0750J2549j4317K717J3863l3670
$$ y = [-61525, -4581, 26196, 2180, -17186, -572, 11545, 6232, -19078, -12497, -41481, -40679, -8702, 25428, -1639, -14967, -41125, -5550, -25234, -7113, 5545, -24350, -47438, -35517, -26615, -8262, 31132, 15609, -10182, -34638, -72479, -29228, -47507, -79474, -35908, 3963, -9288, 4190, 5247, -7088, 26834, 10047, 3948, 7452, 13981, -8732, -16429, 9230, 7043, 30182, 53445, 9487, -20106, -40018, -24955, -27856, -77003, -33760, -5906, -4283, -13115, -49666, -11134, 24394, -16685, -47962, -3375, 4816, -7215, 6703, 17742, -12021, 8063, -24504, -54444, -41732, -30411, -33836, -17261, 1055, -18591, -14519, 5326, 12525, 35954, 34844, 8082, -35829, -31187, 8460, 9662, -26776, -61118, -51312, -17386, -6636, 5913, -8404, -5687, 8176, -25494]
1079b5494l372J4723M3694l0042L566j4930J1082j0785q482L0627l2649K5696
1067C634k3026j035O696P61N351J1793k94l67m877r95J8098l1045R136J6034J1993
1052B1857l8084k1188J9545L25M4223m757j8270j9324L7879j207R684J6583k1998
1039B5268l7182L7165R483l4012o124k6058j314J3923r985K0013K3958Q435j4083
1026I487l1386j2221K2566l648j5437k4199j9425K3812K9090q539K66N6418K654
1013B9438j4542j503j5391j1752k8335k3984L1970r83m502j4981n563k0178K3901
1000e6405L3573L1665O284L5745n65j0636k8037j4832r249j147N403K6660M224
987B2683p421J7697l0387J5772n549l9537O409q219q56l2258n904K1821M5682
$$ y = [-25494, -28866, -14143, 29551, -491, 3075, -11855, -773, -11558, -20040, 10587, -22062, 3634, -19392, -20427, -13731, -12970, -7619, 4174, 3880, 3513, -1364, -2359, 15739, -15306, -6170, 9864, 21857, -16227, -37415, -17870, -17545, 26678, 21921, 3651, -15673, 22206, 20999, 30683, 47266, 25268, -11914, 25251, 34734, 722, -5402, -31460, -32774, -18851, -28836, -8823, 15135, 23570, 9487, -21899, -34120, -11554, -15202, -30639, -54838, -74263, -50451, -21361, -29900, -29634, 26784, 29438, 14896, 13393, -1998, -13750, -42085, -66069, -34099, -35082, -39584, -54565, -60128, -80306, -56405, -22832, 8833, 15117, 50862, 50297, 39661, 11624, -3208, -12457, -13604, -8201, 18459, 22683, 15262, 32959, 2572, 18344, 12795, -26742, -20333, -28552, -29408, -61666, -67570, -45749, -67]
974f7J7689K388Q064m0398L952O758L0630j8111l5053K8106k0631k0226L7307
961D08m548j5612K1514K8124m99k1500j9543k9871K1812J6160j2172N923Q366
948a438J1070k305J3755l5749J3159l8124J2439L8721p57n5775Q382L6037m4862
935d5447M1439M431L8374R22K0156m8254n5378R581j157P336M4839J7955k0742
922A4055j2613J4205n302k6160k5128K0099O510K7064M646k3476j9714J8440K9174
909B1800q776q280L8J3628M4Q326k427j1228J9462J0107p7104L1694J4552N33
895A2369o001n609k3879K570K2157J918L2368K967n0641j8216j371M209q269N86
881c4842N4151k0907m2953K756J2297M4534n3109m5618P7012K1477p397J6755
$$ y = [-67, 17622, 20010, 28074, -12324, -8372, -1614, 29016, 10905, -24148, 3958, -16673, -36899, 408, -4140, -19752, 1762, 29886, 29387, 7887, -11656, -41527, -19715, -3555, -15727, -9804, -1438, 9632, 7327, 21082, -14667, -1508, -39632, -27193, 11528, 10771, -45004, -36622, -585, -45447, -4008, 423, 38797, 39719, 59875, 11621, -43757, -34176, -35333, -27997, 16842, 34797, 14055, 1442, 15647, 10345, -15815, -40943, -20844, -14334, 12730, 17376, -6100, -25814, -7374, 21800, 13024, 4744, 4782, 18410, 18454, 26780, 24353, 13125, 32587, 42694, -34410, -2716, 11836, 12369, 6368, 759, -23120, -20550, 1607, 3525, 35893, 38860, -11781, -29997, -31368, -27159, -35428, -34842, 19309, -1598, -44551, -41795, -29498, 15036, -38073, -83691, -6679, 14798, 7401, 24156]
869B4156m4640M037J89L1576j7879K5298J1038o82k0979m1902j2399J0020M3368
856A1201L2764n2936k7502J3136J8377K465j1808M100J1012K2865l1601M777R827
843F677j1195l317K1980l6811O628N1128k8826j3722p478j2417P559J0527M2809
830C3542k1823j5751k23j6466K0272k47k3114L5746J5025k4557K7262J3482j7324
817B5824m675j2953o94n3742J4498L2394L2027J4172k1053j6840p740N904R288
804A6410j5797k6610J3540K1472Q306k5572j5194K6026j2777L9379k3992l9430
792c4239q978L5984n091K0414P720l6025n186M051J4236j8041j5609K5180J7851
779B267M1360k0478N476P798j6632m6578K4878l616l8532M1197j5562k4190R638
$$ y = [24156, -20484, -16447, -16258, 15318, -2561, 22737, 33775, 33093, 12114, -29788, -42187, -32167, 11201, 43965, -8971, -36473, -23337, -4960, -2495, -14303, -10203, 809, 23674, -7927, -3150, 6677, -4518, -7835, 14145, -22666, -16038, 35090, 6264, -7458, -14936, -27353, -19794, -9267, 33542, 11719, -4032, -4255, -20721, -449, -696, -23810, 11936, 26961, 2404, 29666, 43148, 25824, 21149, 8196, 7502, -46240, -31742, 652, 32679, 46851, 25798, 8958, 1218, 7122, 16410, 613, -25997, -12457, 9015, 17321, -8251, -23445, 2581, -10196, 29183, 5191, -34239, -43217, -7233, -12324, 8090, 15810, -20215, -25401, -21350, -7114, -25155, -40764, -15584, 2267, 43627, 23149, 28625, 36423, 19791, -26787, -1909, -5525, -44057, -2860, -18422, -42612, -32974]
766c2974N7973j7555j1401p220K3572K3663j721j0587K4971o3318K677K4446J089
753A3615N734j4591Q847k1558o885N2808k3274M02K8908j3131j1878l6558L1834
740A4273k2304n905J2481k683L203N185j750R808L948j2731J3050j0445j812l732
726E86J1914J3126P373l532K3942r243l1108K8026j3005k8342l664J04j5178J1823
712g178J4543j7066J5062k2367j2155K8383M0455k3708m096L4497l8268k0222
700a2120M4851M956j9265k1501K536J3918M596n435M2860j49k2522l4962J5199
687A2962M4339l162N06m2980n3480K0441J8607L2652J5427l3019j9009j4112N1944
674C1116m2585L4128j591n26L7275m8698J5016J3254j9269J1072k5446n296p686
$$ y = [-32974, 24999, 7444, -3957, -11177, 12395, 36058, 34337, 23750, 48721, -14597, -11920, 12526, 13615, 19349, 4758, 13605, -7953, -14838, 37970, 14696, 15098, 44006, 30875, 18997, -17561, 14273, -8031, -13936, -1455, -4138, -935, 4250, 2500, 12308, 16256, 3525, 16575, 6130, 4318, 586, 12500, 25626, 32999, 29467, 53409, 44166, 13058, 41084, 28079, -263, -3927, -3823, -19001, -7178, 7365, -9701, 5361, -17006, -29161, -778, 39677, 15969, 11873, 46370, 8102, -12120, 32731, 37687, 18422, -3079, -543, 13375, 17971, 12536, 55396, 55247, 32725, -2237, 12962, 57301, 54139, 54645, 11665, -41815, -21374, -2767, 29885, 45312, 12293, -6716, -20828, 31116, -11469, 22659, 21068, 20542, 57817, 9119, 24135, 37389, 18120, 29192, 3746, -1550, -9236]
661i236J41K9494j0380K0414j5303R728j7990k4730J3159K9117k114j337k6167
648e204n4O009J286N897Q995l2982N302K522j0458m316L1281K9947q589k6439
634C197J4957P445l2712k5635J8517Q458r686K7408j9753Q621K3503L8473K0157
621H2950k5737p502J5569j8146k5324k6043N806L1359O722k4978N331Q643J9353
608D8003l7440M5139l449l0332n0342j2519K9354N4614J1556m191j6098j9537
596A4758K3556k2292m270J2249n670Q527q764N762K8396K9395l499l079k5431
583D9638k2419J2029k841m6105M8443k8659J0816p736l0931K6381O082j339R336
570B2695l3141j4134L0172J3901J5793L2585m5085o1204M3904J003L3543k929
$$ y = [-9236, -9095, 20399, 10019, 30433, 15130, 24858, 6868, -17862, -4703, 24414, 22300, 20963, -5204, -5258, 751, 2037, 7934, 16929, -16053, -10751, -8229, -18687, -23003, 8278, 38225, 29636, 3197, 18154, 25599, -7113, -32748, -14231, -5773, -15459, 11949, -7804, 817, 24320, 62793, 82950, 57213, 49711, 65280, 47134, 21810, -4233, 1573, 32932, 39654, 14676, 20007, 28650, 48003, 10563, 55702, 52253, 21921, -28421, -40940, -11586, 43028, 54584, 50393, 34295, 14758, 38314, 16022, 11752, 24001, 18331, 26858, 18094, 23856, 52252, 81647, 78148, 75069, 49638, 27219, 39248, 36407, -9698, 38745, 10086, 20902, 13166, -17765, 8616, 14698, 13359, 22695, -10446, -24580, 5592, 19493, 35286, 67871, 22786, -38418, 5486, 6489, 40032, 37103]
558C7103K2944n1126l969K3026M375j6329k6454K4901r554L4963k24k3028L846
545B0474O24o86j0840K8666k6153M005n669N6346j2350l7293o105L1809O158l5309
531A3677j7108J3383j8462J0010L0319J2042j243K485o516J1772m6476k8206K5901
518A578R727L2592j2101l398O274j334j5789p503J1341K119k3915O866Q663L3378
504D8498j5636k9349J461k9992J3466J5193j0961K0074M643O638q61J1628L9892
491G4694q297k0103k3849k4191p586L8704l5659O578O1069j6055j9805J2046Q408
478D5954j65k0683m840j8614P294k358J3185J5953m2773M3316j9894N066m5731
465b4290k3818L8189J1991J0020n618J7715K0551o758m02N333k5575J0256J0302
$$ y = [37103, 60047, 8921, 4952, 27978, 32353, 16024, -10430, 14471, 4917, 39880, 39656, 16628, 20474, 21098, 20412, 9572, 38238, 12085, 16090, 10421, 66767, 54417, 17124, 11019, 42828, 48986, 13677, -3431, 9952, -8510, 1500, 31819, 43861, 42618, 45103, 38587, 50359, 3883, -24323, 1578, 11305, 43897, 31796, 28398, 34672, 33338, 17549, 10046, 21387, 23506, -409, 6457, 15120, 48498, 32862, 3513, 4974, -25018, -11552, 3641, -7320, 12754, 17397, 24035, 23174, 34802, 74694, 66397, 46294, 22445, -1746, -9332, 29372, -6287, 291, 61360, 45305, 25500, 37546, 45954, 45789, 25106, 20266, 1652, 8946, 6588, 19773, 35726, -7047, 36269, 16375, 21441, -24290, -48108, -9919, 2072, 12092, 6474, 24189, 44740, 37982, 37580, 42913, 17338, 27594, 37896]
452C7896J6202m782j4692m845J1846P390k1579n8230J5259k4849K4957N8202J2588
439E5363j0202j4494j4009m54N5538l0576n1172L936L5261k2608m1275l4660L0250
426c9102K4819L3036J6823J2848J1421j968j9447M7797k8664j0855k514m2643
414A551K0285P855R824J0277j4257J3460j4580j2387P1K4760P699j0416o11n712
400C7819K0214l779q965P364K461J830l1559O617j9196N018J1908K2199J3397
387F5328k3808J2402k775j7080K5477K155l6114L4758L8830o5407J6498K7038
375G7302k7383l4701Q236K7551m2269J822J6327K9648l7722J4002m164j3960K9632
362D4321N3496k4030k7968L480q094N610M628j7592J894Q623p516J590o153k2085
$$ y = [37896, 54098, 49316, 34624, 29779, 41625, 49015, 27436, -30794, -15535, -40384, -15427, 42775, 55363, 45161, 30667, 16658, 16204, 71742, 41166, -10006, -6070, 29191, 6583, -34692, -69352, -39102, -14283, 18753, 35576, 48424, 59845, 57877, 38430, 86227, 57563, 46708, 44194, 1551, 21836, 29691, 39515, 49792, 35535, 48995, 34415, 22028, 22099, 46859, 54558, 44142, 43531, 37819, 58033, 54254, 45289, 52653, 55114, 56944, 25385, 32002, 12806, 17824, 29732, 51931, 65328, 41520, 53922, 51147, 34067, 59544, 61699, 25585, 60343, 99173, 33766, 50264, 77302, 49919, 15218, 23454, 51005, 8736, 10558, 26885, 56533, 18811, 32813, 28649, 14689, 44321, 97817, 73787, 45819, 49299, 41205, 46815, 51443, 33851, 35745, 44368, 36852, 38442, 32289, 10204]
348A0204J2644M8091j6348j498L6859j0180R006k8930L673K7908j2564j8119K3823
335H4569l6092j5526M876J8929R148N339O917j4095l7399k2474K4204l401l713
322B1282j3385k1467M4394L3470N520j6147m8898J6738K1876M203l4628k6436
310a3478L338L7608N894k8546K6488o116j453J4337j9939K7356j1861k2838M0492
297E1282K9472j3262k3069r653J7126k0741J5861K3685j3541M6010r695k9122
285F4353J7786J2975l8625j8068l391N112J5736l3457K6660K0816l5125n60N388
272C9600L6054R34o217J3000O464k8573k8118J8991K5343P763m5025L1348j9620
259E1944M273k3747l798K586L9421K4695p9936J0313J7136K6006k6837J5705p270
$$ y = [10204, 22848, 70939, 54591, 53093, 89952, 79772, 88778, 59848, 63521, 91429, 78865, 60746, 84569, 48477, 32951, 37827, 56756, 65904, 71243, 78160, 64065, 26666, 4192, 28396, 24995, 21282, 7897, -13570, 30824, 64294, 69814, 53667, 4769, 21507, 43383, 47586, 12958, -13478, -10140, 27468, 33362, 4816, 31304, 25188, 23735, 38072, 18133, 45489, 33628, 10790, 51282, 80754, 67492, 44423, 34770, 51896, 31155, 47016, 70701, 57160, 103170, 93475, 64353, 82139, 95114, 56489, 38421, 35030, 40142, 55878, 22421, 49081, 69897, 34772, 34212, 39600, 75654, 76588, 70371, 83371, 89835, 61262, 33144, 52135, 77478, 85241, 40216, 71564, 51944, 56217, 32470, 28672, 31258, 70679, 95374, 15438, 25751, 42887, 68893, 42056, 57761, 50491]
246E0491L9974L7830o2071l0870K6549p597J0997m504j8762K0648n1205J078J3354
233B5912J1754J4584J1195k478L600k1647o757J6881j7335l1948K3603J1630J0249
220D9243r199l4306m051J4981M0971N675n458j0774L452L0260J2317L606l4285
207F2432p088m987K7710j1943R26J3610l9428k9462L6756K3562l8044l2702N901
194G243O350J7697O421K3755k895k137P929L672J7895j0520O879l7562K6281N408
180G6416k6481p802J5265l395J6881j1520j8057J112K1281J0881m534k2860O871
167E4058Q463p154J384k741m734K3565n082r520m701j5556L3682k8654k9512K9511
153D3009K7240M436j7892k3298M958J6539j0234k1054j4261n474K6467K2306M3923
$$ y = [50491, 90465, 128295, 66224, 35354, 61903, 54306, 65303, 60799, 42037, 62685, 11480, 12558, 25912, 37666, 52250, 63445, 60967, 64567, 42920, 36163, 53044, 35709, 3761, 27364, 38994, 49243, 40044, 5738, 1687, 16668, 57639, 63314, 57856, 47082, 50534, 80794, 93111, 96717, 62432, 55344, 50357, 78067, 66124, 67050, 80660, 41232, 11770, 48526, 72088, 34044, 1342, 7243, 13593, 31290, 37711, 61466, 58571, 56434, 64363, 68035, 85930, 75410, 82289, 44727, 71008, 76416, 49935, 42133, 57398, 54003, 70884, 59364, 41307, 42419, 63700, 74581, 70047, 47187, 54058, 62521, 55367, 56751, 54010, 49276, 72841, 67759, 58239, 53538, 37982, 71664, 43010, 13498, 43009, 70249, 74685, 56793, 33495, 38453, 54992, 44758, 23704, 9443, 3969, 30436, 52742, 96665]
140I6665k2154k8968r000N461K2654R574K3388O533k6182J6436q695j6329j0061
127E9322r632L3564K002J9969j0592j9801l3676j824j5864M9981N166l7377q957
114C2281J5480R755J1902k3146j1044L5177K2949j1842l2772j6816j0995L3316
102E4245k0905q12J8168k8168m415J5849M0038R124k1675k590j629r314L763J423
88E3102j9566Q912J7414L471J428j5722j036j3100m722j7469N850L5851J7265
75G1678K5232m1107J4091j7368M159L2070k525j5335j3695j2791J7655N29j0268
62E2325p668L9996N041j0018k5773l266Q688J436J1618j2931J3880j8402J8560
49G3486K2972k0752P024L218j0118p327p683L774k9255R442J1843k3254J9623
$$ y = [96665, 74511, 45543, 36543, 42004, 64658, 74232, 97620, 104153, 77971, 94407, 85712, 69383, 59322, 49690, 83254, 85256, 105225, 94633, 74832, 41156, 39332, 23468, 73449, 78615, 41238, 32281, 47761, 57516, 69418, 46272, 35228, 70405, 93354, 81512, 48740, 31924, 20929, 54245, 33340, 32528, 50696, 22528, 18113, 33962, 74000, 83124, 61449, 58859, 57230, 47916, 51679, 53102, 33536, 42448, 59862, 63333, 64761, 49039, 48003, 34903, 30181, 12712, 18562, 54413, 71678, 96910, 55803, 69894, 52526, 56685, 88755, 86230, 70895, 57200, 44409, 62064, 62593, 52325, 44657, 84653, 89694, 79676, 53903, 50637, 59325, 60761, 72379, 59448, 73328, 54926, 73486, 96458, 75706, 82730, 85948, 75830, 68503, 60820, 64594, 35339, 44781, 56624, 33370, 52993]
36E2993J7768R275m4267J3902L4907j7086R320j5638K0633M953o815j5017j4712
23E0216J239M875J4255l3334N53K1732K2020K887l4272N134J4874q065Q840j14
9G0840j4019j1510p821K439K4686O812k578M408k3002
0E0255
$$ y = [52993, 70761, 80036, 35769, 49671, 84578, 67492, 76812, 61174, 81807, 86760, 79945, 64928, 50216, 51455, 56330, 70585, 37251, 37804, 59536, 81556, 84443, 50171, 55305, 70179, 62114, 70954, 70840, 56821, 45311, 37490, 39929, 64615, 71427, 68849, 73257, 50255]
$$ Imaginary data points
##PAGE= N=2
##DATA TABLE= (X++(I..I)), XYDATA
16383a134729J3332R678K1347m5137k799L4867J6099O1516K4207J3094J5416j190
16371i74299P960J1136K3525K9615K4068J532q181K253j7113K9628K9044O2496
16359g78336n706J8255L3529K3188J3653m057R68L2576M764l6609J5084K1925
16347f60766K2867M242Q773L0898K8592K6825k7380j748M4632O298R550J5900
16335d91317L0801K7938K1622K4274M635R323K4301j0734J6222j6192J4769L7576
16323c06782n437j3354J9111L3343o249K3528J3290L857J9800K1464l619L7295
16311a63753N999K9333J1969j6789L0J6154L4254K761J8460o736l890K5987L0366
16298a5855J8173Q61J6511K0523m336J2821J2883J2997L0445r244K2302O633L106
$$ y = [-1134729, -1121397, -1111719, -1090372, -1135509, -1138308, -1103441, -1087342, -1025826, -1001619, -988525, -973109, -974299, -966339, -955203, -931678, -902063, -877995, -876463, -884644, -882391, -899504, -869876, -840832, -778336, -784042, -765787, -732258, -709070, -695417, -699474, -698506, -665930, -661166, -697775, -682691, -660766, -637899, -633657, -624884, -593986, -565394, -538569, -565949, -567697, -523065, -516767, -507217, -491317, -460516, -432578, -410956, -386682, -382047, -372724, -348423, -359157, -342935, -359127, -344358, -306782, -312219, -325573, -306462, -273119, -279368, -255840, -242550, -238693, -218893, -197429, -201048, -163753, -157754, -128421, -116452, -133241, -133211, -117057, -82803, -80042, -61582, -68318, -72208, -46221, -15855, 2318, 3179, 19690, 40213, 35877, 48698, 61581, 74578, 105023, 95779, 118081, 124714, 127820]
16285A27820j196k3229K4777L6040L7997j2536J8485j6953K5245M8574k4807j1753
16273B28464K3445K3398j394K1357n2293J4871K6982L1686P072j2044J5377N524
16261C32445J4318K4669L4603k29k4389L663K7598n984J7105K0130K0951K7142
16249D92022j4289k213K7347j9506R658M7435R885k2106k9772N0186K5829m0979
16237E33497J311J6128N521J5862K7321J5379k666j2972j612K2350L5183J6902
16225F72204l1442J204M4799K2253K0544J2499m4827k9901L2544l276K4634k2767
16213F98468L1919J5798k5039l799M6046O77l5205k4417M1961L9261P654M318
16201G97642j1347K0976j4648K9878k6135m7467N2905J9565r712K3934J619j6131
$$ y = [127820, 126624, 103395, 128172, 164212, 202209, 189673, 208158, 191205, 216450, 265024, 240217, 228464, 251909, 275307, 273913, 295270, 242977, 257848, 284830, 316516, 323588, 311544, 326921, 332445, 346763, 371432, 406035, 405806, 381417, 385080, 412678, 406694, 423799, 443929, 464880, 492022, 477733, 475520, 502867, 483361, 493019, 540454, 550339, 528233, 498461, 548647, 574476, 533497, 534808, 550936, 556457, 572319, 599640, 615019, 612353, 599381, 597769, 620119, 655302, 672204, 640762, 641966, 686765, 709018, 729562, 742061, 697234, 667333, 699877, 696601, 721235, 698468, 730387, 746185, 721146, 717347, 763393, 764070, 728865, 704448, 746409, 785670, 793324, 797642, 786295, 807271, 792623, 822501, 796366, 748899, 801804, 821369, 811657, 835591, 837210, 821079]
16189H21079L1594K5065j2465l2007L0065L1061k465j0008J4154l5227j6984L6210
$$ y = [821079, 852673, 877738, 865273, 833266, 863331, 894392, 891927, 881919, 896073, 860846, 843862, 880072]
$$ [...]
##END NTUPLES=NMR SPECTRUM
##END=
