##TITLE=1H_71-2028
 200.13Hz, CDCl3.
 8 sc
4.8.2026
##JCAMPDX= 6.0         $$ Bruker NMR JCAMP-DX V2.0
##DATA TYPE= NMR FID
##DATA CLASS= NTUPLES
##ORIGIN= UXNMR, Bruker Analytische Messtechnik GmbH
##OWNER= pz
$$ XWIN-NMR		Version 3.5
$$ Tue Aug  4 13:39:14 2026 Russian Standard Time (UT+4h)  she@DPX200
##.OBSERVE FREQUENCY= 200.1313
##.OBSERVE NUCLEUS= ^1H
##.DELAY= (6, 6)
##.ACQUISITION MODE= SIMULTANEOUS
##.ACQUISITION SCHEME= undefined
##.AVERAGES= 8
##.DIGITISER RES= 18
##SPECTROMETER/DATA SYSTEM= spect
##.PULSE SEQUENCE= zg30
##.SOLVENT NAME= CDCl3
##.SHIFT REFERENCE= (INTERNAL, CDCl3, 0, 14.3821)
##AUDIT TRAIL= $$ (NUMBER, WHEN, WHO, WHERE, WHAT)
$$ ##TITLE= Audit trail, XWIN-NMR		Version 3.5
$$ ##JCAMPDX= 5.01
$$ ##ORIGIN= Bruker BioSpin GmbH
$$ ##OWNER= she
$$ F:/spectra/data/she/nmr/H-C/1/audita.txt
$$ ##AUDIT TRAIL=  $$ (NUMBER, WHEN, WHO, WHERE, WHAT)
(   1,<2026-08-04 13:37:58.51 +0400>,<she>,<DPX200>,
      <created by zg, POWCHK disabled, PULCHK disabled
       configuration hash MD5:
       00 E9 B6 7A A2 85 ED C7 34 08 36 98 17 FE 4E 26
       data hash MD5: 16K
       A2 8A 46 DC 37 02 12 78 49 E3 97 4C 86 6D 2E 5D>)
$$ ##END=
$$ 
$$ hash MD5
$$ E7 D2 FA D6 45 96 4B 7B 37 CC 65 E9 98 89 C6 FC
##$RELAX= 
##$RELAX= 
##$RELAX= 
##$RELAX= 
##$RELAX= 
##$RELAX= 
$$ Bruker specific parameters
$$ --------------------------
##$DU= <F:/spectra>
##$EXPNO= 1
##$NAME= <H-C>
##$PROCNO= 1
##$TYPE= <nmr>
##$USER= <she>
##$AMP= (0..31)
100 100 100 100 100 100 100 100 100 100 100 100 100 100 100 100 100 100 
100 100 100 100 100 100 100 100 100 100 100 100 100 100 
##$AQSEQ= 0
##$AQ_mod= 1
##$AUNM= <au_zg>
##$AUTOPOS= <>
##$BF1= 200.13
##$BF2= 200.13
##$BF3= 200.13
##$BF4= 200.13
##$BF5= 200.13
##$BF6= 200.13
##$BF7= 200.13
##$BF8= 200.13
##$BYTORDA= 1
##$CFDGTYP= 0
##$CFRGTYP= 5
##$CHEMSTR= <none>
##$CNST= (0..31)
1 1 145 1 1 1 1 1 1 1 1 1 1 1 1 1 1 1 1 1 1 1 1 1 1 1 1 1 1 1 1 1 
##$CPDPRG= <>
##$CPDPRG1= <>
##$CPDPRG2= <>
##$CPDPRG3= <>
##$CPDPRG4= <mlev>
##$CPDPRG5= <mlev>
##$CPDPRG6= <mlev>
##$CPDPRG7= <mlev>
##$CPDPRG8= <mlev>
##$CPDPRGB= <>
##$CPDPRGT= <>
##$D= (0..31)
0 0.7 0 0 0 0 0 0 0 0 0 0.03 0 0 0 0 0 0 0 0 0 0 0 0 0 0 0 0 0 0 0 0 
##$DATE= 1785836277
##$DBL= (0..7)
120 120 120 120 120 120 120 120 
##$DBP= (0..7)
150 150 150 150 150 150 150 150 
##$DBP07= 0
##$DBPNAM0= <>
##$DBPNAM1= <>
##$DBPNAM2= <>
##$DBPNAM3= <>
##$DBPNAM4= <>
##$DBPNAM5= <>
##$DBPNAM6= <>
##$DBPNAM7= <>
##$DBPOAL= (0..7)
0.5 0.5 0.5 0.5 0.5 0.5 0.5 0.5 
##$DBPOFFS= (0..7)
0 0 0 0 0 0 0 0 
##$DE= 6
##$DECBNUC= <off>
##$DECIM= 32
##$DECNUC= <off>
##$DECSTAT= 4
##$DIGMOD= 1
##$DIGTYP= 9
##$DL= (0..7)
0 120 120 120 120 120 120 120 
##$DP= (0..7)
150 150 150 150 150 150 150 150 
##$DP07= 0
##$DPNAME0= <>
##$DPNAME1= <>
##$DPNAME2= <>
##$DPNAME3= <>
##$DPNAME4= <>
##$DPNAME5= <>
##$DPNAME6= <>
##$DPNAME7= <>
##$DPOAL= (0..7)
0.5 0.5 0.5 0.5 0.5 0.5 0.5 0.5 
##$DPOFFS= (0..7)
0 0 0 0 0 0 0 0 
##$DQDMODE= 0
##$DR= 18
##$DS= 0
##$DSLIST= <SSSSSSSSSSSSSSS>
##$DSPFIRM= 0
$$ [...]
##$SUBNAM0= <"">
##$SUBNAM1= <"">
##$SUBNAM2= <"">
##$SUBNAM3= <"">
##$SUBNAM4= <"">
##$SUBNAM5= <"">
##$SUBNAM6= <"">
##$SUBNAM7= <"">
##$SUBNAM8= <"">
##$SUBNAM9= <"">
##$SW= 18.0517328524113
##$SWIBOX= (0..15)
0 0 2 0 0 0 0 0 0 0 0 0 0 0 0 0 
##$SW_h= 3612.71676300578
##$TD= 16384
##$TD0= 1
##$TE= 0
##$TE2= 300
##$TE3= 300
##$TEG= 300
##$TL= (0..7)
0 120 120 120 120 120 120 120 
##$TP= (0..7)
150 150 150 150 150 150 150 150 
##$TP07= 0
##$TPNAME0= <>
##$TPNAME1= <>
##$TPNAME2= <>
##$TPNAME3= <>
##$TPNAME4= <>
##$TPNAME5= <>
##$TPNAME6= <>
##$TPNAME7= <>
##$TPOAL= (0..7)
0.5 0.5 0.5 0.5 0.5 0.5 0.5 0.5 
##$TPOFFS= (0..7)
0 0 0 0 0 0 0 0 
##$TUNHIN= 0
##$TUNHOUT= 0
##$TUNXOUT= 0
##$USERA1= <user>
##$USERA2= <user>
##$USERA3= <user>
##$USERA4= <user>
##$USERA5= <user>
##$V9= 5
##$VALIST= <valist>
##$VCLIST= <CCCCCCCCCCCCCCC>
##$VD= 0
##$VDLIST= <DDDDDDDDDDDDDDD>
##$VPLIST= <PPPPPPPPPPPPPPP>
##$VTLIST= <TTTTTTTTTTTTTTT>
##$WBST= 1024
##$WBSW= 4
##$XGAIN= (0..3)
0 0 0 0 
##$XL= 0
##$YL= 0
##$YMAX_a= 680920
##$YMIN_a= -697611
##$ZGOPTNS= <>
##$ZL1= 120
##$ZL2= 120
##$ZL3= 120
##$ZL4= 120
##$ABSF1= 10
##$ABSF2= 0
##$ABSG= 5
##$ABSL= 3
##$ALPHA= 0
##$AQORDER= 0
##$ASSFAC= 0
##$ASSFACI= 0
##$ASSFACX= 0
##$ASSWID= 0
##$AUNMP= <proc_1d>
##$AZFE= 0.1
##$AZFW= 0.1
##$BCFW= 1
##$BC_mod= 2
##$BYTORDP= 1
##$COROFFS= 0
##$CY= -3
##$DATMOD= 1
##$DC= 2
##$DFILT= <>
##$DTYPP= 0
##$F1P= 0
##$F2P= 0
##$FCOR= 0.5
##$FTSIZE= 0
##$FT_mod= 4
##$GAMMA= 1
##$GB= 0.15
##$INTBC= 1
##$INTSCL= 1
##$ISEN= 128
##$LB= 0.25
##$LEV0= 0
##$LPBIN= 0
##$MAXI= 10000
##$MC2= 0
##$MEAN= 0
##$ME_mod= 0
##$MI= 1.114404
##$NCOEF= 0
##$NC_proc= 0
##$NLEV= 6
##$NOISF1= 3.799351
##$NOISF2= 2.8
##$NSP= 1
##$NTH_PI= 0
##$NZP= 0
##$OFFSET= 14.38212
##$PC= 1
##$PHC0= -4219.682
##$PHC1= 10.9923
##$PH_mod= 1
##$PKNL= yes
##$PPARMOD= 0
##$PSCAL= 0
##$PSIGN= 0
##$REVERSE= no
##$SF= 200.129724274929
##$SI= 16384
##$SIGF1= 3
##$SIGF2= 2
##$SINO= 400
##$SIOLD= 16384
##$SREGLST= <1H.CDCl3>
##$SSB= 0
##$STSI= 0
##$STSR= 0
##$SW_p= 3205.1282051282
##$SYMM= 0
##$S_DEV= 0
##$TDeff= 0
##$TDoff= 0
##$TI= <>
##$TILT= no
##$TM1= 0
##$TM2= 0
##$TOPLEV= 0
##$USERP1= <user>
##$USERP2= <user>
##$USERP3= <user>
##$USERP4= <user>
##$USERP5= <user>
##$WDW= 1
##$XDIM= 8192
##$YMAX_p= 0
##$YMIN_p= 0
$$ End of Bruker specific parameters
$$ ---------------------------------
##NTUPLES= NMR FID
##VAR_NAME=  TIME,          FID/REAL,        FID/IMAG
##SYMBOL=    X,             R,               I
##VAR_TYPE=  INDEPENDENT,   DEPENDENT,       DEPENDENT
##VAR_FORM=  AFFN,          ASDF,            ASDF
##VAR_DIM=   8192,          8192,            8192
##UNITS=     SECONDS,       ARBITRARY UNITS, ARBITRARY UNITS
##FACTOR=    0.0002768,     1,               1
##FIRST=     0,             0,               0
##LAST=      2.2672688,     0,               0
##MIN=       0,             -697611,         0
##MAX=       2.2672688,     680920,          0
$$ Real data points
##PAGE= N=1
##DATA TABLE= (X++(R..R)), XYDATA
$$ [...]
1761i00Q85O49j748J555Kj283J323k23n15O75o49J88M22r60R58r6j068J224l01
1780A38j050J903j210l79J428j226L07Q65j239N43K94r20R01m13k98J018j052
1797c90J56P63j291O51P23j509J285Q3j130J137J6j292J313o15k59Q75p85M26
1815A57L8q43J159p24n66J310p33m24J257j241K54J162j245M50N76r02R06k36
1833C55o22Q93j076L27O94j213N29N27j485J200K10j293J304K4q73J252o76k52
1851a75O71p07K57L86q92R07k26q78R64n27n86J410j296J64J069j092L23R07j337
1870f58J190N0r69Q79o98K05N75r87M48M64j252R51j30j240J322kr72J268n21
1889g7l77Q41n80L22N31q42P82j89n30Q18q13k72J169j308J21R26j291M44P17
$$ plain form
1761 -900 -15 634 -1114 441 443 -840 483 260 -255 420 -229 -41 381 -579 379 283 -785 439 138
1780 138 -912 991 -219 -598 830 -396 -89 776 -463 80 374 -546 355 -58 -356 662 -390
1797 -390 -234 529 -762 -111 612 -897 388 471 -659 478 494 -798 515 -100 -359 516 -269 157
1815 157 195 -648 511 -213 -779 531 -202 -626 631 -610 -356 806 -439 11 587 -315 591 355
1833 355 -267 626 -450 -123 571 -642 -113 414 -1071 129 339 -954 350 374 -499 753 77 -175
1851 -175 496 -211 46 432 -460 447 221 -657 307 -220 -806 604 -692 -528 541 -551 -228 679 -658
1870 -658 532 582 -387 492 -206 -1 574 -413 35 499 -753 198 68 -1172 150 148 -824 444 -77
1889 -77 -454 387 -193 129 660 -182 600 411 -119 699 -114 -386 783 -525 -404 522 -769 -325 392
1908C92r70O28K72r54J097j93l55O79p93K34O49j091P91O5j139J186l98j058J498
1927E40p14l43R62o41r7P66p66M99K43p92R84m93l59Q64j183J88R40j167M16Q05
1947F52j417P65L59q57Q74j58n46P33o53K08N66n98M22M7r52J102m05j001J269
1966D10m23n63J146r65P2P91q11J99N54q03O59k08m44J079j000R4P51r31K02N42
1986C51q38O99J82j186J130k85m06P24l02m25P39n61L7N23r89P35l6p49J158n38
2006c7n43J341j120J20R86r22K42O26r93N16p1m08Q15p92j4Q70j328P53M95r85
2026d49O99L67j359J072%j095J245k91l75O94n42M4L61p92M85J4o82J243q09k60
2046d30J078j045lQ92q31J66R93j229N92K92q97N85j06j33M96q86M83K78q57Q07
$$ plain form
1908 392 -578 50 322 -632 465 272 -83 596 -197 37 686 -405 386 451 -688 498 100 -958 540
1927 540 -174 -517 445 -196 -293 473 -293 206 449 -343 641 148 -211 653 -530 -342 598 -569 -153 652
1947 652 -765 0 359 -498 376 218 -328 405 -248 -40 526 -72 350 397 -555 547 142 -859 410
1966 410 -13 -576 570 -395 -323 468 -343 -144 410 -393 266 58 -386 693 -307 -213 538 -393 -191 351
1986 351 -487 212 394 -792 338 53 -353 371 69 -356 383 -178 -141 382 -607 128 92 -657 501 -37
2006 -37 -580 761 -359 -239 747 -175 67 693 -300 216 145 -263 552 -240 -254 616 -712 41 536 -449
2026 -449 250 617 -742 330 330 -765 480 189 -186 508 -34 10 371 -421 64 78 -604 639 -170 -430
2046 -430 648 -397 -400 492 -339 -173 820 -409 183 475 -422 163 57 -76 420 -466 17 295 -562 245
2066B45Q0j188J174M3q38Q92j51n36P84m29KL84o51K92J61r19Q33l48k63P48q36
2087e21J32P32q48N23P01j090N86L73q08O67j00o17O15k97k21J93o03O81J9o57
2107e40P43j58q00J091j68o66J161o29k23O55n14N3L85n59O35l78n23P72o77K6
2127c14N72p93L94N97r57O52K64q71P53j26n08R96l87l15J71n04N25J82p53Q27
2147D05l20p80J141n74o19J049n02q5R09q82K72L86p78N28J2l14M86l67l14O48
2167C01q80P06K66j182P08M48r06O25J66q51J212n20l78O19n55K30L92o96M39
2186A44r7n88J108p01m61R87o65j12Q46q96M16O47r93M40K65o35O26l59k4N62
2206E10q95K47M20r47P43J29p94Q51J39r29P38j43o17J046o31l3N26o71L72k41
$$ plain form
2066 245 325 -863 311 354 -484 408 257 -279 505 76 78 462 -189 103 264 -655 178 -170 -433 315 -521
2087 -521 -389 343 -505 18 719 -371 215 588 -220 447 347 -270 345 48 -173 20 -583 98 117 -540
2107 -540 203 45 -755 336 168 -498 663 34 -189 466 -48 5 390 -169 466 88 -435 337 -340 -314
2127 -314 258 -535 -141 456 -501 151 415 -456 297 171 -337 659 272 -43 128 -376 149 331 -422 405
2147 405 85 -695 446 -128 -747 302 -200 -285 624 -258 14 400 -378 150 162 -152 334 -33 -347 301
2167 301 -579 127 393 -789 -81 367 -539 86 252 -599 613 93 -285 334 -221 9 401 -295 144
2186 144 47 -541 567 -134 -595 392 -273 -385 461 -435 -19 628 -365 75 340 -295 331 -28 -52 510
2206 510 -385 -138 282 -665 78 207 -587 264 403 -526 212 69 -548 498 -133 -166 360 -311 61 -180
2226a80l51J089p95j1R39j018r5J021j051L24Q34j066N06J56p70O17r2j79O18
2245D96q95K00N01q36Q06K9p38Q44l2r39J168o06k92O03j69j75M75n85P4K66o17
2266d22O26m16j25O30n13R2N92o59L9O62j017M31N60q19N50K7n21M90o30L66L34
2287B77p92N59J79p56R41j20o69R78l89p54J111m31l49P05p63J43M33p67O37m04
2307b31l75P09l48o8O18q01N43L76q30P48M41j169P72P3q45P60m81k48O35n11
2327b32O9K99p02Q52k76n01Q80m85k09R29p51j70Q11l69j77N03q06N77k63l69
2347c90N29j93j33M69p39L56L38q75P76J02o56P27j86n97O78l61Q2N44l98q5K86
2368B74o58M92j22m06O15m31k17R03n16k26R11p82OO82q71L60K78m34L06l23p2
$$ plain form
2226 -180 -531 558 -237 -248 691 -327 -422 599 -452 -128 706 -360 146 302 -468 149 57 -122 496
2245 496 -399 -199 302 -534 272 301 -437 407 375 -564 604 -2 -294 309 140 -35 440 -145 -71 195 -422
2266 -422 204 -212 -337 293 -220 -128 464 -195 -156 506 -511 -80 480 -339 211 238 -283 207 -423 -57 277
2287 277 -515 44 223 -533 408 288 -381 597 208 -546 565 134 -215 490 -273 -130 303 -464 173 -231
2307 -231 -606 103 -245 -313 305 -496 47 423 -407 341 782 -387 385 458 -387 373 -108 -356 279 -232
2327 -232 -163 136 -566 286 10 -491 389 -96 -305 624 -127 -297 514 145 -32 471 -335 242 -21 -390
2347 -390 139 -54 -187 282 -457 -101 237 -638 138 240 -416 311 125 -472 206 -155 -73 471 73 -12 274
2368 274 -384 108 -14 -420 195 -236 -453 450 -66 -292 619 -163 -157 525 -346 14 292 -142 164 -159 -231
2389b31N15o23K92O9k33L14J7n40Q04j3q55Q35l66k06Q57o70K5K03l94L32l6l63
2411b67M74l62j17N29o98M04O28r73K13N79q31M52K14n96L90j3k54N69n09J37
2431c1K84p94O53N2n07N65k70k87L98N2m97P31l58k19M19m11K49K89n77L94p4
2452F1l66N15m97k5O61n20J55K10o17L46M41o60N01j74k78N89m17j82K75l32O04
2473B90j52m58O61l4n68O50l50m12Q17n62J40M13o66J09L27m02J92L5l68P03n57
2494a92n8P04p67L09K31k78J81O8m97N72J64p72P74m28n7L33n72NK63k76M98k72
2516f7j27N14q5l55O20p79J85P10r82J36M97o22L73N1k68M26j38k79L98o72M81
2537A7K04n77O49Nq59J019k54m07M43j44j39L26k70k04K69m16L06O5m47N74k40
$$ plain form
2389 -231 284 -339 -47 22 -211 103 120 -420 384 371 -484 351 -15 -221 636 -34 -9 194 -200 132 96 -267
2411 -267 207 -155 -272 257 -441 -37 591 -382 -169 410 -421 31 245 -351 39 26 -228 341 -168 -31
2431 -31 253 -541 112 164 -343 222 -48 -335 63 115 -382 349 -9 -228 191 -220 29 318 -259 135 61
2452 61 -305 210 -287 -312 349 -171 -16 194 -423 -77 364 -296 205 31 -247 342 -75 -257 18 -314 290
2473 290 138 -320 341 307 -261 389 39 -373 444 -118 22 435 -231 -122 205 -197 -5 30 -338 365 -192
2494 -192 -250 454 -313 -4 227 -51 130 198 -299 273 437 -335 439 11 -46 287 -285 -280 -17 -293 205 -67
2516 -67 -194 320 235 -120 500 -279 -94 616 -366 -230 267 -355 18 69 -199 227 89 -190 208 -464 17
2537 17 221 -356 293 298 -561 458 204 -203 240 96 -43 283 13 -191 78 -338 -32 33 -414 160 -80
2558h0k96Q88n71jM71o22J11O04o87K88L6j24J65j80l28O44l41j95J80k23L44
2579H3J03l90L59q2l95N31n4m60O16m91%L84k66J9O6k16J93j46o6N57m72j65N65
2602B73l49K7K21m09L53kj53J77o7l93M78l37M0L35l71J67J03l20M58kn27O70
2624C72l35j78M15k60k03M84m88L96On11M89J8m19L68l97j50P02n24Q4M29m48
2645a50K36J87m85K51J1j84L04m4j96M41p45J50L91l74J48K38l52N79m28j65M56
2666B69j67l07N28l50k90M73o31O21k08j69O34n34O4J52l03J78K51m30K19K65
2686B65n65L38J69l18K80l11N0K92l09J98K78m80L99j48m80P16m73j85O67l61
2706B2j83N18m34j5K78l56J55J39m10L55l6j52K53j91J70J45m23J92K41o04P03
$$ plain form
2558 -80 -376 512 -59 -60 411 -211 -100 504 -183 105 141 17 182 2 -326 318 -23 -218 -38 -261 83
2579 83 186 -204 155 73 -322 209 155 -305 311 -180 -180 204 -62 -43 23 -193 0 -146 -212 345 -127 -292 273
2602 273 -76 -49 172 -237 116 114 -39 138 71 -322 156 -181 -141 194 -177 -10 93 -227 231 229 -298 372
2624 372 37 -141 274 14 -189 295 -193 203 209 -302 187 205 -214 154 -243 -393 309 -215 -131 298 -150
2645 -150 86 273 -212 39 50 -134 170 126 -70 371 -374 -224 167 -207 -59 179 -173 406 -22 -187 269
2666 269 102 -205 323 -27 -317 156 -475 146 -62 -231 403 -131 -67 85 -218 -40 211 -219 0 265
2686 265 -300 38 207 -111 169 -142 -92 200 -109 89 367 -113 286 138 -342 374 -99 -284 383 22
2706 22 -161 357 -77 -92 186 -170 -15 124 -286 69 33 -119 134 -57 113 258 -165 27 268 -336 367
2727C67p6p00N13j09j49M79l33k50N05k66J00K5j60K64k59j79N81m37l6L34l39
2748a25K31N6m05K17L7j39L46k34k84M42l61K08R3m70N13J16j52P1j54p3K37j35
2770C5l60L39O6j22Nk08K96j2l15L87l5k40M19k64J1L00l97J9N04n26J33K18m86
2793b33L52l32O5J49m9lK70n05L52N1l83O29r5l93L55j02l83M31j55j20L60n31
2815b70K59m3j19J54N9k59N31k25k17M82l04kK12m31K66J30j83K09k4k47K59j08
2837A29l70K94k38L2J65j35L10j19l67N02o9j95N69n26LK44j68o5J87k99P4J09
2859F7j35K89j92J45J11l33J97K48m38l3K03l50M06K5j95J1k53R8K93l83J35Q8
2881Dj40J66Kj79K62j34qK08k95Q1K96l97J14Q8J30l57K39k31L32j61k0J82l86
$$ plain form
2727 367 291 -409 104 -5 -154 325 -8 -258 247 -19 81 106 -54 210 -49 -228 353 -84 -120 214 -125
2748 -125 106 162 -243 -26 11 -128 218 -16 -300 142 -219 -11 82 -388 125 241 89 160 6 -67 170 35
2770 35 -325 14 80 -42 -37 -245 51 39 -276 111 76 -164 255 -9 2 302 -95 -76 428 -98 35 253 -233
2793 -233 119 -213 -148 1 -48 -51 219 -286 66 117 -266 363 268 -125 230 128 -255 176 21 -99 261 -270
2815 -270 -11 -54 -173 -19 40 -219 312 87 -130 352 48 46 258 -173 93 223 40 249 225 -22 237 129
2837 129 -241 53 -185 -153 12 -123 187 68 -299 203 134 -61 508 -18 -15 229 61 -4 183 -116 -42 67
2859 67 -68 221 29 174 285 -48 149 397 -41 -74 129 -221 185 210 15 26 -227 -129 164 -219 -84 4
2881 4 -136 30 32 -147 115 -19 -27 181 -114 -33 263 -134 -20 68 198 -159 80 -151 181 20 0 182 -204
2904b04K61J59m07J60K82n58L08J55j86J07jj66L02l50R0O0j97K77R7k38J08L
2926F2q2L06k93q8L94l41j9K48l22j69N17j80K3k3j95L94k57j41M66l28m8J50
2948G4k02N5K76l50N1j57j23N06m9k99K94k81J80K84k74J38K11m03J34qN5K3k31
2971i6L1K79l50O1K41m35K16J10k21J55Q6r2J40k19J45J49k06K28p8l34L05p8
2993C7k05L64k63J2J90k86k7K06k19L40r5j74N7p8j5L17j34J43pj63R4l0j32n3
3017a21K64k23j5J05j50K99l22Q3J62j70K0L29p1N9k31N5k6P1m79O28l22j82L11
3040G4l09J60J11m22M47Mk68O10l22j96L10j75M7J69l47K35J6l63O4K02k06K92
3062A33q4p4Q7p7Qj61q7L22J27k45K34k07J05J01l41o3L28l78K64J0j06R2L6j73
$$ plain form
2904 -204 57 216 -191 -31 251 -307 1 156 -30 77 76 -90 212 -138 -48 12 -185 92 189 -49 59 62
2926 62 -20 286 -7 -95 299 -42 -61 187 -135 -304 213 33 56 33 -162 232 -25 -166 300 -28 -76 74
2948 74 -128 -73 203 -147 -96 -253 -376 130 81 -218 76 -205 -25 259 -15 123 334 -69 65 57 112 135 -96
2971 -96 -65 214 -136 -75 166 -269 -53 57 -164 -9 77 -15 125 -94 51 200 -6 222 144 -190 115 37
2993 37 -168 196 -67 -55 135 -151 -178 28 -191 149 54 -120 -63 -141 -156 161 27 170 163 0 94 64 -68 -121
3017 -121 143 -80 -95 10 -140 159 -163 -80 82 -88 -68 261 190 249 18 73 47 118 -361 267 -55 -237 74
3040 74 -235 -75 36 -386 61 65 -203 407 85 -111 199 24 71 240 -107 128 144 -219 -155 47 -159 133
3062 133 49 -25 62 -15 -7 -168 -255 67 194 -51 183 -24 81 182 -159 -222 106 -272 -8 2 -104 -12 24 -149
3086a49O2K35l12L56n18L40K43m21L31l8k33J43J06k96M50m32K56k07J94l10M22
3107B22l42M34j05l40K65L9k62K69l59J05R9k46K84Q3j26j94J94j22J00M9m7J22
3129A22j88J64Q8k56J31Jk42K51k0j65K66k65M4K15l4J58o8m44K71j81J8L64j13
3152A17j49K19k78R7J58k26J86N6l85N7K91j5r5J23k08K31k33p6L67l06K22J59
3174C12m73Q0l0o2J97l6n0MR2p4J14j20r8L08l74K20o8j41M70l43Q3J21k49L11
3198A94J8l45L04k32j68J54K19r9jQ6l17J74k89J54L43m41L39jk82J29K20p3j12
3221b6k37J74K25r8l42N86l43JJ90o6J28j61j41K64j52j63L45m52K76J79l92L25
3243A20j12k53L90j80n0K24m88M41n6k02K19L6j38N9k6j57M89l32J87j66j91l6
$$ plain form
3086 -149 -87 148 -164 192 -326 14 257 -164 167 129 -104 39 145 -151 299 -133 123 -84 110 -200 222
3107 222 -120 314 209 -131 134 173 -89 180 -179 -74 25 -221 63 146 20 -174 20 -102 -2 47 0 122
3129 122 -66 98 186 -70 61 62 -180 71 51 -114 152 -113 -69 146 112 270 202 -242 29 -152 -134 230 117
3152 117 -32 187 -91 6 164 -62 124 180 -205 -148 143 128 33 156 -52 179 -54 -130 237 -69 153 312
3174 312 -161 -81 -111 -173 24 -12 -62 -58 34 -40 74 -46 -144 164 -210 10 -58 -199 271 -72 11 132 -117 194
3198 194 212 -133 171 -61 -229 -75 144 45 44 130 -187 -13 -302 -148 195 -246 93 92 -190 -61 159 86 -26
3221 -26 -263 -89 136 38 -304 282 -61 -60 130 64 192 31 -110 154 2 -161 184 -268 8 187 -205 120
3243 120 8 -245 145 -35 -85 139 -349 92 36 -166 53 89 -49 10 -16 -173 316 -16 171 5 -186 -222
3265b22L35j65L68m8k73K54k75j08K77k74M07m9k15J41p0r2k6N7m11K63M3j72
3287b55L94k51l0K57j86n1K30j81K97j89j06K86j98j68L28l99J70J03l16K36k4
3308e3l5P4L4j46M91m77J08Q8j03J58r4k29R3K8N1m4p5j48K89j3j68L43j97j34
3332a59J72k27J41l1j51L73Rq0M6k75J60L8k4j02km8K57o1j39K00j51j5K77j64
3356D4k19L22l62J55Q0j72K61j11k9M5q3j02M49l04l%l5J76j10j60%J97j65M42
3380C16l27k24L53r1j77J59m6JJ84k23J69k1k52L7O5j5M20n26K97J33l53P8K18
3403A75m71M09p1k28J73J67j65J42j85J05P5k16M75k80j45Jq0R6K36j9j83P5q6
3426@MR7l11K70Q0k26L36r3j30K29n02K38J30k20k6K82k28l8pR6K03J12o18M37
$$ plain form
3265 -222 113 -52 316 268 -5 249 -26 -134 143 -131 276 227 12 153 83 -9 -35 22 -389 -126 -83 -255
3287 -255 139 -112 -142 115 -71 -122 108 -73 224 35 -71 215 17 -151 177 -222 -52 51 -265 -29 -53
3308 -53 -88 -14 20 -126 365 -112 -4 84 -19 139 45 -184 -91 -63 -12 -56 -131 -279 10 -3 -171 172 -25 -159
3332 -159 13 -214 -73 -104 -255 118 127 47 93 -182 -22 16 -8 -110 -112 -160 97 36 -103 97 -54 -69 208 44
3356 44 -175 147 -215 -60 20 -152 109 -2 -31 14 -69 -171 278 -26 -29 -29 -64 112 2 -158 -158 39 -126 316
3380 316 -11 -235 118 27 -150 9 -37 -36 148 -75 94 73 -179 -142 -77 -92 328 -198 99 232 -121 -43 175
3403 175 -296 113 42 -186 -13 154 -11 131 -54 51 126 -90 385 105 -40 -39 -119 -23 213 194 11 86 0
3426 0 4 101 -210 60 140 -86 250 157 27 256 -246 -8 122 -98 -124 158 -70 -108 -115 -19 184 296 -322 115
3450A15k19J05jk20L55Mm75N76l24P3Q7l07m4M66l00K62j58r6J72k65J32O2M0
3473D0k2L40o12J47J63l0Pj3k68M51j38j84L37m06J32K45m87L00mn2J47K5k34
3496a16M8J02j15o9J04J40J54k75O2R9l06L50r6n03O83k67k49K11Q1J34j38J6
3518E0P4n2k74M45k9k42K1K66l00J89j33K36j58k60K82j56m3O6k78K09L4L6M8
3541C1J41k90o5K19l13K30J64k19J46J68l22K16m87L57J75l02M2J02j00K03l33
3562b37K3N38o08K61K68l98J08K67k21J79k46k3J33O6l36M65l65J05J58l10J0
3583a63J02k71J68J7j19M65l62r3M22mk52K08l69K50K7k35L76p4l40N73m58KJ55
3606B5K8j78L57m39K75N5j90R0m4l37P13k64j68J92j04Lj3k24O52k74l74K60l4
$$ plain form
3450 115 -104 1 0 -220 135 139 -336 240 -84 -11 76 -231 -275 191 -109 153 -5 -101 71 -194 -62 0 40
3473 40 18 358 -254 -107 56 26 33 20 -248 203 65 -119 218 -188 -56 189 -298 2 -2 -54 93 118 -116
3496 -116 -68 34 -81 -150 -46 94 248 -27 35 134 -172 178 82 -421 262 -5 -254 -43 38 172 34 50
3518 50 124 72 -202 243 214 -28 -7 259 -41 148 15 251 93 -167 115 -41 -84 -18 -296 -87 -53 -17 31
3541 31 172 -118 -183 36 -277 -47 117 -102 44 212 -110 106 -381 -24 151 -151 -109 -7 -107 96 -237
3562 -237 -214 324 -284 -23 245 -153 -45 222 1 180 -66 -89 44 110 -226 239 -126 -21 137 -173 -163
3583 -163 -61 -332 -164 -147 -266 199 -163 -256 166 162 -90 118 -251 -1 26 -209 167 93 -247 326 -132 -130 25
3606 25 53 -125 232 -207 68 123 -67 23 -21 -358 355 91 -77 115 11 14 1 -223 429 155 -219 41 7
3629Gj71K43q9j2J52K3j60M7j95L19K5k86J79j68l1K38k26j11K70k12K04M6Rr4
3653GK22m02M63m88K65P1l72K33N3k52L27j68l3m6n6l4K00Nj76L20j08Q0J0j50
3677b9Q6J58j73K43l05J10M5k20n8L31k71J20j05q4J88J92m24K66k6m4K46k91
3699d5J88M6j46P4J7k43K45L8l59L68j25n4l3J39l07M26k61P6L6lk5p1r3M05m29
3724a36PJ63n0p9l0m4J31j6k13L37p6j88K70J12r0J09k71j29M81k90k04J72K8
3747fK96k14k03K85l61M8K98l64R1L16k63J39l5K7O4k34O8K60l35n3J97l77K53
3770a03J98l41M21k08J7ok20K35J52k43R6K72m13K99l7j82L94l94L8J73l34Q9
3792i7K93k25O5J0k52L04Q1k12K0k5M2J66n03M39jk96K60j1k35K04r8N1O5o3j28
$$ plain form
3629 7 -164 79 -10 -22 130 153 -7 40 -155 164 189 -97 82 -86 -117 121 -105 -216 54 -158 46 92 101 7
3653 7 229 -173 290 -198 67 138 -234 -1 52 -200 127 -41 -74 -120 -176 -210 -10 -5 -181 139 31 111 121 -29
3677 -29 57 215 42 285 -20 90 135 -85 -143 188 -83 37 -68 -152 36 228 -196 70 44 0 246 -45
3699 -45 143 189 43 117 134 -109 136 174 -185 183 58 4 -29 110 -197 229 -32 44 80 77 52 -19 -112 293 -136
3724 -136 -129 34 -16 -95 -125 -169 -38 -54 -267 70 -6 -194 76 188 98 207 -64 -193 288 -2 -206 -34 -6
3747 -6 290 76 -127 158 -203 -155 143 -221 -130 186 -77 62 27 54 118 -116 -48 212 -123 -176 21 -356 -103
3770 -103 95 -246 175 -33 -16 -22 -242 -7 145 -98 -2 270 -143 156 119 -63 331 -63 -25 148 -186 -97
3792 -97 196 -29 36 46 -206 98 179 -33 -13 -38 4 170 -333 106 105 -191 69 58 -177 27 -71 -20 45 -18 -146
3817a46J99P7N1j83k03L08p9J1j17P7m6J14k61K62J67l68N2K32j13K17n6n2q2
3840F1j21N8K06k67l7J71k22j0J32%j15N1K00O4j46j95M59l98Q8K28l71K47j26
3863d3kJ16j02n5R5nl1M9j42j19L16j46K43j94J7J94K3k13P5j02om1p7J69J28
3888A47k57J38n7l18N61j55k97L26j27O3m2j46pK97l43L66o7j88K93k02K2J51
3910A58m05K29J56l48Q1J00j85L55J2OJ2M8j27n9k28Q7J14k77J78n5j7J73j06
3933i8K5K83m33J15L7l4M2P2k23L41j84J55J59k27j96J80kj22K26k68J85J62j64
3956C1J50j3l05K78J67k58L0j85L55m00P9R2K29l83J31R3Pq5J14j76J40j33j9
3979f1J22k42L55j55P7J26l31j74L50lm1J11l01J28j30J06L17j52k7Jj75L0J68
$$ plain form
3817 -146 53 130 181 -2 -205 103 24 35 -82 -5 -51 63 -198 64 231 -137 -85 147 34 251 195 143 61
3840 61 -60 -2 204 -63 -100 71 -151 -161 -29 -29 -144 -93 107 171 25 -170 289 -109 -21 207 -164 83 -43
3863 -43 -45 71 -31 -86 9 4 -27 22 -120 -239 77 -69 174 -20 -3 191 214 1 76 -26 -32 -73 -150 19 147
3888 147 -110 28 -29 -347 214 59 -238 88 -39 24 -18 -164 -171 126 -217 149 82 -106 187 -15 7 158
3910 158 -247 -18 138 -210 -129 -29 -214 141 153 159 171 219 92 33 -195 -108 6 -271 -93 -148 -165 8 -98
3933 -98 -73 210 -223 -108 -71 -105 -63 9 -214 127 -57 98 257 30 -166 14 12 -110 116 -152 33 195 31
3956 31 181 168 -137 141 308 50 80 -105 250 -150 -71 21 250 -133 -2 91 98 13 127 -49 91 -42 -61
3979 -61 61 -181 174 19 96 222 -109 -283 67 64 23 134 -167 -39 -169 -63 254 102 75 76 -99 -69 99
4002I9j82J12Q0k96J38J06j56K48l38n3K08P3M3J60m70R2J48j48L68j42k07L08
4024A91j87r3J55j05O5P8k18N0R9j27K96j43j10o8N4nK64m29M01r0k41L26j66
4047cN5J40l11J13K87l24jK33k50m0K29l85K72J34k17J45M6j50J54j29j85L24
4069A37m26K65j2j92J71J45k09R1L1l3N3j49K00j07q3J08K7m0O1M1l17L85j53
4092fQP7l53K15K72k51J32j9k72K51N9k43J05q3L00k87M8j59J9JK70k02R9K01
4116A82k56Q7K10p5m4j33k45M65j00n14M30m5k61M08j17J07L5j22P5o0j70L91
4138B48m29j1N06l68r2K68j94r5J79j82K92J0p4J15k72O5Q5J4m6J9j80L80j20
4161A18q6J07K4o0j44q7l9L02l45M3M65k52J6l7l00K02K19r2J55j69j57K12k3
$$ plain form
4002 99 -83 29 109 -187 -49 57 -99 149 -189 -242 -34 39 82 242 -228 -136 12 -136 232 90 -117 191
4024 191 4 -89 66 -39 26 104 -114 -64 35 -92 204 61 -49 -117 -63 -68 196 -233 168 78 -163 163 -3
4047 -3 52 192 -119 -6 281 -43 -44 189 -61 -101 128 -257 15 149 -68 77 123 -27 127 -2 -187 137
4069 137 -289 -24 -36 -228 -57 88 -121 -30 1 -32 21 -128 72 -35 -118 -10 17 -23 38 79 -238 147 -6
4092 -6 2 79 -274 -59 213 -38 94 75 -197 54 113 -130 -25 -108 192 -95 -47 -206 -187 -186 84 -118 -19 182
4116 182 -74 13 223 148 104 -29 -274 191 91 -423 7 -38 -299 109 -8 99 134 12 87 27 -143 248
4138 248 -181 -192 314 -54 -146 122 -72 -167 12 -170 122 132 58 173 -99 -34 51 65 19 38 -142 238 118
4161 118 32 139 163 103 -41 -128 -167 135 -210 -167 298 46 62 25 -275 -73 146 54 209 40 -117 95 72
4184G2j00Q7j16K52k16p8K74J6k78L43j24j61M5q4j01J94l14K60K9k95M30Q1n27
4207c11L88l01L15M2l36K52M6k62J81J09k33K77k34j2K17k72o8L83k79L8M09m92
4229a43K65o6j4L58l24m4n7j16P1J19j4L6j07m5J56j53j63N04k98N1l9k30L11
4252E8K3l16M04p4k49M37k56j22J67p2j21J63l16K19M28n05K04j65K4P5j57J53
4274BJ56j90j5O5K5r8K07j11L1j7j47J40j37J20O1l64J15J46l05J30L49l54L07
4297A16P5l29L54k78R9l6r8O9J67j07P5l6QJ11l27J69K48o15K35J17j75J41P6
4320E9n4J58q3k74L63lr3j94K8mL07l38M21l83R7J64j89j34K53r5J8J59k26J28
4344H5m5r5J91K7j63L18n16J85J18l9j79M2L8N2J24l66J61o6j28M61l68J92M2
$$ plain form
4184 72 -28 59 -57 195 -21 -99 175 191 -87 256 132 -29 16 -68 -169 25 -289 -29 0 -295 135 216 -311
4207 -311 77 -224 91 133 -203 49 95 -167 14 123 -110 167 -67 -79 138 -134 -202 181 -98 -60 349 -143
4229 -143 122 56 42 400 76 32 -25 -141 -70 49 35 71 -36 -81 75 -78 -241 263 -35 16 -23 -253 58
4252 58 81 -235 169 95 -154 283 27 -95 72 0 -121 42 -274 -55 373 -132 72 -93 -69 6 -151 2
4274 2 158 -32 -47 18 43 -55 152 41 72 55 -92 48 -89 31 92 -272 -157 -11 -316 -186 163 -191 116
4297 116 191 -138 216 -62 37 1 -97 -28 139 32 107 71 79 190 -137 32 280 -335 -100 17 -158 -17 59
4320 59 5 163 80 -194 169 166 73 -121 -93 -97 210 -128 293 -90 7 171 -18 -152 101 6 24 183 -43 85
4344 85 40 -55 136 163 0 318 -198 -13 105 66 -113 -71 -33 19 143 -223 -62 -128 -256 205 -163 29 71
4367G1j75K45L9k71k0K90j72K17l11k04L73k55K14J0j58K28k55L1k9K20j91R5
4389hj73K69j7j38MO3q0j05J59m2J96M9k35J28P3k38K41m28M08j06KJ45p9k75
4413a87J87Oj38J28j9k3K12P8k99J11k1n2Q0j93Q6J82k08J40K06l59L07k65J72
4436A31k9k84J44j20P9J82j67O8J73l8r8o9j77J50J54n4M1K3l18K92j43l5K35
4459A40j9q3j08l7K12j80j33K56n7j45J61Mm6J45r8L7j85j18K08J09k31J69l6
4482c5m7L01k95L9J24k74L38l73J10K75k13M9M8j01o6n7MK19Q1k2m9m6j68K51
4506I3l5N3N6j74J51K6l89K96K9l78K53J8p2NM2l4L96n30L27j56q4K45q4k25K21
4531E0Qk97L23j07p2K51p5J11r1j82L06k27j71K84j14j47J10p7M6K32l39K99o3
$$ plain form
4367 71 -104 141 180 -91 -111 179 7 224 -87 -291 82 -173 41 51 -107 121 -134 -103 -132 88 -103 -8
4389 -8 -181 88 71 -67 -63 0 -80 -185 -26 -68 128 177 -58 70 143 -95 146 -282 126 20 22 167 88 -187
4413 -187 0 6 -132 -4 -23 -46 166 244 -55 56 35 -17 63 -130 -44 138 -70 70 276 -83 224 -41 131
4436 131 102 -182 -38 -158 -79 103 -64 4 177 139 41 -28 -205 -55 99 45 86 109 -209 83 -60 -95 140
4459 140 121 38 -70 -107 105 -75 -208 48 -9 -154 7 11 -35 110 12 49 -136 -254 -46 63 -168 1 -35
4482 -35 -82 219 -76 -37 87 -187 151 -222 -112 163 -50 -1 47 -54 -120 -177 -173 46 127 105 56 10 -158 93
4506 93 58 111 167 -7 144 170 -219 77 106 -272 -19 -1 -73 -68 -26 -60 336 -194 133 -23 -107 138 54 -171 50
4531 50 58 -239 84 -23 -95 156 81 192 101 -81 225 -2 -173 111 -3 -150 -40 -117 -71 161 -178 121 58
4554E8j59L34l60pK45k14k5K10k65J76r1j0R1K96l07J43k8j72j9J53j1K76m06
4577i2L03l15j45K42K08k99Q7K64n71M37k97L25k22N8j12K22k45K43l4N0j36L8
4599Il3o2J69j03P2q7J10j28J7M7J13j46J61j16O7o4%O8k2n8J39k26j67K93k04
4624a51J45m9j99L24j8r2J21j69j53M46l91R3K54k48N8J19M4m4j73m1J54k1k11
4647b02K67o7mJ48k45J92j35l7J69k91J09r2J92j10LJ61K5O3j77j73J90mL2K37
4671B51l50J5K1J39p5j5r1k2L49m11M08l31K11j66j5K22j27q6J43k63J39k0K8
4694d6j83K85j58R7j03o5M15k85J84j71j10J11J04j86Q6q2m9J47MJ7L31m33J60
4717G0N1j48J34j38O4j59K08l12M55j29k32J25n2l4Q1j8J06l5q4J77j64J31j42
$$ plain form
4554 58 -101 233 -127 -134 111 -103 -128 82 -183 -7 -98 -108 -17 279 -28 115 87 -85 -104 49 38 314 -92
4577 -92 211 -104 -249 -7 201 -98 -11 253 -318 119 -178 147 -75 -17 -129 93 -152 91 57 107 -29 9
4599 9 -24 -86 83 -20 52 -35 75 -53 -36 11 124 -22 139 23 90 26 26 94 72 14 153 -73 -240 53 -151
4624 -151 -6 -55 -254 70 52 -40 81 -88 -241 205 -186 -93 161 -87 -29 90 134 90 -83 -124 30 9 -202
4647 -202 65 -2 -6 142 -103 89 -46 -83 86 -205 -96 -188 4 -106 -103 58 83 146 -31 -204 -14 -18 14 251
4671 251 -99 -84 -63 76 1 -14 -105 -127 222 -189 219 -112 99 -67 -82 140 13 -73 70 -193 -54 -74 -46
4694 -46 -229 56 -102 -5 -108 -173 242 -43 141 -30 -140 -29 75 -111 -25 -107 -156 -9 -5 12 343 -90 70
4717 70 121 -27 107 -31 33 -126 82 -230 225 96 -136 -11 -63 -97 -16 -34 72 37 -47 130 -34 97 -45
4740d5j44Q3K50k35J44j60M3K58k68L6J07j39J02Q5j94k32M18j09k5j98J70j29
4762a82J61Q4l51K08kJ0j16K72j51j33M8R5j92Q5J69j80K77o5R1j4j98K78k19
4785b5j71J23K11k52K40l77K30K63j83l2K62l64J55P9l05M53m04J31k2j21J5J11
4807A7n7P7M8pp2K6j50J90L9j89P6P4l12L05m8j32J27l69L36k0j1j00K36k32K12
4832F4M3j03K92l66J82r9j87K82K0k41J66l2j24J55m8Q7m5j67K00q2M4Q0j51R5
4856F5N5k23J10J13k92K74n0k19J71j7n1N3J24mM4k98J46J62k86%L75k37p1j49
4880b05R5L6K28r1k29j39K68J72k73M08q2l71J93J12n1O2k70lK80j90J58K9l64
4903b27J18K41l68K41J9j12r4J09L6J68j60K00j16j09M5m4j65L53l2j00J91r7
$$ plain form
4740 -45 -189 -106 144 -91 53 -107 -64 194 -74 -38 69 -70 32 117 -77 -309 109 0 -25 -223 -53 -182
4762 -182 -21 63 -288 -80 -82 -72 -188 84 -67 -200 -152 -57 -249 -164 5 -175 102 37 128 114 -84 194 -25
4785 -25 -196 -73 138 -114 126 -251 -21 242 59 27 289 -75 80 159 -146 307 -97 34 12 -109 -94 17
4807 17 -40 37 85 78 6 32 -118 72 111 -78 -2 72 -240 65 17 -115 12 -357 -21 -41 -52 -152 84 -148 64
4832 64 107 4 296 -70 112 13 -174 108 128 -113 53 21 -103 52 4 91 46 -121 79 -3 41 121 -30 65
4856 65 120 -103 7 120 -172 102 52 -167 4 -13 -64 -11 113 109 153 -145 1 163 -123 -123 252 15 -56 -205
4880 -205 -110 -74 154 63 -166 -305 -37 135 -138 270 188 -183 10 122 71 133 -137 -140 140 -50 108 137 -227
4903 -227 -109 132 -236 5 24 -88 -182 -73 -37 131 -29 171 55 -54 -9 -53 -218 135 103 3 194 97
4925I7j38j64J76N0q8J46M8l8k58K99j41LJ32k18k9K36m0m6N7n9J92j83J45k03
4949b4j27J96j43p6J30k33K30Q1k48J44J55o8p5kj31O5K01l56K05J46j48K66j44
4972D4j81J45k62K29L49l27j33K75j68L4m1J68l7K9j55Rj17J88o4j71J72L1j66
4995a49L21l7r6M0J5j45O9P6j02Q5J5l11J67Lm0L04k22R9J52l15K26l67J02J28
5019A8j79K8J1O2N3Oj23K30j72P2j81o7L84k39r8J60Q6L7J10l07n2J68j31J05
5043a9l2J23j30mM5j45r9J53J30l8N4N3q0J12j13O8Mr1M1O8K4m68M82k07n2J13
5069hj19Q2M3J52j28j20o8K61l3M8N0r8o6M0j32L54l70J15J60m31K30P2j58Q7
5093c7J53j26q6K77k0j12R3l17J23K29j26p2%J17L6J47k57R4r7m2J34k42K09K01
$$ plain form
4925 97 -41 -205 -29 21 -67 79 127 89 -169 130 -11 -8 124 -94 -123 113 73 27 84 25 217 34 179 -24
4949 -24 -151 45 -98 -174 -44 -277 -47 34 -214 -70 85 17 -58 -60 -191 -126 75 -281 -76 70 -78 188 44
4972 44 -137 8 -254 -25 324 -3 -136 139 -29 5 -36 132 95 124 -31 -22 -139 49 -15 -186 -14 17 -149
4995 -149 172 135 39 79 94 -51 18 94 -8 77 92 -219 -52 -49 -89 215 -7 92 244 -71 155 -212 -110 18
5019 18 -161 -133 -122 -60 -7 -1 -124 106 -66 6 -175 -242 142 -97 -195 -35 51 88 198 -109 -161 7 -124 -19
5043 -19 -51 72 -58 -62 -17 -162 -261 -108 22 -16 38 91 11 123 10 78 82 -9 32 100 124 -344 138 -69 -121 -8
5069 -8 -127 -45 -2 150 22 -98 -166 95 62 110 160 62 -4 36 -96 258 -112 3 163 -268 -38 34 -124 -37
5093 -37 116 -10 -96 181 161 49 142 -175 -52 177 51 -21 -21 96 132 279 22 116 19 -23 111 -131 78 279
5117B79k70J07l4p7L48m30J37p8L6l8j26J8J24N4j9K02k86N6R5l05J54K89j70
5140F6Mj53j05M54j67r5K33k15P6Nk47L08k50q2J67R8k47J67j82J83K9j54L62
5163B55j40k31K55p6j97L20k9k23K37k54L5O3j81K33l49K99J58j55k50M62k05
5184B7N3l0k41L48l00RN2pR7J7j25K31j22j48L39q4j35J2j07J41q5J13O0j47j65
5209a97Q8K64k42J8M0k55M23j53L9j86K74j26L60l34L8j15J7O4J39j80rN1j24
5232a06O5P4M2l9L0j59L1p2K27j50J71l6p7K1M2j48J67j81j3M2LO5k7J74l67O5
5258a56QJ19O9L7p4q5L6P1k1k46L15J61k16L6j63J15l0K96l94O9j12L66l03m8
5282a50K31NP6k2j24r4K75k04P8K1n5q8J59l25K83j76K48r9M4j41K92k99j5K03
$$ plain form
5117 279 9 116 82 5 353 -77 60 -18 18 -20 -146 -128 -4 50 31 233 -53 3 98 -207 -53 236 66
5140 66 70 -83 -188 266 99 4 237 22 98 103 -144 164 -86 -168 -1 97 -150 17 -165 18 47 -107 255
5163 255 115 -116 139 63 -134 186 157 -66 171 -83 -48 15 -166 67 -282 17 175 20 -230 232 27
5184 27 80 50 -191 157 -143 -134 -82 -89 8 25 -100 131 9 -139 200 116 -19 -7 -114 27 -58 55 115 -32 -197
5209 -197 -109 155 -87 -69 -29 -284 139 -14 25 -161 113 -13 347 13 51 -64 -47 17 156 -24 -33 18 -106
5232 -106 -41 33 75 36 66 -93 -62 -134 93 -57 114 78 1 22 64 -84 83 -98 -111 -69 -66 -1 -28 146 -221 -156
5258 -156 -148 -29 40 77 3 -82 -46 25 4 -242 73 234 18 54 -109 6 -24 272 -122 -53 -165 201 -102 -150
5282 -150 81 86 162 140 16 -78 197 -7 71 92 37 -51 108 -217 66 -110 138 39 83 -58 234 -65 -80 123
5306A23l43K00j02R1K4j93N3l8J51R4M8oj35L7M6r1O5J15k36j85J69J74k02O2
5330g9rJ60m7n7m6K67j31l3j6j29N2K25j19K55l63k7R4K8n5P1Or7J80j4j26J85
5356A75k31Q0l5R2j38J16j85L04l9j40L1nK52k29o5J48n0p2J13k09N8K25j96P4
5380G4J49j53m3J63l32K22J27m28L40r5j84K20r4R8j71p8J73p1j39L32k54m6J44
5403d6J41j12J13k15n7K98k36J98o8k5j36p9J43M7J85k81J44j7p0J80K1k52q9
5426b13K34J22K93l84K77j97p8M2j24O2k00K19j13J7l3K5J26j4m3qP5k43j87K25
5450a20J08J71p8Lr0J13K59l76m7J9m2Q8n3R4O0k75J25o9L2N4M8J01l1j19J57
5475A32nk14K6J18j63mJ48o7J90l12J46j01J22k1q5l7J12J31j38J98l18M5K78
$$ plain form
5306 123 -220 -20 -122 -31 -7 -200 -147 -185 -34 60 108 102 -33 4 50 -41 24 139 -97 -282 -113 61 -141 -79
5330 -79 -88 72 25 -32 -78 189 58 25 9 -120 -68 157 38 293 -70 -97 -3 25 -30 41 47 -50 130 116 -10 175
5356 175 -56 24 -11 81 -57 59 -126 178 139 -1 30 25 277 48 -17 131 81 9 122 -87 -29 196 0 74
5380 74 223 70 27 190 -142 80 207 -221 119 24 -160 60 -34 64 -107 -185 -12 -83 -222 110 -144 -190 -46
5403 -46 95 -17 96 -119 -176 122 -114 84 16 -9 -145 -224 -81 -34 151 -130 14 -3 -73 107 128 -124 -213
5426 -213 21 143 436 52 329 132 54 96 -28 34 -166 53 -60 -43 -76 -51 75 61 18 10 85 -158 -345 -120
5450 -120 -12 159 81 84 -6 107 366 -10 -57 -38 -80 8 -45 49 109 -166 -41 -110 -78 -24 24 125 94 -25 132
5475 132 127 -87 -61 57 -106 -110 38 -29 161 -151 -5 -106 16 -5 -90 -127 -15 116 -22 176 -142 -97 181
5498A81m7j20J07p3k2Lj03J56p8k0K6j34P2J61j17k5l6O3o2j78J35n3Q2o3L05
5523A60m05K46J21n8p2K2Q9J12j45k38L16j64K7j6n7j19J40p6J9L01j47J25l08
5546a27J40R5k6j22K15j95l3K26j58n5J66j46J77k93L8R7J61n7r9k92N6J68J09
5569D5j95J47Q2n2q6K21j15k77Q4J39r2J4k14L17PR7r6Rj74N3K39L7o2j56K4j36
5595a40K53K0k51J73k77L71Ol15J33k0o9jr0J95J62k02Jj20J99j6j14J17J07k26
5619a04K46k50J02j85K96k04J71k6j46L6rJ71P4l07M25k29m0J19k48J18j36K40
5641A14j12J22o0k86K94M6n0j04L7N6j84K53l5j31K2p0R5R9r0j17oJ96j39K09
5665A59Qj89n7m3j38J85n6J52q5J39j93K91l27j9K31j93L38l76J42j38J48l1J05
$$ plain form
5498 181 134 14 121 48 26 29 -74 82 4 -16 10 -124 -52 109 -8 -33 -69 -6 -68 -246 -111 -164 -82 -145 160
5523 160 -245 1 122 64 -8 14 103 215 70 -168 148 -16 11 -5 -62 -181 -41 -117 -98 203 56 181 -127
5546 -127 13 108 82 -40 175 -20 -53 173 15 -40 126 -20 157 -136 -98 -1 160 103 4 -288 -232 -64 45
5569 45 -150 -3 79 27 -59 162 47 -230 -146 -7 -99 -85 -299 18 25 122 26 35 -139 -86 153 190 128 -28 -4 -140
5595 -140 113 133 -118 55 -222 149 155 -160 -27 -47 -116 -117 -207 -12 150 -52 -51 -171 28 12 -102 15 122 -104
5619 -104 142 -108 -6 -191 105 -99 72 46 -100 -64 -73 98 172 -135 290 61 21 140 -108 10 -126 114
5641 114 2 124 64 -222 72 118 68 -36 1 57 -127 126 91 -40 -18 -88 7 106 16 -101 -107 89 -50 159
5665 159 167 -22 -79 -122 -260 -75 -131 21 -64 75 -118 173 -154 -173 58 -135 203 -173 -31 -169 -21 -52 53
5688E3k3j7J28L1m5j49j8J25QJ3k68J29j24J98n9j63J42k9K04j81o0J75m6lK52
5713B73l22N1K7o8J48m9r6J11k01K3r8O9K46k9j31P3r3PJ19o6R4k42J0O0J02j43
5739a25K73N0l47J88J00j49J50k15l3J6k65J81M29m99K40r5J78o9j76mJ35j13
5761a50J39J53k37J31J36k35mJ5r6K43l30K44p5j58L68K1j43k9l5n3K2J52k95
5784b16J38j9j9J66q6K25j37n3J58l7j58j7K41K6j62N3p3J4j1j05p3J1J77m2J35
5809A36j13j39K6n0K48k01Q3q8J75k5j5K0j35j60K04k32K11L2qo6K6N2o9j18R5
5834a11N4P6N8j58N5jJ38k23J93J38k44o0J60R4k38J08R5j27q3R0J64j54N1j1
5858F4k2J00k23J41o5O1o8j63P0N0j10J02j00j50J96J27J34j82K44j51j98K77
$$ plain form
5688 53 30 13 141 172 127 -22 -40 85 93 106 -162 -33 -157 41 -18 -181 -39 -68 136 -45 -105 70 24 21 273
5713 273 -49 2 29 -39 109 60 -36 75 -126 -103 -201 -132 114 85 -46 27 -66 -59 60 -6 88 -154 -144 -84 18 -125
5739 -125 148 198 -149 39 139 -10 140 -75 -108 -92 -357 -176 253 -246 -6 -101 77 8 -168 -172 -37 -150
5761 -150 -11 142 -95 36 172 -63 -67 -52 -148 95 -235 9 -66 -224 144 165 22 -7 -42 -95 -73 79 -216
5784 -216 -78 -97 -116 50 -36 189 52 -1 157 120 -38 -55 186 212 50 103 30 44 33 -72 -145 -134 43 1 136
5809 136 23 -116 -90 -140 108 -93 -10 -98 77 52 37 57 -78 -238 -34 -266 -55 -23 -31 -97 -71 -19 -88 -206 -111
5834 -111 -57 19 77 -81 -26 -27 111 -112 81 219 -25 -85 75 169 -69 39 134 7 -76 14 178 24 75 64
5858 64 42 142 -81 60 -5 56 -12 -175 -105 -55 -165 -63 -163 -313 -117 10 144 -38 206 55 -143 134
5880A34o6j09N9k0q8L2J7KM3rJ5N9k01L96k74n5J35k07J22m7K27j95J08j4Ppr0
5907b6P9Q0j71r1K87l25L51j09j40N2J94j4l49P6j83J91J39n5M0K39m44J59O5
5930D5r8J03OP3k24K44l81J48N0o8J52j5K66m52L57l58n3J43p3K68k09j28K07
5953CJ1K0J24r5J24j63m5J14k14J21R5k15K88k02n6P8N0J0q2J4p0K50o0N6k24
5978f8J79p4j57J84L9n2q7J50%r2r5J6LQ3l19K86l8k1J44j6L3p1M6j19J58R1J41
6005C44m95J62K5j35J17q2P4J8o4R5Q2k54J45j04N0l9N0l4J04l9k6J68m4j77K97
6030B38l79J00P1J74j96J71j72J85l29J74l6l4J07o5J40k7j49l9L81l88J31L4
6052I2j32K35j27o6Q8j74P1K5M9k4K1o1m7J03p0j06K17L6l48K42N3j28J93j60
$$ plain form
5880 134 68 -41 18 -2 -90 -58 -41 -39 4 -5 10 69 -132 264 -10 -65 70 -137 -15 -62 165 -30 78 64 71 64 -26
5907 -26 53 133 -38 -129 158 -167 184 75 -65 -13 181 167 -182 -106 -289 -98 41 -14 26 265 -179 -20 45
5930 45 -53 50 56 129 -95 149 -232 -84 -34 -102 50 35 301 -151 206 -152 -205 -62 -135 133 -76 -204 3
5953 3 14 34 158 63 187 24 -21 93 -121 0 95 -120 168 -34 -90 -12 38 48 -34 -20 -90 160 100 156 -68
5978 -68 111 37 -120 64 103 51 -36 114 114 22 -73 -57 -54 29 -290 -4 -42 -63 81 65 98 27 73 -46 112 203 344
6005 344 -151 11 36 -99 18 -64 10 28 -36 59 141 -113 32 -72 -22 -61 -11 -45 59 20 -6 162 118 -59 238
6030 238 -141 -41 30 204 8 179 7 192 -137 37 1 -33 74 9 149 122 -27 -66 315 -73 58 92
6052 92 -40 195 68 2 90 -84 -13 12 61 37 58 -3 -50 53 -17 -123 94 130 -218 24 77 -51 142 -18
6076a8O1J10k57P8OJ11J5J5j56K17j96m7q7M4R1J31o8l8j3N3L4j75J75j82R0K1
6102A5K3k07N03l46j65J87r2J08O5Kk4J32l37K67j71K34l45K57q4p4K47m73M73
6125A95k44k1J95j25Q9k66QJ22M6J05k34K22l32J81J81r8K7J24k25Q4r4K01j15
6148B6n0j21K60k02P2j4l1O8O6k05P2K07q6k29R3O7Pj2jo1Q5k9L0j05J58m8p4
6175e7On3l7Q2j43L26j87j09L16J0j45r0J1J04rj21J34n6kq8J77p2l63M69j72
6200f9m0L07q0j08N0Ok77K55L3j75J19o1N7J33j12m7k8J55j33l9n1J17J0P1j47
6225e4J45j8m9j69jK64r8j9Q8J59j76J25p8j28L7j46J00Lj10K25M5j54j07P7J55
6250A16n8k13J26mq0K04l67j8N50l33R3R7k6j59j25K1K65M2j77J02K10j74k8r3
$$ plain form
6076 -18 43 153 -104 -26 -20 91 106 121 -35 182 -14 -61 -148 -104 -13 118 50 12 -1 52 86 -89 86 -96 -6 15
6102 15 38 -169 334 -12 -177 10 -82 26 91 93 69 201 -136 131 -40 194 -151 106 22 -52 195 -278 195
6125 195 -49 -70 125 0 89 -177 -169 -47 -1 104 -130 92 -240 -59 122 24 51 175 -50 34 -60 141 26
6148 26 -24 -145 115 -87 -15 -29 -60 8 74 -131 -59 148 62 -167 -74 -7 0 -12 -13 -74 11 -18 12 -93 65 17 -57
6175 -57 -51 -104 -141 -59 -202 124 -63 -172 144 154 9 -81 -70 34 25 -96 38 -18 -20 -108 69 -3 -366 103 -69
6200 -69 -109 198 118 10 60 66 -211 44 77 -98 21 -40 17 150 38 -9 -37 118 -15 -54 -105 12 22 93 -54
6225 -54 91 73 24 -145 -146 118 20 1 89 248 72 197 119 -9 28 -118 -18 -15 -125 100 145 -9 -116 -39 116
6250 116 58 -155 -29 -33 -113 91 -276 -294 256 -77 16 113 87 -72 -197 -176 89 131 -46 56 266 92 64 -29
6274b9o3K20o8k17J40R8m1R7j82J47l1m1j14J01m2J84j24l0O4n2j08J39m1j3o1
6299f7o9K01p2J99j53j38K0K74j61j21P5J03o9O8q7J70Q7l35K0KM4j33O4n0K77
6324A49N1j84j62J28nJ16lk37K0M01j81L5j03J09Kl25J13Q8p1J69K2q4n4J2K8
6349C4L6j76M3L4M8l7J40k34R1P2o6o5K08k3q1j21R4R5k33L02j83k0k5R3o6J90
6375A50R9l34Q9p9K8J03o5KK6p7M5MK6n0j6K47k89M7R8l06P7J92k50K01J91p8
6401H1j49K45k25j20J52J80oj17j3L1k19j38M24l2j95j83J05K1J73M5j92Q7j6
6424f1K0J9Q8p5N7j89K25p5k3R7l14J61J23K0R8j39Q0n2J8j59J38J38j06j47L0
6449b8J7oj54m8K02k8R6%lJ42j27q2J03r5J5O3j54R7J10k08m2M52n24K15K4j12
$$ plain form
6274 -29 -92 128 60 -157 -17 81 40 137 -45 102 71 30 -84 17 -25 159 35 5 69 17 -91 48 7 -6 -67
6299 -67 -136 65 -7 192 39 -99 -79 195 34 -87 -12 91 22 90 3 173 260 -75 -55 -53 -9 -142 -78 -128 149
6324 149 200 16 -146 -18 -23 93 90 -147 -127 274 93 128 25 134 136 -189 -76 12 -59 110 132 48 -6 6 34
6349 34 70 -106 -63 -29 19 -18 122 -112 -21 51 -15 -80 128 105 24 -97 -3 92 -141 161 -22 -42 -67 26 -40 150
6375 150 249 -85 4 -75 -47 56 -9 -7 19 -58 -13 -9 17 -33 -49 198 -91 -44 54 -252 -175 17 -233 -32 159 81
6401 81 -68 177 -48 -168 -16 164 158 41 28 59 -160 -298 126 94 -101 -284 -179 -158 15 60 -132 -45 -61
6424 -61 -41 -22 66 -9 48 -141 84 9 -14 83 -231 -70 53 73 171 32 112 60 78 -81 57 195 89 -58 -28
6449 -28 -11 -17 -171 -219 -17 -45 51 51 48 190 63 -19 84 -11 4 67 -87 10 120 -88 -130 322 -202 13 37 -75
6475g5R6N2n1J6j35J40j11n5K03j53M5j71K29N3k64K01K02j87j20J25j32j92L34
6498E0K4m6J87k53lL6l16K13Q9J95j01Rrmj10m6J94p2j60N5kP6J0j45R4j6J09
6525E8q0j05L25l14J71J18k28L9J19P2j90K0NJ19r2o5K01j23lp6K91j84J0J24
6549B12j76k0j24J1oQ3p1J17J22p4L0o5k0j94J16J89k42K6J06QL9j42J33j7l3
6574Hm7J22n8q8K46j54k9O8p9J47k65L7K40j80M2N0j89L7J4K04Pj99J04o9O8j37
6600a00P1N8j00P6J73k32P0J53k65K26kj68o4Q2NR8m6m0J4p4Q7k21K03O6j56J06
6626B0j23K6K42k01N3rl8rK41k59N3J50j31M3J7l0Q8l3j42k6j12L22q7l03L21
6651G3p1J4O8j26O4l7q5J11j78M9J57k01O9K40l06K1K82k33R5j26j51N15j41k52
$$ plain form
6475 -75 21 73 22 38 -97 43 -68 -123 80 -73 -28 -199 30 83 -181 20 222 35 -85 40 -92 -284 50
6498 50 74 28 215 -38 -41 -5 -321 -108 -19 176 75 84 75 71 -39 -85 109 37 -123 -68 -70 6 16 -129 -35 -51 58
6525 58 -22 -127 198 -116 55 173 -55 -16 103 175 -15 5 10 129 37 -28 173 50 47 -29 262 78 88 212
6549 212 36 16 -108 -97 -103 -20 -91 26 148 74 104 39 19 -175 -59 130 -112 -86 20 28 67 -75 58 41 8
6574 8 -39 83 25 -63 183 29 0 68 -11 136 -129 -92 148 -32 10 60 -129 -92 -78 126 133 -66 38 -31 37 -100
6600 -100 -29 29 -71 5 178 -54 16 169 -96 130 128 -40 -104 -22 -17 81 35 -5 9 -65 22 -199 4 70 -86 20
6626 20 -103 -77 165 -36 17 8 -30 -39 202 -57 -4 146 15 58 75 45 133 100 -42 -68 -180 142 55 -248 73
6651 73 2 16 84 -42 22 -15 -100 11 -167 -118 39 -162 -93 147 -159 -138 144 -89 6 -120 -271 244 103 -149
6675a49K19Q4j08K3j18j1K02j65N1J69k88J96j37j10K17k30O4p7K74p0J0K0q3
6698a7J3n7j83J65o7Q1j36j01K35oK4K17j94P0j85K46j96J79j84n6K86j9n0L8
6722A03l2j4O0j07j59j64L63N7J0k19q3MQ1J44J88l78m5K50j38J03J2o2N6Q2k14
6747a02R8r0N7L9R7l5R0p6j55J27K6L2q6r4r8L79r0j05ol1K81l37K97j31j18L0
6773aO8o9p4j20J77r2n5L30r4j66J07O0q4l4j5Q8o2J94k21R9M5o4M3J09l05K30
6799I4N9j47n2M9k06K97j07r1K22k34J73j10P8j72K48j18j51J21M0p0j16J87m
6822a0J74j20N0j14O0MQ8l73q7L82k92L14k27O2MJ2K13k08J42k11PJ95k07K45
6846A03l2J02l64K65j16k1m3p0J80K38j06nj21j16L6p4J80K6J2l09R2P6K21r7
$$ plain form
6675 -149 70 154 46 69 -49 -60 142 -23 28 197 -91 105 -32 -142 75 -155 -91 -168 106 36 46 66 -17
6698 -17 -4 -61 -244 -79 -146 -65 -201 -302 -67 -73 -49 168 -26 44 -141 105 -91 88 -96 -152 134 115 65 103
6722 103 71 57 117 10 -149 -313 50 107 117 -102 -185 -181 -100 44 232 -146 -191 59 -79 24 36 -26 30 112 -102
6747 -102 -4 -94 -37 2 99 64 154 78 -77 50 76 108 22 -72 -170 209 119 14 8 -23 258 -79 218 87 -31 -1
6773 -1 67 -2 -76 -196 -19 -111 -166 164 70 -96 11 71 -13 -47 -62 26 -36 158 -63 36 81 17 60 169 -136 94
6799 94 153 6 -46 3 -203 94 -13 -104 118 -116 57 -53 25 -147 101 -17 -168 -47 -7 -77 -193 -6 -10
6822 -10 164 44 94 -20 40 44 132 -241 -328 54 -238 76 -151 -89 -85 -73 140 -68 74 -137 -130 65 -142 103
6846 103 71 173 -191 74 -42 -63 -106 -176 4 242 136 131 10 -106 -70 -144 36 62 74 -235 -143 -67 154 57
6870E7ro6K2o5O7R9J60j59j71J41J51j49l51K14M4j84K55j17M8j32r9K64R8k27
6894a09J89k09J77k41L54j43J8j36N6J00o6j45L2l6m6J00J19j77J82j75L8J51
6916C3J50k03J76j04k14J59%K06j31k19K33k5p1%oJ58o7k72K76j49J08l5k10K68
6940F1q1M6n4J39j25k1L72k42m8m7J10M5k51j04K74k77K46j1J9Q6j2j15J06q5
6964C1rj13m5K95P1k63K2R2k54J47J22J8p8r6M8o8N5J61k22J96k87K97n8j07K24
6989A79k68N0N7kJ97r6n9n4p3K34j13jk97K74j20L8Q2r6ok5K7J27j08k0J35j22
7015f0j53L18j69k5J75j06n2l6K7N4k4J19l4R0k40J09L9j60J72j3k9k48J01K78
7039A33j60lJ48n5j24J38q0N6n9j5J19j63P6l1K2J06Q0m75M10P8j96kp0J57r4
$$ plain form
6870 57 48 -18 4 -61 6 105 265 106 -65 76 227 78 -273 -59 -15 -199 56 -61 -13 -145 -244 20 118 -109
6894 -109 80 -129 48 -193 161 18 36 -100 -44 56 -10 -155 -123 -159 -205 -105 14 -163 19 -156 -118 33
6916 33 183 -20 156 52 -162 -3 -3 203 72 -147 86 61 -10 -10 -16 142 75 -197 79 -70 38 3 -207 61
6940 61 -20 26 -28 111 -14 -35 337 95 47 0 110 155 -96 -200 74 -203 43 32 51 137 125 10 116 31
6964 31 22 -91 -136 159 230 -33 -11 81 -173 -26 96 114 36 -60 -12 -80 -25 136 -86 110 -177 120 62 -45 179
6989 179 -89 -39 18 16 213 117 58 4 -69 165 52 51 -246 28 -92 -54 28 -68 -74 -99 -72 55 -53 -73 62 -60
7015 -60 -213 105 -64 -89 86 -20 -72 -108 -81 -27 -51 68 34 124 -116 -7 32 -128 44 31 2 -246 -145 133
7039 133 -27 -30 118 63 -61 77 -3 53 -6 -21 98 -65 11 -20 2 108 188 -287 123 201 5 3 -67 90 -4
7064do5K60l26M18l70L38j13K5j90K15r9n6Q4k12J93l7j05n2Q9Q9j97OL77l53
7088h5J34k6k34K13o6J53k41J14L8J39j93J21j86k3K54P1R8k71J6qm5J9K0j87
7112a75J73K4k9M3k26J73o3J08k3J50q8K6K9k20Q5k00J79N5j5p9J25r9j4J63p1
7137C1j65K95r5j22ko7Q5jR0L6r5L83k95J32j24j58J72j70J11j37N8q1L2J8J20
7162E1Q7j00L4J63k35j57P4o9mQ9K7Q2J27r2m0j00K5K5j5R6m0j40l4J63O4J24
7188B05k45K69j70j4j82K77j42J28j38J02j44J16K6j63K41j11M5o7Q4j01M7pj79
7211a23J29j6J07q6j04O6p2m3K13%j04P5o4J78j09j56L9j00K93k67J55j63Q0L7
7235c5j04K06j47K16k9L3j32m2R1r4l5J49m6j63j7L09l06K31j5o9Kk19K35n3j06
$$ plain form
7064 -4 -69 191 -135 283 -87 251 138 163 -27 188 89 33 117 -95 98 61 -44 -96 -7 82 -115 -109 268 -85
7088 -85 49 23 -211 2 -64 89 -152 -38 0 139 -54 67 -119 -142 112 183 281 10 26 18 -27 -8 12 -175
7112 -175 -2 22 -7 36 -190 -17 -80 28 5 155 67 93 122 -98 -13 -213 -34 21 6 -73 52 -47 -61 102 31
7137 31 -134 161 66 -56 -58 -125 -40 -41 49 85 -10 373 78 210 86 -72 100 -70 41 -96 -38 -119 -87 -69 51
7162 51 138 38 72 235 0 -157 -83 -152 -156 -67 -40 42 169 77 37 -63 -38 -13 -28 68 28 -112 -146 17 81 205
7188 205 -40 229 59 45 -137 140 -2 126 -12 90 -54 62 88 -75 166 55 100 33 117 16 63 56 -123
7211 -123 6 -10 97 11 -93 -27 -99 -142 71 71 -33 42 -22 156 47 -109 -70 -170 123 -144 11 -152 -72 -35
7235 -35 -139 67 -80 136 107 140 8 -34 57 -37 -72 77 31 -132 -149 160 -146 85 70 1 3 -216 19 -34 -140
7260a40J65JL1P4j98r8L66j46j27l6K3K91p6k69K36k01K52K4j72R1ML5j65K45
7284B10l85Q6NJ7J13j49R2R4k30J50j5J97j61k09J24J23P3k44J59q1L55k17R0
7307A97j90r7q9K49j6j04Q1j5QJ70r3j26j1j70K42j6j35K7j00M1L20k06L9J86
7331A92j78p0J23j08O3j38rj05q3L23o6R1j05J24J8j49rM8j75K58rk84K24o3J01
7356A4k11J18p9J13q4K52m92L81m7J34r2j43K57n2R9k54O5M7P2r6l5J03Pkj2k84
7382b21L33R1k64J45j53L9M8j39p8J89k46L48o6m1Q6r9m6O4K4k97K73LK03o2q9
7407D5j16N2J42L4j33r0J59M8j76P9l2n3J24k58K55r9l3k6J05j09K2Q8o5m8k4
7432a09Q1j11K02j69J38o7J23k03J88j10J14j21N4j2O6j80J2J09L36l11Nj04n6
$$ plain form
7260 -140 25 26 57 131 -67 -165 201 55 -72 -108 -85 206 130 -139 97 -104 148 172 0 91 95 130 -35 210
7284 210 -175 -89 -84 -67 46 -103 -11 83 -147 3 -12 185 24 -185 -61 62 135 -109 50 -31 324 107 197
7307 197 7 -90 -179 70 54 -50 31 16 24 194 101 -25 -36 -206 36 20 -115 -88 -188 -147 173 -33 6 192
7331 192 14 -56 67 -41 22 -116 -125 -230 -313 10 -56 35 -70 54 72 -77 -86 -38 -213 45 36 -248 -24 -87 14
7356 14 -197 -79 -158 -45 -129 123 -369 12 -35 99 7 -136 121 69 168 -86 -21 26 98 2 -33 70 77 75 63 -221
7382 -221 112 203 -61 84 -69 -30 18 -121 -199 -10 -256 92 26 -15 71 -28 -74 -10 14 -283 -10 -7 196 134 45
7407 45 -71 -19 123 157 24 -66 93 141 -35 44 12 -41 83 -175 80 -19 -52 -78 27 -82 -60 28 -37 -85 -109
7432 -109 -28 -139 63 -106 32 -35 88 -115 73 -37 77 -44 10 -2 64 -116 -104 5 341 30 35 -69 -125
7455a25K06ro9K32j17l0q9k09K28J03j70Q4l3k1K8K08Rk50J1Lq8J38kKj29J12
7481B3j51J35J7l0K25m24M00p7j29k6L19j70k37J53J10k00R3L1j94j7K75m9j10
7504c3J73r7RJ4k38J49j75K91j08n9J08Kk36J83J53l06K57r7JR0j65J2J15j68
7528a25L1p3K78P5j75K1l6j16K9Qm7J73j46Q6K9j1j10K53m10L59j15j71P1J9j91
7553b94L17J13k06k0M2J50L8o4K16j35k01nK2L8J49j05n1k02K08J2r6jJ28p4l5
7578e6K73j38M5k06J35n1L2m25L11O7m0l2q1K67j52j24q0M80l36R1O7J3l53K66
7602b7k1J05j20Oj51J68J77j48n3L50p6k16m2J37N8n1j16J44l02K87j87K15p1
7625F6n6K9p4N3lLj74N2J23N5R8j84K9j69J61k25K14J39N3o2P7k20q3Q0R3J15
$$ plain form
7455 -125 81 72 3 235 118 88 -1 -210 18 121 -49 35 2 -19 9 217 226 -24 -13 -10 -98 40 38 40 -89 23
7481 23 -128 7 24 -6 219 -205 195 118 -11 -37 282 112 -125 28 138 -62 31 62 -132 -149 126 77 -33
7504 -33 140 43 52 66 -172 -23 -198 93 -15 -74 34 36 -200 -17 136 -170 87 -10 -9 81 -84 -72 43 -125
7528 -125 -94 -167 111 186 11 32 -4 -120 -91 -83 -130 43 -103 -17 12 1 -109 144 -266 93 -22 -193 -122 -103 -294
7553 -294 23 136 -70 -90 -48 102 140 76 292 157 -44 -49 -27 11 160 55 4 -198 10 22 -74 -75 53 -21 -56
7578 -56 217 79 124 -82 53 2 34 -391 -80 -13 -53 -85 -166 101 -51 -175 -255 225 -111 -20 47 60 -293 -27
7602 -27 -48 57 -63 -57 -208 -40 137 -11 -64 286 210 -6 -48 89 147 96 -20 124 -178 109 -78 137 66
7625 66 10 39 -35 18 15 18 -156 -104 19 74 172 -12 17 -152 9 -216 -2 137 190 128 205 -15 -98 -18 75 190
7651A90Pk46Q3J4j19m0J87o2j16J16k52J71qq9K46K7j12n3J34q2j87N1MK24O9
7676A57q5q5J3oJ07mj20J52l35J67l5K36l64J23J38m3J47M0k1pk82O2J03j04p0
7701a16Q4l0N3lK43l8l71M19l46qJ05N4j04J16l57N01k49P1P7k4l4J3l1N7j8R5
7727A59l53K51p2j85J39R9j48K90k1j21q1r2J74r4j14K08o7J48m0l4j8k35L56
7750A49j45J13k97R5K44j92R6Pj16P9j74J33P5n0j10kR4J77k40J72Pk15j15L50
7774A35o7l9N7N4r5k59L73m24K33K12K7n5%K8j43l9J15j07l7j1O1J37Lj88jL8
7800HR8O6k11P4j34l8J48r6J60j94J92K0K6K4k20j2j14J50j77K82k43j19N04m38
7824b44J87Lj87M37l95K15j2M4k72L48j37J47k42k0J54j7N5j83R0n1K28j14l16
$$ plain form
7651 190 197 -49 34 48 -71 -111 76 14 -102 14 -238 -67 -75 -164 82 109 -3 -56 78 -4 -191 -140 -136 88 157
7676 157 72 -13 0 -6 101 97 -23 129 -206 -39 -74 162 -202 -79 59 16 163 203 182 175 -107 -45 58 -46 -116
7701 -116 -32 -62 -9 -12 231 193 -178 241 -105 -113 -8 46 -58 58 -299 202 -47 24 101 77 43 56 25 82 64 159
7727 159 -194 57 -15 -200 -61 38 -110 180 159 38 -43 -135 39 -55 -169 39 -28 120 80 46 28 -207 149
7750 149 4 117 -180 -85 159 -33 63 70 -46 33 -141 -8 67 17 -93 -95 -1 176 -64 108 115 -100 -215 135
7774 135 68 29 86 140 45 -214 159 -265 -32 180 207 152 152 180 37 -2 113 6 -31 -42 19 156 159 -29 -30 8
7800 8 106 172 -39 35 -99 -137 11 -85 75 -119 73 93 119 143 -77 -89 -203 -53 -230 52 -191 -310 194 -244
7824 -244 -57 -54 -241 196 -199 16 4 48 -224 124 -13 134 -108 -128 26 9 64 -119 -29 -80 148 34 -282
7847b82K79K36jk83m5J66j46n3q2N88l03n7k22J51K57k11j27J74k37J44No3K18
7870A06k58R4kJ39k97J62lK24k06p1P9J08k04J95j80J46J1p8L66l91P9m1m2n3
7894a17J82P0k44JJ41r7o9n3K23R4k93J22N8P1j69J18j8j2N9J8J01j06r8N4m1
7919ej90K00J29j53J57j90J18lj24M7j28Q7np8m3J79P9r3j36N6ok4J90j43r2K1
7945a50J05k17Q4Q6m4K03k06K61l27R5K22k33J74j85j1J54K58j77l0k54L64k41
7967f9J65j9J4p1O9j26jj85K49Q3k05K88k43J33j34K36j43J26k05J31o1k5o0J42
7991H9o0Q2n2o0o4L8J02m7mk3K42k73M7m4J06j9N2K7J18k53M6K1Q0k12P8o1N2
8018Hl1J6J53j42N2j32N3J71p1J7j37N4j2p5K00p5j91K23j88M6J98p7m4k1n4j32
$$ plain form
7847 -282 -3 233 232 -51 -96 70 -76 -129 -211 377 74 17 -205 -54 203 -8 -135 39 -198 -54 -49 -112 106
7870 106 -152 -58 -60 79 -218 -56 -59 165 -41 -112 -33 75 -129 66 -114 32 43 -35 331 -60 19 -22 -64 -117
7894 -117 65 135 -109 -108 33 -64 -133 -186 37 131 -162 -40 18 89 -80 38 20 8 67 85 186 80 -18 36 -5
7919 -5 -195 5 134 -19 138 -52 66 63 -61 -14 -142 -55 -60 -138 -181 -2 77 -16 -152 -96 -102 -126 64 -79 -171 -150
7945 -150 -45 -262 -178 -92 -136 67 -139 122 -205 -110 112 -121 53 -132 -143 11 269 92 62 -192 172 -69
7967 -69 96 77 91 20 89 -37 -38 -223 26 109 -96 192 -51 82 -52 184 41 167 -38 93 32 7 -53 89
7991 89 29 111 59 -1 -65 -27 75 28 24 1 243 -30 17 -27 79 60 112 139 257 4 50 71 151 -61 17 -44 8
8018 8 -23 -7 146 4 56 -76 -23 148 77 94 -43 11 -1 -76 124 49 -142 81 -107 -61 137 60 16 -5 -59 -191
8044a91L31J46m8m12J12J86O2k10oJ11j48R2l3k5r0J87n0j08J05q1JR1j6pm0L3
8070hk3J00m5k72J98j21J60j14j28K21K4J10l8J93l0l78L05r0j7j98K96N1k94
8093i8J56j14J99m6o0j73J22j39L49m6l15K85j23J7jm3Q1K06j40l48J86j01P9
8116f7m1j1K72j70J25j76J87p3k25J30J23j18K89j84n9J49j50K10k34RM9L6j27
8139e6O3j16J99q7K0n7k8n6J09N1JJ07k33Q8m1RJ75j11K5N8j31l1M3k02K95Oo3
8166C7O9k9j17k7N2p9J55k20K62K3k74P0N5Q1J70m71K25p4K9K63l33J36J82j33
$$ plain form
8044 -191 140 286 238 -174 -62 124 186 -24 -30 81 -67 25 -8 -33 -123 64 14 -94 11 -70 -69 22 6 -1 -41 -8
8070 -8 -31 69 24 -248 -50 -171 -11 -125 -253 -32 -8 102 64 257 227 -151 154 64 47 -151 145 196 -98
8093 -98 58 -56 143 97 37 -136 -14 -153 196 150 -165 120 -3 14 13 -30 51 257 117 -231 -45 -146 -67
8116 -67 -108 -119 153 -17 108 -68 119 46 -179 -49 74 -44 245 61 2 151 1 211 -23 -14 35 71 -56
8139 -56 7 -109 90 3 23 -34 -62 -118 -9 42 43 150 -83 5 -36 -27 148 37 62 120 -11 -42 1 -201 94 100 37
8166 37 106 77 -40 -67 -15 -94 61 -159 103 126 -148 -78 -23 58 228 -243 -18 -92 -63 200 -133 3 185 52
8190E2p
8191D5
$$ Imaginary data points
##PAGE= N=2
##DATA TABLE= (X++(I..I)), XYDATA
0@%%%%%%%Qj6J6j6K4l2M0m8O4q8J04j20J44j76K16k58K98l52M16m83N57o42P39
30C95q51R71j101J250j410J588j788K004k241K502k787L096l432L805m214M658
46B445n140N666o246O884p583Q351r203J0153j1215J2410j3763J5311j7107J9218
60A0181k1738K4805k8633L3577m0232M9704o4336R0058j47944M98227j10859r90421
72f97611Q86438K17756q57804K42211Q06062o66455m52181P81728J44741p72002
82c67117J98517M77756m27240j73533N86085m0161n07371R9332L57173j80360
92B3081k16384K70800J18132l80761N2106M24625k34124l77949L58635J70901
102B09062m12755J14235M34108l77812l31406N52612O3833n93411L00979M26694
$$ plain form
0 0 0 0 0 0 0 0 0 8 -8 8 -8 16 -16 24 -24 40 -48 56 -64 80 -96 120 -138 160 -192 224 -259 298 -344 395
30 395 -456 515 -586 664 -746 842 -946 1058 -1183 1319 -1468 1628 -1804 2001 -2213 2445
46 2445 -2695 2971 -3275 3609 -3974 4377 -4826 5327 -5888 6522 -7241 8070 -9037 10181
60 10181 -11557 13248 -15385 18192 -22040 27664 -36672 53386 -94558 403669 292810 -697611
72 -697611 188827 406583 -451221 -209010 597052 -69403 -521584 260144 404885 -367117
82 -367117 -168600 309156 -118084 -291617 294468 254307 -253064 -153732 203441 23081
92 23081 -193303 77497 195629 -185132 -133026 291599 57475 -320474 38161 209062
102 209062 -203693 -89458 344650 -33162 -364568 188044 251877 -341534 -40555 386139
112C86139n87750p4830O81140l02743n38621N40144K12445o20762J59682N58683
122D13527m51808l50167O03078L1997n83979K71763L99501m43313j34464M70400
132B26535o7920l95716J70903K80271k47083j71598L28844O5041l69590N9135
142a21178L35122j94895k57501L04102J47910l78674J7507M17902k24349l56740
152c10794M07085J42316m85792J57184M18628l89925k19277M74087l9273m29059
162b74820K63389K80036m05799n0766M40450j89901l34667L44388J08505l64476
172a83661J24148K78090k48088j42259K61583J4996k34264Q2169J88883j58170
182a6573j10748K13044J9359k21110M8638J77758r8737j26510J63541Q4355k38964
$$ plain form
112 386139 -201611 -276441 404699 101956 -436665 103479 315924 -304838 -145156 413527
122 413527 -38281 -388448 214630 246627 -337352 -65589 333912 -109401 -243865 226535
132 226535 158615 -237101 -66198 214073 -33010 -204608 124236 189277 -180313 -121178
142 -121178 213944 19049 -238452 65650 213560 -165114 -147607 270295 45946 -310794
152 -310794 96291 238607 -247185 -90001 328627 -61298 -280575 193512 154239 -274820
162 -274820 -11431 268605 -137194 -187960 252490 62589 -272078 72310 180815 -183661
172 -183661 -59513 218577 -29511 -171770 89813 104809 -129455 -47286 141597 -16573
182 -16573 -127321 85723 105082 -116028 -67390 110368 11631 -114879 48662 133017 -105947
193a05947p419K75483j30569k26656K66394Q7466l17513R2617K75235k39957j73000
204b03866L14133K8815l15489J47721K43983k98996r4006L48580r5591k75219
214a99935K33473J23849k68708K7186K30263j32272j65771J87937Q3321k05031
224h5688K4428J82084j20503j13036J63991L2961j54442J9334J28983n2134j13134
235h7156R9789Q3041j64076j5359J90131q0571j48161J58396O3630j85075K7975
246e7436J75946j10176j37472J84109N7281k22152O8612J88134j86878q4393K25291
257A00866m3430j84519J31479J06830j68157k6247J72773n5160j49787J32909
267A7557Q6934j69755J2464J50729r1505r1104J15503L1881j09945N540J06395
$$ plain form
193 -105947 -113366 162117 31548 -195108 71286 158752 -158761 -66144 209091 -30866 -203866
204 -203866 110267 139082 -176407 -28686 215297 -83699 -177705 170875 75284 -199935
214 -199935 33538 157387 -111321 -84135 146128 13856 -151915 36022 119343 -85688
224 -85688 -61260 120824 321 -112715 51276 84237 -70205 -50871 78112 25978 -87156
235 -87156 12633 95674 -68402 -83761 106370 25799 -122362 36034 99664 -85411 -57436
246 -57436 118510 8334 -129138 54971 112252 -109900 -41288 146846 -40032 -124425 100866
257 100866 57436 -127083 4396 111226 -56931 -83178 89595 34435 -115352 17557
267 17557 104491 -65264 -52800 97929 6424 -84680 30823 62704 -47241 -41701 64694
278F4694m2178j02227Q8569O1007j28190O903J26612o4301q4207R6706M0495j10972
290d7089j571J21746n0056j07990J18064M9998j56937L5468J29619j10104o3433
301h2285J34050k490j22180N2880R7656j00005n6101J36261j1582j28444R1053
312H813P3614j26679j004J07873m9084p1203O9518M2946q4352j5332R4403l3313
324A6200q4872Q0761L9412r3170J5026P4396m2057n0936N3111L8489o8197j5307
336c7144Q9059l2492q1045Q1188L2551r9788K2164P8234n5562m8531O9968K2232
348D0834q3491J3739Q8662o3825n6749J02273m836r4066O1024N1035p8847r035
360c3282O8658j6880o0563L8967M9211o8057j6509P9857l2455n8066O2581J7255
$$ plain form
278 64694 22516 -79711 8858 69865 -58325 -51422 75190 10889 -73318 23388 63883 -47089
290 -47089 -48660 73086 23030 -84960 33104 83102 -73835 -38367 91252 -18852 -82285
301 -82285 51765 49275 -72905 -20025 77631 -22374 -78475 57786 46204 -82240 8813
312 8813 82427 -44252 -45256 62617 13533 -57670 11848 54794 -29558 -44890 49513 16200
324 16200 -68672 12089 51501 -41669 -26643 47753 5696 -45240 7871 46360 -21837 -37144
336 -37144 51915 19423 -61622 19566 52117 -47671 -25507 52727 -2835 -51366 18602 40834
348 40834 -42657 -28918 59744 -4081 -60830 41443 36607 -57459 3565 54600 -24247 -33282
360 -33282 35376 18496 -42067 -3100 46111 -21946 -38455 41402 8947 -49119 13462 30717
372C0717n5414J0610M1087j7145l9255K6524L9095n1359j4204O8645k7285n3816
384d1800N3652J7178n5982P872M8811j9455m5097L9683L3442o9496L232P5719
396D7759n0692m0313P5440p999o2331L5271L4545m2743j5825M9868l88n5778K8717
409d469M1393n7539l929N7043k9865k8842L6739N413k6355m655K4436M362l4767
422b1035J6342L4275m2153j0342M6619j6144l0529K6344J7606k8015j3523L9926
434A9371n69n3146L3537L7914o3020N442N7961m4469k5959N2772l030m0647J7059
447f784L1940k8741k2054M6605j043n0108L3908K4223m6843R979K9213k4537p428
460a1670J4322M212q212j2818J7677P013k7381J4571K1695k5207n851K1045J54
$$ plain form
372 30717 -24697 -14087 27000 9855 -29400 -2876 36219 -15140 -29344 39301 12016 -41800
384 -41800 11852 29030 -26952 -19080 29731 10276 -34821 4862 38304 -31192 -27960 47759
396 47759 -2933 -43246 32194 24195 -38136 -2865 31680 -11063 -26888 22980 22592 -33186 -4469
409 -4469 36924 -20615 -24544 32499 2634 -26208 10531 15944 -10411 -15066 9370 13732 -21035
422 -21035 -4693 29582 -12571 -22913 23706 7562 -22967 3377 20983 -7032 -20555 19371
434 19371 18802 -34344 -807 37107 -25913 -20471 37490 -6979 -32938 19834 16804 -23843 -6784
447 -6784 25156 -3585 -25639 20966 19923 -30185 3723 27946 -18897 -8918 20295 -4242 -11670
460 -11670 2652 6864 -1348 -14166 3511 10524 -16857 -2286 19409 -5798 -11649 9396 9550
473I550j7175N02K6622j5132l0134M2255M985n5380L1772L0408n2452Q866M4069
486B8756l1348k3997L4339R642l4708P949L8149l1531k1988N0762j2578m0967
498b7520L7287N981l3442J8613J1567j7650l495M005Q288m532q108J4670j960
511C704j2650J1023M357m668n423N20J8549j3398j6679L3262j2788l5101M1342
524A2050O862m5450K3668K3480l5869r36L3472j0652k9512K5308K2963m0852L992
537a1476M3225l7916j7082M8778j8540k8195L1993l208k2199J2781Q012p705o795
550h327O368O785j0705M032Q717j0454M802J962o302J4326j1602j1148K7128j4082
564A500j8809L3722j0378k9507K8242Q212k7570P779K1141j5953j6997K8428O846
$$ plain form
473 9550 -7625 -7123 19499 4367 -25767 16488 21473 -33907 -2135 28273 -24179 -15313 28756
486 28756 -2592 -26589 7750 17392 -17316 -9367 28782 -2749 -24737 26025 13447 -27520
498 -27520 9767 15748 -17694 919 12486 -5164 -8659 -4654 3634 -898 -9006 5664 3704
511 3704 -8946 2077 6434 1766 -3657 -3137 15412 2014 -14665 18597 5809 -29292 12050
524 12050 18912 -26538 -2870 20610 -15259 -16195 17277 6625 -22887 2421 25384 -15468 -11476
537 -11476 31749 -6167 -23249 25529 6989 -21206 10787 7579 -14620 -1839 6173 -1532 -8327
550 -8327 -1959 4826 -5879 -1847 6870 -3584 1218 3180 -3122 11204 -398 -11546 15582 1500
564 1500 -17309 16413 6035 -23472 4770 12982 -14588 -6809 14332 -1621 -18618 9810 16656
577A6656l8438J9942K8724m2620N768L8741l6175j1350L6429j4810j6789J9484
589E562J068j4838J814J3606o431j2216J6408K72j5108J6681j714j4295J6034
602F843o221q646K0901j3390j0378K3090j2546j2325K0942l960j5008R783J0923
615A0008j2699r162K2029l316k7164K7287J1780l9187J9234K3329l7522O666K7780
628A9063k3769o663K1105m424j4459P264J2354j5033n912K2673j0667j4343K2848
641A0037p948j4220K0139o840r263J5417q947l650J2988r849k426J0623n526m224
655c689N177L781p189n354J6147n834j8026K4349j126k7593K4989P205l0014J7180
669CJ3790k2988L850J5137q354r150J0010Q160j6785R01J9573j8595o466K4291
$$ plain form
577 16656 -21782 -1840 26884 -15736 -9968 28773 -7402 -18752 17677 2867 -13922 5562
589 5562 6630 -8208 -6394 7212 781 -11435 4973 5245 -9863 6818 5104 -9191 6843
602 6843 622 -8024 12877 -513 -10891 12199 -347 -12672 8270 4310 -10698 -915 10008
615 10008 -2691 -11853 10176 6860 -20304 6983 18763 -20424 -1190 22139 -15383 -8717 19063
628 19063 -4706 -11369 9736 5312 -9147 -1883 10471 -4562 -10474 12199 1532 -12811 10037
641 10037 2089 -12131 8008 1168 -8095 7322 -1625 -5275 7713 -2136 -4562 6061 535 -3689
655 -3689 1488 5269 -1920 -7274 8873 3039 -14987 9362 8236 -19357 5632 12837 -17177 3
669 3 13793 -9195 -5345 9792 1438 -7712 2298 10458 -6327 -5426 14147 -4448 -10914 13377
683A3377j5598r384K1582j1311p432J4193p300k256P082m497K028J358j222J135
697A755k870M445j013p028J1558m814j2074J7988o491j5840K1935l768j7509J8391
711D665J227j5221Q806O467o971k946Q788L199j4594O317J3107k0779K409J9533
725A4007k0347j682J8272j4833l213J2078o630j265M065k06J205m013M566K301
739D305q155P652Q55q916R973l634q803J3056p421p119J5004q774o487J3279n860
754a045n097P975k44k281j056N527J884j1533Q227P550j8205Q400J1234j9864
768h528N161J1600j4587K110P842o462K57J544K205n19n001Q087l16q737J1108
783E764j800r068J0834m495n866J0498p199k827Q601q506P33O628p001J999L187
$$ plain form
683 13377 -2221 -11605 9977 -1334 -8766 5427 -1873 -4129 2953 -1544 484 1842 620 1755
697 1755 -1115 3330 2317 -4711 6847 2033 -10041 7947 1456 -14384 7551 3783 -13726 4665
711 4665 5892 -9329 -523 5944 -1027 -3973 4815 8014 -6580 -263 12844 -7935 -5526 14007
725 14007 -6340 -8022 10250 -4583 -7796 4282 -2348 -3613 452 246 1451 -2562 2004 4305
739 4305 -3850 3802 4657 -4259 5714 2080 -6723 6333 -1088 -8207 6797 -1977 -8464 4815 -1045
754 -1045 -6142 1833 1589 -692 -1748 3779 5663 -5870 2357 9907 -8298 102 11336 -8528
768 -8528 -3367 8233 -6354 -4244 3598 -2864 -2607 -1063 1142 623 -4378 3709 3393 -5344 5764
783 5764 3964 -5104 5730 1235 -4631 5867 -1332 -4159 4442 -4064 -3331 3297 -3704 -1705 1482
798A482k773K562l187L147K809r030Q396L464j4021J0150L743j5190R697M128
812E377j1595O086K487n075J686l80K746j687l788R393m477o025J1963o309o073
827e671J2258o311l685Q475o859K21M452o341L631R11m423N313k623q90M311n796
843c027L300L160p916P528J98r688J0619j330r276J0192j821o564P199k074j826
858a326J865k219L855l073k257Q857p775k679J1243q868j918J0290q436m70O973
873D062o195K304J392l689M564k750r54N034o120J760M064p032N056N57p004P515
889B564k007n866R290m011m533Q767m800j733N659m019J402L82k034M649n345
904a635l05P139q978J149Q273j0030J816O774q656L220L879n590M162n84j556
$$ plain form
798 1482 -1291 1271 -1916 1231 4040 -4990 3406 6870 -7151 2999 6742 -8448 1249 5377
812 5377 -6218 -132 2355 -2720 -1034 -1414 1332 -355 -4143 5250 773 -5252 6711 402 -5671
827 -5671 6587 276 -3409 5066 -1793 -1572 2880 -3461 170 1081 -3342 1971 -652 -1542 2769 -3027
843 -3027 273 3433 -4483 3045 3243 -6445 4174 2844 -6432 3760 1939 -4625 2574 500 -1326
858 -1326 539 -1680 2175 -898 -3155 5702 -2073 -4752 6491 -2377 -4295 5995 -2441 -2911 4062
873 4062 -2133 171 1563 -2126 2438 -312 -1266 3768 -2352 -592 3472 -3560 1496 2053 -4951 2564
889 2564 557 -5309 3981 -30 -4563 4204 -596 -2329 3330 -689 713 1095 -939 3710 -1635
904 -1635 -1940 5199 -3779 -2630 5643 -4387 -2571 4203 -4453 -1233 2646 -2944 1218 634 -922
919i22M435m883J882L239o870N080J263p455O838j616o077Q041l948l464P594
934C137n773J06N837n419J650L099l992L954j585j524M785o157J512N063q791
949d098L623M495r668N024L235p796N450R05m098M466k000O37K307m432M730J1
965B791n825P034k259n532P872m549l568P137n679l63N478o060K518K822n029
980c212M625q5k977N126l897P71L919o622M027K018p899N985N81q000O984o12
996G32n545O280k146j664L798k991K489O30l816O015k427m135P689m742k830P248
1012D585o277n33N431o544K183K742n273L994J94l266M982l168j23M346n002K684
1028I55K231n918N356l57o678P372k281m965O749k888k868N456l865N38K351l284
$$ plain form
919 -922 3513 -1370 512 3751 -3119 1961 3224 -4231 2607 991 -5086 2955 -993 -4457 3137
934 3137 -2636 -2530 3307 -2112 -462 2637 -1355 2599 1014 -510 4275 -1882 -370 4693 -4098
949 -4098 -475 4020 -5648 -624 2611 -5185 265 1170 -2928 1538 -462 175 2482 -1950 2780 2791
965 2791 -3034 4000 1741 -3791 4081 -468 -4036 3101 -2578 -2941 2537 -3523 -1005 1817 -3212
980 -3212 1413 1328 -1649 3477 -420 351 4270 -2352 1675 3693 -4206 1779 2360 -5640 1344 732
996 732 -4813 1467 -679 -2343 1455 -1536 953 1583 -2233 3782 1355 -2780 4909 167 -2663 4585
1012 4585 -1692 -2225 3206 -3338 -1155 1587 -3686 308 502 -2764 2218 -950 -1073 3273 -1729 955
1028 955 3186 -2732 2624 2267 -4411 2961 680 -4285 2464 -424 -3292 2164 -1701 -1163 1188 -2096
1044b096L662j306k347N983m405j510O723o649N27N603o830K292L326o054L434
1059C53O66l844M290j924j408M015l984J565K800n372M485J64n191O095k193l574
1075c057O235l845j585N462m708L09L426m077K102O48k918M014k775p43M682n403
1091b233J080M782o850L258L082o460M246R23m402M227j603j359L709l447R24
1106a23K478m910L667M10m667N059j842l178N738l677j257N460n052J129L679
1121B914n043K694J531m037L810j478j751L924m142Q92L323n513K831K232o165
1136c978M656N18m150M814j507k258M607l271M22K751m044K510Q54m094M133j518
1152D45l392N094l267j136M441m529R79L489m644L052J274l686L859q92k034L675
$$ plain form
1044 -2096 1566 260 -2087 3896 -509 -2019 4704 -1945 -1418 4185 -2645 -353 2973 -3081 353
1059 353 1019 -2825 1465 -459 -1867 2148 -1836 -271 2529 -2843 1642 1806 -3385 2710 517 -3057
1075 -3057 3178 -667 -2252 3210 -1498 -1189 2237 -1840 262 910 -2008 2006 -769 -1512 3170 -2233
1091 -2233 -1153 3629 -3221 37 3119 -3341 905 1828 -2574 1653 50 -1309 2400 -1047 -123
1106 -123 2355 -2555 1112 1522 -3145 1914 72 -3106 2632 -1045 -2302 3158 -1894 -765 2914
1121 2914 -2129 565 2096 -1941 1869 391 -1360 2564 -1578 -686 2637 -2876 -45 2187 -3978
1136 -3978 678 1196 -2954 1860 353 -1905 2702 -569 -147 2604 -1440 1070 1924 -2170 1963 445
1152 445 -2947 2147 -1120 -2256 2185 -2344 -1365 2124 -2520 532 1806 -1880 1979 1087 -947 2728
1168B728l253o9L201m641K283J508m866L751k99m106N019j811k123M781k967l
1184h67L439l803K037J729l919L641j224k855M335l093j489M334m151L54L124
1199A592m552K735J236l598L985q32k335M382k856l88L825m163J251K062m203
1214a859K891k26l568M282k192k198M576l476qL494l830K242J724l568L464n98
1230A150k425L988k508j124L675m059L34L005m453K193J107l581L297o94k270
1245b365M165k595k55L680l937J342K458l775K538L34l263L363j711j843L756
1260A892l243j14L137l791J630J794l506K958L28k933L780j715j387L860l439
1275g49M33K761m153J889J134l447L058o02k371L525k229o62L362l643J434K134
$$ plain form
1168 2728 -525 -594 2607 -2034 249 1757 -3109 642 343 -3763 1256 -555 -2678 2103 -864 -867
1184 -867 2572 -1231 806 2535 -1384 2257 1033 -1822 2513 -580 -2069 2265 -1886 -1532 1592
1199 1592 -2960 -225 1011 -2587 1398 566 -1769 2613 -243 -631 3194 -969 282 2344 -1859
1214 -1859 1032 806 -2762 1520 -672 -2870 1706 -1770 -1778 1716 -2114 128 1852 -1716 1748 1150
1230 1150 -1275 2713 205 -919 2756 -1303 -969 2036 -2417 -224 883 -2698 599 -95 -2365
1245 -2365 1800 -795 -1050 2630 -1307 35 2493 -1282 1256 1590 -1673 1690 -21 -1864 1892
1260 1892 -1351 -1465 1672 -2119 -489 1305 -2201 757 1085 -1848 1932 217 -1170 2690 -749
1275 -749 -316 2445 -1708 181 1315 -2132 926 324 -2047 1478 -751 -1413 1949 -1694 -260 1874
1291A874l769K625P31l171L203j089j910L410k560j94K800l371J303J379l401
1306b140L049j43k964L911j712j675L544k823J54K640l411J689J117l213L188
1321A211n27k429L182j706p89K854k841O41J937l146J990R86l252L207j152k269
1337b103L446j905r60L095k621R15J567l056K693l49k319L407j817j240L267k711
1353f91lK244l001J154J342k958K315l38j851L105j524r15K974k585O63K163l414
1370a320J829R00k853K561p32k077K790j896r83K897k541P93J551k534K103L54
1386H42k315L082j098j412L326k679j98K459l165J139J384l051J999j01j997K457
1402F72j317o27K406k238P76J986l059J909J212l018K720l20k437K945j581j190
$$ plain form
1291 1874 -1895 730 1461 -1710 1493 404 -1506 1904 -656 -850 1950 -1421 -118 1261 -2140
1306 -2140 909 766 -2198 1713 1 -1674 1870 -953 -799 1841 -1570 119 1236 -1977 1211
1321 1211 684 -1745 1437 -269 -1058 1796 -1045 -404 1533 -1613 377 1363 -1889 1318 166 -2103
1337 -2103 1343 -562 -1522 1573 -1048 -133 1434 -1622 1071 722 -1597 1810 -7 -1247 2020 -691
1353 -691 -694 1550 -1451 -297 1045 -1913 402 64 -1787 1318 -206 -1121 1853 -732 -69 2094 -1320
1370 -1320 509 1409 -1444 1117 385 -1692 1098 -798 -1781 1116 -1425 -632 919 -1615 488 842
1386 842 -1473 1609 511 -901 2425 -254 -452 2007 -1158 -19 1365 -1686 313 212 -1785 672
1402 672 -645 -1272 1134 -1104 -328 1658 -1401 508 1720 -1298 1422 1102 -1335 1610 29 -1161
1418a161K687k536K91J485k499J623M42k161K620o95j263L014j933k79K383k948
1434i30J105J514k928J814M35k633K272q00j039J993j844L57J787k612J682Q28
1450A001k457K497j38k211K956j371j066K323k095Q1J647k589J547M30k179K059
1466D35o88j009K289j640k6K427k486Q52J507k861J893M37k277K243p66j417K031
1483I44j446k10J503j916J174M44k036K098M8j958K763j238j075K457j966j16
1499e30J952k250P16R68j855J690o89j248K126j578k46K160k181P85J518k819
1515a481K106M60k336K132k34j580K043j217o69J688j681N48Q78j669J463l91
1531F0j257K382j280q62K483k213M5K152k321Q15R28j912J369O8j118J609j344
$$ plain form
1418 -1161 1526 -1010 -719 766 -1733 -110 332 -1829 791 96 -1167 1847 -86 -365 2018 -930
1434 -930 175 1689 -1239 575 1010 -1623 649 -151 -1190 803 -1041 -684 1103 -1509 173 1001
1450 1001 -1456 1041 903 -1308 1648 277 -789 1534 -561 -480 1167 -1422 125 555 -1624 435
1466 435 -253 -1262 1027 -613 -639 1788 -698 154 1661 -1200 693 1130 -1147 1096 330 -1087 944
1483 944 -502 -712 791 -1125 49 493 -1543 555 603 -1355 1408 170 -905 1552 -414 -530
1499 -530 1422 -828 -112 856 -999 691 2 -1246 880 -698 -944 1216 -965 -180 1338 -1481
1515 -1481 625 1085 -1251 881 647 -933 1110 -107 -776 912 -769 -221 657 -1012 451 60
1531 60 -1197 1185 -95 -957 1526 -687 -642 1510 -811 4 932 -980 389 457 -661 948 -396
1548c96j42J536j791P65J245k338J352N79k047J900j41j662K086j180n04J623
1564H85j472K97J072j547J383k01j321K068j332m00K030j929j87K083k370O08
1580c33J334k103J124M52j384J263n44p7J234j381M73J058j913J113M91k063J917
1597F61l35j607K018q59j049J855j248j43J088j074Q83J70j139J684p53p67K038
1614A423j321l49J721k225M34J488k277J160L80j608J288n1j153J596r29L03P25
1631F05j209J225N6j413J521j51j584K185j018j175J767j312k86J345j444Q10
1647g8K03r24J185l99m21J323j023j94J533j919Q37J257k322J363J31j905J798
1664D45j83j164J295q19m4P27r59R63M08j552J685m94j138K056j314o81K172j560
$$ plain form
1548 -396 -538 998 -793 -28 1217 -1121 231 810 -1237 663 522 -1140 946 -234 -738 885
1564 885 -587 -290 782 -765 618 417 -904 1164 -168 -568 1462 -467 -654 1429 -941 -333
1580 -333 1001 -1102 22 474 -910 353 -191 -268 966 -415 58 1116 -797 316 807 -1256 661
1597 661 326 -1281 737 -122 -1171 684 -564 -707 381 -693 190 360 -779 905 152 -615 1423
1614 1423 102 -247 1474 -751 -317 1171 -1106 54 434 -1174 114 63 -1090 506 -423 -120 605
1631 605 -604 621 677 -736 785 634 -950 1235 217 -958 809 -503 -789 556 -888 -78
1647 -78 125 -799 386 -13 -434 889 -134 -328 1205 -714 123 1380 -942 421 552 -1353 445
1664 445 262 -902 393 -426 -470 257 -702 261 669 -883 802 308 -830 1226 -88 -769 1403 -157
1682a57l70J356j215j93Q44j196R66j21o83J286r29K9J522j671M87J100j712J235
1700E78K0j482J479r5j442J290m11o56J127q96L29M46r67R29q6r49J686q90m59
1719d49J782j408k51J494j801O01O32j183P75M9j027J163m59l70R40j075M83Q28
1737G24j534J017O73j891J428L7j223J376o27p07J384q98L7N64r64P57J17r93
1755g23J170m84n19J282j093n3J306j407K77J167j723P01N05r84J060k17p22Q20
1773C63o15J45P40j258J061J01j388J370l04j243J861q68p74J528q55j28O98q75
1791d41O13K70p35R40p91l59J183q64p6J215j569L67R93j437O30M84j231R09J61
1810B62o75Q05m41J41N50q07K98L29j235J056J26j225J579q92p63J473p90l76
$$ plain form
1682 -157 -527 829 -386 -579 265 -931 35 -86 -769 517 -412 -383 1139 -532 -45 1055 -657 578
1700 578 598 -884 595 500 -942 348 -63 -719 408 -488 -159 287 -680 249 163 -786 900 10 -449
1719 -449 1333 -75 -326 1168 -633 -32 600 -583 192 241 -786 377 -82 -452 488 -587 -104 724
1737 724 -810 207 880 -1011 417 454 -769 607 -20 -727 657 -241 -204 360 -604 153 270 -723
1755 -723 447 -37 -556 726 -367 -420 886 -521 -244 923 -800 -99 406 -578 482 265 -457 363
1773 363 -252 -107 633 -625 436 537 -851 519 215 -1028 833 -35 -809 719 -136 -264 434 -441
1791 -441 172 442 -293 647 -144 -503 680 -184 -260 955 -614 -247 746 -691 -61 423 -808 101 262
1810 262 -413 392 -49 92 642 -165 133 462 -773 283 409 -816 763 -129 -892 581 -209 -585
1828e85R24q34L52O02q40O73K3n33J017r05j26J200j485L97P83j471P28O03j669
1847a146J182J18r65J151l17m21Q06o62K69N85o90M83Jp79Q83n18p18J313r09
1866c34k02J140j123Q5P93p84N61J16n99O15l39j21Q34q95M51O73j481M93P75
1885F58j550J160j1j107J072k79n02R80q00J61N05o29P89l4q31R94k81o95J234
1904H34r01l36J152j333j90J307j170L35M42q47Q20L0k53O81p15K69O61j019K57
1923B4O78j353J185n6j016Q75n63n73J240o47k70R16p25L93Q2p24Q80K9j011J425
1943G89q55m19J294j157RR62j120K29O05j056P74J06o06P17n71r9Q78q96O81J92
1963D57j112Q89K03j141J155l11q02R54m97k21O66l95o5N97q69P24j87n50R74
$$ plain form
1828 -585 339 -495 -143 459 -381 292 315 -218 799 -106 -232 968 -517 -120 663 -808 -80 523 -1146
1847 -1146 36 154 -811 340 23 -398 408 -254 15 600 -90 393 394 -385 498 -20 -738 575 -334
1866 -334 -536 604 -519 -434 359 -425 136 252 -347 268 -71 -192 642 -253 198 871 -610 -117 658
1885 658 -892 268 257 -850 222 -57 -559 421 -379 -218 287 -342 447 413 -418 576 295 -400 834
1904 834 -67 -403 749 -584 -774 533 -637 -302 140 -707 113 143 -110 571 -144 125 786 -233 24
1923 24 702 -651 534 478 -538 337 -226 -799 441 -206 -476 440 -285 108 190 -534 346 375 -636 789
1943 789 -66 -485 809 -348 -339 623 -497 -268 337 -719 55 161 -445 272 -299 -398 480 -416 265 457
1963 457 -655 234 437 -704 451 140 -662 292 -205 -426 240 -155 -220 377 -492 232 45 -505 469
1982D69m32l84J119r55j86J069j221P27J98p78O53m3n29O00k74m80Q46o89J98
2001i2L98r18Q25N2r88J065k63p69J224p81j24P04o74L25L67o68M86J19p50R70
2021E08o08j07R25j098J62O78q83M36K49p20P29J56r62R65j45m96N95m65J99L37
2041D55q74N61j51q02J213j84q95J036n56j91R51q13L9P59o95L25K19p21Q84l78
2061A82j87M68q18K00N27j103N83M70r89P37K03q77R34k03k78L54k97j32O23m92
2081i5M11q7o24O99l06n22R19q07j54R83j070K93Q01j032N25M87o13K52K41l79
2101g8N63n74K87M79j127N64L29j313J151j89q12J120l95o13Q12l02j22N79o34
2120b75M05K81p07O92k41o57J036o57o9P82r66lQ11r71J00P57p78M23J81m95Q69
$$ plain form
1982 469 37 -347 772 -183 -369 700 -521 206 404 -374 279 236 -293 307 33 -447 399 -290 -92
2001 -92 306 -612 213 265 -723 342 79 -690 534 -247 -371 333 -341 -16 351 -317 169 288 -462 508
2021 508 -100 -207 718 -380 -218 460 -423 13 262 -458 271 427 -535 430 285 -211 384 -81 118 455
2041 455 -419 142 -9 -811 402 218 -677 359 -197 -388 563 -250 -211 548 -147 178 397 -324 560 182
2061 182 -5 463 -355 -155 372 -731 -148 322 -667 70 273 -604 330 127 -151 203 -94 -226 397 -95
2081 -95 316 229 -395 304 -2 -524 395 -412 -566 417 -653 -360 441 -591 -66 421 -192 60 301 -78
2101 -78 485 -89 198 677 -450 114 443 -870 281 92 -720 400 5 -608 204 -98 -220 359 -275
2120 -275 130 411 -296 396 155 -502 534 -123 -192 590 -376 -379 432 -539 -439 318 -460 -37 144 -351 518
2141E18n72K34O08r86K30L23p24M43J16r83J023m3q18R53n51k42R33p31O9M52
2161B52n61M38J35p54J062o81k44J144r82r8P51j044K99P48j364J015N0o08Q83
2180D41n03j0M02m38J23M98q76N66J0p50Q58k37o79J107o82l23Q80m66l28P76
2200C69q29Q02j33l42N20m65r2N36n80k1O97q91L89N09j290R01L24q51R22l64
2220A11n43P71n10K3N65r85O07J15o96R35l58n59J083m35o38J113p77P8N66o77
2240b11K21L16o73N08j74l16P73o67J68O09r33N00L35j249R94J79j001R15k0n98
2260c24N35j47k59N42o63L46J80n92O56l66m60J105p29m37J132q63j4J053j050
2279c55K15M95p87N84K4l66L48l63JO76j053M67M65j004P35L5o97N78K99n26N71
$$ plain form
2141 518 -54 180 788 -198 32 355 -369 74 190 -793 230 187 -631 322 -229 -471 462 -269 -200 252
2161 252 -309 129 264 -490 572 -109 -353 791 -191 -289 462 -582 -283 465 -899 116 166 -442 441
2180 441 -62 -72 330 -108 15 513 -363 203 213 -537 321 84 -595 512 -170 -493 387 -79 -407 369
2200 369 -460 342 209 -133 387 -78 -170 366 -214 -235 462 -429 -40 469 -821 80 404 -447 475 111
2220 111 -432 339 -171 -148 417 -568 39 154 -542 393 35 -524 559 124 -514 599 -178 -100 466 -211
2240 -211 10 326 -347 161 -13 -329 444 -223 -55 554 -379 121 456 -793 201 380 -621 294 274 -324
2260 -324 211 64 -195 347 -316 30 210 -382 274 -92 -552 553 -176 -613 519 -344 -358 695 -355
2279 -355 -140 355 -432 152 176 -190 158 -205 -204 472 -581 -114 351 -653 82 117 -580 -2 297 -229 342
2300C42l22j78O44n88J17L92o38O40k49m63O11o34j71Q73r30K40R19j202N57O88
2320F48j057N22K15l95N27k31l59O18p67KN02o15O00r4p11Q85j36q73R23j33m17
2341c46Q18m44l25P95q22O14j32m95O76k34j33K99n61l1P85j076M77M82p56O56
2361B47N5p44N79k24p3P43n24J05Q7m99N69Jo93N68l34k58O65l24n51J067m92
2382c0l08N72n73M97J15l10N08l95k44O20o74J09N51q34K48N61j203P51L33p64
2402d70O94M5m11M02l40J1K50m36M29M3m11L14p5o26R53n23k83P12l25k44P72
2423D81r62L85K99m60M95j37l08N57k84l04N02n75K59N24q98N51K30p49L53k1
2443f2l29O32k09k63M91n06L18K01n51N30k37k78O09k92k94O74q13J56P99r87
$$ plain form
2300 342 20 -158 486 -102 15 407 -231 409 160 -303 308 -326 -497 376 -554 -314 605 -597 -40 648
2320 648 -409 113 328 -67 460 229 -130 488 -279 -277 225 -390 210 116 -595 290 154 -719 204 71 -346
2341 -346 472 28 -297 498 -324 290 158 -337 339 105 -28 271 -290 -321 464 -612 -135 347 -409 247
2361 247 302 -442 137 -87 -160 583 59 164 251 -248 321 322 -371 197 -137 -395 270 -54 -605 462 -30
2382 -30 -338 234 -339 158 273 -37 471 76 -168 452 -222 -113 438 -396 -148 413 -790 -39 294 -470
2402 -470 224 269 -142 260 -80 -69 181 -255 174 217 -194 120 45 -581 372 -151 -434 278 -47 -291 481
2423 481 -481 -96 203 -257 238 101 -207 350 66 -238 264 -311 -52 472 -426 125 355 -394 -41 -62
2443 -62 -391 241 32 -231 260 -246 72 273 -278 252 15 -263 346 54 -240 434 -379 -223 576 -411
2463d11M18K35k46K61l40l08Q76m82j00K82o53K95M42o85O63j75o35Q12oo04P04
2484C43l90j22L79j81N1L0m92M86K08p00N66m44J52L72l65J14M25o45OP98p29
2505a38J79J11l38O27m28j49L81m93N8M40o45M45n3m98O96q4m91N54j43l65P11
2526C77l82j31N08m04N3K34m98M56k42r8N25p59o3P09n14J25L26m71M28P4m77
2547b24N55j65k47M74o21K72M5l94M80l39l17P51m02j09N44m04j41O04n44R4M49
2568C61m03j5L39n31O13m24r6L82n70P9N80o31J0O29p02L98J89n22N45j41l48
2589b58M28k67j32J38o8N0L73m03J31q1k07L10j04k23P73m66r1N97o54P1K71k85
2611i7M15j91j56K92n68J53N24p75K82L02l91J80K91p72N92j21k17M71k20r3L83
$$ plain form
2463 -411 7 242 -4 257 -83 -391 485 3 -97 185 -468 -173 269 -416 247 72 -563 249 243 -361 343
2484 343 -47 -169 210 29 80 110 -382 104 312 -388 178 -266 -114 258 -107 7 432 -213 -207 591 -138
2505 -138 41 152 -186 441 13 -136 245 -248 -190 250 -395 50 -3 -501 195 111 -380 174 31 -334 377
2526 377 -5 -136 372 -32 21 255 -243 213 -29 -127 398 -361 -424 285 -229 -104 222 -249 179 253 -224
2547 -224 331 166 -81 393 -228 44 89 -305 175 -164 -481 270 -132 -241 303 -101 -242 362 -182 -88 361
2568 361 -42 -57 282 -249 364 -60 -156 226 -344 -265 315 -316 -306 323 -379 19 208 -314 231 90 -258
2589 -258 170 -97 -229 -91 -159 -109 264 -139 -8 -89 -296 14 -90 -313 460 -6 -97 500 -154 -83 188 -97
2611 -97 318 127 -29 263 -305 -152 372 -403 -121 181 -210 -30 261 -511 81 -40 -257 214 -6 -99 284
2632B84l51J25Q0k70L86j98k07K50Qm78P12m55J13N21p26J95J91k79K5J90j09
2653GQ3k01o8M34m77M20j82k46K96J49o62M98P6m17M51j45p8J70j70O2P6l26L41
2676I1n0k76L78k35q6L57m28J70L04l90J63K81o13L60J42n42O59j67j89O7J43
2697A39J99q8n03L62J26m62L58o4m75N49j63O5K08k60k23M66l87P7rl4K35M0j95
2720c9M39n87K2N98n69J45K49m58M19j9l38K22K2k92M90k30l78L14j10j00K67
2741F7k86J71M3l12O60l78LM34k94j11K91n01o1M41j62J71l99K82K14m03k5J48
2763gk64K21K48l83L09J61n74M03N3k35K43j41O3J19j71j4K5p4JQ4m15M07l5j93
2787a69L56l81r5M81k13J71K6j89J9M3k18J39J12j83K24l18P3K54m57L48K9l71
$$ plain form
2632 284 -67 58 138 -132 254 56 -151 99 107 -371 341 -114 -1 520 -206 -11 180 -99 -74 116 7
2653 7 90 -111 -179 255 -222 198 16 -230 66 215 -447 51 127 -290 161 16 -62 108 -62 0 76 -250 91
2676 91 41 -235 143 -92 -178 179 -249 -79 225 -165 -2 279 -334 26 168 -374 285 118 -71 -4 139
2697 139 338 250 -253 109 235 -227 131 67 -408 141 -22 43 251 -9 -232 234 -153 -76 -85 -119 116 156 -39
2720 -39 400 -187 -165 433 -136 9 258 -200 219 200 -138 84 106 -186 304 74 -304 10 -100 -200 67
2741 67 -219 -48 -5 -317 343 -35 -32 402 108 -3 288 -213 -274 167 5 176 -223 59 273 -130 -155 -7
2763 -7 -271 -50 198 -185 124 285 -289 114 167 -68 175 34 97 216 45 31 56 -18 -17 67 -348 59 24 -169
2787 -169 187 -194 -289 192 -21 150 176 -13 6 49 -169 -30 82 -101 123 -195 -122 132 -325 23 52 -319
2809c19K32R2O3N6O6m24L61j75K60L3m37J58J36l52L39j96l0J08k42M6N76k24
2831A27j49M13n10N8J07rJ17j07k23L65k48o5M9j21J22J31k43K02k4k70L86o1
2853D7k80O34m00r7K37l45K53N5k29K80k18q4L05m57K17Q4J83j73R6j69J6J85
2875A40l19O2K14j59L29m32R4J90j86J81j14j30J72k51J30R4r4L2K79j91k68O19
2897C92m91J11J70l75K72Oj74J60k49J90N1k82J11N18o46K60J02k84J63j03j46
2918b44K58l9m1R8j32J46J82o46N95j54k07M74r1k70L00j05m81M23Lj99L58k88
2940f0J19o4k55N90j95k06K85l32j76M73m60K71J94k80K96O4m95J82m1oK00r7
2962Gk89L92p5r1J84k91J82Jj87K81l14M6L59l65K47k6q4J06p4p8k8k5j49N21
$$ plain form
2809 -319 -87 5 68 124 190 -234 127 -48 212 245 -192 -34 102 -250 89 -107 -137 -29 -271 -225 351 127
2831 127 -22 391 -119 -61 46 37 154 47 -176 189 -59 -124 -75 -196 -74 57 -186 16 -8 -278 108 47
2853 47 -233 401 1 -96 141 -204 49 104 -125 155 -63 -147 158 -299 -82 2 185 12 108 -61 -45 140
2875 140 -179 -117 97 -62 267 -165 -71 119 -67 114 0 -130 42 -209 -79 15 -79 -47 232 41 -227 392
2897 392 -99 12 182 -193 79 85 -89 71 -178 12 63 -219 -108 410 -236 24 126 -158 5 -98 -244
2918 -244 14 -25 -66 32 -100 46 228 -418 177 23 -184 290 199 -71 229 124 -357 66 69 -130 228 -60
2940 -60 59 -5 -260 330 135 -71 214 -118 -294 179 -281 -10 184 -96 200 264 -231 -49 -90 -96 104 7
2962 7 -282 110 35 -56 128 -163 19 20 -167 114 -200 -154 205 -160 87 61 -23 83 9 -69 -97 -122 -271 250
2986B50m66J82J69k22J80K76m62L20l5l95J95N1k59J52k5j58K47l26K84J70m48
3007c20M30l3k88L79k75r6M85k86j70L97j54j02l8l31O47r0l82O34n70J74J57
3028A68l89J57L19l75K96Q3n18M89l8l99L76j4k12l1MJ14j57j56M98k54k13N24
3050B72l82m3L60l19J15K08j65r7Q0k30M97k88k60L41j73o5L0J33o7J24k66K99
3072A04j34m8J01p2jL36j69k89M04j21j53K23k57M1J47l86L41p4l0J93k25p0K45
3095A06j12k1k5J9J14j31l5R8L6l33L54m3K1J28n62L67K54n05N76k20l47L48j37
3118e0J12k4k31NK89m07L20m0j16K45j31Q8J72l52j58M47l95J28K37k77J87K13
3140B62n75L43n9n8J35j8p4J36L0J33l16P6P8kk51k3K79j78K60k13q3P5j5q9R8
$$ plain form
2986 250 -216 -34 135 -87 93 369 -93 227 192 -203 -8 43 -216 -64 -89 -247 0 -326 -42 128 -320
3007 -320 110 77 -211 168 -107 -203 282 -4 -174 223 69 -33 -71 -402 245 155 -227 407 -163 11 168
3028 168 -221 -64 255 -120 176 259 -259 230 192 -207 169 155 -57 -88 -84 30 -127 -283 215 -39 -252 272
3050 272 -110 -153 207 -112 3 211 46 -51 29 -201 296 8 -252 89 -84 -149 -119 14 -53 71 -195 104
3072 104 -30 -78 23 -49 -50 286 117 -172 232 111 -42 181 -76 -35 112 -274 67 -7 -37 156 -69 -139 106
3095 106 -6 -27 -52 -33 81 -50 -85 13 49 -284 70 27 48 176 -386 -19 235 -270 306 86 -261 87 -50
3118 -50 62 38 -193 -188 101 -306 14 -26 -142 103 -28 60 232 -120 -278 169 -226 -98 139 -138 49 262
3140 262 -313 30 -29 -87 48 30 -44 92 122 255 -61 15 93 91 -160 -183 96 -82 178 -35 -118 -43 -58 -147 -49
3165d9j80K56R9j45N1k1jL86n17J73J39k26R4m0l8JM1l55M15j29k93N59n1l53
3189a84J97k4K75j93K2P9j29r4M27l74j86J98q2j2L8p4R0oQ5J3l7k07K46j2l6
3214B0J81k15J5K42l78K16k12j61L88k24K98k75J40k23L43j59o4J65m35K18K75
3235A55j93Q6pj52J53j42l7P4n3KQ9q1j6J96m11N51r9k73L67k10J2L88n55K45
3259H9O1k15K37j63m2K13k78o3J75k73K40Oj95L56j88j16L36M5j89J07k10J16
3281D9K15k70k6J78j01O9Qj83Q2k4j99L68l31k3K89rmJm07N70q6k53L25k05k43
3306b10J31k9o6K94OL4k06j39L27Q1m03J86j19J92J3j34J16j48K6K2j1j04L60
3329B19j07k58M96n39J70K8j45J95N6l40K77O9m16N65j83j84R1r2J88P9k70J46
$$ plain form
3165 -49 -229 27 126 -19 32 11 10 396 -121 52 191 -35 59 19 -19 -18 23 -332 83 -46 -339 220 169 -184
3189 -184 13 -11 264 71 93 172 43 -51 376 2 -184 14 -68 -80 -42 -116 -26 -32 53 66 29 -178 68 56 20
3214 20 201 -14 1 243 -135 81 -131 -292 96 -128 170 -105 35 -188 155 -4 -68 97 -338 -120 155
3235 155 -38 48 41 -111 42 -100 -137 -63 -116 -114 -25 -106 -122 74 -337 214 115 -158 209 -1 11 399 -156 89
3259 89 150 -65 172 9 -33 180 -98 -161 14 -259 -19 -13 -208 148 -40 -156 180 225 36 143 -67 49
3281 49 264 -6 -32 146 45 114 122 -61 21 -3 -202 166 -165 -188 101 92 88 89 -318 252 166 -87 238 33 -210
3306 -210 -79 -108 -174 120 126 160 -46 -185 142 223 -180 6 -113 79 92 -42 74 -74 -48 -26 -37 -141 219
3329 219 112 -146 350 -189 -19 9 -136 59 115 -225 52 121 -295 270 87 -97 -6 -98 90 169 -101 45
3351D5J72l56J47O9j28J59j92L6ro6L21k3l67L29o0j34M6q9M3J77l39M1L25k80
3375a33J28K78k79J31k69j31M10M0m15L33k18Q0R2l07L63j20r7M13j58k93L28
3396A76p2m3J78m03K55o3O3k48K60k91O4K93k37O2L2j06J01J9J1L25n37L65k45
3419d1j22K98q0k32K46l17J54K5q9k9J92j97J91j22k03N23j49j19J38q3m2L3j31
3442a56J04P3j31K88k0m12L72k07j62L62j70k11M30k71J52m9m6M08j03m43K72
3463H0k12NK23j88N7k4j55J77O2k89L24j11J03o2pj48K08j23K54k21j47J94N4
3486E4k25K55o6j6K30k81k2K38j14j37l5p1J92j6q9P6R4j43J40j67j4J64j92J72
3510B7m9j84K64M9m04N02r9j64J99k86J01P1n1j3K6q6M84l85k15L88j95O2K8l31
$$ plain form
3351 45 217 -139 8 77 -51 108 -84 -48 -57 -123 198 175 -192 137 77 -57 -11 -100 -57 120 -219 -178 147 -133
3375 -133 -5 273 -6 125 -144 -275 135 175 -240 93 -125 -45 47 -260 103 -17 -114 299 141 -152 176
3396 176 104 61 239 -164 91 28 91 -157 103 -188 -124 169 -68 -6 26 -80 21 40 51 376 -161 204 -41
3419 -41 -163 135 55 -177 69 -248 -94 -69 -158 -187 5 -192 -1 -123 -326 197 48 -71 67 -16 -58 -25 -156
3442 -156 -52 21 -110 178 158 -254 118 -89 -251 111 -59 -270 160 -111 41 -8 -54 354 251 -192 80
3463 80 -132 -127 96 -92 -35 -59 -214 -37 25 -264 60 -51 52 -10 -17 -165 43 -80 174 -47 -194 0 54
3486 54 -171 84 18 2 232 -49 -71 167 53 -84 -119 -190 2 -14 -103 -27 67 -76 64 -103 -117 47 -145 27
3510 27 -22 -206 58 107 -297 205 106 -58 141 -145 -44 27 -24 -37 -11 -97 387 2 -213 175 -20 42 70 -261
3534b61K30K72n98M10k1q9K97j96q7J38N4k6J36m68L69o0j76J86j79L8J40m5q4
3557b0K15m52K48K2j42K52k1k56J73k1j12L07k22p6K62l29J81R1j98L7l4j58K10
3580d3N9k15L16j94R5J34n26L05q4P9J04j13M8J86N8k50K2r9L3K47k74K48j07
3603B9m3J13J00l43J79j88O0Q1k32K54O8k54L19rk02J30n7j48P9P2j52J61j71
3626a54K55m5k25L46j19m56O85j29l27L50j06j03P9L9Jj1l15N75l84J12J22r1
3648I9k03K53l11J30Kq1K22O6k49K72j13k91N07l00j57L03n1NR9n14M71j68j15
3671a24K68j53K6K53k89J2K25l39k7M08l55R5r6q9K90k46PJ90l31K38J19k53K39
3694F8n2k45J66p1J18J38j11M2Q7l50K82J53q5k11Rj54L68j28j62J00j83J69K01
$$ plain form
3534 -261 -31 241 -357 53 32 -57 240 44 -43 95 149 123 259 -209 160 100 -76 110 -69 -31 109 64 -20
3557 -20 195 -257 -9 13 -129 123 102 -154 19 -2 -114 193 -29 -105 157 -172 9 100 -98 -61 -95 -253 -43
3580 -43 16 -199 117 -77 18 152 -374 -69 -153 -74 30 -83 -35 151 209 -41 -19 -118 -85 162 -112 136 29
3603 29 -14 99 199 -144 35 -153 -93 -12 -244 10 78 -176 143 134 -68 62 5 -143 -64 8 -144 17 -154
3626 -154 101 56 -169 177 58 -398 287 158 -169 181 75 -28 51 90 91 80 -235 340 -44 68 190 99
3648 99 -104 149 -162 -32 -30 -111 111 177 -72 200 87 -204 303 3 -154 149 98 103 202 -312 159 -9 -124
3671 -124 144 -9 17 270 -19 -7 218 -121 -148 260 -95 0 -96 -185 105 -141 -134 56 -275 -37 82 -171 68
3694 68 16 -229 -63 -134 -16 122 11 53 140 -210 72 225 140 -71 -62 -216 152 24 -138 -38 -221 -52 149
3717A49k57J47J40j66j14L0M2r6l2M2J59j09J36q3J6j12K45l69P7R2R4O8j48j05
3741a54L68l31J50Q3l15L98k36Q9o7l18K91L07j74k3j17kNK3k76K64Rj77L74p6
3765I5j85J29P5j41Q8p7J74J41o33L06p8M0L50k78p1J96l15O4L11k46j3J02l14
3788b80L20K5k46K05j38j28L39j32j09R0j85L17J39j81L07j97l04L91k74J73j34
3809bl2j59K93k09J21m5m5L22j99k28K48n4q7K73m01M91p2l24K78k94q8M56j63
3832H0l8J79o4j93L21m23K23j80l0M23j16k66O4j24m1K64k64J98J24k45J13J76
3854A81k26J48j04j70J51j16K83j83m0J57J15l08K50o2j18J70K9n12M66r9O2K9
3876A03k18Q4J52m04L42K15l35K28p2j89J04l8J35K8l67M23k94L8L12l61K8R3
$$ plain form
3717 149 -108 39 179 13 -101 -71 -29 -125 -157 -115 44 -65 71 -12 4 -108 137 -232 -155 -63 31 99 -49 -154
3741 -154 214 -117 33 116 -199 199 -37 52 -15 -333 -42 265 91 68 -49 -51 -46 -23 -299 -35 -26 -203 171 95
3765 95 -90 39 114 -27 61 -16 158 299 -334 -28 -106 -66 284 6 -65 131 -184 -120 191 -55 -68 34 -280
3788 -280 40 65 -181 24 -114 -242 97 -35 -144 -54 -239 78 217 36 343 146 -158 233 -41 132 -2
3809 -2 -34 -193 100 -109 12 -33 -78 244 45 -183 65 11 -76 197 -204 287 215 -109 169 -125 -213 243 80
3832 80 42 221 157 -36 285 -138 85 -95 -125 298 182 -84 -20 -144 -185 79 -185 13 137 -108 5 181
3854 181 -45 103 -1 -171 -20 -136 147 -36 -76 81 196 -112 138 76 -42 128 157 -355 111 12 74 103
3876 103 -115 -31 121 -283 59 274 -61 167 95 -94 10 -28 107 135 -232 191 -103 -65 247 -114 -86 7
3898Gj33K27j54J20L4N2j55M5j76L5L56k20N2M1o7j23K10k07J10K26k01J84k66
3921cj08K01j42P2J47l04j8K25k63L02j5q9K30k46p6J61j61N3oj39M0K49k34J10
3945a4J54k87M35l82K64Qk11J89J5l91K78k5l75N25p1k02K37q3k64K48l5O2j77
3968a02QK79k53O8J08j60j0J95j39j53K06j60J7P8j39J23K10l03L68k61M3K68
3990B91k97R3M1k26M0O8m4O2J04l5N9k32J08J65k32rN3l50M75j28j55M32l21J50
4014A12r5j18P6J09L2j37n6j92L31L2k56M58k23j20K01k48J36K8m38L94q1k11
4036b66K83K27m38L98l26K4K27n8m1P2m11K37K41k25P7P0j51p1K38k75K85l21
4058b04K24L1j46J05J85l33R8O8O6P3k87P8K92l49Q0J76l23L74m09Q6L80j05k08
$$ plain form
3898 7 -126 101 -53 67 101 153 -2 43 -133 -98 258 38 90 131 64 -59 151 -56 54 280 79 263 -3
3921 -3 -111 90 -52 20 167 -137 -155 70 -193 109 94 5 235 -11 -87 74 -87 -34 -40 -179 -139 110 -124 -14
3945 -14 140 -147 288 -94 170 178 -33 156 171 -220 58 33 -342 183 112 -90 147 64 -200 48 13 75 -102
3968 -102 -94 185 -68 0 108 -52 -62 133 -6 -159 47 -113 -96 -18 -157 -34 176 -127 241 -20 23 291
3990 291 -6 87 128 -98 -58 10 -34 28 132 97 156 -76 32 197 -35 -44 9 -341 134 6 -149 283 -38 112
4014 112 17 -101 -25 84 116 -21 -77 -269 62 94 -162 296 73 -47 154 -94 42 70 -368 26 -55 -266
4036 -266 17 244 -194 204 -122 -98 129 71 30 102 -309 -72 169 -56 21 91 -60 -131 107 -168 117 -204
4058 -204 20 51 -95 10 195 -138 -40 28 94 167 -120 -42 250 -99 -19 157 -166 208 -201 -115 265 160 -48
4081d8K32m31J71K23j93O2l24J40K15n3N1o7k7N5J1p8j74M04l44J71P6M0j63O0
4105Io6K11j37j21k6N3P2J2l3k1p4M9K39k45J08l2j35N2M99n67L84m6n80O52j71
4130H6j06Q9l8k17M36l50P9K13l56J05n3o6K23j06l40M11j22L9L37l58KL04l83
4153a71K37n4p3K95p8k08J37j79k8K00j40O2Q7l22M62nk55O7J1MJ80l03J3K42
4177A81k82K46l72J24J93k49J40J19j39j54L66m67J31L04l25K16j50j17N83k71
4197G7n1L73m01j15L77m59J76O5l32N25k43qJ49Jj7O6j95R7R3r9j36R8j13K06
4221A34k26J34J36k22NKj43J89K06m56L07qr4J18k7l51K24n7N3K45j63j16J30
4244B0k61J25K95l94L40n5j55K63k64Q7K20m11J99K8k19L59l33K70n4n7j33M66
$$ plain form
4081 -48 184 -247 -76 147 -46 16 -308 -168 47 -6 45 -22 -49 6 17 -61 -235 169 -175 -4 72 112 -51 9
4105 9 -57 154 17 -104 -130 -77 -5 7 -26 -47 -121 -72 167 -78 30 -2 -137 -85 414 -153 231 185 -395 257 86
4130 86 -20 69 31 -186 250 -100 -21 192 -164 -59 -112 -178 45 -61 -401 10 -112 -73 264 -94 -92 212 -171
4153 -171 66 12 -61 234 156 -52 85 -94 -122 78 -62 0 87 -235 227 222 -33 34 45 49 229 -74 -61 181
4177 181 -101 145 -227 -103 90 -159 -19 100 -39 -193 173 -294 -163 141 -184 32 -118 -235 348 77
4197 77 26 399 -2 -117 260 -199 -23 42 -290 235 -8 -16 133 134 117 183 -12 85 178 79 -57 41 -72 134
4221 134 -92 42 178 -44 -39 -37 -180 9 215 -241 66 58 -36 82 55 -296 -72 -129 -76 169 6 -110 20
4244 20 -241 -116 179 -215 125 70 -85 178 -86 1 221 -190 9 37 -182 177 -156 114 60 3 -130 336
4266C36l03j94K35k52L58j73N6P3k74j36L61P7l25L20k14J6J39k09J55P8l80M30
4288A74k03J14J29k99rK02l93M37j45k4M4j53QM28k90k58L63l10J77L7k06L73
4310A96k17j66K73k68K00J80m29K00K14m89K14R7q7R8k36O2J52m4QL1Qm5K01j72
4334a9j39k6L36l4m6m32L32M3k91L64k20K68k09k18L40K34q1j54J66l7k7K8j26
4357E2K70l83J58j17j94M74j71r0j27m9nK71j39K16k29k45L38K2p0L65j97j29
4379B1J68m86J42K42k07J43m4R0L9J5m10L78l3j54K94j16k91L13n4J12j92k03
4401b33L87l18j23L65j32k9J62j66mM4L8P5j8O2P8j34p8j0K16k43J13k81K50j54
4425a33J77K7r0J23j52m6K10K4k96R8J85k88J18J19k37L99l08p2K17o9r8L66l05
$$ plain form
4266 336 33 -161 74 -178 180 7 63 136 -138 -274 87 164 -161 159 -55 -39 100 -109 46 124 -256 174
4288 174 -29 85 214 -85 -94 108 -285 152 7 -17 27 -126 -118 310 20 -238 125 -185 -8 29 -177 196
4310 196 -21 -187 86 -182 18 198 -231 -31 183 -306 -92 5 -82 16 -220 -158 -6 -50 -42 -11 -3 -48 153 -19
4334 -19 -158 -184 152 118 72 -360 -28 15 -276 88 -132 136 -73 -291 49 283 202 48 214 177 150 178 52
4357 52 322 -61 97 -20 -214 260 89 -1 -128 -177 -182 89 -50 166 -63 -308 30 52 -18 347 150 21
4379 21 189 -297 -155 87 -120 23 -21 69 108 123 -287 91 58 -96 198 82 -209 104 50 162 -30 -233
4401 -233 154 -164 -287 78 -54 -83 79 -87 -91 -47 -9 66 48 110 188 54 -24 -34 182 -61 52 -229 21 -133
4425 -133 44 71 -19 104 -48 -94 116 140 -156 -58 127 -161 -43 76 -161 238 -70 -142 75 6 -92 274 -31
4448c1k00j7J99qK68k90J14n9k61M52k4l49J14J2mJ24r3n5j20K02J79m0j24M8
4472C7j81J83M1j67J95m7k00O5J74j24N3o7J41q5j83P2K38l09J84P7l03L14J33
4495B41j75j05j10q3K91j73N5K21j53Q5J20n2j16Mj26K89k29j27J37LK2K75l58
4518f4J80k21o3K63j9k19K97j49p8J00j92M8J34k13J18J03j50L10qj74J77j50
4540C0L5q5q7K17J38m99J10R0j02N5J85k23J68N8K1J15l23J3L07l95M07m84K64
4563A5Q8j41J70M9l71L6K04k40K14r8J3J30l06K05J67l32J64Q2j78J00K5n0K5
4586b9N6q1K0O9j66L54l56Q8K01k32J59R1k53R6Q1k21K34R6l81J4K23m3J19j32
4610GK03J7l23K3j5KO5j79K96K58l91J89n6q7L32l46K5P2o0m1P4k7j10N0J7Kk4
$$ plain form
4448 -31 -231 -248 -49 -57 211 -79 35 -24 -285 167 143 -206 -92 -80 -84 40 -53 -108 -228 -26 153 113 -11 37
4472 37 -144 39 80 -87 108 61 -139 -74 100 -24 29 -38 103 18 -165 -93 145 -164 20 97 -206 108 241
4495 241 66 -39 -149 -232 59 -114 -59 162 9 94 214 162 46 50 -76 213 -16 -143 -6 -3 19 294 -64
4518 -64 116 -105 -168 95 76 -143 154 5 -73 27 -165 -117 17 -196 -78 25 -125 185 177 3 180 30
4540 30 65 -20 -107 110 248 -251 -141 -51 -153 -98 87 -136 32 90 111 226 -97 -84 223 -172 235 -249 15
4563 15 103 -38 132 181 -190 -154 50 -190 24 -74 -61 69 -237 -32 135 -197 -33 49 -129 -29 -4 -54 -29
4586 -29 27 -54 -34 35 -131 223 -133 -45 156 -76 83 174 -79 17 98 -123 111 207 -174 -160 63 20 139 7
4610 7 210 227 -96 -73 -88 -86 -21 -200 96 354 -37 152 96 9 341 -5 20 92 32 -9 65 38 -72 -22 -5 -3 -27
4637b7j38K59j99K2J25q8lJ28j59J56j27J46Q0j58j59J54op9L07o14K28K37k67
4660a82K76l44M21k57M9Kmj40L14j13M3K14l26k5P0J00k33J05k41K13Q0k36J71
4683d3K97k63K63j42k07J00R2l34M08j38l6N6j00P6Rq2K50l19J8J41rl13N04l06
4707g8N2J30k85M3K76j90J59j35J47k5k3j79M0M8n4J48j68J72O6j79k2J34j12
4730c5n6Q6J74j19l9J52j79M0ll2J14j41M7j16J86Q7k05L4k6K9k2j48L17N6k02
4755aK48l26j33L73j92p0J80k53P5K72l39K89N7n09L41j69k1K55k12M1K75l23
4777a42K02m5N2L1q4j46L45k39k5R5j16J01Q0k91P9L2K5K41r2l2J44l82Q9J83
4801A05k77P1O8m1J78j61N9O0k72M8J83p8n6K22l9k9k27Q7K10n8k72L17k45L23
$$ plain form
4637 -27 -165 94 -105 -83 42 -46 -49 79 -80 76 -51 95 175 17 -142 12 6 -73 234 -380 -152 85 -182
4660 -182 94 -250 171 -86 -37 -35 -39 -179 135 22 65 279 -47 -72 -2 98 -135 -30 -271 -58 22 -214 -43
4683 -43 254 -9 254 112 -95 5 97 -237 171 33 -3 53 -47 29 38 -44 206 -113 -95 46 37 -276 228 -78
4707 -78 -26 104 -181 -138 138 -52 107 -28 119 94 71 -108 -68 -20 -74 74 -94 78 144 -35 -57 77 -35
4730 -35 -91 -5 169 50 11 163 -16 24 21 -11 103 -38 9 -107 79 166 -39 -5 -31 -2 -24 -172 145 201 -1
4755 -1 247 -79 -212 161 -31 -101 79 -174 -99 173 -166 123 180 -329 12 -157 -178 77 -135 -94 181 -142
4777 -142 60 15 67 98 14 -132 213 -26 -51 44 -72 29 109 -182 -103 -71 -46 195 103 71 215 -167 -78 105
4801 105 -172 -101 -33 -74 104 -57 2 62 -210 -162 21 -57 -113 109 70 41 -186 -99 111 53 -219 98 -147 176
4825A76o6K8k32J88k35K21k03k7L16k39K8P3j18QN2k40M73k50j00J76k08K02J29
4848A52q3k7k1j89J50r3P7J14mj12K3J2q1K30j05o3J74j72R3l07J15K71m8j21
4872a5K6j19J12lj04K78j66r3N1r2Q0j42L98k76K08l67K66L5p7J72N5l54R7O4
4896C4L4q4N2j47Q2k2J02L1K1r0K99k11P2l32J88L3k26J31L54k26j07Q4k41J53
4920a6j48l3J23N3l0K23k27m0K24q1L6k08J34J81k09k76L69k88J12K64j69J10
4942A04k1k20MJ94q9J52j34j69L33j73n0Q2n4O8N7p6r6J76o1j57K71k33K84j65
4966B7R5K37m55L4J78j82p6J87j11J38j43L3J08k30K7K12j97pJ16j69J77J3p6
4989f4k5K13j58k9K0J35j50K17j75l3q4J0L06k7j42K8j33K87j12K4J5j62K1P1
$$ plain form
4825 176 110 138 -94 94 -141 80 -123 -150 166 -73 -45 28 -90 -82 -30 -270 203 -47 -147 29 -179 23 152
4848 152 69 42 21 -168 -18 -111 -34 80 76 -36 -13 -1 -82 148 43 -20 154 -18 75 -232 -117 154 106 -15
4872 -15 11 -108 4 1 -103 175 9 -84 -33 -125 -45 -187 211 -65 143 -224 42 77 0 172 227 -127 -30 34
4896 34 68 -16 36 -111 -29 -51 51 82 103 13 312 101 173 -159 29 62 -164 -33 321 95 -12 72 -169 -16
4920 -16 -164 -197 -74 -21 -51 172 -55 -95 129 48 84 -124 10 191 -18 -294 75 -213 -101 163 -6 104
4942 104 83 -137 -133 61 -28 124 -10 -179 154 -19 -69 13 -41 27 84 8 -88 88 27 -130 141 -92 192 27
4966 27 122 359 -96 -62 116 -66 -142 45 -66 72 -71 -38 70 -160 -133 79 -118 -125 -9 -178 -1 12 -64
4989 -64 -89 124 -34 -63 -43 92 -58 159 -16 -49 -133 -123 183 156 14 42 -91 196 84 108 123 -39 -18 53
5013E3k95P2p3K52n4j04K13Kj19qO2N5jJ64k17J06j7n2N9k36j04L21k23K04j4
5038D6j03K45j97K1j05J3J00M0J7j5K10l69q4L47k29K03r3j44K31m95L46K05k90
5061a00J17J25k05J04J03k2o2j5j24j7k6R1pj64L3O4K54K6n6j99j46J27J31j80
5085a48K59n8L1j04Q2pr5O2L7k63J18J1j20J00R1j0p1o9J17m1mK0j92l8L86j84
5111i0nJ06q0R4j28m1o2J77k51N82m16PJ25j57J23J27p6pj15M3J10J01k09J95
5135A53j93J51j01J36m7L0L2j11m4M5k8nj60J5K14j41K9J33k04J07J31j62Pl28
5159c41O39l29J10j31J13O2j4o9J29l84J21Q6M4j37K25n4r5O3K1J52k23k89L59
5182E8l08J38J18k6L6k5j83L20j53LJ84lL0m0k41P0J05J10j35M9m6k41J79q5K11
$$ plain form
5013 53 -242 -170 -243 9 -45 -149 64 66 -53 -61 1 56 55 219 2 108 91 39 98 -138 -242 79 -144 60 46
5038 46 -57 188 -9 12 -93 -80 20 60 77 62 272 -97 -181 166 -63 140 47 -97 134 -361 -15 190 -100
5061 -100 17 142 -63 41 144 122 60 45 -79 -96 -122 -31 -38 -202 -169 -105 149 175 119 -80 -226 -99 32 -148
5085 -148 111 53 84 -20 62 55 -40 22 59 -204 -86 -75 -195 -95 -4 -14 -85 -154 -37 -78 -82 -62 -254 -292 94 -90
5111 -90 -95 11 -69 25 -103 -144 -206 -29 -280 302 -114 -107 18 -139 -16 111 35 28 -87 -44 66 167 -42 153
5135 153 -40 111 10 146 99 129 161 50 6 51 23 18 -142 -127 87 -54 -25 108 -96 11 142 -20 -13 -341
5159 -341 298 -31 79 -52 61 123 109 40 169 -215 -94 -8 36 -101 124 70 -25 38 59 211 -12 -301 58
5182 58 -250 -112 6 -20 16 -9 -192 128 -25 -22 162 159 189 149 -92 -22 83 193 58 107 61 -180 -1 -86 125
5207A25k52p3K39P9k02J82j12K7o8J4R1j2p9K15j7j42R1l58L66j69J88j16j7o3
5231f3N0Q3j29J88nk02k3q7J00J9J88l01J00J53j20J55j15K99m78J62P5J39j94
5254fm9K72j46N4k51K31k45K0J37r0k1J82k32O9J19N4J2j43J05j35Q5j28QJ99
5278A01j44M0j9Q0J21j45m0Q6j66K24k5k57K45l7P1k04J40j37L4N4J31K6j50J72
5302B01j46j44K58j12l35M56k14J08q9J19N1j16n9J41j34o2J47n9j69L03o8k86
5324b09L30k5M7j04J28j94M6j20J58Kn1j11L17O1l05K52k48J0j79K69j09R2m2
5347A5l5M0pq4J41j4o5R2j23J08j9j74J59J13j73P5n2P5j94K51k39L9j08J89P7
5372H7j36J20J39l68J47K47j45j38p9j47M69k11j16J30m3q6J04J4n3j5M1J47q0
$$ plain form
5207 125 -127 -200 39 118 -84 98 -14 13 -55 -41 50 38 -41 174 157 15 106 -252 114 -55 133 17 0 -63
5231 -63 -13 70 -59 129 124 -78 -101 -188 -88 -69 119 -182 -82 71 -49 106 -9 290 -188 -26 49 188 -6
5254 -6 -55 217 71 125 -126 105 -140 -120 17 -73 -94 88 -144 -75 44 98 110 -33 72 -63 22 -106 -98 101
5278 101 -43 -3 -22 58 179 34 -6 80 -86 138 113 -144 101 64 135 -69 71 -66 -32 22 153 179 29 201
5302 201 55 -89 169 57 -278 178 -36 72 -17 102 153 37 -22 119 -15 -77 70 11 -158 145 77 -209
5324 -209 121 96 143 39 167 -27 19 -101 57 59 8 -103 214 275 -30 222 -26 -16 -195 74 -35 57 15
5347 15 -20 20 13 -71 70 56 -9 83 -40 68 49 -125 34 147 -26 49 -3 72 -122 129 -110 -71 -179 10 87
5372 87 -49 71 210 -158 -11 236 91 -47 -126 -273 196 -15 -131 -1 -44 -130 -26 -12 -65 -80 -39 108 28
5395B8l8K1m4jP3j03j4J62j82N4n5J51R6k71J24n4K05j37q5J05J16l27Q0L35j27
5420A12k31K12q7O8J0k17J47k14L47j37Jo7K7l7J5J6L2n7n3J65J56K3l39nK1K0
5446g2l7J73P5k61K06J9j69K55p4j89J42j82l6K3J22ml4J81k60J50J79l69k7L84
5470A95J60l48Q8m8j66P6OQPJ16j23jj21K5N4P2j07j00L25k17J37k4k48Q9J54
$$ plain form
5395 28 -10 11 -33 -34 39 -64 -78 84 -98 -44 -99 52 148 -123 1 -53 152 15 -70 35 151 -176 -96 239 112
5420 112 -119 93 6 74 84 -133 14 -200 147 10 11 -56 -29 -66 -51 -35 -3 -60 -113 52 208 231 -108 -113 -92 -72
5446 -72 -109 64 139 -122 84 103 -66 189 115 -74 68 -114 -150 -127 -5 -9 -43 138 -122 28 207 -162 -189 195
5470 195 355 7 95 47 -119 -43 -37 -29 -22 94 -29 -30 -151 -126 -72 0 -107 -207 118 -99 38 14 -234 -145 9
$$ [...]
8191H1
##END NTUPLES=NMR FID
##END=
