##TITLE=1H_71-2025 Bay
 200.13MHz,CDCl3,
 8 sc
 
 24.6.2025
##JCAMPDX= 6.0         $$ Bruker NMR JCAMP-DX V2.0
##DATA TYPE= NMR FID
##DATA CLASS= NTUPLES
##ORIGIN= UXNMR, Bruker Analytische Messtechnik GmbH
##OWNER= pz
$$ XWIN-NMR		Version 3.5
$$ Tue Jun 24 15:29:30 2025 Russian Standard Time (UT+4h)  she@DPX200
##.OBSERVE FREQUENCY= 200.1313
##.OBSERVE NUCLEUS= ^1H
##.DELAY= (6, 6)
##.ACQUISITION MODE= SIMULTANEOUS
##.ACQUISITION SCHEME= undefined
##.AVERAGES= 8
##.DIGITISER RES= 18
##SPECTROMETER/DATA SYSTEM= spect
##.PULSE SEQUENCE= zg30
##.SOLVENT NAME= CDCl3
##.SHIFT REFERENCE= (INTERNAL, CDCl3, 0, 14.3821)
##AUDIT TRAIL= $$ (NUMBER, WHEN, WHO, WHERE, WHAT)
$$ ##TITLE= Audit trail, XWIN-NMR		Version 3.5
$$ ##JCAMPDX= 5.01
$$ ##ORIGIN= Bruker BioSpin GmbH
$$ ##OWNER= she
$$ F:/spectra/data/she/nmr/H-C/1/audita.txt
$$ ##AUDIT TRAIL=  $$ (NUMBER, WHEN, WHO, WHERE, WHAT)
(   1,<2025-06-24 15:27:53.73 +0400>,<she>,<DPX200>,
      <created by zg, POWCHK disabled, PULCHK disabled
       configuration hash MD5:
       00 E9 B6 7A A2 85 ED C7 34 08 36 98 17 FE 4E 26
       data hash MD5: 16K
       AF 25 08 A7 7F 49 55 50 31 28 3B E7 F3 C7 0D FD>)
$$ ##END=
$$ 
$$ hash MD5
$$ C2 4D A6 CE 72 64 FF D3 A9 E7 2F DA 84 85 7C 76
##$RELAX= 
##$RELAX= 
##$RELAX= 
##$RELAX= 
##$RELAX= 
##$RELAX= 
$$ Bruker specific parameters
$$ --------------------------
##$DU= <F:/spectra>
##$EXPNO= 1
##$NAME= <H-C>
##$PROCNO= 1
##$TYPE= <nmr>
##$USER= <she>
##$AMP= (0..31)
100 100 100 100 100 100 100 100 100 100 100 100 100 100 100 100 100 100 
100 100 100 100 100 100 100 100 100 100 100 100 100 100 
##$AQSEQ= 0
##$AQ_mod= 1
##$AUNM= <au_zg>
##$AUTOPOS= <>
##$BF1= 200.13
##$BF2= 200.13
##$BF3= 200.13
##$BF4= 200.13
##$BF5= 200.13
##$BF6= 200.13
##$BF7= 200.13
##$BF8= 200.13
##$BYTORDA= 1
##$CFDGTYP= 0
##$CFRGTYP= 5
##$CHEMSTR= <none>
##$CNST= (0..31)
1 1 145 1 1 1 1 1 1 1 1 1 1 1 1 1 1 1 1 1 1 1 1 1 1 1 1 1 1 1 1 1 
##$CPDPRG= <>
##$CPDPRG1= <>
##$CPDPRG2= <>
##$CPDPRG3= <>
##$CPDPRG4= <mlev>
##$CPDPRG5= <mlev>
##$CPDPRG6= <mlev>
##$CPDPRG7= <mlev>
##$CPDPRG8= <mlev>
##$CPDPRGB= <>
##$CPDPRGT= <>
##$D= (0..31)
0 0.7 0 0 0 0 0 0 0 0 0 0.03 0 0 0 0 0 0 0 0 0 0 0 0 0 0 0 0 0 0 0 0 
##$DATE= 1750764473
##$DBL= (0..7)
120 120 120 120 120 120 120 120 
##$DBP= (0..7)
150 150 150 150 150 150 150 150 
##$DBP07= 0
##$DBPNAM0= <>
##$DBPNAM1= <>
##$DBPNAM2= <>
##$DBPNAM3= <>
##$DBPNAM4= <>
##$DBPNAM5= <>
##$DBPNAM6= <>
##$DBPNAM7= <>
##$DBPOAL= (0..7)
0.5 0.5 0.5 0.5 0.5 0.5 0.5 0.5 
##$DBPOFFS= (0..7)
0 0 0 0 0 0 0 0 
##$DE= 6
##$DECBNUC= <off>
##$DECIM= 32
##$DECNUC= <off>
##$DECSTAT= 4
##$DIGMOD= 1
##$DIGTYP= 9
##$DL= (0..7)
0 120 120 120 120 120 120 120 
##$DP= (0..7)
150 150 150 150 150 150 150 150 
##$DP07= 0
##$DPNAME0= <>
##$DPNAME1= <>
##$DPNAME2= <>
##$DPNAME3= <>
##$DPNAME4= <>
##$DPNAME5= <>
##$DPNAME6= <>
##$DPNAME7= <>
##$DPOAL= (0..7)
0.5 0.5 0.5 0.5 0.5 0.5 0.5 0.5 
##$DPOFFS= (0..7)
0 0 0 0 0 0 0 0 
##$DQDMODE= 0
##$DR= 18
##$DS= 0
##$DSLIST= <SSSSSSSSSSSSSSS>
$$ [...]
##$SUBNAM0= <"">
##$SUBNAM1= <"">
##$SUBNAM2= <"">
##$SUBNAM3= <"">
##$SUBNAM4= <"">
##$SUBNAM5= <"">
##$SUBNAM6= <"">
##$SUBNAM7= <"">
##$SUBNAM8= <"">
##$SUBNAM9= <"">
##$SW= 18.0517328524113
##$SWIBOX= (0..15)
0 0 2 0 0 0 0 0 0 0 0 0 0 0 0 0 
##$SW_h= 3612.71676300578
##$TD= 16384
##$TD0= 1
##$TE= 0
##$TE2= 300
##$TE3= 300
##$TEG= 300
##$TL= (0..7)
0 120 120 120 120 120 120 120 
##$TP= (0..7)
150 150 150 150 150 150 150 150 
##$TP07= 0
##$TPNAME0= <>
##$TPNAME1= <>
##$TPNAME2= <>
##$TPNAME3= <>
##$TPNAME4= <>
##$TPNAME5= <>
##$TPNAME6= <>
##$TPNAME7= <>
##$TPOAL= (0..7)
0.5 0.5 0.5 0.5 0.5 0.5 0.5 0.5 
##$TPOFFS= (0..7)
0 0 0 0 0 0 0 0 
##$TUNHIN= 0
##$TUNHOUT= 0
##$TUNXOUT= 0
##$USERA1= <user>
##$USERA2= <user>
##$USERA3= <user>
##$USERA4= <user>
##$USERA5= <user>
##$V9= 5
##$VALIST= <valist>
##$VCLIST= <CCCCCCCCCCCCCCC>
##$VD= 0
##$VDLIST= <DDDDDDDDDDDDDDD>
##$VPLIST= <PPPPPPPPPPPPPPP>
##$VTLIST= <TTTTTTTTTTTTTTT>
##$WBST= 1024
##$WBSW= 4
##$XGAIN= (0..3)
0 0 0 0 
##$XL= 0
##$YL= 0
##$YMAX_a= 199770
##$YMIN_a= -266951
##$ZGOPTNS= <>
##$ZL1= 120
##$ZL2= 120
##$ZL3= 120
##$ZL4= 120
##$ABSF1= 10
##$ABSF2= 0
##$ABSG= 5
##$ABSL= 3
##$ALPHA= 0
##$AQORDER= 0
##$ASSFAC= 0
##$ASSFACI= 0
##$ASSFACX= 0
##$ASSWID= 0
##$AUNMP= <proc_1d>
##$AZFE= 0.1
##$AZFW= 0.1
##$BCFW= 1
##$BC_mod= 2
##$BYTORDP= 1
##$COROFFS= 0
##$CY= -3
##$DATMOD= 1
##$DC= 2
##$DFILT= <>
##$DTYPP= 0
##$F1P= 0
##$F2P= 0
##$FCOR= 0.5
##$FTSIZE= 0
##$FT_mod= 4
##$GAMMA= 1
##$GB= 0.15
##$INTBC= 1
##$INTSCL= 1
##$ISEN= 128
##$LB= 0.25
##$LEV0= 0
##$LPBIN= 0
##$MAXI= 10000
##$MC2= 0
##$MEAN= 0
##$ME_mod= 0
##$MI= 1.114404
##$NCOEF= 0
##$NC_proc= 0
##$NLEV= 6
##$NOISF1= 3.799351
##$NOISF2= 2.8
##$NSP= 1
##$NTH_PI= 0
##$NZP= 0
##$OFFSET= 14.38212
##$PC= 1
##$PHC0= -1195.89
##$PHC1= 5.192202
##$PH_mod= 1
##$PKNL= yes
##$PPARMOD= 0
##$PSCAL= 0
##$PSIGN= 0
##$REVERSE= no
##$SF= 200.129724274929
##$SI= 16384
##$SIGF1= 3
##$SIGF2= 2
##$SINO= 400
##$SIOLD= 16384
##$SREGLST= <1H.CDCl3>
##$SSB= 0
##$STSI= 0
##$STSR= 0
##$SW_p= 3205.1282051282
##$SYMM= 0
##$S_DEV= 0
##$TDeff= 0
##$TDoff= 0
##$TI= <>
##$TILT= no
##$TM1= 0
##$TM2= 0
##$TOPLEV= 0
##$USERP1= <user>
##$USERP2= <user>
##$USERP3= <user>
##$USERP4= <user>
##$USERP5= <user>
##$WDW= 1
##$XDIM= 8192
##$YMAX_p= 0
##$YMIN_p= 0
$$ End of Bruker specific parameters
$$ ---------------------------------
##NTUPLES= NMR FID
##VAR_NAME=  TIME,          FID/REAL,        FID/IMAG
##SYMBOL=    X,             R,               I
##VAR_TYPE=  INDEPENDENT,   DEPENDENT,       DEPENDENT
##VAR_FORM=  AFFN,          ASDF,            ASDF
##VAR_DIM=   8192,          8192,            8192
##UNITS=     SECONDS,       ARBITRARY UNITS, ARBITRARY UNITS
##FACTOR=    0.0002768,     1,               1
##FIRST=     0,             0,               0
##LAST=      2.2672688,     0,               0
##MIN=       0,             -266951,         0
##MAX=       2.2672688,     199770,          0
$$ Real data points
##PAGE= N=1
##DATA TABLE= (X++(R..R)), XYDATA
0@%%%%%%%%%%%%%qJ6j6J6j6K2l0L2m0M8n6O4p2Q8j02J16j32J50j70J92k18K45
$$ 0 0 0 0 0 0 0 0 0 0 0 0 0 0 -8 8 -8 8 -8 14 -16 16 -24 24 -32 32 -40 48 -54 62 -70 80 -90 102 -116 129
35A29k74L07l43L82m25M73n25N81o43P11p85Q64r51J049j155J273j403J546j708
$$ 129 -145 162 -181 201 -224 249 -276 305 -338 373 -412 452 -499 550 -605 668 -735 811 -897
54h97J889k093K327k599K920l300L761m336N071o048P406r425J2715j8910L4240
$$ -897 992 -1101 1226 -1373 1547 -1753 2008 -2328 2743 -3305 4101 -5324 7391 -11519 22721
69B2721j35241j54431M60473p6799k98362J93912J45631j90809o7502J59230J9087
$$ 22721 -112520 -266951 193522 116723 -181639 12273 157904 -32905 -100407 58823 77910
80G7910j80832Q9797J35479j81396n482J50369j12669k7489Q5611m0586n631l780
$$ 77910 -102922 -13125 122354 -59042 -64524 85845 -26824 -54313 31298 -9288 -14919 -18699
92a8699J1084O4110r3821k311J32212j03737n5951J29203m4327o6186O6826K5273
$$ -18699 -7615 56495 -37326 -39637 92575 -11162 -67113 62090 17763 -48423 18403 43676
104D3676n4405m4015R1038J7886j63507R4639J31441k04480K2063J86425j51507
$$ 43676 -10729 -54744 36294 54180 -109327 -14688 116753 -87727 -65664 120761 -30746
115c0746n0249J59953m6123q7092N5922N7233n5653o7355J06110K1833j41342
$$ -30746 -80995 78958 32835 -54257 1665 58898 3245 -64110 42000 63833 -77509
126g7509Q3374P6295j39169K9798O9563o5994J3680p52q032M9235n4040K030O6778
$$ -77509 5865 82160 -57009 -27211 42352 -23642 -9962 -10714 -18746 30489 -23551 -21521 45257
139D5257o4951O558N2117n8396J0254L2804k1174L406k1095K9477J7628q9970
$$ 45257 -19694 -13136 38981 -19415 -9161 23643 2469 5875 -15220 14257 31885 -58085
151e8085N7099N8191j23790M4472Q3900j03091J5395O4630n1857K098K1804j585
$$ -58085 -986 57205 -66585 -22113 61787 -41304 -25909 38721 -13136 -11038 10766 9181
163I181n404k3892M7561l809o9478P4800J1209q8812O2924J0389o4851N1496r023
$$ 9181 3777 -20115 27446 23637 -45841 28959 40168 -48644 14280 24669 -40182 11314 2291
176B291l1056M3572k5334M09K5318l7621L2132Q269m6675M6229j799l2456L6723
$$ 2291 -28765 14807 -10527 -10118 15200 -22421 9711 17980 -28695 17534 15735 -16721 20002
189B0002k1778M993K6434n8858L2472L0895p4432L8269K6682n9038L9901O142
$$ 20002 -1776 3217 29651 -29207 3265 34160 -40272 -2003 24679 -34359 5542 11684
201A1684l9194L6820p004j0234J6604k3893L0794K47m7076N6986l405n2396N4501
$$ 11684 -27510 9310 2306 -7928 8676 -15217 15577 15824 -31252 25734 22329 -30067 24434
214B4434j4805l6318M9091k9326j4972M0486l1849M517J5465k6935L2089j0262
$$ 24434 9629 -26689 22402 -6924 -21896 18590 -13259 -8742 6723 -20212 11877 1615
226A615k8484M9273k0548j9736M0970k9595P257K7240m8307K5824J9338m9592
$$ 1615 -26869 22404 1856 -17880 23090 -6505 752 27992 -20315 5509 24847 -24745
238b4745L1623K756l3637L8629j7380j8319L6044k5312K646J8116l1863L2420
$$ -24745 6878 9634 -24003 14626 -2754 -21073 14971 -10341 -7695 10421 -21442 10978
250A0978K023m0393M7172n598l2985M1565k1042j1682L5321l8466L942K9236l6188
$$ 10978 13001 -27392 19780 14182 -18803 22762 1720 -9962 25359 -13107 -9165 20071 -16117
263a6117J5269O345k5572L2931j6880j9919M2375k4956o881L2498l2414J5914
$$ -16117 -848 5497 -20075 12856 -4024 -23943 18432 -6524 -13405 19093 -13321 2593
275B593K0254m0615K7424Q308l4049K9847j1009j7586L4314k7294o102K9799k9145
$$ 2593 22847 -17768 9656 17964 -16085 13762 2753 -14833 19481 -7813 -13915 15884 -13261
288a3261R531J0002k8209L2888n268l1214M2809j1436k0094L4042k2866L21K5198
$$ -13261 -3730 6272 -21937 10951 5683 -25531 17278 5842 -14252 19790 -3076 -2755 22443
301B2443l5042J3284J5742l1214K2552n359k0676L4903k2914j3718L5510k6638
$$ 22443 -12599 685 16427 -14787 7765 2406 -18270 16633 -6281 -19999 15511 -11127
313a1127O84K2746l0160K1798J0581l2694K9404j076k1652K8646j9421o181L0458
$$ -11127 -10443 12303 -17857 3941 14522 -18172 11232 10156 -11496 17150 -2271 -8452 22006
326B2006l1882K784K3279k8696J3942K401k3549L1087j2505k0359L6206j7816
$$ 22006 -9876 -7092 16187 -12509 1433 3834 -19715 11372 -1133 -21492 14714 -3102
338c102p693K7130k5303R065J8854l1104J7282O808k2146K2995j3370j1503L1381
$$ -3102 -10795 16335 -8968 97 18951 -12153 5129 11937 -10209 12786 -584 -12087 19294
351A9294k6796n672K7472k7041P745J3183k7507K4326K644k4942K7956p435j1364
$$ 19294 -7502 -13174 14298 -12743 -4998 8185 -19322 5004 7648 -17294 10662 3227 -8137
364h137K4927k3667M085K3700l1811J1148J4718k6247J8258m085j8713K8702j7120
$$ -8137 16790 -6877 -2792 20908 -10903 245 14963 -11284 6974 2889 -15824 12878 -4242
377d242j2383K8475k1397K572J8832k7281J7357J1672k7847K1077N24j5466K2305
$$ -4242 -16625 11850 -9547 -6975 11857 -15424 1933 13605 -14242 6835 7359 -8107 14198
390A4198j7385l832K5643k6903K971J8086k5738J4008L898k3610K5712m856j8801
$$ 14198 -3187 -7019 18624 -8279 -5308 12778 -12960 1048 4946 -18664 7048 2192 -16609
403a6609K5559j1592l455J8964k2704J0678J5757k7751J5727O269j9727K1167
$$ -16609 8950 -2642 -6097 12867 -9837 841 16598 -11153 4574 10843 -8884 12283
415A2283j0632j3140K6192j8988o480K0295k0539Q876R587k4421K1379L119k2074
$$ 12283 1651 -11489 14703 -4285 -10765 9530 -11009 -2133 7454 -16967 4412 7531 -14543
428a4543K2459n980r341K1296j9058K068K0464k4838Q224J0025k1398J7742m563
$$ -14543 7916 1936 -7405 13891 -5167 -3099 17365 -7473 751 10776 -10622 7120 2557
441B557j8426K6280j1379j3274K2499j4991K092J4095k2085J4791Q703k1971J8276
$$ 2557 -15869 10411 -968 -14242 8257 -6734 -4642 9453 -12632 2159 10862 -11109 7167
454G167j825j3305K2264j4930p092K3007j9584q08J3726j8829J1903J817j9206
$$ 7167 5342 -7963 14301 -629 -7721 15286 -4298 -5106 8620 -10209 1694 3511 -15695
467a5695K1915m625j4977K1341j1756k492J8815k1154O566J6040k0875J0817L640
$$ -15695 6220 1595 -13382 7959 -3797 -6289 12526 -8628 -2062 13978 -6897 3920 7560
480G560j5198J9134j0389j2626K3573j4679o149J6931j7114P387Q041k0474J7232
$$ 7560 -7638 11496 1107 -11519 12054 -2625 -8774 8157 -8957 -1570 6471 -14003 3229
493C229K158j7059J9547p740p020K1283j8471q53K0498k0061L642Q764j5813J4028
$$ 3229 5387 -11672 7875 135 -6885 14398 -4073 -4926 15572 -4489 -847 7917 -7896 6132
507F132m168j4721K0422r300q427J7574j6111M398J4705k2324J0866J0913j8066
$$ 6132 1964 -12757 7665 -1635 -10062 7512 -8599 -4201 10504 -11820 -954 9959 -8107
520h107J3831j055j1171J8852j2382o606J8823j5859K25J0807j6519J1115K312
$$ -8107 5724 4669 -6502 12350 -32 -6638 12185 -3674 -3449 7358 -9161 1954 4266
533D266j7535J7814l493j1828J8043j2006r50J8833k0152L479J6321j7762P510
$$ 4266 -13269 4545 1052 -10776 7267 -4739 -5689 13144 -7008 -3529 12792 -4970 2540
546B540L832j2880J5130p292r830J7438j2259j942J2431j8087J0045Q667k1472
$$ 2540 6372 -6508 8622 1330 -8500 8938 -3321 -5263 7168 -10919 -874 7793 -13679
559a3679J5327M560j6463J6115m727p200J7710j3971k086J5668j4811M730M853
$$ -13679 1648 6208 -10255 5860 1133 -6067 11643 -2328 -4414 11254 -3557 1173 6026
572F026j3993J4167l830j3629J8115q739o284J5671j5926L397J5585k0158P670
$$ 6026 -7967 6200 2370 -11259 6856 -1883 -8167 7504 -8422 -5025 10560 -9598 -1928
585a928J0944j5372J0313J77r531J4954r431m741J3848j3435L877O960j7283J3408
$$ -1928 9016 -6356 3957 4134 -5397 9557 126 -4615 9233 -4202 -325 6635 -10648 2760
599B760K763j9031J6829j218j1608J5729r465k783J6503j4912J887J1595j3024
$$ 2760 5523 -13508 3321 2103 -9505 6224 -3241 -6024 10479 -4433 -2546 9049 -3975
612c975Q108j6j0756J5566p671q941J6010j2133r09J2228j7788Q031J0666j9957
$$ -3975 4133 4117 -6639 8927 1256 -7685 8325 -3808 -4717 7511 -10277 -2246 8420 -11537
626a1537J1047N951j2848J1826l883n323J4122j1052m25J0632j2639P448K340
$$ -11537 -490 5461 -7387 4439 556 -4767 9355 -1697 -2122 8510 -4129 3319 5659
639E659j5090J5739k355j5267J6565n991p418J4393j2327R80J3461j4699M751
$$ 5659 -9431 6308 3953 -11314 5251 -740 -8158 6235 -6092 -5112 8349 -6350 -1599
652a599P157j0231R678l253o990J5184j0303l985J3455j3644L651Q490j7608J0650
$$ -1599 5558 -4673 5005 1752 -5238 9946 -357 -4342 9113 -4531 -880 7610 -9998 652
666F52N897j7258J1764Q08r068J2112q028j557J3052j2385L165P816j1982J0490
$$ 652 6549 -10709 1055 1863 -7205 4907 -3121 -4678 8374 -4011 -846 6970 -5012 5478
680E478j032j2587J6571n930j0159J4950r947k424J1749j4668M815R643j4446
$$ 5478 4446 -8141 8430 2500 -7659 7291 -2656 -5080 6669 -7999 -3184 6459 -7987
693g987P547L194q307J0981o532l321J4038j2010N74J0625j3851P791M611j6617
$$ -7987 -440 2754 -5553 5428 -1104 -4425 9613 -2397 -1823 8802 -5049 2742 7353 -9264
707i264J2672J680j3874J1645l474n305J0888j0560J979R867j2409O610L675j0155
$$ -9264 3408 5088 -8786 2859 -615 -5920 4968 -5592 -3613 6254 -6155 455 4130 -6025
721f025J2741m385r201J5894q110n793J2588j0917J729Q106j4656P841N172j3014
$$ -6025 6716 2331 -6870 9024 914 -4879 7709 -3208 -1479 6627 -8029 -188 4984 -8030
735h030R532j739n783J1818r568m74J2378j2194L599P417j2891J0940Q34j3768
$$ -8030 1502 -237 -6020 5798 -3770 -4244 8134 -4060 -461 6956 -5935 5005 5839 -7929
749g929J4013k445r942J0995o859j229Q766j2118M684O579j1520Q569l29q076
$$ -7929 6084 3639 -6303 4692 -2167 -3396 5370 -6748 -2064 4515 -7005 1564 1235 -6841
763f841J3622p245n822J4958r238j999R848j1058N612M242j2933R342J032j0055
$$ -6841 6781 -464 -6286 8672 -566 -2565 7283 -3775 1837 6079 -6854 2488 3520 -6535
777f535R831n317k905J0826j1550J816R797j1587O150L327j0283J2352k685j0076
$$ -6535 3296 -2021 -4926 5900 -5650 -3834 5963 -5624 526 3853 -6430 5922 3237 -6839
791f839J3952n301n564R971r380K520O297j2648P419K739j0212R974m211n254
$$ -6839 7113 1812 -3752 6219 -3161 -641 5656 -6992 427 3166 -7046 2928 -1283 -6537
805f537J3334r826k503J3169j0440J779O893j0369Q295J086j0837J0733k652o304
$$ -6537 6797 -3029 -5532 7637 -2803 -1024 5869 -4500 3795 4881 -5956 4777 2125 -4179
819d179R379q706O31R277j3093M402O846j1220P893O6p854J2788n822o024J2800
$$ -4179 5200 -3506 -2875 6402 -6691 -2289 4557 -6663 1230 1296 -6558 6230 408 -5616 7184
834G184p642j247Q003j0206N771L702j1472Q391k22p608R443p119k306J1868j1625
$$ 7184 -458 -1705 6298 -3908 1863 5565 -5907 2484 2262 -5346 4097 -3022 -5328 6540 -5085
849e085N87J0463j0791N000L788r396J0148j823p625J0764n588k393Q221j0705
$$ -5085 -4498 5965 -4826 174 3962 -5434 4714 2891 -4734 6030 442 -1951 6270 -4435
863d435M041O573j3054O674L552r862R102l317n652J2019p725k647J0656q629
$$ -4435 -394 6179 -6875 -201 3351 -6511 2591 -726 -6378 5641 -2084 -4731 5925 -2704
877b704K878N014j0081Q519J103r926R598l246m636R004r332O07R567j2288L476
$$ -2704 174 5188 -4893 3626 4729 -5197 4401 1155 -3481 5523 -3809 -3202 6365 -5923 -2447
892b447O847j0259O979P36p908J0696l789m968R877p068J267O134j0856O574M225
$$ -2447 4400 -5859 1120 1856 -6052 4644 855 -4113 5764 -1304 -37 6097 -4759 1815 6040
907F040j2188Q317J91p877R391o020l206J0806r514M87P923r021N785K049q953
$$ 6040 -6148 2169 2360 -5517 3874 -2146 -5352 5454 -4060 -3573 4350 -4671 1114 3163 -5790
922e790J0468j775p420R939n513j692Q182j0662L252P108j2095N820K779q627
$$ -5790 4678 2903 -4517 5422 -91 -1783 6399 -4263 -1011 6097 -5998 -178 2601 -6026
936f026Q689l135n575J0713o366j819P880p528M253M029j0438Q736J398r972R106
$$ -6026 2663 -472 -6047 4666 -1700 -3519 4361 -3167 1086 5115 -5323 3413 4811 -5161 3945
951C945k742m794Q940q273p15Q835r603K446M911q458P477p14p272J0649l881
$$ 3945 1203 -3591 5349 -2924 -3639 5196 -4407 -1961 2950 -5508 1969 1255 -6017 4632 751
966G51m397R039o972J046O656j0536N469M754j0908P060m8o831Q752n536l167
$$ 751 -3646 5393 -1579 -533 6123 -4413 1056 5810 -5098 1962 1914 -4917 3835 -1701 -4868
981d868R750q008O05O054q178O475J342r408J0535j183p382R305n198j693Q207
$$ -4868 4882 -3126 -2521 3533 -4645 1830 3172 -6236 4299 3116 -4266 5039 -159 -1852 6355
996F355r872K346O218r467M377J920p115Q426l998n160J0505n998j773P864p933
$$ 6355 -3517 -1171 5047 -4420 -43 1877 -5238 3188 -810 -5970 4535 -1463 -3236 4628 -3305
1011c305L924M624j0365P366K383q653P434k721l995Q439p884m87P968q777K948
$$ -3305 619 5243 -5122 2244 4627 -4026 3408 687 -3308 5131 -2753 -3240 4728 -4049 -1101
1026a101L391q061Q204r50p484J0058l148m460Q491o548J110O566r840M307M104
$$ -1101 2290 -5771 2433 1483 -6001 4057 909 -3551 4940 -1608 -498 6068 -3772 535 4639
1041D639q509N998j233n510Q999o462k850R442p709R64N729q451O406K249r072
$$ 4639 -3870 2128 895 -4615 4384 -2078 -4928 4514 -3195 -2231 3498 -4953 1453 3702 -5370
1056e370Q409j55o123P699m824j380P484q787J733N815q741M926N51o805Q842
$$ -5370 3039 2884 -3239 4460 -364 -1744 5740 -3047 -1314 4501 -4240 686 1237 -5568 3274
1071C274l352n831R839n204j645P363p663L493M673r106N943J748o703O810l754
$$ 3274 -78 -5909 3930 -1274 -2919 4444 -3219 274 4947 -4159 1784 3532 -3171 3639 -115
1086a15k981Q476q005n40P459q526L502L264q017P455J43p727Q856k318l581O859
$$ -115 -3096 5380 -2625 -3165 4294 -4232 -730 2534 -5483 1972 2115 -5612 3244 926 -2655 4204
1102D204o037J513N908r268M474K963p802O645j997n391R251n766l446Q427o398
$$ 4204 -1833 -320 5588 -3680 794 3757 -4045 2600 603 -4788 4463 -1303 -4749 3678 -2720
1117b720R89M912p780N868K102p848P045m72m306O850n500p04P448q812J880N078
$$ -2720 -1731 3181 -4599 1269 3371 -4477 2568 2096 -2210 4640 -860 -1564 5884 -2928 -1048 4030
1133D030q206N302N46p128Q439k446n749Q322l996j112N854p061L444M178q184
$$ 4030 -4176 1126 1672 -5456 2983 537 -5212 3110 -886 -1998 3856 -3205 239 4417 -3767
1148c767O042N87n970P352m471l237Q566o947j311O777p092K834K754p372P046
$$ -3767 2275 2862 -3108 4244 -227 -3464 5102 -1845 -3156 3621 -3471 -637 2117 -5255 1791
1163A791k46o101P324k664k038O496p085K120N922q859M340K585p258O555k016
$$ 1791 1545 -4556 2768 104 -1934 4562 -2523 -403 5519 -3340 1000 3585 -3673 2882 866
1178H66n707Q583m533l349P066n460J452L759p264N744J757p013O960j497l908
$$ 866 -4841 3742 -791 -4140 2926 -2534 -1082 2677 -4587 1157 2914 -4099 2861 1364 -2544
1193b544P492o191o82P318p660J218M422o869M564L33o341P331k061m410O794
$$ -2544 4948 -1243 -1925 5393 -2267 -1049 3373 -3496 1068 1401 -4940 2391 330 -4080 2714
1208B714m386J53N257p449L981M193q039N579K54n188P258m422l176P705n939
$$ 2714 -1672 -1519 3738 -3711 270 4463 -3576 2003 2257 -2931 4327 -95 -3271 4434 -1505
1223a505j259N712o401L581J758o797O704o80n219O827l233j617O782p063J581
$$ -1505 -2764 2948 -3453 128 1886 -4911 1793 1113 -4106 2721 -512 -2129 4653 -2410 -829
1238h29N906p643L145K477o438N985k101m631P591m438k232N772n547K449L560
$$ -829 5077 -2566 579 3056 -3382 2603 502 -4129 3462 -976 -3208 2564 -2983 -534 3026
1253C026p638N621J794o491O058j376l353O890n416j268O793o396J074L417o186
$$ 3026 -4612 1009 2803 -3688 2370 994 -2359 4531 -885 -2153 4640 -1756 -682 2735 -3451
1268c451M943k95n968O871k057l590O099m509P02N120p195L033M305o634M239
$$ -3451 1492 1197 -4771 2100 43 -3547 2552 -1957 -1255 3865 -3330 -297 4008 -2626 1613
1283A613L13m588O317l628l081O895n484rM101o221M097J650o872O371O7n099
$$ 1613 1926 -2662 3655 27 -3054 3841 -1643 -1652 2449 -3772 325 1975 -4897 1474 1541 -3558
1299c558O216l191j368O213o128P79N325o341L119J079n234N724j961m720O824
$$ -3558 2658 -533 -1901 4312 -1816 -1037 4288 -2053 1066 2145 -3089 2635 674 -4046 2778
1314B778l863j682N104n613K459L843o893M368K167n684N293j645k642O180m804
$$ 2778 -1085 -2767 2337 -3276 -817 3026 -3867 501 2668 -3016 2277 632 -2010 4170 -634
1329f34j263N752n443J384K528n871N306m01n898O581j887l481N837m470L01N227
$$ -634 -1897 3855 -1588 -204 2324 -3547 1759 1358 -4540 2041 154 -3327 2510 -1960 -1659 3568
1345C568o436K682L266n495M402n24m116O464l648l044O260m977L00L548n783
$$ 3568 -2868 -186 3080 -2415 1987 1463 -2653 3811 163 -2881 3379 -1598 -1298 2250 -3533
1360c533L755K234o838N437J76m406N630l128j182N893n640Q51M392n443L009
$$ -3533 222 2456 -4382 1055 1231 -3175 2455 -673 -1855 4038 -1602 -751 3641 -1802 1207
1375A207P96n330N925j600m452N989l256j545M659n266K077L510o219M017J449
$$ 1207 2003 -3327 2598 998 -3454 2535 -721 -2266 2393 -2873 -796 2714 -3505 512 1961
1390A961m215M631k225k461O241m498j133N203n386K045K007n553M764L35n723
$$ 1961 -2254 2377 152 -2309 3932 -566 -1699 3504 -1882 163 2170 -3383 1381 1716 -4007
1405d007N528j836k280M836m368O44M871n628K219K725n106M531r05m097O473
$$ -4007 1521 -315 -2595 2241 -2127 -1483 3388 -2240 -21 2704 -2402 2129 1224 -2873 3600
1420C600l252k762N429m446M66K960n314L240K139n683M251q4l067N396l872r06
$$ 3600 348 -2414 3015 -1431 -965 1995 -3319 -79 2060 -3623 628 544 -2523 2873 -999 -1905
1436a905N683n160P48L701m994L597J24n090N451r24m338M878k751o00L907n339
$$ -1905 3778 -1382 -634 3067 -1927 1670 1794 -3296 2155 1231 -3107 1771 -980 -1580 2327 -3012
1452c012J998L497n546L551Q12l679N093k488k633O020m143j012M468m627K066
$$ -3012 -1014 2483 -3063 488 1300 -2379 2714 226 -2407 3613 -530 -1542 2926 -1701 365
1467C65J902n739M600K38m824M779j844j707M770m601P86M562n482K107K475m671
$$ 365 2267 -3472 1128 1366 -3458 1321 -523 -2230 2540 -2061 -1275 3287 -2195 -88 2387 -2284
1483b284M434r47l996N700k241k517M527m081O36K982n320K973J995m860L778
$$ -2284 2150 1203 -2793 2907 666 -1851 2676 -1405 -769 2213 -3107 -134 1861 -2999 779
1498G79o92k640N135l429j203N447m319M44L076m387L045M90m767M579m69l618
$$ 779 87 -2553 2582 -847 -2050 3397 -922 -478 2598 -1789 1256 1746 -3021 1558 1089 -2529
1514b529M402l163k89L890m857J390L616n018K995P95l573M752j775l065N516
$$ -2529 1873 -1290 -1579 2311 -2546 -1156 2460 -2558 437 1232 -2341 2411 636 -2429 3087
1529C087l134r80L494m091K147J695n278L889M80m373M483k102j512M858m293
$$ 3087 -47 -1027 2467 -1624 523 2218 -3060 829 1309 -3064 1419 -683 -2195 2663 -1630
1544a630J6M565m526J655J830m143M192n95l898M989j900k032L784l872R93K875
$$ -1630 -1614 2951 -1575 80 1910 -2233 1959 1364 -2534 2455 555 -1477 2307 -1565 -572 2303
1560B303n314K656K007m443L634o86k528M791k862j615M900l593N92K449l964
$$ 2303 -3011 -355 1652 -2791 843 157 -2371 2420 -442 -2057 2843 -750 -158 2291 -1673
1575a673L056O26m616M119q32k927M178l240l43M157m777J079L332m278K471N25
$$ -1673 1383 2009 -2607 1512 680 -2247 1931 -1309 -1652 2505 -2272 -1193 2139 -2139 332 857
1591H57l245M840j947k467M628k644o60K796m030K339K129n328L287M99l567L808
$$ 857 -2388 2452 505 -1962 2666 22 -638 2158 -1872 467 2596 -2732 555 1054 -2513 1295
1607A295j855j721M649l605n93M077l679J683J341l489L933q47l481M620k091
$$ 1295 -560 -2281 2368 -1237 -1830 2247 -1432 251 1592 -1897 2036 1189 -2292 2328 237
1622B37j510L540l898Q16L220m820J921J898l645L175q72k352M495k379j651M350
$$ 237 -1273 2267 -1631 -815 2405 -2415 -494 1404 -2241 934 62 -2290 2205 -174 -1825 2525
1638B525l453R58K194m287L336Q23m668M143q59k719L891l017m95L954m325R44
$$ 2525 -928 30 2224 -2063 1273 2096 -2572 1571 712 -2007 1884 -1133 -1628 2326 -1999 -1055
1654a055K751l692K690K41l207M437j674k110M052k826k66L129m504K127K267
$$ -1055 1696 -1996 694 935 -2272 2165 491 -1619 2433 -393 -659 2470 -2034 93 2360
1669B360m631K498M72k988L578j860j367M065l331p1L079l263J961J104l762L834
$$ 2360 -2271 227 699 -2289 1289 -571 -1938 2127 -1204 -1275 1804 -1459 502 1606 -2156 1678
1685A678j60l747M199j731j483L333l532M45L196m116J534J333l027K975q56k360
$$ 1678 1518 -2229 1970 239 -1244 2089 -1443 -998 2198 -1918 -384 949 -2078 897 41 -2319
1701b319M518k346j394L507l163J387K145m308K951R50l997L074o93k068L594
$$ -2319 2199 -147 -1541 1966 -1197 190 2335 -1973 978 1928 -2069 1005 312 -1756 1838
1716A838k921o14L641l525P64K072l277K975k46l032M640j682k261L788k357j71
$$ 1838 -1083 -1697 1944 -1581 -817 1255 -2022 953 707 -2325 2315 633 -1628 2160 -197 -368
1732c68K801m215J660K070m069K526J25k689L369j871j430M231l098k45L065l470
$$ -368 2433 -1782 -122 1948 -2121 405 530 -2159 1210 -661 -2091 2140 -958 -1203 1862 -1608
1748a608K231J077l817L475j3l025L250j398j191L076l401L17K980l696J608R84
$$ -1608 623 1700 -2117 1358 1345 -1680 1570 172 -1019 2057 -1344 -1027 1953 -1743 -135 849
1764H49l056L524j179k527M453k273j213L508l224J002K348m049K469J259l605
$$ 849 -2207 1317 138 -2389 2064 -209 -1422 2086 -1138 -136 2212 -1837 632 1891 -1714
1779a714K788r93j717L572k963n81L524l536J025J791l446L117L78l358L766p54
$$ -1714 1074 81 -1636 1936 -1027 -1608 1916 -1620 -595 1196 -2250 867 1245 -2113 1653 899
1795H99k438L534k352K27K620l902J401J837l404K196q2k535L448j860j679L799
$$ 899 -1539 1995 -357 -130 2490 -1412 -11 1826 -1578 618 536 -1999 1449 -411 -2090 1709
1811A709k545k37K816l326J972J302l705K991M12k823L285k138p10L199l660L47
$$ 1709 -836 -1073 1743 -1583 389 1691 -2014 977 1389 -1434 1851 -287 -997 2202 -1458 -1111
1827a111L007l815J706J061l018L215n85k861L998j564j095L111l164J190K215
$$ -1111 1896 -1919 -213 848 -2170 1045 460 -2401 1597 33 -1062 2049 -1115 75 2290
1842B290l912K232P26k904K770j101j782L654k806r39L398l015R48J586l282K933
$$ 2290 -1622 610 1336 -1568 1202 101 -1681 1973 -833 -1772 1626 -1389 -441 1145 -2137 796
1858G96K89k993L174p67j565K927k331o4K807l807J489J750l608K636k59k683
$$ 796 1085 -1908 1266 499 -1066 1861 -470 -534 2273 -1534 -45 1705 -1903 733 474 -2209
1874b209L414j386j994L586k221J14K234l343K237R82l220K782k67j906L192k248
$$ -2209 1205 -181 -2175 1411 -810 -696 1538 -1805 432 1414 -1806 976 709 -1197 1995 -253
1890b53o70L203l233P7K449l145J742N53k836L159q14k292L281j526o44K866l323
$$ -253 -923 2280 -953 -876 1573 -1572 170 723 -2113 1046 232 -2060 1221 -305 -949 1917 -1406
1907a406J374K277l716K120Q99l126K947j418j593L598k630j133K992k658J165
$$ -1406 -32 2245 -1471 649 1548 -1578 1369 -49 -1642 1956 -674 -1807 1185 -1473 -308
1922c08J327l248K859O99l221L141r61j311K985k889J96L034l584Q65J981k941
$$ -308 1019 -2229 630 1329 -1892 1249 288 -1023 1962 -927 -731 2303 -1281 -416 1565 -1376
1938a376K151l86k541L496j356j737K991k314N66J789k946J866J488l312K536
$$ -1376 775 389 -2152 1344 -12 -1749 1242 -1072 -506 1283 -1663 203 1691 -1621 915
1953I15j50j911K941k066r21L106k898J18K296l105J930M50k847K955l77k418
$$ 915 765 -1146 1795 -271 -1192 1914 -984 -866 1430 -1675 255 705 -2142 813 436 -1982
1969a982L348j939m11K784l175J256K219l599J891Q34k631K617j077j897L447
$$ -1982 1366 -573 -984 1800 -1375 -119 2100 -1499 392 1226 -1405 1212 135 -1762 1685
1984A685k187q10K679k850J353J346l292K717M38k610K657q74j157K973k736j07
$$ 1685 -502 -1312 1367 -1483 -130 1216 -2076 641 1079 -1531 1126 252 -905 2068 -668 -775
2000g75K836l037Q42J237k352J967l93k339L192j245j488K789k194M31J980l280
$$ -775 2061 -976 -134 1103 -1249 718 325 -2014 1178 -67 -1555 1234 -960 -529 1451 -1829
2016a829K116J377l162K511l12j896L014j927j017L089k755L6J892k840K005M62
$$ -1829 287 1664 -1498 1013 701 -1195 1819 -108 -1125 1964 -791 -755 1137 -1703 302 764
2032G64k987L176o13j944K897j791l30K922l268R76K306l280J633P39k811L192
$$ 764 -2223 953 340 -1604 1293 -498 -828 2094 -1174 -198 2108 -1172 461 1200 -1611 1581
2048A581j303j853L118j849n31J974k564J259J490l381K395N83k470K809j138
$$ 1581 278 -1575 1543 -306 -837 1137 -1427 -168 1322 -2059 336 919 -1551 1258 120
2063A20j153L001k353m81K933k957J030J142k737K373k82k409K883j305j338K817
$$ 120 -1033 1968 -385 -866 2067 -890 140 1282 -1455 918 636 -1773 1110 -195 -1533 1284
2079A284k354N65K226l105J279J463k562K082k52j757K983k003j235L096k700
$$ 1284 -1070 -505 1721 -1384 -105 1358 -1204 878 626 -1131 1852 -151 -1386 1710 -990
2094i90M15J791k641J847N09k798K384j69j804K533j832RK555k768O90K018k845
$$ -990 -575 1216 -1425 422 931 -1867 517 348 -1456 1077 -755 -746 1809 -959 -269 1749 -1096
2111a096J869J41k278K815j108k161L256j874m77K087k664J309J348k955K152
$$ -1096 773 914 -1364 1451 343 -1818 1438 -436 -913 1174 -1490 -181 1167 -1788 364
2126C64N35k311K640j177r78K970k434l37K362k634J191P53k546K293r2k420K764
$$ 364 899 -1412 1228 51 -927 2043 -391 -728 1634 -1000 191 944 -1602 691 599 -1821 943
2143I43q62j149K267k079K00K305k998J319J284k405K499q20j772L012j641j384
$$ 943 81 -1068 1199 -880 -680 1625 -1373 -54 1230 -1175 1324 504 -1268 1744 103 -1281
2159a281K895k176K09J477k714J967L59k652K421m58j366K453j809j96K581k540
$$ -1281 1614 -562 -353 1124 -1590 377 736 -1916 505 47 -1319 1134 -675 -871 1710 -830
2175h30L34K179k751J827J28k410K761r42j862K784j418n45K010k652J099J518
$$ -830 -496 1683 -1068 759 887 -1523 1238 296 -1566 1218 -200 -745 1265 -1387 -288 1230
2191A230k806J707L98j705K507j121j374K982k219k03K250k401R57Q19k699K423
$$ 1230 -1576 131 529 -1176 1331 210 -1164 1818 -401 -604 1646 -755 202 1021 -1678 745
2207G45j06k296K518j096r40K475k406N39J991k704J318Q92k295K402n11j972
$$ 745 639 -1657 861 -235 -1175 1300 -1106 -567 1424 -1280 38 930 -1365 1037 526 -1446
2223a446L006j426r85K167k094P79J085k319J345O77k327K017m42j260K412j946
$$ -1446 1560 134 -851 1316 -778 1 1086 -1233 112 789 -1538 479 37 -1223 1189 -757
2239g57l8K599k291K56J545k282J786j02k268K610n45j899K458j669KK137k720
$$ -757 -795 1804 -487 -231 1314 -968 818 716 -1552 1058 513 -1386 1072 -597 -595 1542 -1178
2256a178P37J595k510J709K62j931K497j175j348K770j671m17J954j744Q30P08
$$ -1178 -441 1154 -1356 353 615 -1316 1181 6 -1342 1428 -243 -660 1294 -450 380 1088
2272A088k630K015J74k165K405j156n63K078k235J86K151k149P61Q93j834K013
$$ 1088 -1542 473 647 -1518 887 -269 -832 1246 -989 -803 1348 -801 -40 853 -981 1032
2288A032m51j794K478r37j020J857j877O11J264k592J433R67k418J967l54j481
$$ 1032 581 -1213 1265 328 -692 1165 -712 -101 1163 -1429 4 971 -1447 520 166 -1315
2304a315K377j456o39K411j882K82J355k151J685L90k449K133j21j430J794j211
$$ -1315 1062 -394 -1033 1378 -504 -222 1133 -1018 667 1057 -1392 741 620 -810 984 -227
2320b27l59J917k314L86J609k198J398L63j751K320j078j089K349j417k95J791
$$ -227 -586 1331 -983 -597 1012 -1186 212 575 -1176 1144 66 -1023 1326 -91 -386 1405
2336A405k311Q58J164k433J627J63j649J935j112n96K186j812l89K141j822N95
$$ 1405 -906 -48 1116 -1317 310 473 -1176 759 -353 -949 1237 -575 -964 1177 -645 -50
2352e0J037k152K114l49j786K143r28q37K084k113L87J530k330J244Q57j989J386
$$ -50 987 -1165 949 600 -1186 957 29 -808 1276 -837 -450 1080 -1250 -6 851 -1138 248
2369B48l6j706K689j401q80K321k036P07J030j857J443N27k201J679n5j356J768
$$ 248 212 -1494 1195 -206 -1086 1235 -801 -94 936 -921 522 1049 -1152 527 472 -884 884
2386H84j262n08K037k107O46J235j968J467R6j586J920n71j384K181j152l49J617
$$ 884 -378 -886 1151 -956 -310 925 -1043 424 520 -1066 854 283 -1101 1080 -72 -421 1196
2403A196j910P73J067k110J209L29j841K069j038q87K062j433k69J676j527O44
$$ 1196 -714 59 1126 -984 225 554 -1287 782 -256 -1143 919 -514 -783 893 -634 10
2419A0Q21j890J596J54j655J935r65l99J588j696j92J539j923P26P25j563J690
$$ 10 831 -1059 537 691 -964 971 6 -393 1195 -501 -693 846 -1077 -351 374 -1189 501
2436E01n71j034K162j067p61J663j484L11J379j997J346M40k054J697l4j155J568
$$ 501 -70 -1104 1058 -9 -770 893 -591 -280 1099 -898 448 888 -1166 531 497 -658 910
2453I10j242l01J463j561L19R77j497J312L8j540J879m21j322K153j456m6J247
$$ 910 -332 -633 830 -731 -412 565 -932 380 418 -1122 757 336 -986 1167 -289 -335 912
2470I12j619P37R56j869J120J83j366J648r38q90K089j385o4J347j577P73Q26
$$ 912 -707 30 986 -883 237 420 -946 702 -236 -1126 963 -422 -486 861 -716 57 883
2487H83j892J439K55j441J489n81m24J286j735O6J407j500P07L81j424J454l75
$$ 883 -1009 430 685 -756 733 152 -272 1014 -721 -655 752 -748 -41 340 -1084 370 -5
2504ej154J844r28o29J835j306K76Q67j541R52N94j570J292l50r08J602j247k11
$$ -5 -1159 685 -243 -872 963 -343 -67 800 -741 211 805 -765 527 177 -731 871 -376 -587
2522e87J581j506lJ255j946J609mj501J761l56r42J648j190l2J289j723N55Q91
$$ -587 994 -512 -515 740 -1206 403 399 -1102 659 303 -639 1009 -181 -213 1076 -647 -92 799
2540G99j579J041J80j445J835j017q06J768j132l62J396j337P14P06j678J322
$$ 799 -780 261 441 -1004 831 -186 -992 776 -356 -718 678 -659 55 761 -917 405
2556D05M58j345J244q13p15J860j580k1J510j599P56L95j486J392k03j361J857
$$ 405 863 -482 762 -51 -766 1094 -486 -507 1003 -596 160 555 -931 461 258 -1103 754
2573G54o37p68J693j464N06Q73j720J052L03j215J250n18o57J483j130n54J653
$$ 754 117 -651 1042 -422 84 957 -763 289 592 -623 627 109 -548 935 -195 -749 904
2590I04j409Q0J072j583J109J39j052J361j65j045J600j170j01J258j714L93J225
$$ 904 -505 -425 647 -936 173 312 -740 621 456 -589 1011 -159 -260 998 -716 -323 902
2607I02j389O62O8j245J680o50j011J924j335j03J119j398Q31Q42j671J376j25
$$ 902 -487 175 243 -1002 678 28 -983 941 -394 -497 622 -776 55 897 -774 602 477
2624D77j167J302n98o60J463j305OJ189j294O42L23j337J328oj129J357o24l70
$$ 477 -690 612 14 -646 817 -488 -482 707 -587 55 378 -959 369 363 -766 591 -33 -403
2642d03J287j179J17J146j525Q33J54r26J182m03r59J469r23o50J474j142K72
$$ -403 884 -295 -178 968 -557 276 430 -496 686 283 -676 793 -130 -780 694 -448 -176
2659a76O33j301R52M14j372J217l05m31J297j093k36J248j327L64Q30j164P16
$$ -176 457 -844 108 522 -850 367 62 -369 928 -165 -401 847 -480 -116 714 -450 266
2676B66k8j156J237o7j320J678j057J58J031j536Q21Q34j480J010K0j030J180
$$ 266 238 -918 319 252 -1068 610 -447 -289 742 -794 27 861 -619 391 411 -619 561
2693E61o85m40J391r72k46J093j296O17J84j020J198o2j122J304o00j59J012j245
$$ 561 -124 -564 827 -145 -391 702 -594 23 207 -813 385 323 -799 505 -95 -254 758 -487
2711d87M85Q22j409P12M31j016R33k96r50J499p96m56Q24r85M09P96j288Q49M29
$$ -487 -2 820 -589 123 554 -462 471 175 -775 724 -72 -528 296 -689 -280 516 -772 77 506
2730E06j135R67n3p14J098q07q6J136j323L96P04j184O53R2j148J259m37p59J440
$$ 506 -629 338 285 -429 669 -138 -224 912 -411 -15 689 -495 158 250 -898 361 -76 -835 605
2749F05j105M5J131j269N24P26j074N38K87p93R87m86n15J132j053j57Q03p40
$$ 605 -500 -455 676 -593 -69 657 -417 121 408 -385 602 116 -399 733 -320 -477 326 -414
2767d14L10L53j103Q74L94j075J099p53r4J156j119K11P85r20K92N34j026J159
$$ -414 -104 249 -854 20 414 -661 438 -315 -409 747 -372 -161 624 -296 -4 530 -496 663
2785F63l79q47J013n14n45J139r45K48N51j250Q20N24r45P77j20p21J417r71l16
$$ 663 284 -563 450 -64 -609 530 -415 -167 384 -866 -46 478 -467 310 190 -531 886 -85 -401
2804d01J265r51l2O52j164Q26J18j043R70q8n28P44q70K20P01r73L92O94p71N98
$$ -401 864 -87 -119 533 -631 195 313 -730 240 152 -376 368 -502 -282 419 -554 -162 532 -239 359
2824C59n0o65R49n36n24J260r66k51J033j079M28L79j128Q63J82q63P79l42k35
$$ 359 309 -356 593 57 -467 793 -173 -424 609 -470 -42 337 -791 72 254 -609 170 -172 -407
2843d07J072q27o1P57o54K50M37j049Q54k83o40J099p71j44O37o05J17P26j035
$$ -407 665 -162 -223 534 -120 130 567 -482 372 89 -551 548 -223 -367 270 -335 -218 508 -527
2862e27M98L46p88J035n29m89J201r06p3J009r68J17N81j317J073J05j090P30
$$ -527 -29 317 -471 564 35 -454 747 -159 -232 777 -191 -74 507 -810 263 368 -722 8
2880Hj11m07J097p11k03J201j285M17M14r55O99K16j039R22n6n58O21m29j18O30
$$ 8 -103 -510 587 -124 -327 874 -411 6 420 -535 164 380 -659 263 207 -351 270 -159 -277 353
2900C53n96K17O16j243P58R5r39J098m64l42J016q18M5P13p78L41J62p71R28K
$$ 353 -243 -26 590 -653 105 200 -739 359 -105 -447 569 -249 -204 509 -269 72 234 -537 391 393
2920C93j105J035k68m92Q77j135N08O83j198P34J84p29Q49m41l48J331q29m02
$$ 393 -712 323 55 -437 440 -695 -187 496 -702 32 216 -513 336 -105 -453 878 49 -353
2938c53J083r59K57M43r97N97M74j056Q46l41o63R96n78k9P37o89M9P09p85N46
$$ -353 730 -229 28 471 -526 71 545 -511 335 -6 -669 327 -251 -280 457 -232 -183 526 -259 287
2958B87l8p93J077j26n82M45j43l17Q36j241O93K13j003O47J30n88R08l20m08
$$ 287 249 -544 533 407 -175 270 127 -190 646 -595 98 311 -692 -45 85 -503 405 85 -323
2977c23R82r61JP80r10O69J24r41Q71j58n86P92r6l60M86o75O5P69r49L96L45
$$ -323 659 -302 -301 479 -431 238 362 -579 292 134 -452 340 244 -116 370 -305 -240 529 -420 -24 321
2998C21o82N31J9o13Q93l37n18Q04n37J12N80j004M28O36j175N41J40n48Q62o78
$$ 321 -361 170 189 -424 469 132 -386 418 -119 -7 573 -431 -3 633 -542 -1 139 -409 453 -225
3018b25j4N83q38J49O81o93O23K2j024R96k86l90Q83n34k14P24p16j25P77q40
$$ -225 -239 344 -494 -345 336 -357 266 288 -736 260 -26 -416 467 -67 -281 443 -273 -398 379 -461
3038d61M17J35p23J130n30l55Q16n97q0N89q28N74K67o08K41J37m79P48n69j89
$$ -461 -44 91 -632 498 -32 -387 429 -168 -248 341 -487 87 354 -254 -13 124 -355 393 -176 -365
3058c65Q52p70l1O29o66L87K18p65Q64j77n24O86m31k22O47m18J32L37p42M68
$$ -365 487 -283 -314 315 -351 36 254 -511 353 176 -348 338 -93 -315 332 -86 46 383 -359 109
3078A09K39p47N67l77k04P31n50k56J030j065M30L94n60O83k09o86O22L5m93P60
$$ 109 348 -399 168 -209 -413 318 -232 -488 542 -523 -93 301 -259 424 215 -471 151 186 -307 453
3098D53o85k6Q62r39Q8O47q90O05j8n94R66m88m74R47o18M7M86n52L01L38q18
$$ 453 -232 -258 604 -335 -247 400 -490 115 97 -497 469 -19 -493 454 -164 -117 369 -183 118 456 -362
3119c62Q19j52o39M57k57j91O31o60J3P23r63N45J69m80O24j08p54Q03j25k97
$$ -362 457 305 -334 123 -134 -325 306 -354 -341 382 -581 -36 133 -347 277 169 -585 218 93 -204
3139b04N59m79Q5N68q24M56J9m79N70j73n36P64k41n91J056r72K62N33o97M38
$$ -204 355 -124 -39 529 -295 161 180 -299 271 98 -438 326 85 -506 550 -422 -160 373 -324 114
3159A14K09p64P29j85k35N01m56o8N85q60R6P21p98M08M2o19R94m64l54Q04o34
$$ 114 323 -441 288 103 -132 369 -87 -155 430 -430 -334 387 -411 -3 39 -580 414 -50 -404 400 -234
3180b34L21M16q02J96K91p14P61n9m92P29m12n25Q43n14q4M81o28L89L14o92O30
$$ -234 87 503 -299 -103 188 -526 235 176 -316 413 1 -524 319 -195 -279 202 -426 -37 277 -415 215
3201B15J67n94N08j71m82O27n93L68O37r99M47O9p94N17K79o12Q70p63jM44m87
$$ 215 382 -212 296 125 -357 270 -323 45 682 -317 130 199 -595 -78 201 -411 459 -304 -305 139 -348
3222c48K08M12o68O30J19r50R55m28m6M97n91j3P41o96Q8M07n61L36j46m50P16
$$ -348 -140 272 -396 234 353 -597 358 -70 -116 381 -210 -223 518 -178 -90 317 -244 92 -54 -504 212
3243B12j36n47P64k26j65N32p50L70M33q90M37k5k53O24l12m81N04k68J50L11
$$ 212 76 -471 293 67 -98 434 -316 54 487 -403 34 9 -244 380 68 -413 91 -177 -27 284
3263B84p23N89lo76R97m9o02N39l81j36P48o04j31M83o30k9N17m86L63n8l96N38
$$ 284 -439 150 147 -529 468 419 -183 356 -25 -161 587 -17 -148 335 -295 -324 193 -293 70 12 -384 154
3285A54l50j16P99o63m7O32p62N35J94n45K66N5k34N33o67NN40m94l6N22o97K75
$$ 154 -196 -312 487 -176 -223 409 -353 182 376 -169 97 152 -82 451 -216 -211 329 -165 -201 321 -376 -101
3307a01M48q65O18J45n71O94n01L9L83l57k1K28l31J85K26n56N33l10k07O01l83
$$ -101 347 -518 100 245 -326 368 -133 -94 289 -68 -89 139 -192 -7 219 -337 196 -114 -321 280 -103
3328a03l0K97l54J06L20m39L04O7m84M35k81J02L63o34L10K84n52L65R4m56L21
$$ -103 -133 164 -190 -84 236 -203 101 168 -316 119 -162 -60 303 -331 -21 263 -289 76 170 -286 35
3349C5J5m42P75n23j30N92m81j52P26n76O8M18o04M28o1l19M99k64l14N53l75
$$ 35 50 -392 383 -140 -270 322 -159 -311 415 -161 -93 325 -279 149 88 -231 268 4 -310 243 -132
3370a32NL33m71L53J47n14K38K39l65L71l82l3O93n29m8K17j55J41o4l50O84n17
$$ -132 -127 206 -265 88 235 -279 -41 198 -167 204 -178 -211 482 -47 -95 122 -33 108 44 -306 378 -139
3392a39j69O13m81N0L45m43J58N48p52M50j47k0K75Pm08O05n55r0L40k12N7K62
$$ -139 -308 305 -176 -126 219 -224 -66 482 -270 180 33 13 288 295 -113 492 -63 -153 187 -25 32 294
3414B94o22M84m6n35N64l99Q1M81l33q3N76o27J86J71m51M04M1l40L45j11j32
$$ 294 -328 156 110 -425 139 -260 -179 302 -31 -114 462 -165 21 192 -259 145 186 -154 191 80 -52
3435e2K50o8j77J70l89L96K0m50M96j61k59L62k26jL53l38p4M35m50J33K80o53
$$ -52 198 130 -47 123 -266 130 150 -300 196 35 -224 138 -88 -89 264 -74 -148 287 -163 -30 250 -403
3457d03P26l44k13N05l07l47M73m79K48L81o71J85K53j67L46k7l10M24l41j50
$$ -403 323 -21 -234 271 -36 -383 90 -389 -141 240 -431 -246 7 -160 186 159 -151 273 -68 -218
3477b18M25k88m8N11p76O56j59l93N75l78L2K01j81l1M84n25K26j56k27N15j59
$$ -218 207 -81 -129 382 -394 262 103 -290 285 -93 -61 140 -41 -72 412 -113 113 -43 -270 245 86
3498H6l53M64j46j82K21n1r5K83n64L81K54n10K20n3j89M81j82k92M35l46J37
$$ 86 -267 197 51 -131 90 39 -56 227 -337 44 298 -212 8 -45 -234 247 65 -227 208 -138 -1
3519aJ78k90J41L8l02M41k02k56N07k93k40M26k55P1L45n18K15J18j87K93l27
$$ -1 177 -113 28 66 -236 205 3 -253 254 -39 -279 147 -108 -37 308 -210 5 123 -64 229 -98
3540i8J58O4m0j39L56m88K33L21n91J85J80n16M42r9j91N13l90j1K29j1j91K93
$$ -98 60 124 84 -55 301 -187 46 367 -224 -39 141 -375 67 -32 -223 290 -100 -111 118 107 -84 209
3562B09l45J48Q6k58K65J9l75L66j01Jl5j90J99J97m37L99k08q2K65j42k01L86
$$ 209 -136 12 98 -160 105 124 -251 115 14 15 -20 -210 -11 186 -251 148 -60 -142 123 -19 -220 166
3584A66j23L5M8l83L07Q7k42Q4K10k98K11l08O3K11m6Q3O0m13J91R8k15L78k26
$$ 166 43 78 126 -257 50 137 -105 -21 189 -109 102 -206 -143 68 22 105 165 -248 -57 41 -174 204 -22
3607b2o5L05j11k12L32l29O8J95l41L43j33l85L78Ql04N56k33k63J93j14J28r8
$$ -22 -87 218 107 -105 227 -102 -34 161 -180 163 30 -355 23 31 -273 283 50 -213 -20 -134 -6 -104
3629a04j95N16r0j65K67Rm49L82m15J87J8j02N1j15J70pL7k95M14j43j81L71k75
$$ -104 -299 217 127 -38 229 238 -211 171 -244 -57 -39 -141 -90 -205 -35 -42 -5 -300 114 -29 -210 161 -114
3652a14K6L38m05K36J25k69L02j97k87M53j67j77M36k49j03N2j5J55j44J2K09
$$ -114 -88 250 -155 81 206 -63 239 42 -245 208 41 -136 300 51 -52 0 -15 140 -4 8 217
3673B17L6n57M77j97J9L2l82L51J28l11J33J95l36K87j9k18N04m61j13L19j46
$$ 217 253 -304 173 -24 -5 27 -355 -4 124 -187 -54 141 -195 92 73 -145 359 -102 -215 104 -42
3694d2K02j94q6K0J14r0J41j98n6L26l25M30p7m00L36j23j07L15J4k41J32j00
$$ -42 160 -34 -120 -100 14 -76 65 -133 -189 137 -188 242 165 -235 101 -22 -129 186 200 -41 91 -9
3716ij13L95l35q8M55k85L3l6j67J2J41j97J77j6L3K53l96J86J5j24k5L30k49
$$ -9 -122 273 -62 -150 305 20 53 17 -150 -138 3 -194 -17 -33 0 253 -143 43 58 -66 -91 239 -10
3739a0J03J2j23O6k41L0L62k60L3mq3%J38O8J35m83J86m2Q1rK34k74O5J93m70
$$ -10 93 105 -18 48 -193 -163 199 -61 -28 -32 -115 -115 23 91 226 -257 -71 -113 -32 -41 193 -81 -16 177 -293
3764b93M86ql77K71k9j23K09l78oJ43k3jL3j38L08N0l93J68N4J61J02j79k68L52
$$ -293 193 185 -192 79 50 -73 136 -242 -248 -105 -128 -129 -96 -234 74 124 -269 -101 -47 114 216 37 -231 121
3788A21r0l2P5j85J05P2l73K97J5j49K13k25R9j99K04p4J82k24J90j94nL67k86
$$ 121 31 -1 74 -111 -6 66 -307 -10 5 -144 69 -156 -57 -256 -52 -126 56 -168 22 -172 -177 190 -96
3811i6j17K28J18j63K65j70o8q7r1K33j59J39j43J57j13L11k42KL7Kl8J57q6j96
$$ -96 -213 15 133 -30 235 65 -3 -90 -181 52 -107 32 -111 46 -67 244 2 4 41 43 5 162 76 -120
3835a20K71k40J04r4k39M32j75q2M09m16K22k36Ko8L63k21M22l98j2K13l44K73
$$ -120 151 -89 15 -79 -318 114 -61 -143 266 -150 72 -164 -162 -230 133 -88 334 -64 -76 137 -207 66
3857F6J44k63j1N0j99L00l8j20Q5J55l60KQK45R4k06K12Kk00q3j19L53j4l8J29
$$ 66 210 -53 -64 -14 -213 87 49 -71 14 169 -191 -189 -181 64 158 -48 164 166 -34 -117 -236 117 103 65 194
3882A94j20l09O6K35l31L92j22k44M32n1l15M45m48K29J79l56K63Nj14n2K38k31
$$ 194 74 -235 -169 66 -265 127 5 -239 193 142 -173 272 -176 53 232 -124 139 144 30 -22 216 -15
3904a5P4ol72L00k09M00j86N2mK01l88K67k7k34L97k58Q9L1j63j84M06l18J36
$$ -15 59 53 -319 -19 -228 172 -14 38 34 235 -153 114 87 -147 250 -8 81 112 -51 -235 171 -147 -11
3927a1np0J52j44n3l2J86J01r0m9r5L97k85K07k19O2K4p0r5J07L5J46j14j57K31
$$ -11 -16 -86 66 -78 -131 -163 23 124 34 -15 -110 287 2 209 -10 52 76 6 -89 18 53 199 85 -72 159
3952A59l05K5q8M86l46K20k78n9K10M9M4j28J6kJ79l29J65Q6m40M10lNj56K14
$$ 159 -146 -121 -209 277 -69 151 -127 -186 24 73 117 -11 5 3 182 -147 18 104 -336 74 71 76 -80 134
3976A34q8J21l15J1J33k35J27j27J58J94nk67L05l17J41K3R3R2k48lk1K7o8K24
$$ 134 46 167 -148 -137 -4 -239 -112 -239 -81 113 108 -159 146 -171 -30 -7 86 178 -70 -73 -94 -67 -135 89
4000H9k07K80k28P6J03j28r5K56O4k33K68k26j28K65j16n7j58K94j62K7k90J12
$$ 89 -118 162 -66 10 113 -15 -110 146 210 -23 245 19 -109 156 40 -17 -175 119 -43 -16 -306 -194
4022a94J50O6n7j7L6J42k10j70K93k9J54j62L1P6j11k77J38K92j62J08k68%J43
$$ -194 -44 22 -35 -52 -16 126 -84 -254 39 10 164 2 33 109 -2 -279 -141 151 -11 97 -171 -171 -28
4045b8n5K12l5l44M22j28J80r2J3l09M25l35J27Q1j67J69j50j5J91j19k42K31
$$ -28 -83 129 94 -250 172 44 224 132 145 -164 261 -74 53 134 -33 136 -14 -29 162 43 -199 32
4067C2J14l26K63j93R3O5r2J57q1r6J26J12k45l2J84J10k91J02m9J19l32K29J25
$$ 32 146 -180 83 -110 -17 48 -44 113 32 -64 62 174 -71 -103 81 191 -100 2 -47 72 -260 -31 94
4090I4j63J21k52J97PJ3j28J95k21J90n1j0J07J28j86J95j62j07j29J32L2Q6j96
$$ 94 -69 52 -200 -3 4 17 -111 84 -137 53 2 -8 99 227 41 236 74 -33 -162 -30 2 88 -108
4113a08J10R8k84K87q0r1J04j43j29L76p7j56J74j87K3J53j01l9nQO1J01l03J22
$$ -108 2 100 -184 103 23 -68 36 -107 -236 140 63 -93 81 -106 -83 70 -31 -70 -75 -67 -6 95 -208 -86
4137h6J04j97J38L1J6L2j26K3K25l27L93k27k60K41o5N2o1O1O4q7J67J14k78J6
$$ -86 18 -179 -41 -10 6 38 -88 -65 160 -167 226 -1 -261 -20 -85 -33 -94 -33 31 -56 111 225 -53 -37
4161c7K19k59m7J05J9QQ1j18J87j40j92M15j79r0J4m7n5K12k36J79L01m66J50
$$ -37 182 -77 -124 -19 0 8 89 -29 158 18 -174 241 62 -28 -14 -61 -116 96 -140 39 340 -126 24
4184B4L5QK8l22K92J86l09l9J90j98o0K67j72K28m2r2J3k5Q4qn1r8K0J47j5k00
$$ 24 59 67 95 -227 65 251 -58 -97 93 -105 -165 102 -70 158 116 24 37 12 96 88 37 -61 -41 106 91 -109
4210a09K3J53K7j5N3j63NK0j82K91j9j84J3j20L73k42L09m41J97O6J28k43o8J83
$$ -109 -86 67 94 79 132 -31 -26 -6 -188 103 84 -100 -87 -207 166 -76 233 -208 -11 55 183 -60 -128 55
4234E5m4J36l1j51j06J11j25L91k32OO6k54J15j86N38j54k18J63j44J24Ml3J21
$$ 55 11 147 116 -35 -141 -30 -155 236 4 10 76 -178 -63 -249 289 135 -83 80 -64 60 64 31 152
4257A52j62K4J9k32L05j32p6K17k31O1J76l4J1l1k18J56O0l6mj26P9J74j40l9
$$ 152 -10 14 33 -199 106 -26 -102 115 -116 -55 121 87 98 67 -151 5 65 29 25 -101 -22 152 12 -27
4281b7K69m45J43Q6q8J94M5k38J22j08m7k76L23k5L6j65J67J73l3j2j17j39J53
$$ -27 242 -203 -60 26 -62 132 177 -61 61 -47 -94 -370 -47 -72 -36 -201 -34 139 106 94 -23 -162 -9
4304iJ59m33M15j24k96L17r1J11j29k70K46K83l80K1K45M4p1J63j63L48l65j0
$$ -9 150 -283 132 8 -288 29 -62 49 -80 -350 -104 179 -201 -180 65 109 38 201 38 386 21 11
4326A1O8k97K31J25j99J95j36p0J47j91j16J74k1j1K69q6j14L04m35L06l37J71
$$ 11 79 -218 13 138 -61 134 -2 -72 75 -116 -232 -58 -79 -90 179 93 -21 283 -152 154 -183 -12
4348a2R6j27KLj75J36J37l54L61p5p2J81j2l58N07k69k0P3m8M0J13k51K11j8n2
$$ -12 84 -43 -41 -38 -213 -77 60 -294 67 -8 -80 101 89 -269 238 -31 -51 22 -26 14 127 -124 87 69 17
4373A7r0n3j5L43l62L22q3l09J88J82j62R3K2k75K71l25J67L32m01K44k09J5K04
$$ 17 -73 -126 -141 202 -160 162 79 -230 -42 140 -22 71 93 -182 89 -236 -69 263 -138 106 -103 -88 116
4396A16m6q1K29k74m0J50MJ69l74J1m1J91q6J22k4j50J47k27J44K84k61r9J85
$$ 116 70 -11 218 -56 -96 54 58 227 -147 -136 -177 14 -72 50 26 -124 23 -204 -60 224 -37 -136 49
4419D9j76J10Q4j92Q2Q4P6o4q7K2J34j13m4J06k08J54K2k2L6j43p1L14J35l94
$$ 49 -127 -17 67 -125 -43 41 117 53 -34 -12 122 9 -35 71 -137 17 39 17 53 -90 -161 153 288 -106
4443a06K22q8r4OR0j4j08J30j23n2j40L11j66K58n0j31J61n7j69J90j45J3R2J09
$$ -106 116 28 -66 -60 30 16 -92 38 -85 -137 -277 34 -132 126 76 -55 106 49 -120 70 -75 -62 30 139
4467A39l40K93k92N9L48k26j03M1N8J85k33K64n6Np8J9j41p4N5r1P7J35K9j11
$$ 139 -201 92 -200 -141 207 -19 -122 -81 -23 162 -71 193 137 142 64 83 -58 -132 -77 -168 -91 44 73 -38
4491c8J09k39K05K1j3J63k34O7j61q2K68j1k39J06M2L0r7R5M4J64k35l0J64j23
$$ -38 71 -168 37 58 45 208 -26 41 -120 -202 66 55 -184 -78 -36 -6 -103 -8 36 200 -35 -65 99 -24
4515b4o6j50P3K55M9j12k5q5J62l4o4J77r9pn4J11%n6Jq5J43j6m5J25j86J50l5
$$ -24 -90 -240 -167 88 137 25 0 -85 77 43 -21 156 57 50 -4 107 107 51 52 -33 110 94 49 174 -12 138 103
4542A03j87K26k52r0L31l4r6J67k24j3R1p0J38P0j58L4k03k5K03J66l03J12j7
$$ 103 -84 142 -110 -200 131 97 1 168 -56 -69 22 -48 90 160 2 36 -167 -192 11 177 -126 -14 -31
4565c1J01j17N7j7O6k57J58m0M0j3l2p5K05j66q5K51j4K0j53J09K04j58k38R6
$$ -31 70 -47 10 -7 59 -198 -40 -80 -40 -53 -85 -160 45 -121 -206 45 31 51 -102 7 211 53 -185 -89
4589h9q4K6K01j64m4J92m2J97n7j11L3J33j34O5o6l68M63Q1j34r9r3K32j29j06
$$ -89 -173 -147 54 -110 -154 38 -4 193 136 25 58 191 57 122 56 -312 151 232 98 -1 -94 138 9 -97
4613i7O4k08J63K26k8j03m6n2K79l89K18J00k06J23j20J40N2o1j59J60j36N0j33
$$ -97 -33 -241 -78 148 120 17 -29 -81 198 -191 27 127 -79 44 -76 64 116 55 -104 56 -80 -30 -163
4636a63K06j7J15j92O2K4p8O9qj01r8K09j74J19J3j3O8M3k39K66n4n3O1m2m2l6
$$ -163 43 26 141 -51 11 35 -43 26 18 -83 -181 28 -146 -27 -14 -27 41 84 -155 111 57 4 65 23 -19 -55
4662e5p6J88Q7j56J25pj10q4J45l06K31L2K21j91j72K7L23l84J51n0l1K65l19
$$ -55 -131 57 144 -12 113 106 -4 -88 57 -249 -18 14 235 44 -128 -101 222 -162 -11 -61 -92 173 -146
4685a46K01j4K51k62J99m43K34l14J25J38q0J11P3O6j12J20k56J18J55k45m2J86
$$ -146 55 41 292 30 229 -214 20 -294 -169 -31 -111 0 73 139 27 147 -109 9 164 -81 -123 63
4707F3K6L1k11k4L18k77o4J62j65J30J23j03J62k27MR9n3n2j12K94j59J92j62
$$ 63 89 120 -91 -115 203 -74 -138 24 -141 -11 112 9 171 -56 -52 47 -6 -58 -170 124 -35 157 -5
4730ej7p2R6L8Q3j64k46K63J05jk50J90O0k2J3N0j78J71l2p0mRJ71k96j60L75
$$ -5 -22 -94 2 40 123 -41 -287 -24 81 80 -170 20 80 58 71 121 -57 114 82 12 8 17 188 -108 -268 107
4756A07j24j0K5N2K3q3J81n8q1r7K11j87n4R6M1N4k06J28j9J84k63r6J50o9J40
$$ 107 -17 -27 -2 50 73 -10 171 113 32 -65 146 -41 -95 1 42 96 -110 18 -1 183 -80 -176 -26 -95 45
4781D5N2j07p4K29j98n5J89k10J35pP6jj86J69r1J5j8j09k8K06n1M7J31j28r4
$$ 45 97 -10 -84 145 -53 -108 81 -129 6 -1 75 74 -112 57 -34 -19 -37 -146 -174 32 -19 28 159 31 -63
4806f3K15j90N0m3J2o8K07m0l72K93j02J2J18l55L27q1J4J10j40K14j83J42m4
$$ -63 152 -38 12 -31 -19 -87 120 80 -292 1 -101 -89 29 -326 1 -80 -66 44 -96 118 -65 77 33
4829C3o6J0k9%J0J03j24J34nq8j85J12J16P6k82K33O7p6k88N87k22J19k26p4J0
$$ 33 -33 -23 -52 -52 -42 61 -63 71 66 -22 -207 -95 21 97 -185 48 115 39 -249 338 116 235 9 -65 -55
4854e5ql7J87j37mJ66k49K31j11K8n5l6J4J51N3j98J71r8p0P5l9J11j79l8K29
$$ -55 -63 -100 87 -50 -54 112 -137 94 -17 11 -44 -80 -66 85 138 -60 111 13 -57 18 -21 90 -89 -127 102
4879A02k9p9L4J21j59p8J28P9k14j7Q2J50l58K01M8R8j34jP9J26j46j02K57q8
$$ 102 73 -6 28 149 -10 -88 40 119 -95 -112 -30 120 -238 -37 11 109 -25 -26 53 179 33 -69 188 100
4903A00k68L10Mpj95M6l8P9k90L43n7N2l0k23L18j77oJ08Nj62L4O3Q7J85l00%
$$ 100 -168 142 146 139 -56 -10 -48 31 -259 84 27 79 49 -174 144 -33 -39 69 74 -88 -54 9 96 281 -19 -19
4929a9K57k63J66k22O7R1J0j68K04n2j21J80n7j02J67j42N0K1k6p0l4J11nQl4
$$ -19 238 -25 141 -81 -14 77 87 -81 123 71 -50 130 73 -29 138 -4 46 67 41 -29 -63 48 43 51 17
4954A7J33k49M7r8n3L05k38J39NL1j66K43o1j69m4J31p2J32K7M7n0Q8l00M58k27
$$ 17 150 -99 -52 -150 -203 102 -136 3 8 39 -127 116 55 -114 -158 -27 -99 33 60 107 57 145 -155 303 76
4979G6M6k94Q0O5m6o3K65k58J71J30j60J68k84pJ1J55N3k6j29J58L5K4k37j8m
$$ 76 122 -172 -92 -27 -73 -136 129 -129 42 172 12 180 -104 -111 -100 55 108 82 -47 111 146 170 -67 -85 -89
5004h9K26j13q3J26n1j2j34R5o3k3O1q6K88l87M37k28P5K65l31p9K3oK7oM2r2
$$ -89 137 24 -59 67 16 4 -130 -35 -98 -121 -60 -146 142 -245 192 -36 39 304 -27 -106 -83 -89 -62 -68 -26 -118
5030a18O9l3K40j42LM5n9m6K38k59m8J67j15o7J03QJ19j44N8J37m44L29q4P6K6
$$ -118 -49 -82 158 16 19 64 5 -41 197 -62 -110 57 -58 -125 -22 -14 105 -39 19 156 -288 41 -43 33 59
5055E9J34k17J33j63O4j7O9k28J49p0J56Mo5J08P7k03O1k11J40K3N8k4M4j77J60
$$ 59 193 -24 109 -54 10 -7 62 -166 -17 -87 69 73 8 116 193 -10 51 -160 -20 3 61 37 81 -96 64
5080F4n1q0K35j00k17J95l02P4L07j89K7J27j57j5J05L6M4k63J61l1J78q4j43
$$ 64 13 -67 168 68 -149 46 -256 -182 125 -64 -37 90 -67 -82 23 59 103 -160 1 -30 148 64 -79
5103g9J8o7L30k72N5J60k81J94R2k49J27K1k18K67j0o5J19k64J92ok47N28l75
$$ -79 -61 -128 202 -70 -15 145 -136 58 150 -99 28 49 -169 98 88 23 142 -122 70 64 -183 345 -30
5126c0j4j27J56P9p2J23j01pj26J48J09k90K61j95J03J81k64K75L7nj76Rj79K37
$$ -30 -44 -171 -15 64 -8 115 14 7 -119 29 138 -152 109 -86 17 198 -66 209 246 241 65 74 -105 132
5150A32j89j97K23j69o6K42J42j84L67m19j9J18j69M28k08k56L18j21k57M28k38
$$ 132 -57 -254 -31 -200 -266 -24 118 -66 301 -118 -137 -19 -188 240 32 -224 94 -27 -284 144 -94
5171i4J04N0p1j38J98r8j18K35j57J04l55K88J95k9p6O8l9N1n4r1Q8J07k51O5
$$ -94 10 60 -11 -149 49 -49 -167 68 -89 15 -340 -52 143 114 38 106 67 118 64 -27 61 168 -83 -18
5195a8N3K3o1j79K26l09K89K2o8p3j22K51K1k54J28J59j96L07j39k00OR0j1M1
$$ -18 35 58 -3 -182 44 -265 24 46 -22 -95 -217 34 55 -199 -71 88 -108 199 60 -140 -134 -44 -55 -14
5219a4m0Rn3J75k53j9NJ14J80L8k88M96l33o9J16r2jK17n9j95M9K41l53K06N9
$$ -14 -54 -45 -98 77 -176 -195 -190 -76 104 142 -146 350 17 -52 64 -28 -29 188 129 -66 -17 224 -129 77 136
5244A36l1j77r9O4q7M6J79j06J10j12J65m8p5Qj9J3J1K18m6k01J35j47L4J79k49
$$ 136 105 -72 -171 -107 -194 -148 31 -75 35 -77 88 40 -35 -27 -46 -33 -22 196 150 -51 84 -63 -29 150 -99
5269i9N7j07J51O0j78j33K38L2oj29K9r1J40k57L16k5l37M27p7j88J80Q3l77L46
$$ -99 -42 -149 2 62 -116 -249 -11 21 15 -114 -85 -176 -36 -293 23 -2 -339 88 11 -177 3 86 -291 55
5293E5q9OJ16j41M3J95l43M6J99L5j9Q7k91K10j66K13J79m11N9K5P5k80l0L16
$$ 55 -34 -28 88 -53 -10 185 -158 -112 87 122 103 190 -101 109 -57 156 335 -76 -17 8 83 -197 -227 89
5317H9o6j21m8J61r2Q3K9K5j2k03J13O3p8o4K09P2j28j01J70j36Q2k76J90k6J61
$$ 89 23 -98 -146 15 -77 6 35 60 48 -155 -42 21 -57 -121 88 160 32 -69 101 -35 47 -229 -39 -65 96
5342I6N1m7q8J64K0j68L22l83m6p1Q5K72m24l3L01KJ65m44J53J17K1M4q5J66j36
$$ 96 147 100 12 176 196 28 350 -33 -79 -150 -65 207 -217 -250 51 53 218 -226 -73 44 65 109 24 190 54
5367E4r0j46J82J40j83RJ12j86K69k56o3J06k8q5K5k3J34Q4J8l00K52j13J75j20
$$ 54 -36 -182 0 140 -43 -34 78 -108 161 -95 -158 -52 -80 -165 -140 -163 -29 55 73 -227 25 -88 87 -33
5391c3R8P4l43O6M38k28k07M48l56M2R9k93J05P2P2K5k6j11L64j88j54n9k00K68
$$ -33 65 139 -204 -138 300 72 -135 313 -43 -1 98 -195 -90 -18 54 79 53 -58 306 118 -36 -95 -295 -27
5415b7J26%j92J82m6m2nj00K91k16OJ7j05J35J53q5k5J38o5p4j58j00L67k31O5
$$ -27 99 99 -93 89 43 1 -4 -104 187 -29 -23 -6 -111 24 177 92 67 205 140 66 -92 -192 175 -56 9
5440IL9j05P9J85j19n0j04O0J19j65j06L84l66J50j3J23k8%k19J23J06l03K80
$$ 9 48 -57 22 207 88 38 -66 -6 113 -52 -158 226 -140 10 -3 120 92 92 -127 -4 102 -201 79
5463G9k51K53L6p7j08j11l0P5J77k4J65l93K01P2o7Mo7j3K03k03j63J91K50l52
$$ 79 -172 81 117 40 -68 -179 -209 -134 43 19 184 -209 -8 64 -3 1 -66 -79 124 -79 -242 -51 199 -153
5487a53J7J48j72J59k31J84K09j33o6J43j11j9N8o6O0O7k3j08P7j20J97l41J58
$$ -153 -136 12 -160 -1 -232 -48 161 28 -38 105 -6 -25 33 -33 27 94 71 -37 40 -80 117 -224 -66
5510f6J27o7N0k7r3J35j12M2J28j00l0O6j20P3R9k5j39q5m1J71m2J86J08j80R
$$ -66 61 -6 44 17 -76 59 -53 -11 117 17 -13 53 -67 6 105 80 -59 -144 -185 -14 -56 130 238 58 67
5535F7j06pK1K72m30K67j4j60M7J90j77p3N3K32k11j28K06rj8M3r6k1m2p6Q0K98
$$ 67 -39 -46 -25 247 -183 84 70 -90 -43 147 -30 -103 -50 182 -29 -157 49 40 22 65 -31 -52 -94 -170 -90 208
5561B08k00k96L47j55mK9J62j21r9J10j16J3M5P6p5J11l4L4j09r3K93l37L44j08
$$ 208 8 -288 59 -96 -100 -71 91 -30 -129 -19 -135 -122 -77 -1 -76 35 1 35 -74 -167 126 -211 133 25
5585B5R7j36k08M46j36j25K71k40l7J71k89K26J99n16L17N7j74K2p2Q5J42k78
$$ 25 122 -14 -222 224 88 -37 234 -6 -43 128 -161 65 264 -252 65 122 -52 -30 -102 -17 125 -153
5607a53K1J94l43K40p3M6J13k5K2r4m5J25j80J79j4r4Q6J2k5k5K29k59O6j38J08
$$ -153 -132 62 -281 -41 -114 -68 45 20 42 -52 -97 28 -152 27 13 -81 5 17 -8 -33 196 -63 3 -135 -27
5632b7k8M7j7p1M0o1M7J56j95K21j41R5l9j16P6q3m7L49k76J24L3k77J42m6R2
$$ -27 -55 -8 -25 -96 -56 -117 -70 86 -109 112 -29 66 27 -89 -13 -96 -143 206 -70 54 87 -190 -48 -94 -2
5657bJ20q4k47K90n4j6n5K2J64j26r4M5J14j9l8p4p3K34j36J88j12J07j78J12
$$ -2 118 34 -213 77 23 7 -48 -26 138 12 -82 -37 77 58 20 -54 -127 107 -29 159 47 154 -24 88
5681H8r0mJ93k30P5j03j3O3q1J3J53m7j78K66k84Q9J22Ro9J88j33O3m6j12o0l2
$$ 88 -2 -6 187 -43 32 -71 -84 -21 -102 -89 64 17 -161 105 -179 -90 32 41 -28 160 27 90 44 -68 -128 -160
5707a60J36M2n6N6n4J04q9j05L05k70J02Q2j8K4p5Nj01P0P0l7RP8j70J7k0l9J84
$$ -160 -24 18 -38 18 -36 68 -21 -126 179 -91 11 93 75 99 24 29 -72 -2 68 31 40 118 -52 -35 -55 -94 90
5734I0k2j75J54r4J21j37O0J71j47R6j68j10K81k7j34P9R6j25PJ32j63K26n0j81
$$ 90 68 -107 47 -47 74 -63 -3 168 21 117 -51 -161 120 93 -41 38 134 9 16 148 -15 211 161 -20
5758b0m5P0k2m1J1J15J32k11Q8J09k02l2R0j93J69j17K44r6j69O3k8OK52l42J26
$$ -20 -65 5 -17 -58 -47 68 200 -11 77 186 -16 -48 42 -151 18 -99 145 49 -120 -57 -85 -79 173 -169 -43
5783d3K61k51N4j16J39j95K22k1n4k4P9M2j30J10kj39Q5j06J76oj07P0O5j75r5
$$ -43 218 -33 21 -95 44 -151 71 50 -4 -28 51 93 -37 73 71 -68 17 -89 87 81 -26 44 109 -66 -161
5808a61K26p2j23J43j61q1M34k75J49Q5k01Q8N7j80L8N6o6K63k04P3J18l46K16
$$ -161 65 -7 -130 13 -148 -229 205 -70 79 164 -37 51 108 -72 -34 22 -44 219 15 88 206 -140 76
5831G6j1k47J24J39j30J60k14r3K84K3k2P8l11M50l18P2pj48L6K8P9m1K43p3r2
$$ 76 65 -182 -58 81 -49 111 -103 -196 88 111 89 167 -144 306 -12 60 53 -95 -59 -31 48 7 250 177 85
5856H5r8nK7pM9r5L21j42l3p8m2Lj88M92j27k32J08K5j07j71J08m1n0J32J18N9
$$ 85 -13 -18 9 2 51 -44 277 135 102 24 -18 -15 -203 289 162 -70 38 63 -44 -215 -107 -148 -198 -66 52 111
5882A11r3m6lk42L57j60J9J41j31J10%o6K3j98K05J11j27K0O1J9k42P5J00O3j53
$$ 111 18 -28 -31 -273 84 -76 -57 84 -47 63 63 -3 20 -178 27 138 11 31 92 111 -131 -56 44 107 -46
5907d6M3QJ6q4J45K01l41J91l62P0J36j17j79K61R3Q2P2Q4l25j6R0l6j82K42N4
$$ -46 -3 5 21 -63 82 283 -58 133 -229 -159 -23 -140 -319 -58 35 117 189 273 -52 -68 22 -14 -196 46 100
5932A00r1n5K32k66pO7J20j93J53q0J53jk22K69k55J12o7R8o9j1j22K62l7k55
$$ 100 9 -46 186 -80 -87 -20 100 -93 60 -20 133 132 -90 179 -76 36 -31 67 -2 -13 -135 127 90 -165
5956a65J32K01j85J49j39j20L49l19J09p1J37Q3l14L04k92L19k61M0p2J0K54r2
$$ -165 -33 168 -17 132 -7 -127 222 -97 12 -59 78 161 -153 151 -141 178 -83 -43 -115 -105 149 57
5978E7k85J07m0M3J98j24j25K96l00J26J6j53L28j30M3j25N5m2J17j00n9K41j93
$$ 57 -228 -121 -161 -118 80 -44 -169 127 -173 -47 -31 -184 144 14 57 -68 -13 -55 62 -38 -97 144 -49
6001d9J01m0m4J84j43K5J27j64L5K7q5J77K3j02r1K49j65lJ0k10M6K11m6O3m09
$$ -49 52 12 -32 152 9 34 161 -3 32 59 -26 151 174 72 -19 230 65 62 72 -138 -92 119 73 136 -273
6026b73M94l30J60jP6r1j71N6j32L55l67J67J58o2p6j02R7k7r4M11k93J00l5J8
$$ -273 221 -109 51 50 126 35 -136 -80 -212 143 -224 -57 101 39 -37 -139 -42 -69 -163 248 -45 55 20 38
6050C8l8Q9N2n3o5J94k43K35j51o4O4j27J4M6j56J28L1n7K29j5j27j06K10j51
$$ 38 0 89 141 88 23 217 -26 209 58 -6 58 -69 -55 -9 -165 -37 -6 -63 166 151 24 -82 128 -23
6074b3J33j32j40K72m7n5J98m18L26Q5j67q2J61j85J42n9j11j40L73r3k16K93
$$ -23 110 -22 -162 110 63 8 206 -212 114 199 32 -50 111 -74 68 9 -102 -242 131 38 -178 115
6096A15j79J21j76K76k65J88j61j0LM0J54p5q6j77K12K10l64J07J50R0j98K48
$$ 115 -64 57 -119 157 -108 80 -81 -91 -88 -48 106 31 -55 -232 -20 190 -174 -67 83 173 -25 223
6118B23l56K34L5j88q9Q4K94j31j75K4M2o6Q0m1p5K1k5J51NP8P9k47K16j68j65
$$ 223 -133 101 136 -52 -141 -57 237 106 -69 -45 -3 -69 11 -30 -105 -84 -109 42 47 125 204 -43 173 5 -160
6143a60J07m5J84j23Q7j98K23j18J9M2j21m4J35Pk4O5j95M15k97J8j13J60O7k41
$$ -160 -53 -98 86 -37 50 -148 75 -43 -24 18 -103 -147 -12 -5 -29 36 -159 256 -41 -23 -136 24 91 -150
6167a50K18j71K21j60J80j56J3q0K02l9q5M4J5J79m30K57M5k94kO4l9M5J07j20
$$ -150 68 -103 118 -42 138 -18 -5 -85 117 78 -7 37 52 231 -199 58 103 -191 -193 -129 -168 -123 -16 -136
6191a36r1K65j22p1J4J13o1K41j73N4j44K65j02l4%J52q9m1j17n1K35j13r8Q3
$$ -136 -227 38 -84 -155 -141 -28 -89 152 -21 33 -111 154 52 18 18 170 81 40 -77 -128 107 -6 -104 -21
6215b1k8Q4k8j69J15K52l88J02N5j69K83j31n9J14J52j47k6K28k86J83J19l10
$$ -21 -49 35 7 -162 -47 205 -183 -81 -26 -195 88 -43 -102 12 164 17 -9 219 -67 116 235 -75
6237g5O6P1k6j85J12n9K4J8K14j39J1j16J87m4rj31P1J48j05j82M9J36j71n8J36
$$ -75 -9 62 36 -149 -37 -96 -72 -54 160 21 32 -84 103 59 50 -81 -10 138 33 -149 -100 36 -135 -193 -57
6262e7l2J54k63K75j88j69J97N8L5Q7k30N5J68k39J99j93J82p8KK4O7N6j81J91
$$ -57 -89 65 -198 77 -111 -280 -83 -25 10 97 -133 -78 90 -149 50 -143 39 -39 -37 -13 54 110 -71 120
6286A20p4J02k15p4K04j51J72q2J02jj12q1J87p7j4K21k24j9l4p0j03Q0J67K6
$$ 120 46 148 -67 -141 63 -88 84 2 104 103 -9 -90 97 20 6 227 3 -16 -50 -120 -223 -143 24 50
6310E0l3p3K01o6l33L80R2m4j20k22J15O8k3l6R5k27J97J11l24K74o2j12P6j54
$$ 50 17 -56 145 79 -254 126 218 174 54 -168 -53 15 -8 -44 51 -176 21 132 -192 82 20 -92 -16 -170
6334a70Q9qJ62j53k5R9l1Rj82R4O0J59k05J08p5J93k48K95j73l4J1N0Rp5n3K13
$$ -170 -81 -89 73 -80 -105 -6 -37 -28 -210 -116 -56 103 -102 6 -69 124 -124 171 -2 -36 -25 25 34 -41 -94 119
6360A19m1k49l2L07k80K30k6p5J0Q4N3j55MJ0J10j32P1j01J82j07r1J56O4q7J7
$$ 119 78 -171 -203 104 -176 54 28 -47 -37 47 100 -55 -51 -41 69 -63 8 -93 89 -18 -109 47 111 24 41
6385D1ok02N1K0j17J94K28Rj89r0J37l3P2j5J12j51j38J22n9J08p6j80Q8j26K52
$$ 41 35 -167 -116 -96 -213 -19 209 218 29 -61 76 43 115 100 212 61 -77 45 -14 94 18 -162 -74 -200 52
6410E2n1j40J19L0l4J1K1n6q1j32K23J29k11Q8K19l47O1J06l36K38l6J16j76J93
$$ 52 1 -139 -20 10 -24 -13 8 -48 -129 -261 -38 91 -120 -32 187 -160 -99 7 -329 -91 -127 -11 -187 6
6434FL2j26Q8j54p6J60J49r5M3J0j9lK2J50k00M3l4k0K4J39j85q1P5J74k18N2
$$ 6 38 -88 0 -154 -230 -70 79 -16 27 37 18 15 37 187 -13 30 -4 -24 0 139 -46 -127 -52 122 -96 -44
6460d4J78j17j20J12j44J68K1j9j28J42j78O2K92j55o1J30j67j40J30L6o8J40
$$ -44 134 17 -103 9 -135 33 54 35 -93 49 -129 -67 225 70 9 139 -28 -168 -38 -2 -70 70
6482G0q5J01J76j8j44o7J3j57L06j71q1J48j89J06r2Q4k2l3J33r5J9j90L02j64
$$ 70 -15 86 262 244 100 33 46 -111 195 24 -57 91 -98 8 -84 0 -22 -55 78 -17 2 -188 114 -50
6506e0O7m3J77n9J6j63J21j32j00P1J44Rk71K21N4j78J33Q9k7j09j47K82N5j16
$$ -50 17 -26 151 92 108 -55 66 -66 -166 -95 49 58 -213 8 62 -116 17 106 79 -30 -177 105 160 44
6530D4j47K11k15J65L5Jk08l4R9k2J34n6O7J8r0j19kj57J95N9J75k43K69k55J32
$$ 44 -103 108 -107 58 93 94 -114 -148 -49 -71 63 7 74 92 2 -117 -119 -276 -81 -22 153 -90 179 -76 56
6555E6n1L7n8J07J07l84K67k37K04k1k59K98q6Q5K6n2j06O2K32k83J50k94J83
$$ 56 5 42 -16 91 198 -186 81 -156 48 27 -232 66 -20 65 91 39 -67 -5 227 -56 94 -200 -17
6578a7K22j35j19Q8K5K45l75K17o7n4O8l51K49Q2L6j13J70k79J05Q2j86K24j28
$$ -17 205 70 -49 39 64 309 -66 151 84 30 98 -253 -4 78 114 1 171 -108 -3 79 -107 117 -11
6601a1k1J46K5n29K68J23j05L3j2J18j62J42N0q8Q6L7j63K49k57j59J91K3o3L
$$ -11 -32 114 139 -390 -122 1 -104 -71 -83 35 -127 15 65 -23 63 100 -63 186 -71 -230 -39 -16 -79 -76
6625g6L0k7J15j42J0J99j22R3rk91L15j9k38O1P0J4J60m7k59M56k56j58K23l16
$$ -76 -46 -73 42 -100 -90 109 -13 80 71 -220 95 76 -162 -101 -31 -17 143 96 -163 293 37 -121 102 -214
6649b14K18J14k7k1j16r6L34j85K0k63K78m8K63k95J52j55L01j93q7j74K88O8
$$ -214 4 118 91 70 -46 -142 192 7 27 -236 42 -6 257 -38 114 -41 260 67 -20 -194 94 162
6671A62m53L61l0n8r2K43j14j67R3K9M4Pk4l42L23j9k36K02J36j82R0L37m32J69
$$ 162 -291 70 40 -18 -110 133 19 -148 -55 -26 18 25 1 -341 -18 -37 -273 -71 65 -117 -27 310 -122 47
6695D7M5N1q0pj33l5j03J16J55k4p7J49k07j13L13l82O65l77N9j18P1j0J1j03
$$ 47 92 143 63 56 -77 -112 -215 -99 56 32 -45 104 -103 -216 97 -285 380 3 62 -56 15 5 16 -87
6719h7r1K42j12r7nK07j33J21j12J39J9k41J89P9K1m0j20J05r0K2r0N6j16K39
$$ -87 -178 64 -48 -145 -150 57 -76 45 -67 72 91 -150 39 118 139 99 -21 84 -6 16 -74 -18 -134 105
6743A05k57m0K41r3l8J07O1M7j70j04P8J20q1o3K01m6J57m19K22k2k32L00l5j36
$$ 105 -152 -192 49 -44 -82 25 86 133 -37 -141 -63 57 -24 -87 114 68 225 -194 28 6 -226 74 39 -97
6767i7Q1n5j29K47M5j68J60k8m3J29k76J49No7L24k69J18P1j63n8j26J34o6N0
$$ -97 -16 -71 -200 47 92 -76 84 56 13 142 -134 15 20 -47 277 8 126 197 34 -24 -150 -16 -82 -32
6791c2J8q2R3k13L63k05Q7ko6J51k45J04Q7j47M5j34M8L8K08k6lj75k8J19ML3
$$ -32 -14 -96 -3 -216 147 -58 29 27 -39 112 -133 -29 58 -89 -44 -178 -130 -92 116 90 87 -88 -116 3 7 40
6817D0J25K9k22J14P5k05J66J04l04Q5j8j91L7L9J87k03l5L01j23k59K91j07l6
$$ 40 165 194 -28 86 161 -44 122 226 -78 7 -11 -202 -165 -126 61 -142 -177 124 1 -258 33 -74 -110
6840a10K90l03L2J12j76J13N4k48K68Qq9Q7q7l3J90j11j7Rj3J71k2O6J02l32m
$$ -110 180 -123 -91 21 -155 -42 12 -236 32 40 -49 38 -49 -82 108 -3 -20 -11 -24 147 125 191 293 -39 -43
6865d3J86r1l7K7j8j39l4P1m3J70j13K4j09L23q7j01m7N5j86K70k2j63J72kk72
$$ -43 143 52 15 42 24 -115 -149 -78 -121 49 -64 -40 -149 174 87 -14 -61 -6 -192 78 56 -107 65 63 -209
6890b09K03N5p9j4J32k22K60j63o2K76q2q6l6j72Q4M2J42p6p6J25p0qJ04J55k13
$$ -209 -6 49 -30 -44 88 -134 126 -37 -99 177 95 9 -27 -199 -115 -73 69 -7 -83 42 -28 -36 68 223 10
6915A0k6Kj11J35R2k03L61l20J12J2j65Q3J83l59L14k5j53J49l02K40j8k9j0M8
$$ 10 -16 -14 -125 10 102 -101 260 -60 52 64 -101 -18 165 -194 120 95 -58 91 -211 29 11 -18 -28 20
6939B0o2J04J52k34j3J1o8L01m07Q8K63l34L90l04j9K49j5j90J71j0r3r3m0J63
$$ 20 -42 62 214 -20 -33 -22 -90 211 -196 -108 155 -179 211 -93 -112 137 122 -68 103 93 0 -93 -133 30
6963C0l6m0J2J79j43J70k37NK61m21L30K40l78N5J40k26k8J82m37K97J29j98J09
$$ 30 -6 -46 -34 145 2 172 -65 -60 201 -220 110 350 -28 27 167 -59 -87 95 -342 -45 84 -114 -5
6986eo1lJ76j64Q8Oj00oK53k72K6K12k39N9l8K2K13l35J83m5l4R4j58N3K95k29
$$ -5 -66 -69 107 -57 31 37 -63 -69 184 -88 -62 150 -89 -30 -68 -46 167 -168 15 -30 -64 30 -128 -75 220 -9
7012iL2Kn2J07K6j25J11n6j26J59Q2j69k3N0kJ35k27J4J78k91N60l22n9%j27M4
$$ -9 23 25 -27 80 106 -19 92 36 -90 69 151 -18 -41 9 7 142 -85 -71 107 -184 376 54 -5 -5 -132 -88
7038h8K46r8J09j09j00M5O9p6N2J66j04K2k42r2K78k31N3K86k88K43j60J31j41
$$ -88 158 60 169 60 -40 5 74 -2 50 216 112 134 -108 -200 78 -153 -100 186 -102 141 -19 112 -29
7061b9Lk6J53j67r2L40j29r5NJ03O4j08j88L63j36j26L3p0o8L14k67m2K40qmj03
$$ -29 -26 -52 101 -66 -158 182 53 -42 -37 66 130 22 -166 197 61 -65 -32 -102 -170 144 -123 -165 75 67 63 -40
7087d0j26J59K01k17K27k02m7l4jJ06O4j43J0K6j4J84k01J7P9o4j4J53k41L55
$$ -40 -166 -7 194 -23 204 2 -45 -79 -80 26 90 -53 -43 -17 -31 153 -48 -31 48 -16 -30 123 -118 237
7111B37j60j37k4J35QL4L7jlj81J31j62Q9J23k27np3K40j44K07j72n8K12l17Q0
$$ 237 77 -60 -84 51 59 93 130 129 126 -55 76 -86 3 126 -101 -106 -179 61 -83 124 -48 -106 106 -211 -131
7136a31p7J44L8K66k35l1m6o2K84k4j38Kj22K70j69N5j73K73j45J01k00J20m2
$$ -131 -208 -64 -26 240 5 -26 -72 -134 150 126 -12 -10 -132 138 -31 24 -149 124 -21 80 -120 0 -42
7159d2k07J57K25l32J79J48q5j06K27k73J50M1j5L8j82J27m2l1J26J78k96k2l3
$$ -42 -249 -92 133 -199 -20 128 43 -63 164 -109 41 82 67 105 -77 50 8 -23 103 281 -15 -37 -70
7182g0J53k11R1KJ27k40L06k1r3N1J75k97k6k9n4R1M1Q8%L3j30K60j0j60J25l85
$$ -70 83 -128 -37 -35 92 -148 158 137 44 95 270 -27 -53 -82 -136 -45 -4 84 84 117 -13 247 237 77 202 -183
7208a83M39j44k96K92j23R8Q7l08J29K36m90L73j99j10K84j25j3J13r2n3P2L2
$$ -183 256 112 -184 108 -15 83 170 -138 -9 227 -263 110 -89 -199 85 -40 -53 60 -32 -85 -13 19
7230A9MK47k94l0O1J01j50L8K9j28J76J7rj82J26kp6l5J97l00J92K44j27K7k38
$$ 19 23 270 -24 -54 7 108 -42 -4 25 -103 73 90 81 -101 25 23 -53 -88 109 -191 1 245 118 145 -93
7255i3j9J23K4j40R1l6K37j26j0k1m0J51J23j90pj99J19J89l07L2J4J16n9J78
$$ -93 -112 11 35 -105 -14 -50 187 61 51 30 -10 141 264 74 67 -132 -13 176 -131 -99 -85 31 -28 150
7279A50k19K41J41n05L61r5m2k12K76l90L62L8k82L38j44Q5J95m29K02k9j81J27
$$ 150 -69 172 313 -192 169 74 32 -180 96 -294 68 106 -176 162 18 103 298 -131 71 42 -139 -12
7301a2L14l25j96L56j25m4O9j80J95R9j13j2k57J49N0k22M26k26j32K43k13J22
$$ -12 302 -23 -219 137 12 -32 37 -143 52 151 38 26 -231 -82 -32 -254 172 -54 -186 57 -156 -34
7323c4N2R2%J24l40l8K25m71N66j50l22M25r1J69j26j21Q4k4j39K14J9k82K04
$$ -34 18 110 110 234 -106 -144 81 -390 176 26 -296 129 38 207 81 -40 44 20 -119 95 114 -168 36
7346C6q6O3j5J17j25J62l34J80J09KJ26l19J5R0LJ87j79l3q4J06j74J05J27k5
$$ 36 -50 13 -2 115 -10 152 -182 -2 107 109 235 -84 -69 21 24 211 32 -1 -85 21 -153 -48 79 54
7370E4K03r4j89mP9o0J77j74pJ7l56L53R9k74L07l9N7L9l33J26K75k98L6K12l40
$$ 54 257 163 -26 -30 49 -11 166 -8 -15 2 -354 -1 98 -176 131 92 149 188 -145 -19 256 -42 -6 206 -134
7395a34N7K52l95L60j27j9k6K0n4K12k81L36q0k49K25Mj56R2l3N5R4k28O2J46
$$ -134 -77 175 -220 140 13 -6 -32 -12 -66 146 -135 201 121 -128 97 101 -55 37 4 59 153 -75 -13 133
7419A33Oj06K12k90Q9j4r9L06j84M1M2m42L94p9j06J23J18l82K24L71l59J26O1
$$ 133 139 33 245 -45 44 30 -69 237 53 94 136 -306 88 9 -97 26 144 -238 -14 357 -2 124 185
7442A85l0K9j47k22L30k65K21o6k62P0J22J04k65K35m6o5K48l87K34o3On6J49
$$ 185 155 184 37 -185 145 -120 101 35 -227 -157 -35 69 -196 39 -7 -72 176 -211 23 -40 -34 -90 59
7465E9o0P1k10K46q7l2mk05J66qk5q5L81l69L65j31k4J0l48R8J38l6K33Oj77R7
$$ 59 -1 70 -140 106 19 -13 -17 -222 -56 -64 -89 -174 207 -162 203 72 48 58 -290 -192 -54 -90 143 149 -28 69
7491F9n9l3m8j2J10L6k19J76J90k80R9J58k97K21k85J80q0J02m7j25kJ38n9M6
$$ 69 10 -23 -71 -83 27 63 -156 20 210 -70 29 187 -110 111 -174 6 -74 28 -19 -144 -146 -8 -67 -21
7515b1O0m6M6J75k65j2K22k51j96N08k91L0j32j06L46j99J6J26J50j22L26j87
$$ -21 39 -7 39 214 -51 -63 159 -92 -288 220 -71 -41 -173 -279 67 -132 -116 10 160 38 364 177
7537A77k08K03l57K20m5l4J28m2j10K22m49O6K93j78J29K1j81J68Q7j94J14l2
$$ 177 -31 172 -185 35 -10 -44 84 42 -68 154 -295 -229 64 -114 15 36 -145 23 110 -84 30 -2
7559bj13J61k11J18R9k09K98n8jp2J4j55p1J46J8J17Nk66K77p3J29o9nlQ7l06
$$ -2 -115 46 -165 -47 52 -157 141 83 82 10 24 -131 -202 -56 -38 79 84 -182 95 22 151 82 77 74 161 -145
7585a45K01k79J30J64k36P5J57q2Q9n3j25J55k47N3J47j08O0j8P5O8K6j79L5J84
$$ -145 56 -223 -93 71 -165 -90 67 -15 74 21 -104 51 -196 -143 4 -104 -44 -62 13 81 107 -72 -37 147
7609A47j14o3J09k5J03k84L07k84J11O1j25o0kN1m3J14R1j98K26l07K81j92n7
$$ 147 33 -30 79 54 157 -127 180 -104 7 68 -57 -117 -119 -68 -111 3 94 -104 122 -185 96 -96 -153
7632a53P1R1k92N03j17l02J11nJ0M1P5K7o9n2K16p1j50M6L4k57L43j35k03L34
$$ -153 -82 9 -283 220 103 -199 -88 -93 -83 -42 33 60 -9 -61 155 84 -66 -20 14 -243 100 -35 -238 96
7656I6j64j66P0K20L3J25k72K8r3Q1J11R8j96J66j22j39J93l13K48q7k5Q4M5Q6
$$ 96 -68 -234 -164 56 89 214 -58 -30 -123 -42 69 167 -29 137 15 -124 69 -244 4 -83 -108 -24 21 107
7680A07j59K02j50k5J7q6J81k91K27j01M2M6N3o2J54n4j13N7k17L75k02j75L6
$$ 107 -52 150 0 -25 -8 -94 87 -204 23 -78 -36 10 63 1 155 101 -12 45 -172 203 1 -174 -138
7703a38K76k40L9k1J19r6M4M5qJ3j13J27j39J07J4k30L04r5r7J65l14K57M4k79
$$ -138 138 -102 -63 -84 35 -61 -17 28 20 33 -80 47 -92 15 29 -201 103 8 -89 76 -238 19 63 -216
7727b16M05j10j20m2J83j46P2J4J03k92R7kl2n0J55j1M0Q4j3k59K86k45r1L60
$$ -216 189 79 -41 -83 100 -46 26 40 143 -149 -52 -54 -86 -136 19 8 48 132 119 -140 146 -99 -190 170
7751A70k44J74p7m0J57j27k39L37r3j00J9K2j59J86k43K37N6J53j70N3k20L93
$$ 170 -74 100 23 -17 140 13 -226 111 18 -82 -63 -41 -200 -14 -257 -20 36 189 19 72 -148 245
7773B45j31j10K28j63l4Q7k72K67j70j73K57Q9L3j46n9j84J49J35J67m9k36J79
$$ 245 114 4 232 69 35 122 -150 117 -53 -226 31 120 153 7 -52 -236 -87 48 215 166 -70 109
7795A09l2j64J86L8k74P9J40k79J76j18R8J05k27J33J08r8NQ0j50L85l28J13J30
$$ 109 77 -87 99 137 -137 -58 82 -197 -21 -139 -41 64 -163 -30 78 -20 -15 65 -85 300 -28 85 215
7818B15j20p6J55m34K54J74k61R0q0K18k8k21Q0J04o5l31M80n8j02j05M5J30p0
$$ 215 95 19 174 -260 -6 168 -93 -3 -83 135 107 -114 -34 70 5 -326 154 96 -6 -111 -66 64 -6
7841fl9K5roK34k79N5K71k38K38j86P0P1k81J56q3k5k09J25j52J10J42L6M6o2
$$ -6 -45 -20 -29 -35 199 -80 -25 246 8 246 60 130 201 -80 76 -7 -32 -241 -116 -268 -158 -16 20 66 4
7866DR4j4q3n2P3r3J29J39l66N7J70j39K78k11J8K6Pj28K60l59J73J19k84J63
$$ 4 98 84 1 -51 22 -71 58 197 -169 -112 58 -81 197 -14 4 30 37 -91 169 -190 -17 102 -182 -19
7890a9l2J26j77L46l21J46j48J20r4O1jP5O5j15J75k50J07r0J73rj28j53L07m3
$$ -19 -51 75 -102 244 -77 69 -79 41 -53 8 7 82 147 32 207 -43 64 -26 147 138 10 -143 164 121
7914A21j37J59k39O0J85k3k05K8J4J34q3m3J97k70R7k0J4k3J22m1K9j73P7J64
$$ 121 -16 143 -96 -36 149 126 -79 -51 -37 97 14 -29 168 -102 -5 -25 -11 -34 88 47 76 -97 -20 144
7938A44k98P3J3O0q4K26k72J48J9n0J20o9O8K04l86O4m4j88M43j61k81K21J01
$$ 144 -154 -81 -68 -8 -92 134 -138 10 29 -21 99 30 98 302 -84 -20 -64 -252 191 30 -251 -30 71
7961G1k15N7l0K26j79k67M64m2k6j62o5J77j65Q6m0K82m05L33J48l70k67M02J16
$$ 71 -144 -87 -117 109 -70 -337 127 85 59 -103 -168 9 -156 -70 -110 172 -233 100 248 -122 -389 13 129
7984A29o6O9j95RJ7P2M3j33l20M13p4rJ55l02K67j95j19L89k65o0J26m4J60j16
$$ 129 63 132 -63 -54 -37 35 78 -55 -375 38 -36 -45 110 -192 75 -120 -239 150 -115 -175 -49 -93 67 -49
8008d9Q9r7L4J41j59K15j93QJ39n04M04j14J44J9j90J97j40o7L77j37m82L72R0
$$ -49 40 -57 -23 118 -41 174 -19 -11 128 -376 28 -86 58 77 -113 84 -56 -123 254 117 -365 7 97
8031I7o7R6L0j09m6r1O8j97J16J08k75j8K56p5Q8Q4k23L57k59O2j58J4K11j61
$$ 97 30 126 156 47 1 -90 -22 -219 -103 5 -270 -288 -32 -107 -19 65 -158 199 -60 2 -156 -142 69 -92
8055i2L5Q2Q5j11k1J4J36N9j15k41K03k2l4J13J12k73J78m7QR8k70j36K13j64
$$ -92 -57 25 110 -1 -22 -8 128 187 72 -169 34 12 -22 91 203 -70 108 61 69 167 -103 -239 -26 -190
8079a90Q7J19p2Q4j51n8J83Q5j52R8q7K8j79J84k8k2R1p6QN8j12k5l5J63K4R7
$$ -190 -103 16 -56 28 -123 -181 2 87 -65 33 -54 -26 -205 -21 -49 -71 20 -56 -48 10 -102 -127 -162 1 25 122
8105A22J13k47L08l46l1R6l2j01J28OJ81L8l41q5M15k91l7K09M5j84j1N1M3k78
$$ 122 235 -12 296 -50 -81 15 -17 -118 10 16 197 235 -106 -191 224 -67 -104 105 150 -34 -45 6 49 -229
8129b29J21L18m95M61k05j26K26j37l48O09k56JJ0j1J2J21l0L2o2k63L20k64Q1
$$ -229 -108 210 -285 176 -29 -155 71 -66 -414 195 -61 -60 -50 -61 -49 72 42 74 12 -251 69 -195 -114
8152a14j3Q0n1pL1Q2J0j21K43j94k3J76k57J55L7J43k78mn5L09j85j12O8R5PJ12
$$ -114 -127 -47 -98 -105 -74 8 18 -103 140 -54 -77 99 -158 -3 34 177 -101 -105 -160 149 -36 -148 -80 15 22 134
8178A34n7j53J17k56L94q0O9j50J8j46M4P9r4
$$ 134 77 -76 41 -215 179 99 168 18 36 -110 -66 13 -81
8191h1
$$ Imaginary data points
##PAGE= N=2
##DATA TABLE= (X++(I..I)), XYDATA
0@%%%%%%%%%%%qJ6j6J6k4L2m0N3o1P2q8J04j27J51j76K08k40K73l13L60m11M68
$$ 0 0 0 0 0 0 0 0 0 0 0 0 -8 8 -8 8 -16 16 -24 29 -32 40 -48 56 -71 80 -96 112 -128 145 -168 192 -219 249
33B49n30O01o80P65q59R61j073J196j331J477j637J814k006K213k441K690k962
$$ 249 -281 320 -360 405 -454 507 -566 630 -701 776 -861 953 -1053 1160 -1281 1409 -1553
50a553L263l596L965m370M824n333N907o564P321q206R254j0519J2083j4075J6710
$$ -1553 1710 -1886 2079 -2291 2533 -2800 3107 -3457 3864 -4342 4912 -5607 6476 -7599 9111
65I111k0379K5878l5125N4554j66946K20182J12495m29852J89359K02158j76783
$$ 9111 -11268 14610 -20515 34039 -132907 87275 199770 -230082 -40723 161435 -15348
76a5348j09914J80411L6940j61451J7112J77787j48830o8693J79611o0941r6097
$$ -15348 -125262 55149 92089 -69362 -52250 125537 -23293 -91986 87625 26684 -69413
87f9413J16647k9978m3997K2595p022M0091m5318m7102J31645n3043j01625J31131
$$ -69413 47234 17256 -26741 -4146 -11168 28923 -16395 -63497 68148 15105 -86520 44611
99D4611J043j02729O7451L7008n5569l0338O5961M1898j32401K6815J61815j65875
$$ 44611 45654 -57075 10376 47384 -8185 -38523 27438 69336 -63065 -36250 125565 -40310
111d0310o7477K11767j00178j23240J74837o229j22194O0902O4474n0684o3473
$$ -40310 -107787 103980 3802 -119438 55399 49170 -73024 -12122 52352 1668 -61805
122f1805P6198N6250j31302L1795J24593j23277j9963J15415o5468k4990L4460
$$ -61805 14393 70643 -60659 -28864 95729 -27548 -47511 67904 2436 -22554 11906
133A1906k8039L2786k4929l3731P4261l7820l4101P1226m0724j9643N4176k5228
$$ 11906 -16133 16653 -8276 -42007 32254 -5566 -39667 31559 -9165 -28808 25368 140
145A40p094L904O155L2287o3010J3813Q6509j02850j3070J14434q9179l5279R3862
$$ 140 -6954 -3050 3105 35392 -27618 -13805 72704 -30146 -43216 71218 -17961 -53240 40622
158D0622m5082k5569M2005r867n907j3660K2469K0479o5536M2251N2459r1440
$$ 40622 -4460 -30029 11976 2109 -3798 -17458 5011 25490 -40046 2205 54664 -36776
170c6776L2545N7272p7413K7236K7903n4955L3807j860k9401L5301k6527K670
$$ -36776 -4231 53041 -24372 2864 30767 -24188 9619 7759 -21642 13659 -12868 -10198
182a0198L1180m9508K2848K7014m8619K8451O916k1719L7550l5050J80N6397o3294
$$ -10198 20982 -28526 -5678 21336 -27283 1168 8084 -13635 23915 -11135 -10955 45442 -17852
195a7852K952N7918o2254Q814L6274n0524K1996J5813l0594K0264j2447M167K0671
$$ -17852 -14900 43018 -19236 -10422 25852 -24672 -2676 13137 -17457 2807 -9640 -5473 15198
208A5198m6718L2085L0229o3033L7652K3948n4246M1226K686m0651M2642j4828
$$ 15198 -31520 565 30794 -32239 5413 29361 -24885 16341 19027 -21624 21018 6190
220F190k2642L0843k4295R165J3008l9975L4599N128m3296L9450o661k0706M0249
$$ 6190 -16452 14391 -9904 -739 12269 -27706 6893 12021 -31275 8175 1514 -19192 21057
233B1057l2155L14M3845m5841R266L1198m3203K2704Q929l7023L3598p231k1511
$$ 21057 -11098 -10784 33061 -12780 -3514 27684 -15519 7185 16114 -20909 12689 5458 -16053
246a6053K9001k4986N614K3102m5870K6304K2723m7140L2296Q514l1885L8383
$$ -16053 12948 -12038 -6424 16678 -29192 -2888 19835 -27305 4991 13505 -18380 20003
258B0003j5977j9897M1997k6817p937K7161k9644J6511O819l5669L4993m626l1705
$$ 20003 4026 -15871 26126 -691 -8628 18533 -11111 5400 12219 -23450 11543 6917 -24788
271b4788L6131j7346j1134L5058l3447O340L1908l7285J6049J4868l0747K9295
$$ -24788 11343 -6003 -17137 17921 -15526 -9186 22722 -14563 1486 16354 -14393 14902
283A4902n679k6500L5930j6151j3012K5492k6832J1416J4805m0968K7444J1831
$$ 14902 9223 -17277 18653 2502 -10510 14982 -11850 -434 14371 -26597 847 12678
295A2678l8324L0699j134k0466L3368k0882o583L2739k8739N616J7031k8953K4664
$$ 12678 -25646 5053 3919 -16547 16821 -4061 -10644 22095 -6644 -1028 16003 -12950 11714
308A1714k57l1144L4985j0268k2714L0703k2262k181K6383l4074J2858K0854l1460
$$ 11714 11457 -19687 15298 5030 -17684 13019 -9243 -11424 14959 -19115 -6257 14597 -16863
321a6863K1508K605k2273L2413j4947j6697L4937k1113m835K0672k5982J6499
$$ -16863 4645 7250 -15023 17390 2443 -14254 20683 -430 -5265 15407 -10575 5924
333E924O840l4165K8580J82k8228K9261j1863j0832K9662k4349M52K4621k5359
$$ 5924 12764 -21401 7179 7361 -20867 8394 -3469 -14301 15361 -8988 -8536 16085 -9274
346i274J2024P289k2816K8247p966k3149L3609j5302j2935K4708k4777N276J8108
$$ -9274 2750 10039 -12777 15470 7504 -15645 17964 2662 -10273 14435 -10342 -5066 13042
359A3042l1436J6039J0495k4904K2362o558j3261L0698k0990p070K9738k3531
$$ 13042 -18394 -2355 8140 -16764 5598 -960 -14221 16477 -4513 -11583 18155 -5376
371e376M334J5001k4760K0403J150k6753K7185p830j7417K5262j9792j867K4522
$$ -5376 -1042 13959 -10801 9602 10752 -16001 11184 3354 -14063 11199 -8593 -10460 14062
384A4062k7706P412J7669k2969J5639K13j7150K7777j2856j3257K8518j8407k623
$$ 14062 -13644 -6232 11437 -11532 4107 4320 -12830 14947 2091 -11166 17352 -1055 -3678
397c678J8781k5631J2068J1103k9085J8485L274j8804K0342j2087o281K5201k2764
$$ -3678 15103 -10528 1540 12643 -16442 2043 5317 -13487 6855 -5232 -11513 13688 -9076
410i076P99K1920k2225J1326P425k1488K3383l276k0588K4540j1019q456J9120
$$ -9076 -8277 13643 -8582 2744 10169 -11319 12064 8788 -11800 12740 1721 -6735 12385
423A2385k2721O154J6834k7457J2640R619k0943J8628n565j2420K5796j5905o196
$$ 12385 -10336 -4182 12652 -14805 -2165 7454 -13489 5139 -426 -12846 12950 -2955 -9151
436i151K2934j8542N702J1704k3944J8563L504k5074K0957l485j3493J8805j6166
$$ -9151 13783 -4759 943 12647 -11297 7266 10770 -14304 6653 3168 -10325 8480 -7686
449g686k29J9505k3269O967J3106k0382J6631N73j7992K4994p243j3966K1651
$$ -7686 -7915 11590 -11679 -4712 8394 -11988 4643 5216 -12776 12218 4975 -8991 12660
462A2660j3059j210J3358k0991J0939Q951k3903J5952J040j6153J9906j1645p878
$$ 12660 -399 -1609 11749 -9242 1697 10648 -13255 2697 3737 -12416 7490 -4155 -12033
475a2033K3585j7232j641J6572j6337J1009M672j9838K1405j745j8571J9922q800
$$ -12033 11552 -5680 -7321 9251 -7086 3923 8595 -11243 10162 8417 -10154 9768 968
488I68o798J6213j8547M586J3674k1949J1206N438j7528J8894o015j3513K5170
$$ 968 -5830 10383 -8164 -3578 10096 -11853 -647 4791 -12737 6157 142 -13371 11799
501A1799j1488q678J9241j3329L988Q277j8969J4837K694j8422J6893n996r962
$$ 11799 311 -8367 10874 -2455 1533 9810 -9159 5678 8372 -10050 6843 847 -9115
514i115J9016j6720l020K0177j8770L034J1783j6043J3651O40j5294K0243n566
$$ -9115 9901 -6819 -9839 10338 -8432 -5398 6385 -9658 3993 4633 -10661 9582 4016
527D016j1297J7638j1411m13J2308j8854Q947P917j9357J3461j012j3070J9172
$$ 4016 -7281 10357 -1054 -1467 10841 -8013 934 8851 -10506 2955 1943 -11127 8045
540H045j1377r268K2867j3484l590J4963j3575Q096M882j6082J5901j507j2694
$$ 8045 -3332 -12600 10267 -3217 -6807 8156 -5419 2677 7559 -8523 7378 5871 -6823
553f823J6250j0926l320J6828k0158K954J5363k0249P773O864j5235J5526l862
$$ -6823 9427 -1499 -4819 12009 -8149 -5195 10168 -10081 -2308 4556 -10679 4847 985
566I85j2009J9369p737o044J3984j2041N318P512j7736J3072K743j5817J5475
$$ 985 -11024 8345 608 -5436 8548 -3493 1825 9337 -8399 4673 7416 -8401 7074
579G074p074r023J9079j5249m666J8842j5077J071J0172j2820J0772Q32j2092
$$ 7074 0 -9023 10056 -5193 -9859 8983 -6094 -5023 5149 -7671 3101 3933 -8159
592h159J5686n477o413J4230j3494L096J2420k0420P896J0324j8875J0666J090
$$ -8159 7527 2050 -4363 9867 -3627 -531 11889 -8531 -635 9689 -9186 1480 2570
605B570j2772J6121p228q789J6744r348j217R652j2004R942L272j5121J5074k173
$$ 2570 -10202 5919 -1309 -10098 6646 -2702 -3919 5733 -6271 3671 6943 -8178 6896 4723
619D723j1009J5755j1088l671J6940j7889p6J5053j5904M854N409j1906J2479
$$ 4723 -6286 9469 -1619 -5290 11650 -6239 -6315 8738 -7166 -2312 3097 -8809 3670
632C670k837r224J4870p576j574J0921j4121P884Q716j9155J1429M927j5766J2868
$$ 3670 833 -8391 6479 -1097 -2671 8250 -5871 2013 10729 -8426 3003 7930 -7836 5032
646E032l815r910J6175j0273n290J3806j0656K646N571j1148J2105r16j1710J5742
$$ 5032 1217 -8693 7482 -2791 -8081 5725 -4931 -2285 3286 -7862 4243 3327 -8383 7359
660G359o010n939J4740j3385Q53J4316j7910L708J0044j4260P524L44r715J3429
$$ 7359 1349 -4590 10150 -3235 -2382 11934 -5976 -2268 7776 -6484 1040 1384 -8331 5098
674E098o658o203J3454r993K539Q075j4103J1033M803j6027J3346n4j1091J3600
$$ 5098 -1560 -7763 5691 -4302 -1763 6312 -7791 3242 8045 -7982 5364 5310 -5781 7819
688G819q317n023J4523j2743j073J0431j1205N381J538j0113J3476m577q152J4694
$$ 7819 -498 -5521 9002 -3741 -4814 5617 -5588 -207 1331 -8782 4694 117 -8035 6659
702F659q637j213J2457j4654M937J1124j6445O730N628j1737R156l906o405J2552
$$ 6659 -1978 -3191 9266 -5388 -451 10673 -5772 958 6586 -5151 4005 99 -6306 6246
716F246r556j988J0394j1205N500M766j3670J3011J343j2947J3776l148o780J2824
$$ 6246 -3310 -5298 5096 -6109 -609 4157 -9513 3498 4841 -8106 5670 2522 -4258 8566
730H566j0540n46J1867j3402K910O330j0673Q280k465q675J3841p123n291J2611
$$ 8566 -1974 -2520 9347 -4055 -1145 5185 -5488 2792 327 -8348 5493 -1630 -6921 5690
744E690j0124K409R333j4598Q363P253j4379R232J410q381J0112p075l416J1718
$$ 5690 -4434 -2025 7308 -7290 1073 8326 -6053 3179 4589 -3792 6320 -755 -4171 7547
758G547j1294J090P021j1416Q498Q78j2291J3994j900j0071J2963n933k212J0655
$$ 7547 -3747 -2657 4364 -7052 1446 2324 -9967 4027 2127 -7944 5019 -914 -3126 7529
772G529j1406L444Q653j2626O248K363r257J0504n813o330J2924r146k224R990
$$ 7529 -3877 -433 8220 -4406 1842 4205 -5052 5452 -361 -6691 6233 -2913 -5137 4853
786D853j1086N717N526j3717J0697L119j1583J0486k134n191J0686r609M60R598
$$ 4853 -6233 -516 5010 -8707 1990 5109 -6474 4012 1878 -3313 7373 -2236 -1776 7822
800G822j1805M347L658j0734J0715k913j0302J3976n177o603J1599q168J608P915
$$ 7822 -3983 364 4022 -6712 4003 1090 -9212 4764 -413 -7016 4583 -3585 -1977 5938
814E938j1678O639N245j0732Q677j932o129J1463q492l482J1925j0631N49O913
$$ 5938 -5740 899 6144 -4588 4089 2157 -3972 7491 -1001 -4483 7442 -3189 -2640 4273
828D273j0833P430K131j1943J1701j032q040J0630n741j161R645j0715L319P153
$$ 4273 -6560 870 3001 -8942 2759 1727 -6313 4317 -1424 -2585 7060 -3655 -336 6817
842F817j0759O686K19q503J1740n906p441J3237p989k957R107r572M249N367j1201
$$ 6817 -3942 2744 2963 -5540 6200 294 -7147 6090 -1899 -4856 4251 -5321 -1072 4295 -6906
857f906Q573J618q169R726m740l297J1589j0782R7R997j1261L640M117j0191R277
$$ -6906 1667 3285 -4884 4842 102 -3195 8394 -2388 -2291 7706 -3555 85 4202 -5989 3288
872C288j534r610J1496m393m421R235p951K254P668j1260O157M262r475Q573k626
$$ 3288 1754 -7856 3640 -753 -5174 4061 -3890 -1636 6032 -5228 929 5191 -4284 4289 1663
887A663o045J1675p965m027J1365r090j49O566r864O315K382r996R141j344n338
$$ 1663 -4382 7293 -672 -4699 6666 -2424 -2573 3993 -5871 444 2826 -7170 1971 627 -4711
902d711R126o972O1J0052j1171K785P524j0290O180O00q423J0045l840p119J0489
$$ -4711 4415 -2557 -2496 7556 -3615 -830 6694 -3596 2584 3184 -5239 4806 966 -6153 4336
917D336n960j931P224r297M935N016j0703P903J166p101R419n144l370J1382r474
$$ 4336 -1624 -3555 3669 -5628 -693 4323 -6380 1523 2689 -4412 5007 -137 -3507 7875 -1599
932a599j023R241r720L279L640r620Q300p86q272R325l918k725P992q768K851
$$ -1599 -2622 6619 -3101 178 3818 -5802 2498 1712 -6560 2765 -1153 -3878 4114 -4654 -1803
947a803P865j1207N665M183q588P907j974o207J0466o076m263Q931p587J387M871
$$ -1803 6062 -5145 520 4703 -3885 4022 2048 -4159 6307 231 -4032 4899 -2688 -1301 3570
962C570r724P093J924r690Q823j639m908R468p448k76J0008j0078J953O722q880
$$ 3570 -6154 939 2863 -6827 1996 357 -4551 4917 -2531 -2807 7201 -2877 -924 5798 -3082
977c082N582M72q065R579l424o276Q966o098k41O347r880N514N241j0701P293
$$ -3082 2500 2972 -5093 4486 1062 -5214 3752 -2346 -2587 3760 -6120 -606 4635 -6066 1227
992A227J346p176R412m601m033J0526p587j128P278p944L634K337r079Q373q54
$$ 1227 2573 -4603 4809 208 -3825 6701 -886 -2014 5264 -2680 954 3291 -5788 2585 1731
1007A731p632Q682m047k558Q473q862J961P882r544L955L754p332P606k295n931
$$ 1731 -5901 2781 -1266 -3824 4649 -4213 -2252 5630 -3914 41 3795 -3537 4069 1774 -4157
1022d157R645n189l303P383p332K576M154j0256P112K376r304Q086j573m469R056
$$ -4157 5488 299 -3004 4379 -2953 -377 3777 -6479 633 3009 -6295 1791 218 -4251 4805
1037D805o653j197R091q175J820M710p739O554n62p869R394l286n616Q533o359
$$ 4805 -1848 -3045 6046 -2129 -309 4401 -3338 3216 2654 -5215 4179 893 -4723 3810 -2549
1052b549q4O889r579L983N591r269O037J029n756Q433m710l281R114o696k76N825
$$ -2549 -2633 4256 -5323 -1340 4251 -5018 1019 2048 -3708 4725 15 -3266 5848 -848 -1124 4701
1068D701q136N123J900r302P890j87p387P911m118k184Q270p913J092P102p865
$$ 4701 -3435 1688 3588 -5714 2176 1989 -5398 2513 -1605 -3789 4481 -3432 -2340 4762 -3103
1083c103L618K318o311P651k712n579R419n336k737P390q062K704M996r752N144
$$ -3103 515 2833 -3478 4173 1461 -4118 5301 -35 -2772 4618 -3444 -740 4256 -5496 -352
1098c52L143p724O359j667l405Q211o415n01P506p468K574L859q042O992P7q274
$$ -352 2791 -4933 1426 -241 -3646 4565 -1850 -2351 5155 -2313 261 4120 -3922 3070 3147 -5127
1114e127Q913k686n290P626n841l4O507q490L226M506p485N557n62m542Q643m716
$$ -5127 3786 1100 -4190 3436 -2405 -2439 4068 -4422 -1196 3310 -4175 1382 820 -3722 4921 205
1130B05l458Q743o688K37N491q056M596K881r036O306N07n951O269l737j371P087
$$ 205 -3253 5490 -1198 -961 4530 -3526 1070 3951 -5085 1221 1728 -4223 2046 -1691 -3062 4025
1146D025p391J460N897p432M691J277o722Q448k375n901Q612m294k397O026p133
$$ 4025 -3366 -1906 3991 -3441 1250 2527 -4195 4253 1878 -4023 4589 295 -2102 3924 -3209
1161c209K566M350q548M833J809n993O217k729l074Q442o225r35P658p314K648
$$ -3209 -643 3707 -4841 -8 1801 -4192 2025 -704 -3778 4664 -1561 -2496 5162 -2152 496
1176D96L480p846O621N86p472O848j957l883O110n499M33N680p807L361L474o805
$$ 496 3976 -3870 2751 3337 -4135 2713 756 -3127 2983 -2516 -2083 3597 -4210 -849 2625 -4180
1192d180O465j152n432Q908m155l511P618n052k58M742p343M395K160p612N709
$$ -4180 2285 1133 -4299 4609 454 -3057 4561 -491 -749 3993 -3350 1045 3205 -4407 1302
1207A302n26m321O346m892j115P243p212J252N576o943M780J088o526P748j657
$$ 1302 776 -3545 2801 -2091 -3206 4037 -3175 -1923 3653 -3290 1490 2578 -3948 3800 2143
1222B143n509O985l566j641N147o767K539L974p645M673J104n762O921l263l418
$$ 2143 -3366 3619 53 -1588 3559 -3208 -669 3305 -4340 333 1437 -4325 2596 -667 -4085
1237d085Q604n819j230O491n888K299L097o757N458N35o019N801k314k735N927
$$ -4085 4519 -1300 -2530 3961 -1927 372 3469 -3288 2170 2705 -3314 2487 173 -2562 3365
1252C365o188R10N666p668K940L462o239N693r44m990P999l400l187O429m902
$$ 3365 -2823 -1913 3753 -3915 -975 2487 -3752 1941 997 -3993 4006 606 -2581 3848 -1054
1267a054R05L906o950M375J896p050N597j253l874O492m785j562P307o190K60
$$ -1054 -149 3757 -3193 1182 3078 -3972 1625 372 -3502 2990 -1795 -3357 3950 -2240 -1980
1282a980M826n748M365Q41n917O982j670m502O408m327l42M646o829K749L788
$$ -1980 2846 -2902 1463 2304 -3613 3369 1699 -2803 3605 -722 -1064 3582 -3247 -498 3290
1297C290p212M019J038n015O211k713l490P522m679r46N314n515L228K208o427
$$ 3290 -3922 97 1135 -3880 2331 -382 -3872 3650 -1029 -1975 3339 -2176 1052 3260 -3167
1312c167N204M53n506N660k800k173N910o109K60N606o484K384K496n028N337
$$ -3167 2037 2490 -3016 2644 -156 -2329 3581 -2528 -2268 3338 -3146 -762 1734 -3294 2043
1327B043j118m610O870k792k388N457n009J699L648p292M243K072o361M859j104
$$ 2043 925 -3685 3185 393 -1995 3462 -1547 152 3800 -3492 751 2823 -3538 1321 217
1342B17l598O448m561j614O063m962R64L586n516M424P13n695O342j134m038N631
$$ 217 -3381 3067 -1494 -3108 2955 -2007 -1043 2543 -2973 1451 2164 -3531 2811 1677 -2361 3270
1358C270m160k59N112p012K274L745o176L463N34m471N939k483l218O432l997
$$ 3270 -890 -1149 3963 -3049 -775 2970 -3206 257 791 -3680 2259 -224 -3442 2990 -1007
1373a007m25M493n289L133K251o522N120O19m925N058k846j882N619n542O5M927
$$ -1007 -1432 3061 -2228 905 3156 -3366 1754 2373 -2552 2506 -340 -2222 3397 -2145 -2080 2847
1389B847n470K104J819m846N557r07m518O220k470j710M632m769J388M041o603
$$ 2847 -2623 -519 1300 -3546 2011 1104 -3414 2806 336 -1374 3258 -1511 -123 3918 -2685
1404b685K844K141n074M334j611l019N815m081j306N371m861J325K938n132M749
$$ -2685 159 2300 -2774 1560 -51 -3070 2745 -1336 -2642 2729 -2132 -807 2131 -3001 1748
1419A748P28n585N365r99l166N153m264j72M937o081J435L089m956L167j05l838
$$ 1748 2476 -3109 2256 1257 -1909 3244 -1020 -1192 3745 -2336 -901 2188 -2768 399 294 -3544
1435c544N741k296l166N895l546k07M185n343K826K580n662L805P03m124M326
$$ -3544 2197 -99 -3265 2630 -916 -1123 3062 -2281 545 3125 -2537 1268 1971 -2153 2173
1450B173k647j705N284m733k97M158m870K487J558m937N459o25m392N350k078
$$ 2173 -474 -2179 3105 -1628 -1925 2233 -2637 -150 1408 -3529 1930 1305 -3087 2263 185
1465A85j499M511m602J335L664n726K378J594m474M347j990k751N534l649j485
$$ 185 -1314 3197 -1405 -70 3594 -2132 246 1840 -2634 1713 -277 -3028 2506 -1143 -2628
1480b628M817m033J372K737n458M495R81m958M546j043k334M296l843p2M333n199
$$ -2628 2189 -1844 -472 2265 -3193 1302 2283 -2675 1871 828 -1506 2790 -1053 -1125 3208 -1991
1496a991J332K866m907L491k62m081N673j903l071M988k910L9L552n056K754K539
$$ -1991 -659 2207 -2700 791 529 -3552 2121 218 -2853 2135 -775 -736 2816 -2240 514 3053
1512C053n098L128K99l485M406k826j588M996m465j54L622m369K723R70m653M908
$$ 3053 -2045 1083 1382 -2103 2303 -523 -2111 2885 -1580 -1734 1888 -2481 242 1212 -3441 1467
1528A467j76l980M717j992r87L889m527J224L674n295K454J214l946M198k096
$$ 1467 1291 -2689 2028 36 -951 2938 -1589 -365 3309 -1986 468 1682 -2264 1934 -162
1543a62k878N294k953j660M322l718J372K258m437L603R35m286M018j146j865
$$ -162 -3040 2254 -699 -2359 1963 -1755 -383 1875 -2562 1041 1976 -2310 1708 562 -1303
1558a303M311l824o44M439m430Q12K332m257L820l43m429N035j466k433M242k904
$$ -1303 3008 -816 -1460 2979 -1451 -639 1693 -2564 1256 913 -3516 1519 53 -2380 1862 -1042
1574a042L38L455m853K493K101m494L483n25k787M426k879k208N234l854l48L068
$$ -1042 -704 2751 -2102 391 2492 -2002 1481 956 -1831 2595 -284 -2492 2742 -1112 -1460 1608
1590A608l897K532J159m309L991q6l301M122j995o41L925m603Q64L527m533K105
$$ 1608 -2289 243 1402 -2907 1084 998 -2303 1819 -176 -817 3108 -1495 -631 2896 -1637 468
1606D68Q31l735M127j428l003M627k605j249L527l405J731K243m888L622J034
$$ 468 1299 -2436 1691 263 -2740 1887 -718 -1967 1560 -1845 -114 2129 -2759 863 1897
1621A897l788L809j506j899M486l636r38M265l829M32K151m061L545j35l764M129
$$ 1897 -1891 1918 412 -1487 2999 -637 -1575 2690 -1139 -707 1444 -2617 928 793 -2971 1158
1637A158j109j837L517l022Q06L428m867K014K151m038L057j89l049M554k500
$$ 1158 49 -1788 1729 -1293 -487 2941 -1926 88 2239 -1799 1258 1069 -1980 2574 74
1652G4k018M051l207P0K442l871K599J138m221L855j57k765M012k556n52M246
$$ 74 -1944 2107 -1100 -1030 1412 -2459 140 1278 -2943 912 755 -2010 2002 -554 -1106 3140
1668C140m282L69L404m119J989O57l565M053j178k887M040k318q16L220l775J672
$$ 3140 -1142 -773 2631 -1488 501 1158 -2407 1646 468 -2419 1621 -697 -1513 1707 -2068 -396
1684c96K570m562K840J203l267L533j518j872M187l148r37L362l074Q71J390l565
$$ -396 2174 -2388 452 1655 -1612 1921 403 -1469 2718 -430 -1367 1995 -1079 -208 1182 -2383
1700b383L269J54l833L730r16j527L268l479Q45L753m398J551K156l731K994n92
$$ -2383 886 1040 -2793 937 21 -1506 1762 -1717 -872 2881 -1517 34 2190 -1541 1453 861
1716H61k865M149k096j882L599k907L13K178l956K781J378m272L512l4k479L572
$$ 861 -2004 2145 49 -1833 1766 -1141 -828 1350 -2606 175 1553 -2719 793 759 -1720 1852
1732A852k173q88L863l319J34K563l206K017K47l421L992j169k965L973k164p37
$$ 1852 -321 -1209 2654 -665 -531 2032 -1174 843 1090 -2331 1661 492 -2473 1500 -664 -1401
1748a401L107l714J354K671m077K382R53k893L432j566j814M116k901m74K717
$$ -1401 1706 -2008 -654 2017 -2060 322 1275 -1618 1814 248 -1566 2550 -351 -825 1892
1763A892l326J581J416l946L338M1l554L669j281j247L287l048L11L266l683J164
$$ 1892 -1434 147 1563 -2383 955 996 -2558 1111 -170 -1417 1870 -1178 -867 2399 -1284 -120
1779a20J866l001K673o45k729L915j966j864L699k943M81K273l882K123J550l639
$$ -120 1746 -1255 1418 773 -1956 1959 -7 -1871 1828 -1115 -634 1639 -2243 -120 1430 -2209
1795b209K813l9k199L512k242p84L543l022J36K263l430K796J04l572L836r00
$$ -2209 604 565 -1634 1878 -364 -1148 2395 -627 -491 1772 -1658 1138 1242 -2330 1506 606
1811F06k628L331k096l14K794l426J067K465l494K272K07k192L304j621j677L710
$$ 606 -2022 1309 -787 -1101 1693 -1733 -666 1799 -1695 577 784 -1408 1896 275 -1402 2308
1827B308k550n07K654l334J524J330m058L061O06l150K931j143r50L045k839J47
$$ 2308 -242 -749 1905 -1429 95 1425 -2633 428 1034 -2116 815 -328 -1278 1767 -1072 -925
1843i25K946l329J524J459l307L239o71k873L846j876j502L112l011O39K269l943
$$ -925 2021 -1308 216 1675 -1632 1607 936 -1937 1909 33 -1469 1643 -1368 -729 1540 -2403
1859b403K218J572l340K501m68j771L913k454j201L618k968O18J906l321K691
$$ -2403 -185 1387 -1953 548 80 -1691 2222 -232 -1433 2185 -783 -165 1741 -1580 1111
1874A111K04l654L283m56k065K867k276j50K909l370J126J954l071K203M5k262
$$ 1111 1315 -2339 944 488 -1577 1290 -986 -1136 1773 -1597 -471 1483 -1588 615 660 -1602
1890a602L518j550j974L698k167q83K718l189J419J567l706K407N43k675K705
$$ -1602 1916 366 -1608 2090 -77 -960 1758 -1431 -12 1555 -2151 256 799 -1876 829
1905H29j561p00L389l171J12L188l123J588R23l075L036l20k865L068j247j418
$$ 829 -732 -1432 1957 -1214 -1102 2086 -1037 551 1474 -1601 1435 1115 -1750 1318 71 -1347
1921a347K847k833Q17K188l629J808J154k762K575q78j495L719k517r52L524k655
$$ -1347 1500 -1333 -516 1672 -1957 -149 1005 -1757 818 -60 -1555 2164 -353 -1305 2219 -436
1937d36K10J838l031K134N15l329L025o26j807K889k362m46L143l300R96J989
$$ -436 -226 1612 -1419 715 1230 -2099 926 300 -1507 1382 -980 -1426 1717 -1583 -587 1402
1953A402k940K178rk410L501j115j922L159k165l01K242l006J286J427l316K399
$$ 1402 -1538 640 631 -1779 1722 607 -1315 1844 -321 -622 1620 -1386 -100 1327 -1989 410
1969D10J93k509L038j865p52L337k551l78K931k904J371J087l144L114l79k668
$$ 410 603 -1906 1132 -733 -1485 1852 -699 -1077 1854 -1050 321 1408 -1736 1378 999 -1669
1985a669L036j249j210K643l021P20K354l518J722J073k565K823j154j636L275
$$ -1669 1367 118 -1092 1551 -1470 -750 1604 -1914 -192 881 -1684 1139 -15 -1651 1624
2000A624j686j172K864k487R75J655l291K235O96l368K681m83j486K551k215k29
$$ 1624 -62 -1234 1630 -857 118 1773 -1518 717 1413 -1955 726 243 -1243 1308 -907 -1136
2016a136K985l032N25J963k667K160J32k799L509j200j783K971k044L8K168l411
$$ -1136 1849 -1183 -658 1305 -1362 798 930 -1869 1640 440 -1343 1628 -416 -378 1790 -1621
2032a621J533J409l168J992M05k265K889j683j151L236k214j79K224k435J464
$$ -1621 -88 1321 -1847 145 550 -1715 1174 -509 -1660 1576 -638 -817 1407 -1028 436
2047D36R22k980K754j77k631K904j659o55K822k923L58K506l357J418J016k454
$$ 436 1358 -1622 1132 955 -1676 1228 -431 -1086 1736 -1187 -829 1677 -1680 -262 754 -1700
2063a700K616j004j634L269j400j260K648k338R29J825l434J851J069l025K467
$$ -1700 916 -88 -1722 1547 147 -1113 1535 -803 126 1951 -1483 368 1437 -1588 879
2078H79o49j516K662k228n22L136l022O67J922k942K591m06k252K959p80j558
$$ 879 230 -1286 1376 -852 -1374 1762 -1260 -593 1329 -1613 978 572 -1680 1279 499 -1059
2094a059K579j862k64K317l048J228J677l108J973k2j954K900j616j229K987j884
$$ -1059 1520 -342 -606 1711 -1337 -109 1568 -1540 433 411 -1543 1357 -259 -1488 1499 -385
2110c85l28J957k454J658J016k883K296l5k156K656j500r61K445k452K61K268
$$ -385 -713 1244 -1210 448 1464 -1419 877 842 -1314 1342 -158 -1119 1326 -1126 -865 1403
2126A403k949J449O50k199K518o42j946L126j325r84K414k319R57J603l321K009
$$ 1403 -1546 -97 553 -1646 872 230 -1716 1410 85 -899 1515 -804 153 1756 -1565 444
2142D44O34k041J905r66j398K822k068q15K806k545P57J718k768K107M19k711
$$ 444 1078 -963 942 -24 -1422 1400 -668 -1483 1323 -1222 -465 1253 -1515 592 1011 -1700
2158a700K957o49j536K486k201M58K024l226J127J799k914K123m97j833K710j408
$$ -1700 1257 608 -928 1558 -643 -185 1839 -1387 -260 1539 -1375 748 251 -1582 1128 -280
2174b80j291K961k106J9J960k521J565J406l126K028K25j969K272j713k23K311
$$ -280 -1571 1390 -716 -697 1263 -1258 307 1713 -1413 615 840 -1129 1143 -570 -793 1518
2190A518k634L81J975k514J328N69k252K631n16j966K753j430n47K251k410P52
$$ 1518 -1116 -735 1240 -1274 54 623 -1629 1002 486 -1480 1273 -157 -704 1547 -863 -111
2206a11J922l067J541O29k136K060q71j308K885k226o95K615k325O95J349k784
$$ -111 1811 -1256 285 914 -1222 838 -33 -1341 1544 -682 -1377 1238 -1087 -392 957 -1827
2222a827K523J57k372K567p81j031K093j953n0K250k474N30J263k100J717p0k025
$$ -1827 696 853 -1519 1048 267 -764 1329 -624 -674 1576 -898 -368 895 -1205 512 442 -1583
2239a583K622j087j328K630j844K29J783k644J754P85k692K121j20j514K157j556
$$ -1583 1039 -48 -1376 1254 -590 -361 1422 -1222 532 1317 -1375 746 626 -888 1269 -287
2255b87q43K595k287K10J859k452J156O55k321K409L7k110K397j264k03J986k273
$$ -287 -1130 1465 -822 -612 1247 -1205 -49 606 -1715 694 731 -1379 1018 -246 -449 1537 -736
2272g36N51J591k240J201N06k149K358r42j511K692j886n83K080j986R06J163
$$ -736 -185 1406 -834 367 873 -1276 1082 140 -1371 1321 -565 -1148 932 -1054 -148 1015
2288A015k225J723L12j834K046p89r95K031j699j99K027k299N37J396k265J648
$$ 1015 -1210 513 825 -1009 1037 248 -747 1284 -415 -614 1413 -886 -349 1047 -1218 430
2304D30J5k117K662j105j085K100j538P6J619k004J265Q83k154J466m7j506K257
$$ 430 445 -1672 990 -115 -1200 900 -638 -562 1057 -947 318 1201 -953 513 466 -1040 1217
2321A217j412q89K544k032k62J908k105J128N83k240K188k02j509K036j260j81
$$ 1217 -195 -1084 1460 -572 -834 1074 -1031 97 680 -1560 628 426 -1083 953 -307 -488
2337d88K056k284N61J754k347J259K85j953J973o97j284K174j405m88J761j878
$$ -488 1568 -716 -155 1599 -748 511 796 -1157 816 119 -1165 1009 -396 -884 877 -1001
2353a001Q54J226k308J695N28k110J817n00r66K264j780m53K047j842K83J112
$$ -1001 -147 1079 -1229 466 994 -1116 701 201 -765 1499 -281 -734 1313 -529 -246 866
2369H66k218J684l1j640K110q86r87J927j498J31J841k170Q16J388k167J505l01
$$ 866 -1352 332 301 -1339 771 -115 -1102 825 -673 -542 1299 -871 -55 1333 -834 671 370
2386C70j305K400j502j115K230j565j06J503k109J149O63j828J643K44j646J895
$$ 370 -935 1465 -37 -1152 1078 -487 -593 910 -1199 -50 613 -1215 428 672 -974 921
2402I21j031p07K147j957M13J350j819Q77N61j839J774p02j313K182r33q14J591
$$ 921 -110 -817 1330 -627 -214 1136 -683 194 755 -1084 690 -12 -1325 857 -76 -890 701
2419G01j801P77J302k216J231Q44j840J863o90r83K185j518m40J808j847M65Q46
$$ 701 -1100 -323 979 -1237 -6 838 -1002 861 171 -812 1373 -145 -585 1223 -624 -159 687
$$ [...]
8191a53
##END NTUPLES=NMR FID
##END=
