##TITLE=1H_71-2024
 CDCl3
 8 sc, 
 6.9.2024
##JCAMPDX= 6.0         $$ Bruker NMR JCAMP-DX V2.0
##DATA TYPE= NMR FID
##DATA CLASS= NTUPLES
##ORIGIN= UXNMR, Bruker Analytische Messtechnik GmbH
##OWNER= root
$$ XWIN-NMR		Version 3.5
$$ Fri Sep  6 13:55:09 2024 Russian Standard Time (UT+4h)  she@DPX200
##.OBSERVE FREQUENCY= 200.1318
##.OBSERVE NUCLEUS= ^1H
##.DELAY= (6, 6)
##.ACQUISITION MODE= SIMULTANEOUS
##.ACQUISITION SCHEME= undefined
##.AVERAGES= 8
##.DIGITISER RES= 18
##SPECTROMETER/DATA SYSTEM= spect
##.PULSE SEQUENCE= zg30
##.SOLVENT NAME= CDCl3
##.SHIFT REFERENCE= (INTERNAL, CDCl3, 0, 15.7039)
##AUDIT TRAIL= $$ (NUMBER, WHEN, WHO, WHERE, WHAT)
$$ ##TITLE= Audit trail, XWIN-NMR		Version 3.5
$$ ##JCAMPDX= 5.01
$$ ##ORIGIN= Bruker BioSpin GmbH
$$ ##OWNER= she
$$ F:/spectra/data/she/nmr/H-F/1/audita.txt
$$ ##AUDIT TRAIL=  $$ (NUMBER, WHEN, WHO, WHERE, WHAT)
(   1,<2024-09-06 13:54:03.01 +0400>,<she>,<DPX200>,
      <created by zg, POWCHK disabled, PULCHK disabled
       configuration hash MD5:
       00 E9 B6 7A A2 85 ED C7 34 08 36 98 17 FE 4E 26
       data hash MD5: 16K
       D4 0B 84 C1 A2 F7 F4 C2 66 37 CE 5D 4A 52 1C 3A>)
$$ ##END=
$$ 
$$ hash MD5
$$ 76 DF A5 A0 E1 9C F9 29 2A 11 78 E5 58 E5 08 E0
##$RELAX= 
##$RELAX= 
##$RELAX= 
##$RELAX= 
##$RELAX= 
##$RELAX= 
$$ Bruker specific parameters
$$ --------------------------
##$DU= <F:/spectra>
##$EXPNO= 1
##$NAME= <H-F>
##$PROCNO= 1
##$TYPE= <nmr>
##$USER= <she>
##$AMP= (0..31)
100 100 100 100 100 100 100 100 100 100 100 100 100 100 100 100 100 100 
100 100 100 100 100 100 100 100 100 100 100 100 100 100 
##$AQSEQ= 0
##$AQ_mod= 1
##$AUNM= <au_zg>
##$AUTOPOS= <>
##$BF1= 200.13
##$BF2= 200.13
##$BF3= 200.13
##$BF4= 200.13
##$BF5= 200.13
##$BF6= 200.13
##$BF7= 200.13
##$BF8= 200.13
##$BYTORDA= 1
##$CFDGTYP= 0
##$CFRGTYP= 5
##$CHEMSTR= <none>
##$CNST= (0..31)
1 1 145 1 1 1 1 1 1 1 1 1 1 1 1 1 1 1 1 1 1 1 1 1 1 1 1 1 1 1 1 1 
##$CPDPRG= <>
##$CPDPRG1= <>
##$CPDPRG2= <>
##$CPDPRG3= <>
##$CPDPRG4= <mlev>
##$CPDPRG5= <mlev>
##$CPDPRG6= <mlev>
##$CPDPRG7= <mlev>
##$CPDPRG8= <mlev>
##$CPDPRGB= <>
##$CPDPRGT= <>
##$D= (0..31)
0 1.2 0 0 0 0 0 0 0 0.06 0 0.03 0 0 0 0 0.0002 0 0 0 0 0 0 0 0 0 0 0 0 
0 0 0 
##$DATE= 1725616442
##$DBL= (0..7)
120 120 120 120 120 120 120 120 
##$DBP= (0..7)
150 150 150 150 150 150 150 150 
##$DBP07= 0
##$DBPNAM0= <>
##$DBPNAM1= <>
##$DBPNAM2= <>
##$DBPNAM3= <>
##$DBPNAM4= <>
##$DBPNAM5= <>
##$DBPNAM6= <>
##$DBPNAM7= <>
##$DBPOAL= (0..7)
0.5 0.5 0.5 0.5 0.5 0.5 0.5 0.5 
##$DBPOFFS= (0..7)
0 0 0 0 0 0 0 0 
##$DE= 6
##$DECBNUC= <off>
##$DECIM= 24
##$DECNUC= <off>
##$DECSTAT= 4
##$DIGMOD= 1
##$DIGTYP= 9
##$DL= (0..7)
0 120 120 120 120 120 120 120 
##$DP= (0..7)
150 150 150 150 150 150 150 150 
##$DP07= 0
##$DPNAME0= <>
##$DPNAME1= <>
##$DPNAME2= <>
##$DPNAME3= <>
##$DPNAME4= <>
##$DPNAME5= <>
##$DPNAME6= <>
##$DPNAME7= <>
##$DPOAL= (0..7)
0.5 0.5 0.5 0.5 0.5 0.5 0.5 0.5 
##$DPOFFS= (0..7)
0 0 0 0 0 0 0 0 
##$DQDMODE= 0
##$DR= 18
##$DS= 0
##$DSLIST= <SSSSSSSSSSSSSSS>
$$ [...]
##$SUBNAM2= <"">
##$SUBNAM3= <"">
##$SUBNAM4= <"">
##$SUBNAM5= <"">
##$SUBNAM6= <"">
##$SUBNAM7= <"">
##$SUBNAM8= <"">
##$SUBNAM9= <"">
##$SW= 24.0689170037331
##$SWIBOX= (0..15)
0 0 2 0 0 0 0 0 0 0 0 0 0 0 0 0 
##$SW_h= 4816.95568400771
##$TD= 16384
##$TD0= 1
##$TE= 0
##$TE2= 300
##$TE3= 300
##$TEG= 300
##$TL= (0..7)
0 120 120 120 120 120 120 120 
##$TP= (0..7)
150 150 150 150 150 150 150 150 
##$TP07= 0
##$TPNAME0= <>
##$TPNAME1= <>
##$TPNAME2= <>
##$TPNAME3= <>
##$TPNAME4= <>
##$TPNAME5= <>
##$TPNAME6= <>
##$TPNAME7= <>
##$TPOAL= (0..7)
0.5 0.5 0.5 0.5 0.5 0.5 0.5 0.5 
##$TPOFFS= (0..7)
0 0 0 0 0 0 0 0 
##$TUNHIN= 0
##$TUNHOUT= 0
##$TUNXOUT= 0
##$USERA1= <user>
##$USERA2= <user>
##$USERA3= <user>
##$USERA4= <user>
##$USERA5= <user>
##$V9= 5
##$VALIST= <valist>
##$VCLIST= <CCCCCCCCCCCCCCC>
##$VD= 0
##$VDLIST= <DDDDDDDDDDDDDDD>
##$VPLIST= <PPPPPPPPPPPPPPP>
##$VTLIST= <TTTTTTTTTTTTTTT>
##$WBST= 1024
##$WBSW= 4
##$XGAIN= (0..3)
0 0 0 0 
##$XL= 0
##$YL= 0
##$YMAX_a= 286536
##$YMIN_a= -312300
##$ZGOPTNS= <>
##$ZL1= 120
##$ZL2= 120
##$ZL3= 120
##$ZL4= 120
##$ABSF1= 10
##$ABSF2= 0
##$ABSG= 5
##$ABSL= 3
##$ALPHA= 0
##$AQORDER= 0
##$ASSFAC= 0
##$ASSFACI= 0
##$ASSFACX= 0
##$ASSWID= 0
##$AUNMP= <proc_1d>
##$AZFE= 0.1
##$AZFW= 0.1
##$BCFW= 1
##$BC_mod= 2
##$BYTORDP= 1
##$COROFFS= 0
##$CY= 11.3945322036743
##$DATMOD= 1
##$DC= 2
##$DFILT= <>
##$DTYPP= 0
##$F1P= 15.6554695791079
##$F2P= 12.8336369535428
##$FCOR= 0.5
##$FTSIZE= 0
##$FT_mod= 4
##$GAMMA= 1
##$GB= 0.15
##$INTBC= 1
##$INTSCL= 1
##$ISEN= 128
##$LB= 0.24
##$LEV0= 0
##$LPBIN= 0
##$MAXI= 10000
##$MC2= 0
##$MEAN= 0
##$ME_mod= 0
##$MI= 1.114404
##$NCOEF= 0
##$NC_proc= 0
##$NLEV= 6
##$NOISF1= 3.799351
##$NOISF2= 2.8
##$NSP= 1
##$NTH_PI= 0
##$NZP= 0
##$OFFSET= 15.70392
##$PC= 1
##$PHC0= -25993.58
##$PHC1= 11.58748
##$PH_mod= 1
##$PKNL= yes
##$PPARMOD= 0
##$PSCAL= 0
##$PSIGN= 0
##$REVERSE= no
##$SF= 200.130013532006
##$SI= 16384
##$SIGF1= 3
##$SIGF2= 2
##$SINO= 400
##$SIOLD= 16384
##$SREGLST= <1H.CDCl3>
##$SSB= 0
##$STSI= 0
##$STSR= 0
##$SW_p= 3612.71676300578
##$SYMM= 0
##$S_DEV= 0
##$TDeff= 0
##$TDoff= 0
##$TI= <>
##$TILT= no
##$TM1= 0
##$TM2= 0
##$TOPLEV= 0
##$USERP1= <user>
##$USERP2= <user>
##$USERP3= <user>
##$USERP4= <user>
##$USERP5= <user>
##$WDW= 1
##$XDIM= 8192
##$YMAX_p= 0
##$YMIN_p= 0
$$ End of Bruker specific parameters
$$ ---------------------------------
##NTUPLES= NMR FID
##VAR_NAME=  TIME,          FID/REAL,        FID/IMAG
##SYMBOL=    X,             R,               I
##VAR_TYPE=  INDEPENDENT,   DEPENDENT,       DEPENDENT
##VAR_FORM=  AFFN,          ASDF,            ASDF
##VAR_DIM=   8192,          8192,            8192
##UNITS=     SECONDS,       ARBITRARY UNITS, ARBITRARY UNITS
##FACTOR=    0.0002076,     1,               1
##FIRST=     0,             0,               0
##LAST=      1.7004516,     0,               0
##MIN=       0,             -312300,         0
##MAX=       1.7004516,     286536,          0
$$ Real data points
##PAGE= N=1
##DATA TABLE= (X++(R..R)), XYDATA
0@%%%%%%%Lj1J6j6K4l2L6m4N6p2Q6r8J13j34J60j88K17k49K87l29L77m32M87n47
$$ 0 0 0 0 0 0 0 0 3 -8 8 -8 16 -16 20 -24 32 -40 46 -52 61 -73 87 -101 116 -133 154 -175 202 -230 257 -290
31b90O20p01P86q78R79j093J218j352J502j666J843k040K261k504K769l067L407
$$ -290 330 -371 415 -463 516 -577 641 -711 791 -875 968 -1072 1189 -1315 1454 -1613 1794
48A794l791M228m733N322o022O870p924R269j1050J3537j7262K3523m9940L04467
$$ 1794 -1997 2231 -2502 2820 -3202 3668 -4256 5013 -6037 7500 -9762 13761 -36179 268288
62B68288j68149k71049L13114L122r6775R8994j24426j60721K22960n5573l24931
$$ 268288 100139 -170910 142204 145326 48551 147545 23119 -137602 85358 29785 -295146
73b95146K20729K35888l87815K1196M18292j25652j39252J60144p6626M9127J59879
$$ -295146 -74417 161471 -226344 -205148 213144 87492 -51760 108384 31758 80885 240764
84B40764k92492j76542L37656j939l69278J17737K36153k00699J7950K01882j20653
$$ 240764 -51728 -228270 109386 107447 -261831 -144094 92059 -108640 -90690 111192 -9461
95i461N1328J29080k23245P4615K48121l05297k08947L14032L9874k83560L5795
$$ -9461 41867 170947 -52298 22317 270438 -34859 -243806 70226 110100 -173460 -137665
106a37665J25137n4106J14479K6791k06578J90915J97373l13057j378K73475k11740
$$ -137665 -12528 -66634 47845 74636 -131942 58973 256346 -56711 -58089 215386 3646
117C646j71397K02439o233j36704N7484j9570l0682K21795k1984k88378K06382
$$ 3646 -167751 34688 28455 -108249 -50765 -70335 -101017 120778 98794 -189584 16798
128A6798K61675k87656p7071K04119j15992n6219J02857j25218k8222J56163r9225
$$ 16798 278473 -9183 -86254 117865 1873 -54346 48511 -76707 -104929 51234 -47991
139d7991r6455K40506K2620k68386J34774K28253j93194o5931R7848r3442O0319
$$ -47991 -144446 96060 118680 -149706 -14932 213321 20127 -45804 52044 -41398 18921
150A8921P2754k25356J664K31559r3086j45644J66801O0256j52676P3474J05394
$$ 18921 91675 -133681 -132017 99542 6456 -139188 27613 87869 -64807 8667 114061
161A14061j18598K0008L4272j31976J07279R0613k42171r858K25614n6026j23617
$$ 114061 -4537 15471 49743 -82233 25046 115659 -126512 -136370 89244 33218 -90399
172i0399P7240L6328k8034O9727k2072j04523J09501L6387j72196Q0426J05528
$$ -90399 -13159 23169 -4865 64862 42790 -61733 47768 84155 -88041 -7615 97913
183I7913j85587p394J56286n1660n1123M0948k7696L0643J00958q6025j20424
$$ 97913 -87674 -95068 61218 9558 -41565 -617 -28313 2330 103288 17263 -103161
194a03161J44655O6606j70675K8516Q7104j09057K7705P7227q9074J6884O3113
$$ -103161 41494 108100 -62575 -34059 53045 -56012 -28307 48920 -40154 -23270 39843
205C9843p6900J7927J11496p7005j11711J18825P0357j26415K271M8094n9294
$$ 39843 -37057 -19130 92366 15361 -96350 22475 92832 -33583 -31312 16782 -42512
216d2512O5309L0081j26570M5077R4600q3015j5914P9202m0190o0999P2129L4023
$$ -42512 22797 52878 -73692 -28615 65985 -17030 -32944 46258 6068 -54931 17198 51221
228E1221p3603J2537J8351m3176P4746J3367j29591M4632R5134o4939k7925L2142
$$ 51221 -22382 -9845 8506 -34670 40076 53443 -76148 -31516 63618 -1321 -29246 2896
240B896j7938L020L9649j6776l8452L9113J0885m4950N4547Q069r9339M0432O4974
$$ 2896 -15042 -12022 27627 10851 -27601 11512 22397 -22553 31994 40063 -59276 -18844 46130
253D6130n4527j2034N798j7960M4185K7461n1622k0787N8503J3797m7721K4068
$$ 46130 -8397 -20431 -14633 -32593 11592 39053 -12569 -33356 25147 38944 -8777 15291
265A5291L536n8966M2431K7395o1025J3032J0982k6491M8632K1977n5247p818
$$ 15291 18827 -40139 2292 29687 -31338 -18306 -7324 -33815 14817 36794 -18453 -26271
277b6271N7150J3337m4264J561K335k8970M0419K301o7055K7364K8402k7204L0094
$$ -26271 30879 44216 -48 1513 3848 -25122 15297 17598 -49457 -22093 6309 -20895 9199
290I199J1964l6674Q497L9647L681l5513p358O974j2426K6054p639n8924K9968
$$ 9199 21163 -15511 -7014 32633 36314 801 -6557 417 -12009 14045 6406 -52518 -22550
303b2550L7703k2344J0739m74j4565K6042J6323j0253k3263o903J4694m788L635
$$ -22550 15153 -7191 3548 3074 -11491 14551 30874 20621 -2642 -9545 5149 361 3996
316C996j0525l6419K9466L0725k0467K445o378L81L5809l699k2047p940o61J6438
$$ 3996 -6529 -42948 -13482 17243 -3224 -779 -7157 -6776 29033 25334 3287 -4653 -5314 11124
330A1124l790j4014r815j2990K8875J5849k5592M152K61M808L3790j5657k6938
$$ 11124 7334 -6680 -16495 -29485 -610 15239 -10353 -6201 -5940 -1132 32658 17001 -9937
343i937Q312O209R589q085k0640l173J111K3590L552l1233J0052J3795J493K1646
$$ -9937 -1625 4584 14173 6088 -14552 -17725 -16614 6976 10528 -20705 -10653 3142 4635 26281
357B6281j7923k2969J9869Q579p4j4858j8677R091N477R905j096k9553J3960K5336
$$ 26281 8358 -14611 5258 13837 13763 -1095 -19772 -10681 -5204 4701 3605 -25948 -11988 13348
371A3348m720O443j4300j1207K3964M174q531j6509j4775K0606N376q423j364
$$ 13348 8628 15071 771 -10436 13528 17702 9171 -7338 -22113 -1507 3869 -4554 -5918
384e918j7605J5680K7340j0496m456p594J240K3535p018j4872r451r162K3246
$$ -5918 -23523 -7843 19497 9001 4545 -3049 -1809 21726 14708 -164 -9615 -18777 4469
397D469L773k2269K61j123J5832J8851j6042n780R37O456J9997j8386j8735N483
$$ 4469 8242 -14027 -13766 -14889 943 19794 3752 -2028 -1091 5365 25362 6976 -11759 -6276
411f276l511J4089J930k5055K367J2222J4204N521j9677Q79Q811L415J3060k2472
$$ -6276 -9787 4302 6232 -18823 -16456 -4234 9970 15491 -4186 -3307 5504 8919 21979 -493
425d93k0011K0039J551o92r64j7702O901J5913Q452l319k1110R370J5317n892
$$ -493 -20504 -465 1086 394 -570 -18272 -11371 4542 12994 9675 -11435 -2065 13252 7360
439G360N535j9206j5894K8520K643j3841k069p423J2163J3584l262o746j3460
$$ 7360 12895 -6311 -22205 6315 8958 -4883 -6952 -14375 -2212 11372 8110 1364 -12096
452a2096J3592J5327j3527r23j0769q913K9298j107k1007J312q01J5694J0196
$$ -12096 1496 16823 3296 2373 -8396 -17309 11989 10882 -10125 -8813 -9614 6080 16276
465A6276j7130p222K268J3136O918j7928o97k052j664K3476j0519j9409J2420
$$ 16276 -854 -8076 -5808 7328 14246 -3682 -4379 -6431 -8095 15381 4862 -14547 -2127
478b127j774R644J2042k5259q202J7547J1855o196j7668L583M212K784J5871k1423
$$ -2127 -3901 5743 17785 -7474 -15676 1871 13726 7530 -10138 -6555 -2343 441 16312 -5111
492e111j4307K8749o369o031J7560k1293j0688K5498Q042j6045j2692Q359N151
$$ -5111 -19418 9331 2962 -3069 14491 -6802 -17490 8008 16050 5 -12687 -4328 823
505H23M061J0380k9264r334M4244j0302k3706J9954r487p268K3045l406j7503
$$ 823 4884 15264 -14000 -23334 20910 10608 -13098 6856 -2631 -9899 13146 9740 -7763
518g763n04Q666q23L486R338k9177o769M8727r797l2707J7649r70J581J9103k1947
$$ -7763 -8267 399 -424 3062 12400 -16777 -23546 25181 15384 -17323 326 -644 937 20040 -1907
533a907j6136J9775O704j4224O05J2558j9104m494L7674j0542k4140J7282p534
$$ -1907 -18043 1732 8436 -5788 -5183 7375 -11729 -16223 21451 10909 -13231 4051 -3483
546c483Q297K3781l8986j8619L8768O070k6692l113J3686m255L502J7179k0079
$$ -3483 4814 28595 -10391 -29010 9758 15828 -10864 -13977 -291 -4546 -1044 16135 -3944
559c944k952K6652k4846J091L5144m0727k4545M5754L678k8456j236O649M807
$$ -3944 -6896 19756 -5090 -3999 31145 -9582 -34127 11627 15305 -13151 -14387 -7738 -2931
572b931J8723M59l7303J5346M4209l9286j7645M1361k7472k2334L6847p248j8113
$$ -2931 15792 16251 -21052 -5706 38503 -783 -18428 22933 -4539 -26873 9974 2726 -15387
585a5387J2853o366k50L3757k909m9928J8883N5562l8016l3991L2715j1397n579
$$ -15387 -2534 -8900 -9150 24607 21698 -28230 -9347 46215 8199 -25792 6923 -4474 -10053
598a0053K3034l0255m998L8481j6262j8041L6947N903m3645R128M5005k5540k7235
$$ -10053 12981 -17274 -22272 16209 -53 -18094 18853 24756 -18889 -9761 35244 9704 -17531
611a7531J4899j2120J6742K2257n4979k736O3299j6177l4019K5908J2091j9932
$$ -17531 -2632 -14752 1990 24247 -30732 -33468 29831 13654 -20365 5543 17634 -2298
623b298M783J2210j8606K376O480l2206K5635L6088o3165j0612O9419r997l3762
$$ -2298 2485 14695 -3911 -1535 4945 -27261 -1626 34462 -28703 -39315 30104 20107 -13655
636a3655J2354K185N621J7346k3425k8137L5827J6754n4674J3576M8081m7644
$$ -13655 -1301 884 6505 23851 426 -27711 8116 24870 -29804 -16228 31853 -15791
648a5791j4643N1793j2009j4035J2292k2075J4369M0628l8248m6816M9749L4652
$$ -15791 -30434 21359 9350 -4685 7607 -14468 -99 40529 2281 -44535 5214 39866
660C9866n7839r667M2211k0509k316K3919l0291J1381L1185m3640n6N4980k7679
$$ 39866 -17973 -27640 14571 -5938 -8254 15665 -14626 -3245 27940 -15700 -15756 39224 11545
673A1545n0697L6084L6204l6451j7576J6369o080K3768P875n6346K2294N6435
$$ 11545 -39152 -3068 33136 -3315 -20891 -4522 -10602 13166 21041 -35305 -13011 43424
685D3424m5964k2025M6098q441k9266J5383R983j1422J960q889j5683M2351J2955
$$ 43424 -2540 -24565 21533 13092 -16174 -791 9192 -2230 -270 -9159 -24842 17509 30464
698C0464o9208J4670O7549l2766k8860K2906m833O075R902l0037l807L5974j4252
$$ 30464 -38744 -24074 43475 10709 -18151 4755 -78 5997 15899 -14138 -17945 18029 3777
711C777l8209L9889K7206n8385L718N1960k0536j1929N813k2164K9457K5100n8083
$$ 3777 -34432 5457 32663 -25722 -22004 29956 9420 -2509 3304 -18860 10597 35697 -22386
724b2386j5145N9145p18m9252J8119K9379k7411M012J9944k3449J5874R703m6326
$$ -22386 -37531 21614 20896 -28356 -10237 19142 -8269 -4257 15687 -7762 8112 17815 -28511
737b8511K6435M3323n4996k6904N2433J1990l4977k125J2777j168J9715p004l9528
$$ -28511 -2076 41247 -13749 -40653 11780 23770 -11207 -13332 -555 -1723 17992 10988 -28540
750b8540L3530K8670n4546N095M3822l1633j9658K7460M314p752j427j2248M559
$$ -28540 4990 33660 -20886 -15791 28031 -3602 -23260 4200 8514 762 -665 -12913 -8354
763h354L6179j3094n1799L1675M2100m2799j1067K5168j2405O171P116k1996J1795
$$ -8354 27825 14731 -37068 -5393 36707 -6092 -17159 8009 -4396 1775 8891 -13105 -1310
776a310J7890k6823p750L8943m268m6421J9553L6146k4442p519L904j2113L1074
$$ -1310 16580 -10243 -17993 20950 16682 -29739 -10186 25960 1518 -6001 -2097 -14210 16864
789A6864N488m8619J2594L8569k3966k0692K4988M568k3670J1007J3597j4633
$$ 16864 22352 -26267 -13673 24896 930 -19762 5226 9794 -13876 -2869 10728 -3905
801c905J0914l440k5889L7251J5516n4920L083M1684j2214j9866N715K475J762
$$ -3905 7009 3569 -22320 14931 30447 -24473 -21390 20294 8080 -11786 -6071 -3596 -1834
814a834J2419q986j7258K6788N290l5557K2583K1668l9587j663K6262p001n703
$$ -1834 10585 1599 -15659 11129 16419 -19138 3445 25113 -14474 -16137 10125 3124 -2579
827b579k923q377J5021J9028j9178k2883K8939J6333l1659L540J5218j8499O241
$$ -2579 -5502 -13879 1142 20170 992 -21891 7048 23381 -8278 -4738 10480 -8019 -1778
840a778O870j4687J1077J774j8351J3749K0639j7316j9773J9966J7607j9500m255
$$ -1778 5092 -9595 1482 3256 -15095 -1346 19293 1977 -17796 2170 19777 277 -3978
853c978J895o275J9324m108k7599J8673J3250j9870N058J3805r916q291J1345
$$ -3978 -2083 -8358 10966 6858 -20741 -2068 11182 -8688 -3630 10175 259 -8032 3313
866C313O513r030P06n401p354K5594l186l4420J6806J9643j5797l80L808n353
$$ 3313 9826 796 1502 -3899 -11253 14341 11155 -23265 -6459 13184 -2613 -2993 815 -4538
880d538N899O525o531n642R660k818j2457J8727K094k8827J1080J6569j1199L27
$$ -4538 1361 7886 1355 -4287 5373 2555 -9902 8825 10919 -17908 -6828 9741 -1458 -1131
894a131k850m798J5096N075j3321n847J3003M454j3614N334L446j5577Q660P253
$$ -1131 -3981 -8779 6317 11392 -1929 -7776 5227 9681 -3933 1401 4847 -10730 -2070 5183
908E183j0873M803k223n301J5624L615j3129l682J0556P046j0012m626P50m219
$$ 5183 -5690 -887 -3110 -8411 7213 10828 -2301 -5983 4573 11619 1607 -3019 -2269 -6488
922f488R506j093j3711R961K444o081J2424P0r927L108N045K851n371o659j420
$$ -6488 3018 1925 -11786 -1825 619 -5462 6962 7032 -2895 213 5258 8109 2738 -3921 -5341
937e341L39J0037m779j5615J2782P025o573Q347l607n910R320J245l937l169l330
$$ -5341 -5002 5035 256 -15359 -2577 4448 -2125 6222 2615 -3295 6025 7270 3333 164 -3166
952c166m08q63P226l699j3450J1991R416p239M471l394l758J2089j307q472k661
$$ -3166 -3574 -4437 2789 -910 -14360 -2369 7047 -192 4279 885 -2873 9216 7909 -563 -3224
967c224J55L343k666N14n38p696R684P908p940K104p37j639J0130l621q944m73
$$ -3224 -3069 274 -2392 -1878 -2416 -10112 -428 7480 -460 1644 907 -732 9398 5777 -3167 -3640
983c640J062N273l242n454K223j094O618M476q731K223K014k31P052o595o821
$$ -3640 -2578 2695 -547 -6001 -3778 -4872 1746 6222 -2509 -286 1728 1497 8549 1954 -4867
998d867L952j75L552j909q361L867L400L033P90p683L761M262j358M617p603m699
$$ -4867 -915 -1090 2462 553 -7808 -3941 -541 2492 3282 -4401 -640 3622 2264 6881 -722 -5421
1014e421Q542j829o95j237o693M481M556K47j698n935O242N582m117K317n226
$$ -5421 3121 1292 597 -640 -7333 -2852 1704 1951 253 -5682 560 6142 2025 4342 -884
1029h84l686J0361k802n291m00l045M990K753k744q78l418O849O273p538O03o25
$$ -884 -4570 5791 2989 -2302 -2702 -5747 -757 1996 -748 -1626 -5044 1805 8078 540 1143 518
1045E18k549Q201l869p189J241m68N291N31n668K192k26M996N254q897p88L435
$$ 518 -2031 6170 2301 -4888 -3647 -4115 1176 1707 -3961 -1769 -1995 3001 8255 -642 -1430 2005
1061B005j271M216n384o316M043L78L990p93p072N251L220R25L111p407o92M835
$$ 2005 734 4950 -434 -6750 -2707 -2329 1661 868 -6204 -953 2267 3192 6303 -1104 -1796 3039
1077C039r85J065o453m303P831p23J14Q39n928N731N432k638l91m489J276M183
$$ 3039 2054 3119 -3334 -7637 194 -529 -415 424 -5504 227 5659 3021 2630 -1859 -583 3600
1093C600l037N90n739k616J0113j564l946K660l686N486N402n851k121j197L113
$$ 3600 563 1153 -4586 -7202 2911 1347 -2599 61 -3625 1861 7263 1412 -709 -1906 1207
1108A207K786o054M91j801k291J0086k304o402M618q74L179L977p480j667J153
$$ 1207 3993 -2061 -1570 -3371 -5662 4424 2120 -4282 336 -538 2641 6618 -862 -2529 -1376
1123a376L479J758q141M94L373j445O197l738n531O719m62P65K152p113M2L807
$$ -1376 2103 3861 -4280 -3786 -413 -1858 4339 601 -4930 1789 1327 2092 4244 -2869 -2827 980
1139I80O06J207p014n96O392j19J773n132l161R194j561k553K041o361K970M989
$$ 980 1586 2793 -4221 -4817 1575 1456 3229 -1903 -5064 4130 2569 16 2057 -4304 -1334 3655
1155C655m052O44k106j288M743J028J51o281j842J1271k929n461L145m785M437
$$ 3655 -397 247 -1859 -3147 1596 2624 2775 -3506 -5348 5923 2994 -2467 678 -4107 330
1170C30O232q935j205M511n06M41l14R02m591j350R879k988o359M734l846M045
$$ 330 6562 -2373 -3578 933 427 868 554 1456 -3135 -4485 5394 2406 -3953 781 -3065 980
1186I80P638j1442l480Q504J315k709l834J524J106j073N365l913l766P001m474
$$ 980 8618 -2824 -6304 2200 3515 806 -3028 -1504 -398 -1471 3894 -19 -3785 3216 -1258
1201a258R05Q436j0562l818Q634J178k462n162m38N569K149r09n801N35R692n510
$$ -1258 -353 8083 -2479 -6297 2337 3515 1053 -4109 -4547 1022 3171 2262 -3539 -3004 6688 1178
1217A178l288O716o530j433O002l603J193j620m701O394N678l444p912K467J1601
$$ 1178 -2110 4606 -1924 -3357 2645 -958 235 -1385 -6086 308 5986 2542 -5370 -2903 8698
1232H698n407o802M293m194L639M473j0888K878P263p641J513P422j969p092J270
$$ 8698 3291 -3511 782 -3412 227 4700 -6188 -3310 3953 -3688 -2175 5247 3278 -3814 -2544
1247b544R754l717o240J617m238P223O347j7144J307J4760n535m133L704M39j333
$$ -2544 7210 3493 -2747 -1130 -5368 1855 8202 -8942 -7635 7125 1590 -2543 1161 1600 267
1262B67N0K677k871r81J623p431O871R139j6521k624J6042j854m761j196j247
$$ 267 317 2994 123 -858 765 -6666 205 9344 -7177 -9801 6241 4387 -374 -1570 -2817
1277b817O401J606n470m547N031M944j0054J460J0623j0290l413J0425k240M63
$$ -2817 3584 5190 -280 -4827 204 5148 -4906 -3446 7177 -3113 -6526 3899 1659 2122
1291B122k171o866R458O824j0406p355Q007Q277q611m984P144k884J630K697q220
$$ 2122 -49 -6915 2543 9367 -1039 -8394 -387 7890 -721 -5705 1439 -1445 185 2882 -5338
1306e338O839L797j2868O313J0949r105p552N622Q204m075o507L76n5Q804j18
$$ -5338 1501 5298 -7570 -1257 9692 587 -6965 -1343 6861 2786 -3721 -3345 -3400 5404 5286
1321E286j6601Q445J3371j3378j146R415m235k654J483J393O79j434m408l298
$$ 5286 -11315 -2870 10501 -2877 -4023 5392 1157 -1497 -14 1379 2058 624 -3784 -7082
1335g082J1951L354j9825M337J7933q068n093K973k032N893J7q766K000N965l354
$$ -7082 4869 8223 -11602 -7265 10668 2600 -2493 480 -1552 4341 4358 -4408 -2408 3557 203
1350B03q026P647Q072j4128q51J3408k785j570k503n686J2349L110j5909j113
$$ 203 -7823 -176 7896 -6232 -7083 6325 3540 1970 -533 -6219 6130 9240 -6669 -7782
1364g782J0495J458q582l57P493l051m85L332l473O111j611j2155J1477P829j5808
$$ -7782 2713 4171 -4411 -4768 2725 -326 -811 2521 -952 5159 3548 -8607 2870 10699 -5109
1379e109l809R371L885l605n797J445M963N213m150r886J0820N568j5624M992
$$ -5109 -8918 453 4338 733 -5064 -3619 1344 6557 2407 -7479 3341 8909 -6715 -1723
1393a723Q509r931j562L604J292L138l959n535M891J0611m331j5559R257J1832
$$ -1723 6786 -3145 -4707 -1103 189 3327 -632 -6167 -1276 9335 5004 -10555 -1298 10534
1407A0534j2444j570M341m280N192m24o842O928K654p554m40R895L81j3668K955
$$ 10534 -1910 -3480 861 -3419 1773 1349 -5493 1435 4089 -3465 -3905 5990 6371 -7297 -4342
1422d342J1502n350l249j126l072J1535j7j3804N471Q275m892l867L133L237n321
$$ -4342 7160 1810 -1439 -2565 -5637 5898 5881 -7923 -2452 5823 931 -2936 197 3434 -1887
1437a887j000M845j780J868l602n917J3235K231j5105K471Q408o78k535m369J564
$$ -1887 -2887 1958 178 2046 -1556 -7473 5762 7993 -7112 -4641 3767 3089 554 -3815 -2251
1452b251M511J53l515k556P583q88r341Q862M381j1989K117M105n34K513n910
$$ -2251 2260 2413 -1102 -3658 3925 3037 -6304 2558 6939 -5050 -2933 1172 638 3151 -2759
1467b759l344Q422M410p078o375Q808M835r891K243L238n923M280j00m822P301
$$ -2759 -6103 2319 6729 -349 -6724 2084 6919 -2972 -729 2509 -3414 866 766 -4056 3245
1482C245k484o977O986N782n116o874M620P439o171j982L4k250P996k248q938
$$ 3245 761 -6216 770 6552 1436 -5438 -818 6621 450 -1532 -1498 -3748 4248 2000 -6938
1497f938P350L207o015K239K798j186l320M68M538j894k240j387k070Q962n55
$$ -6938 412 3619 -2396 -157 2641 1455 -1865 -1397 3141 1247 -993 -2380 -4450 4512 3957
1512C957j1115N563N033k655M68k585L76L308k371l14k4N30r21k939O831L13q858
$$ 3957 -7158 -1595 3438 783 1251 -1334 -958 2350 -21 -335 -359 171 -750 -3689 3142 3455 -5403
1529e403M239L604j467J981n850r81Q005j637m729l61L044J602m084K641J024
$$ -5403 -1164 2440 973 2954 -2896 -3877 4128 2491 -2238 -2599 445 2047 -2037 604 1628
1544A628m909M274P03l072M361m360l150Q080N4n445j260K955L723l485j215O34
$$ 1628 -3281 993 1696 -1376 2985 -1375 -4525 3555 3609 -1836 -3096 -141 3582 97 -1118 -484
1560d84j929M974j045n478N137n56l616N611m29l424k23J247L360j983l471Q28
$$ -484 -2413 2561 1516 -3962 1175 619 -2997 2614 2185 -1239 -1462 -215 3145 1162 -2309 -1481
1576a481l33M431p39o607M601K204k484K512k042j051K517j891J510p77l000J391
$$ -1481 -1814 2617 1878 -4729 -128 2076 -408 2104 62 -989 1528 -363 1147 370 -2630 -1239
1592a239K27K389L0n551L819K850j292J382m022l98N328l057j532K99j877K252
$$ -1239 -1012 1377 1407 -4144 -325 2525 1233 2615 -1407 -1805 3523 466 -1066 -767 -2644 -392
1608c92J66J96K47k733L539K234k541J658l511r85N999l431l591J574l60K139
$$ -392 -226 -30 217 -2516 1023 3257 716 2374 -1137 -2122 3877 446 -3145 -1571 -1931 208
1624B08K97j595Q72o20L168R97m193K206j422j774M747k994l603K436mK527n34
$$ 208 505 -1090 -218 -838 2330 3327 -866 1340 -82 -1856 2891 -103 -3706 -1270 -1274 1253 719
1641G19k453J845L6K564N06n135K079J282k515K580k653k146K826r2J220k06k692
$$ 719 -1734 111 147 2711 3217 -1918 161 1443 -1072 1508 -1145 -3291 -465 -557 663 457 -2235
1658b235K963P92L41P50m585J277K782k512Q50k487n91L921j586L65K76k535L720
$$ -2235 728 1520 1861 2611 -1974 -697 2085 -427 423 -2064 -2655 1266 -320 45 321 -2214 1506
1675A506Q33k091O34k427J514K448k564j77j628k90M466k610j350J890j942L266
$$ 1506 2339 248 882 -1545 -31 2417 -147 -324 -1952 -2242 2224 -386 -1736 154 -1788 1478
1691A478J102l266N76k96J562J225l605P57l29p11L948l101k387L221r68J757
$$ 1478 2580 -686 -110 -406 1156 2381 -1224 -467 -796 -1507 2441 -660 -3047 174 -794 963
1707I63J040l155J475M56Q91Q14m252J054J086j807K766k413k718L895K34M88
$$ 963 2003 -1152 323 779 1670 2484 -1768 -714 372 -1435 1331 -1082 -3800 95 329 817
1723H17J89k246K355Q18n13P58m044P25K653k954J016j138k157M627k06o11P79
$$ 817 1006 -1240 1115 1933 1420 2178 -1866 -1141 1512 -1442 -426 -1564 -3721 906 700 89 868
1740H68k256L608J143k820P39k649Q0K809l155l20m5n43L992q35q89K020k236
$$ 868 -1388 2220 3363 543 1282 -1367 -1287 1522 -1633 -1953 -1998 -2541 1451 616 -273 1747 -489
1757d89L157J092m525O08j33m01J390l093j75Q77j18L877j905j306L805k160J716
$$ -489 2668 3760 -765 -157 -290 -691 699 -2394 -2569 -1692 -1810 2067 162 -1144 2661 501 2217
1774B217J535m832K96J120q72N19k734l0K090MK711k052k166N447j216j195J484
$$ 2217 3752 -1080 -784 336 -536 -17 -2751 -2781 -691 -687 2024 -28 -2194 3253 2037 842 2326
1791B326l793Q40J340j625N71k321M49K675q55J672j332j875N136n41k340N91
$$ 2326 -1467 -627 713 -912 -341 -2662 -2213 462 -393 1279 -53 -1928 3208 2667 327 918
1807I18k327J562J444l410J030q18j48K621j521L72M22j321L750m09k154O95j936
$$ 918 -1409 153 1597 -1813 -783 -1601 -1749 872 -649 -277 145 -1176 2574 2165 11 706 -1230
1824a230K252J534m900O44J314o44J875j610q21J778j98J948r73j214J956k645
$$ -1230 1022 2556 -2344 -1700 -386 -1030 845 -765 -1586 192 -6 1942 969 -245 1711 -934
1840i34J797K150n283l09K828q52J023j861j182L053P66O90k174m06L574k241
$$ -934 863 3013 -2270 -2579 249 -603 420 -1441 -2623 430 1196 1886 -288 -694 2880 639
1856F39j042K929m357j08K469j824J036p35j649L072J478j27k266o50M729j560
$$ 639 -403 2526 -1831 -1939 530 -1294 -258 -993 -2642 430 1908 1781 -485 -1135 3594 2034
1872B034l015J527k103R90J504l377J256J238j817K307M93K18r58j327L648m4
$$ 2034 -981 546 -1557 -567 937 -2440 -1184 54 -1763 544 1037 1255 297 -1030 2618 2574
1888B574l482P6j025K099J456m993J312K759j113J199n84j57J425j323N78O91
$$ 2574 -908 -832 -1857 242 1698 -3295 -1983 776 -337 862 278 121 1546 223 801 1492
1904A492j704j85j986K893K210n926M98M086j026J173j755j524L812m8k479n25
$$ 1492 -212 -397 -2383 510 2720 -3206 -2708 1378 352 1525 -230 -1754 2058 2010 -469 -994
1920i94Q53J479k795R05L163m365R8L130j560J433j307l536M577J864l141k072
$$ -994 -141 1338 -1457 -552 2611 -1754 -1656 1474 -86 1347 40 -3496 1081 2945 -196 -2268
1936b268J639L528k377k224K940j699M54J156l111K354M89m163K918K720k289
$$ -2268 -629 2899 522 -1702 1238 -461 -7 1149 -1962 392 881 -3282 -364 2356 67
1951F7j575k2M269l8l745O35j4K340M2n530K072L185l654R15J390n24J232j310
$$ 67 -1508 -1530 2739 2701 -1044 -409 -423 1917 1959 -3571 -1499 1686 -1968 -1053 337 -187 1045 -265
1969b65R43K482k351j892r1K768M39o275J144M295j856O16r21p13M719r96k797
$$ -265 678 3160 809 -1083 -1174 1594 2033 -4242 -3098 1197 -659 -43 -964 -1677 3042 2046 -751
1986g51J933J037j709k075J442J892m693j01L208n83J260j481k498O714M94n021
$$ -751 1182 2219 510 -1565 -123 1769 -2924 -3025 183 -400 860 -621 -3119 3595 4089 -932
2002i32L58K296M00k746q90J637j469m79J419j666L367k87m147N314K442m647
$$ -932 -574 1722 2122 -624 -1514 123 -1346 -1825 -406 -2072 1295 1008 -3139 2175 4617 -30
2018c0j304J917J637j149l662N74J487P73k93l421L486K687m595J948K805j970
$$ -30 -1334 583 2220 1071 -2591 -2017 -530 243 -50 -3471 15 2702 -1893 55 2860 890
2034H90n90q02J151J937l968j624J992K303p00m669K345M442k602j43Q49o49K787
$$ 890 300 -502 649 2586 -1382 -3006 -1014 1289 589 -4080 -1735 2707 105 -38 811 162 2949
2051B949k465j749L293j598k759N11K329J61l815M93M155l58k76j578n13N388
$$ 2949 484 -1265 2028 430 -2329 -1818 511 672 -3143 -2650 1505 1147 871 -707 -1220 4168
2067D168j041n493K582J275k135r06j00J137r36o63K073M13J562j318k733N673
$$ 4168 3127 -2366 216 1491 -644 -1550 -1650 -513 -1449 -2112 -39 374 1936 618 -2115 3558
2083C558O24n934Q12J559j50r49k312O62J986M1l14r24L173P39l529K929J831
$$ 3558 4182 -1752 -940 619 469 -480 -2792 -2130 -144 -103 -417 -1341 1832 2571 -958 1971 3802
2100C802m390Pm4M71R89l991k17L247J214j116j752K320L003k868k39J109j545
$$ 3802 -588 -581 -625 -154 835 -3156 -3373 -126 1088 -28 -1780 540 3543 675 436 1545 0
2117@P57j990q61L056k758j789L263J344m52j990R62L501j002j412o75r22L139
$$ 0 757 -1233 -2094 962 -1796 -3585 -322 1022 570 -1420 -458 3043 2041 629 -46 -968 2171
2134B171k130l372L450m67j685K134J90K18j50r54K095L06o51j690j271L753k55
$$ 2171 41 -3331 119 -348 -2033 101 291 509 359 -595 1500 1806 1155 -535 -1806 1947 1692
2151A692n044K655R93j042J094j470O99J561q04L10k52M38k93k190K824Q19m138
$$ 1692 -3352 -697 296 -746 348 -1122 -423 1138 334 644 392 830 537 -1653 1171 1990 -2148
2168b148J177J471m93J155k658qL119r27q79p70R94J381k003N36J416k226N74
$$ -2148 -971 500 7 1162 -1496 -1504 1615 688 -191 -961 33 1414 -589 -53 1363 -863 -289
2185b89L04p07J914k544n10K676J91j206k73k28K405p10j757Q29o97J209p13j743
$$ -289 15 -692 1222 -1322 -1832 844 1035 -171 -444 -672 1733 1023 -734 95 -602 607 -106 -1849
2203a849K486j241j130K688p52m25M38q45K047K22j860k61j80J652m86k955K253
$$ -1849 637 -604 -1734 954 202 -223 215 -630 1417 1639 -221 -482 -662 990 504 -2451 -198
2220a98M01j154J896j334k21J835j060M87K25r39j01p44J740O9k998J471J508
$$ -198 203 -951 945 -389 -610 1225 165 652 877 -62 -163 -907 833 902 -2096 -625 883
2237H83j083Q18j459j95K662j428j00J25q58R42q55N49P87k293J181J157j151
$$ 883 -200 618 -841 -1036 1626 198 98 223 -635 307 -548 1 788 -1505 -324 833 -318
2254c18J121j652p3K377j087q58Q6m56J926n57j290J307j032P32Q12j320O63o42
$$ -318 803 -849 -922 1455 368 -490 -404 -860 1066 509 -781 526 -506 226 1038 -282 381 -261
2272b61o25J927j108q64R39q21J683K18j759Q44J30N74J37j943Q28j6q87J796
$$ -261 -886 1041 -67 -931 8 -813 870 1088 -671 173 303 877 1014 -929 -101 -117 -1004 792
2290G92j539o00J821j043J100P35j745Q16L29K53k69j927O79O93j082J052j036
$$ 792 -747 -1347 474 -569 531 1266 -479 337 666 919 650 -1277 -598 95 -987 65 -971
2307i71l63K451q34m3R49j066O54j1l62J69k154J003R67j570R79l45n17K350o86
$$ -971 -1334 1117 283 240 1189 123 777 766 404 573 -1581 -578 389 -1181 -202 -547 -1064 1286 600
2326F00n02N85r47J390l81j441P24j163K82J415j523M04M24m87J814p89n17Q74
$$ 600 98 683 -264 1126 745 -696 28 -1135 -853 562 -961 -557 -133 -620 1194 405 -112 762
2344G62o47J033q8k171R11j71j4R17j554K65Q47m45J501j088n05J561j044O93
$$ 762 115 1148 1060 -1111 -200 -371 -385 532 -1022 -757 90 -355 1146 58 -447 1114 70 763
2362G63L06k345J200K65p00Q23j070O4J136q78J073p45j086K447q33m15P33j510
$$ 763 1069 -1276 -76 189 -511 312 -758 -694 442 -436 637 -108 -1194 1253 420 5 738 -772
2380g72N96Q94q17q9o58K31J128j081R88l13p51J912o46p34Q10j021P71L75j569
$$ -772 -176 718 -99 -188 -846 -615 513 -568 420 107 -644 1268 622 -112 698 -323 448 823 -746
2399g46M17q29M79J419j297J77P71r65J700k20j273R18p37O71K45j803P45k03
$$ -746 -329 -1158 -679 740 -557 -380 391 -574 1126 906 -367 551 -186 485 730 -1073 -328 -531
2417e31k66J306j561J03J416m35R22l37r13J354p56J7J98j892J087J07o17J342
$$ -531 -797 509 -1052 -949 467 32 954 617 -296 1058 302 319 517 -1375 -288 -181 -798 544
2435E44r54m55J677p1J15n28q29J410m95n01M59j823P58J392j657J071j63l03
$$ 544 -410 -865 812 741 856 328 -501 909 414 -87 372 -1451 -693 699 -958 113 -50 -353
2453c53J237m42J74k51j098J504n11j037J169j460O78J516j808N57J87n9J120
$$ -353 884 442 616 365 -733 771 260 -777 392 -1068 -390 1126 -682 -125 62 3 1123
2470A123j337l8N00j005J500l55j375J466q52N00Q24j202J19J88n4Q88j495k47
$$ 1123 -214 -252 248 -757 743 388 -987 479 -373 127 951 -251 -132 56 2 890 -605 -852
2488h52J145o31M09j01j108J782m09j63J089j628M48N67j194J386j132j299K046
$$ -852 293 -338 71 -30 -1138 644 235 72 1161 -467 -19 548 -646 740 -392 -1691 355
2505C55l15j46Jp55J843k34p18O10j385R52O68k033J107k56r66J268pJ07J15p59
$$ 355 40 -106 -105 -860 983 749 31 641 -744 208 876 -1157 -50 -306 -1272 -4 -11 96 211 -548
2525e48J813j98j012N20j533R78J249k657P14J104j019P25k30j92Q50p14R21J28
$$ -548 1265 1067 55 575 -958 20 1269 -1388 -674 430 -589 136 -94 -286 564 -150 771 899
2543H99j157N34j011M51J584k543j83J675l68Q26r91n27J792r53J13R8n57R27
$$ 899 -258 276 -735 -284 1300 -1243 -1426 249 -119 707 -284 -811 981 28 141 239 -318 609
2561F09o52n31J359j336l00J008n20J282j099j291K225j4o22j25o36J567l42j207
$$ 609 -43 -574 785 -551 -851 157 -363 919 -180 -1471 754 740 118 -7 -643 924 582 -625
2579f25O75m84L39M88j259J480o9k072J908L56r06k5l88J211N54j627K83j88P06
$$ -625 50 -434 -95 393 -866 614 545 -1527 381 737 -169 -194 -582 629 1183 -444 -161 -349 357
2598C57N31j970O20J291j590O86L40j58L77n04L78P69j226j38k97R37Q65k994
$$ 357 888 -1082 -462 829 -761 -75 265 107 484 -20 358 1127 -99 -237 -534 403 1268 -1726
2616a726L94J999q08M51n67lJ455p16n52Q83q15M75q09k21J313j571q63J690J12
$$ -1726 -1332 667 -141 310 -257 -260 1195 479 -73 810 -5 470 -339 -560 753 -818 -1681 9 121
2635A21O23j120r30K854l79j553L89j37N99l90j506J276j38k60O84l28J167k63
$$ 121 744 -376 -1306 1548 1169 -384 5 -132 467 77 -1429 -153 -291 -551 133 -195 972 709
2653G09k270K622J96j435L33p28N17P18j851K75R24K17K4j327J548Q28k114J251
$$ 709 -1561 1061 1257 -178 155 -573 -56 662 -1189 -914 10 227 251 -1076 472 1300 -814 437
2671D37O31j097L88j047L88J221j496m83P39P62N88k237Q12J771j477L09k02o51
$$ 437 1068 -29 359 -688 -300 921 -575 -1058 -319 443 1031 -1206 -394 1377 -100 209 7 -644
2689f44J474j134o08J594o22o78L63L03R83j633n40K193p48j17m23o91K008m45
$$ -644 830 -304 -912 682 60 -618 -255 48 1031 -602 -1142 1051 303 186 -237 -928 1080 635
2707F35j543J265l57L78k67j045J674o52j052J179J9L06n19j075K154K6j654L94
$$ 635 -908 357 0 378 111 -934 740 88 -964 215 234 540 21 -1054 1100 1126 -528 -134
2725a34R0K20N90k047Q12Q98o85J18m04R78K97j460J288M37j488N31l98L83Q86
$$ -134 -44 176 766 -1281 -469 429 -256 -138 -542 436 733 -727 561 998 -490 41 -357 26 912
2744I12k012m74J770K48k67r52P30J319j545M04N93j200J140q33m96J499j271
$$ 912 -1100 -1574 196 444 177 -775 -45 1274 -271 133 726 -474 666 -167 -663 836 -435
2761d35q34J249M30M77j427l4J856o73m88L7j009J729p98j668J960k65m33L39
$$ -435 -1269 -20 410 887 -540 -574 1282 609 121 158 -851 878 80 -1588 372 107 -326 13
2779A3m77J377p78q76J480k79n83j46p32J771J31j970J285j8k59O28j212Q13O40
$$ 13 -464 913 135 -741 739 460 -123 -269 -1001 770 901 -1069 216 198 -61 567 -645 168 808
2798H08j248P54j63k86K28j140J177L35j281O54R2L22Q93j784k3J597j078k60
$$ 808 -440 314 151 -135 93 -1047 130 465 -816 -162 -70 252 1145 -639 -662 935 -143 -403
2816d03K6J22N15q47N66P21j215J170m12m57J436j536n82J373m84l25k38o6J484
$$ -403 -377 -255 260 -587 -21 700 -515 655 243 -214 1222 -314 -896 477 -7 -332 -570 -636 848
2835H48p27k38O70p52J002m80j011J241o86j105J425k99K0l28l03J721m68l64
$$ 848 121 -117 553 -199 803 323 -688 553 -133 -1238 187 -112 -92 -420 -723 998 530 166
2853A66L69q43R00K33k022J222R6r12Q81p77M95M81q92J437j21j085Q72n25M50
$$ 166 535 -308 592 825 -1197 25 121 -791 90 -687 -192 289 -603 834 713 -372 500 -25 425
2872D25K46j735N27O47l94O99j347L21J341j093K72P18q02P82m22j72L46j008
$$ 425 671 -1064 -537 110 -284 415 -932 -611 730 -363 -91 627 -175 607 185 13 359 -649
2890f49N27K18m28O97r86k63J909r23j29M70q28J025m03k60K72q16O87kj095J490
$$ -649 -122 96 -332 365 -621 -884 1025 102 -27 443 -385 640 237 -23 249 -567 120 118 -977 513
2910E13p21o02J529q74k70L96l76J086l65p24Q17p76P87K02j521Q39k9o96J032
$$ 513 -208 -810 719 -155 -425 -29 -405 681 316 -408 409 -367 420 622 -899 -60 -89 -785 247
2929B47m32j68M82m89J225l23q66Q77m11q1N8j042K12O83n72N54k40N3R16p92
$$ 247 -185 -353 129 -360 865 542 -324 553 142 61 119 -923 -711 -28 -600 -46 -286 -233 683 -109
2949a09O43M92j365J131o11n97O22j243K82R44p93R66q27J42J459r68M5P45j233
$$ -109 534 1026 -339 792 181 -416 206 -1037 -755 189 -604 362 -465 -323 1136 168 213 958 -275
2968b75Q65l21p81K91n39R9O47q08R63o7l95J574p11k38N00q90L69J1r17L95o14
$$ -275 590 269 -512 -221 -760 -661 -14 -822 141 74 -321 1253 542 304 804 -86 283 294 -623 -228 -842
2989h42L42O69r59Q36L18l27J067m30r74P21k70k10J09j069Q82l64K3M42l84K76
$$ -842 -500 169 -790 46 364 37 1104 674 -300 421 151 -59 50 -1019 -137 -501 -478 -36 -420 -144
3009a44P24o95P55k93o08Q71o42J00O7j155Q06J15k35Q97p83q5R61q02L65j40
$$ -144 580 -115 640 347 -261 610 -32 68 135 -1020 -214 -99 -334 563 -220 -305 656 -146 219 79
3029G9o13R77n72O1M83j237Q83L22p28P60m25k51Q80q04J63L3l51J199r36j28
$$ 79 -534 443 -129 -68 415 -822 61 383 -345 415 -10 -261 619 -185 -22 11 -340 859 -77 -205
3049b05P68j189O65N68j067L60j89m8M68m38J69L92o11J094m45p88J117p38R9
$$ -205 563 -626 39 607 -460 -100 -289 -337 131 -307 -138 254 -357 737 292 -496 621 -117 -18
3068a8L93q53N38Mm24O82p89n4J070o88R39n51r73J161l90j78P04j276N34K86
$$ -18 375 -478 60 64 -360 322 -467 -521 549 -139 800 249 -724 437 47 -131 573 -703 -169 117
3088A17o89J007q43%J275p13J81J53r43J097n31m81L70p92O33M92j073J209m60
$$ 117 -572 435 -408 -408 867 154 335 488 -455 642 111 -370 0 -792 -159 333 -740 469 9
3107Ik27J228j034j5M22n76N61l66m15Q36j234P64M92r29N68J78n10R27o15j66
$$ 9 -218 1010 -24 -39 383 -193 368 2 -413 423 -811 -47 445 -484 84 262 -248 679 64 -102
3127a02M60o01L68j29n18R42p62l4R17q46N42M4m58O20n66n07R11m76K49j57q01
$$ -102 358 -243 125 -4 -522 420 -342 -376 541 -305 237 281 -177 443 -123 -630 281 -195 54 -103 -904
3148i04J529k36n95O75p36Q5M61q18P34k55n02J175o75K82K30r74J007J12r05
$$ -904 625 389 -206 469 -267 -182 279 -539 195 -60 -562 613 -62 220 450 -524 483 595 -310
3167c10M56q52N57K98q72O75J30k95P83p47J58O50q37N29J06o65K99n67K63O30
$$ -310 146 -706 -149 149 -723 -48 82 -213 570 -177 -19 631 -206 323 429 -236 63 -504 -241 389
3187C89r40L19M08m11O78l30m73P44m89J79Om14K70m91M8O89q49M36O17l50N79
$$ 389 -551 -232 176 -235 443 113 -360 384 -105 74 80 -334 -64 -555 -507 182 -667 -231 386 36 615
3208F15k95n93Q10m58j48j30l98Q68j83o51R56p08J5O83p97R74m71o66J048k01
$$ 615 320 -273 537 79 -69 -199 -597 271 88 -563 393 -315 -300 383 -414 560 89 -577 471 270
3228B70k17K40j156J067L11r93M05j72J06Q96j026L51L13n71L48j13k99P34j291
$$ 270 53 293 -863 204 515 -478 -73 -245 -139 757 -269 82 395 -176 172 59 -240 494 -797
3247g97Q34O73p99n9l7K22M00j005K69M78p21Q86m70n02J354p00k18M84m59K77
$$ -797 37 710 -89 -148 -185 37 437 -568 -299 179 -542 344 -126 -628 726 26 -192 292 -167 110
3267A10m32j33J036j132KQ51o56Q75k94q93J164J05j075P10l51J46j7l72L71l05
$$ 110 -322 -455 581 -551 -549 302 -354 521 227 -666 498 603 -472 238 -113 33 16 -356 15 -290
3287b90l3P09o47P48L2j199J111Q4n63J87n40M80J74p68M19m5lN56o77R5Q97j168
$$ -290 -323 386 -261 487 519 -680 431 515 -48 139 -401 79 253 -515 -96 -141 -144 412 -265 -170 727 -441
3309d41O53P6n14N62r68L47P88r87J80J05K20N53n89j08M64m87L14k83l35P44
$$ -441 212 288 -226 336 -632 -285 503 -484 -304 -199 21 574 -15 -123 341 -146 168 -115 -450 294
3329B94o72j12J031p80k67O71k29M61m09l80Q04o24M16l64n57J492m54q50O96
$$ 294 -378 -490 541 -239 -506 165 -64 397 -12 -392 412 -212 204 -160 -717 775 321 -529 167
3348A67k29K6K56n78O50k7p57O14m98O17k9j063J475j5j072N57j15M4L05p58L37
$$ 167 -62 -36 220 -358 292 265 -492 122 -376 241 212 -851 624 609 -463 94 -21 23 328 -430 -93
3369i3K48n22M37n40M83O78j307R48J40m40M7k91L22N26j264K86M09l65N07m90
$$ -93 155 -367 70 -470 13 691 -616 332 472 32 79 -212 110 636 -628 -342 67 -298 209 -281
3389b81L7P96p18k4O19l90M10n78lP94j052l6M81l9L41k64n88R77k73j54M7j11
$$ -281 -244 552 -166 -190 429 39 449 -129 -132 662 -390 -426 55 16 357 93 -495 482 209 55 102 -9
3411iO26p96l87R74q52r8O37m26O29n8n96O27k27J29k01o74R92L0r74O62j0j66
$$ -9 617 -179 -566 408 -444 -542 95 -331 298 240 -356 271 44 173 -28 -702 290 320 -654 8 -2 -168
3433a68L76m66J44M16n88N20k98P7K01o57N94J04o02L54K6k78N34p52K13P24m69
$$ -168 208 -258 -114 302 -286 234 -64 13 214 -443 151 255 -347 7 33 -245 289 -463 -250 474 5
3454EJ66m03J15P86j009L63M61o58M62k55J80K05q34LN71k05L21m51n68J365m21
$$ 5 171 -232 -117 669 -340 23 484 -174 288 33 213 418 -416 -413 158 -47 274 -177 -745 620 199
3475A99l64M60l57L52p3n14P60o16m58O51m24M21j9k67P83P1n41J35k24M74l13
$$ 199 -165 295 -62 290 217 -297 463 -153 -611 40 -384 37 18 -249 534 605 64 199 -25 449 136
3496A36m80M72j87k81M79p59N35M66o45L64R7N8n4n90N40J91q39L05K08m20P60
$$ 136 -344 128 -59 -340 139 -620 -85 381 -264 100 197 255 201 -389 151 342 -497 -192 16 -404 356
3517C56p71J52P83m77J74p0j24N32q97K23K70m89O6J99k93N22m18k06J070n18
$$ 356 -415 -263 520 43 217 147 23 555 -342 -119 151 -338 -272 -73 -366 156 -262 -468 602 84
3537H4K74l20k59P90o91j59O25n62J73L8L5L72m87j31N05j05jQ3q58O20R5o89
$$ 84 358 38 -221 569 -122 -281 344 -218 -45 -7 28 400 -87 -218 287 182 181 264 -594 26 121 -568
3559e68P15k80M4M65o38O19k85j76M42m78J4K43n87N61J16m24J67L5K0K52n86
$$ -568 147 -133 -89 376 -262 357 72 -104 338 -140 -126 117 -470 91 207 -217 -50 -15 5 257 -329
3580c29N02l41j10N49o91K56K43k90L00O3m08L08M2j16K66n73K97J83m62M11k76
$$ -329 173 -168 -278 271 -420 -164 79 -211 89 152 -256 52 94 -22 244 -329 -32 151 -311 100 -176
3601a76l55J025k67j95L00n27N37k16k82K15m28J9P47p03K67M1l15Q29m66k13
$$ -176 -531 494 227 32 332 -195 342 126 -156 59 -369 -350 397 -306 -39 2 -313 516 50 -163
3621a63O05m67J41m7l69M26j36k51K65n6K09j44M6L96m34n6M25p24L56j4o09O38
$$ -163 442 -25 116 69 -300 126 -10 -261 4 -52 157 13 59 455 21 -35 390 -334 22 8 -601 37
3643C7k06m7M21l30L47j40k36N16l87k3M78o72l6K32m38L51K99j82M14n00J35
$$ 37 -169 -216 205 -125 222 82 -154 362 -25 -48 430 -242 -278 -46 -484 -133 166 -16 398 -102 33
3664C3M40l50J30r7n71M26q5m49M50k59L71K17m54P28p01J86K76m58M37k78l93
$$ 33 473 123 253 156 -415 11 -74 -523 -73 -332 39 256 -198 530 -171 15 291 -167 270 -8 -401
3685d01L51l5q0L89m73N76J34o09N29l8n25N64n14j4R4l64M58jj77K27l9K75J63
$$ -401 -50 -85 -165 224 -249 327 461 -148 381 343 -182 382 -132 -146 -52 -416 42 41 -136 91 52 327 490
3708D90o81L82Q1p01N09j95k85J98O8N1J18j72M08k63j90N77q61M83J82n54M69
$$ 490 -191 191 272 -429 80 -115 -400 -202 -134 -83 35 -137 271 8 -182 395 -466 17 199 -355 114
3729A14k26q9K72j74L03o6o14Q47j99j41J88n19M07K41n64L08j51k36O34n40J99
$$ 114 -112 -201 71 -103 200 134 -480 367 168 27 215 -304 103 344 -220 88 -63 -299 335 -205 -6
3750fJ70m58N00j22l13M59k36k4K27k57Q5J51l73Q92q92j67O60l07K25l2m17M16
$$ -6 164 -294 206 84 -229 230 -6 -30 197 -60 25 176 -197 695 -197 -364 296 -11 214 182 -235 181
3772A81k05J19P2k85N93n69k38P21n55j99L48p5J57j69k60P63m12P6M23o14K4
$$ 181 -24 95 167 -118 475 -94 -332 389 -166 -365 -17 -92 65 -104 -364 399 -13 63 486 -128 -104
3793a04O08q19L65j91l60M63j58J96K09m07N05Rl41O11o99nK96m98J08K92o10
$$ -104 504 -315 50 -141 -501 -38 -196 0 209 -198 307 316 -25 586 -113 -118 178 -320 -212 80 -530
3814e30P66n24jM10l71N34L9l17K57l45j66N49m75M8R3j82K99k79K42L36l16M3
$$ -530 236 -288 -289 121 -250 284 323 6 263 -82 -248 301 -174 -126 -33 -215 84 -195 47 383 67 110
3836A10k2j59K04j50o22Q25l10j16K62m09P12l17j95M98l64J46K77o09K46L7k11
$$ 110 88 -71 133 -17 -639 186 -124 -240 22 -387 325 8 -187 311 -53 93 370 -239 7 44 -167
3857a67M99m52j86K88j60M79j80k36M88m31MK75l95k7L64m10L15k82N3M57m62
$$ -167 332 -120 -306 -18 -178 301 121 -115 373 -58 -54 221 -174 -201 163 -247 68 -214 -161 296 -166
3878a66L69J57n65L40l0k84K96o91N53M11m64J69r2q4N06p81K61K53l05L37k80
$$ -166 203 360 -205 135 105 -179 117 -574 -21 390 -74 95 3 -81 425 -356 -95 158 -147 190 -90
3899i0j97L95l65K24L02m39N67j64j87L52l95k45L30k85K08j47l48Q94k79q9L71
$$ -90 -287 108 -257 -33 269 -170 397 233 46 398 3 -242 88 -197 11 -136 -484 410 131 42 413
3920D13o11M38j52l50L91k96K28n7k82L23J87m77M79m1l0N8n22L49M29q14K09
$$ 413 -198 240 88 -262 129 -167 61 4 -278 45 232 -245 234 193 163 221 -301 48 477 -337 -128
3941a28P7r4L12o27P79j70k47L70J00o13O00m90j00K14p0K61k94P0L71q59M37
$$ -128 -51 -145 167 -460 319 149 -98 272 372 -241 359 -131 -231 -17 -87 174 -120 -50 321 -538 -101
3962a01M95p01J61K07m90N70o5k81M57k57p3q6M6N59l76l33J87j36L56k75l32
$$ -101 394 -307 -146 61 -429 141 76 -205 252 -5 -78 -164 -118 441 65 -268 -81 -217 139 -136 -468
3983d68N66o5k06K82oK24k38l61P17k55m18J81K5j03L04n13N41l52lJ88j38K87
$$ -468 98 33 -173 109 103 327 89 -272 445 190 -228 -47 -22 -125 179 -334 207 -145 -148 40 -98 189
4005A89N7p79M66J42o17N30l61J03R6k00M63K5k30K92k38O4L27l94j14K82l3P7
$$ 189 246 -533 -67 75 -542 -12 -373 -270 -174 -374 89 114 -116 176 -62 2 329 -65 -179 103 70 147
4027A47m14K34L01n78K94N67p32M55m03j40N90l65q4N4j11L43j63m32O87q3k01
$$ 147 -267 -33 268 -310 -16 551 -181 274 -129 -269 321 -44 -128 -74 -185 158 -5 -437 250 167 -34
4048c4K91k98L29r0m24M87m77j27N55n26P04k06m12M45j71L0J64l47J72K64k23
$$ -34 257 -41 288 198 -226 261 -216 -343 212 -314 390 184 -228 217 46 76 240 -107 65 329 106
4069A06j96mK11K5l96M46N9n56K20J83m8P7m13K76r8j53N06l23k31R51j127L98
$$ 106 -90 -94 117 142 -254 192 251 -305 -85 98 50 127 -286 -10 -108 -261 245 -78 -309 642 -485 -87
4091h7L68o66M04q7k13M11m27L58M06n20L99k17l8K42k74l70M75m59N58l21k86
$$ -87 281 -385 19 -68 -281 130 -297 61 467 -53 346 129 91 333 59 -311 164 -295 263 -58 -344
4112c44N36o7k33M30k70Q0K28m52O04o52j88M25l89L58j83k12K68J33o3M2k61
$$ -344 192 125 -108 322 52 132 360 -92 512 -140 -328 97 -292 66 -117 -329 -61 72 9 51 -210
4133b10M18J14m75L08j15m52L96k49J27J77l11N49l99J92K77l14J62J63o16R9
$$ -210 208 322 -153 155 40 -412 -16 -265 -138 39 -272 277 -122 70 347 33 195 358 -258 -159
4153a59Q5j92M36o71R2O72m46J89K83k79R7n3j43M23n39J51j18m8N9m8M0K83j72
$$ -159 -74 -266 170 -501 -409 263 -183 6 289 10 107 54 -89 334 -205 -54 -172 -220 -161 -209 -169 114 -58
4176e8J90J53l07K80k63k00M17n94N08k7o10N30j56k65N57j69M9k6j79M67l63
$$ -58 132 285 -22 258 -5 -205 212 -382 126 99 -511 19 -137 -402 155 -14 35 9 -170 297 -66
4197f6k75M58k58J79M52q30M04pm8q1n1P6L94m16P6M5m3L18l73P1L83o68M94k98
$$ -66 -341 117 -141 38 490 -340 64 57 9 -72 -123 -47 347 -69 7 52 9 327 -46 25 408 -260 234 -64
4221f4j28M63o08K63J90j44Q4J58o18Q11j81m19L95l55K91k55l43N18k82K90K55
$$ -64 -192 271 -337 -74 116 -28 56 214 -404 407 226 -193 202 -153 138 -117 -460 58 -224 66 321
4242C21m39Q7J72l22M64k89LM9j56j19J88j58K66j01k11P07o55L17L15n35K71
$$ 321 -118 -31 141 -181 283 -6 -3 46 -110 -229 -41 -199 67 -34 -245 462 -193 124 439 -96 175
4263A75O7m37M01n57l1L03l02M59j58j58O00l26j3J81k55K17J05o47M11ql13O97
$$ 175 242 -195 206 -351 -382 -79 -381 78 -80 -238 362 36 23 204 -51 166 271 -376 35 27 -286 411
4285D11o75K59K87m51K03q7l41M99l71L50Qj87l2J5k69O12m42R1L71m52L65o1
$$ 411 -264 -5 282 -169 34 -53 -394 105 -266 84 92 -95 -127 -112 -381 231 -211 -120 251 -201 164 103
4307A03r1K38m20O2M41p31M14Q6l86N90l59l9L06k98K38j04m20K94o8J18L69n42
$$ 103 12 250 -170 -108 333 -398 16 102 -284 306 -53 -92 214 -84 154 50 -370 -76 -144 -26 343 -199
4329a99K19K25m38M03q3k75L69l25J56L3k64M29j27l70M61j71r1L19n35K82J85
$$ -199 20 245 -193 210 127 -148 221 -104 52 85 -179 250 123 -247 214 43 -48 271 -264 18 203
4350B03m11M19k74j34L19m45N77l0k48R3j06J95Qm22J61J10j32K28k25j6L27k78
$$ 203 -208 211 -63 -197 122 -323 254 224 -24 69 -37 158 166 -256 -95 15 -117 111 -114 -130 197 -81
4372h1pK62l38N22l39K1O4n70M30L1j20K60k35o9M91l07J23K39k63M3j80l89O53
$$ -81 -88 174 -164 358 19 40 104 -466 -36 -5 -125 135 -100 -169 322 15 138 377 114 157 -23 -412 241
4395B41l91J97l6k07J97J05j32J31P8j93N7n2L33l12q2M05n86j51O71m57R8L16
$$ 241 -150 47 11 -196 1 106 -26 105 183 -10 47 -5 328 16 -66 339 -247 -398 273 -184 -86 230
4417B30n14K82M8j27P3J21P2k22m33O67l35r7L85j42j20K59j98Q6J4j09L61o31
$$ 230 -284 -2 46 -81 -8 113 185 -37 -470 197 -138 -235 150 8 -112 147 -51 35 49 -60 301 -330
4439c30J36Q8L0M1K05l30K51J1j31J86j74J27o1k10K29k84O0M51n84L84J6j15
$$ -330 -194 -106 -76 -35 170 -160 91 102 -29 157 -17 110 49 -161 68 -216 -156 295 -289 95 111 -4
4461dN5J21K4p8l22K67J7k89J49jn4J38j36K12K0k07K88m35K42K86m51J50j63
$$ -4 51 172 196 118 -204 63 80 -209 -60 -61 -115 23 -113 99 119 -88 200 -235 7 293 -158 -8 -171
4484a71OK22m0j12K89j88j18K23k45K70l96J29J96j20J03K62n29M30m01l7K50
$$ -171 -165 57 17 -95 194 6 -112 111 -134 136 -260 -131 65 -55 48 310 -219 211 -190 -227 23
4505B3NN8l5j68K30j09n7K20l47J84N4k56J76N8k40L33l51J3L75m81K03L64n18
$$ 23 28 86 51 -117 113 4 -53 167 -180 4 58 -198 -22 36 -204 129 -222 -209 166 -315 -112 252 -266
4528b66K22l6JJ85l47J38J12k24J72r1n5K09l33N11mj95K40O3o6K6m22KK22mj11
$$ -266 -44 -80 -79 106 -241 -103 9 -215 -43 -134 -189 20 -313 198 194 -1 239 302 236 262 -160 -158 64 60 -51
4553e1M53r00N77j88J80J34l28K49Q6k98J49j02k69O15n19J34N4k99L66J9l3O6
$$ -51 402 -498 79 -109 71 205 -123 126 212 -86 63 -39 -308 307 -212 -78 -24 -323 43 62 29 95
4575I5k30K23k3K9J03k32k36L92m04K07L9O1J64j34j63K37k43JL53l56M0O7l18
$$ 95 -135 88 65 94 197 -35 -271 121 -283 -76 -37 24 188 54 -109 128 -115 -114 239 -117 -77 -10 -328
4598c28O03m01Q1Nj62P5L62m60M01l67j5L59k81N9J71k76L61l12r5K43o5K67k55
$$ -328 275 -126 -45 -40 -202 -127 235 -225 176 -191 -206 153 -128 -69 102 -174 187 -125 -220 23 -42 225 -30
4621c0J1J94j60j09Q5j15k9K72j24P9P6m1o9m0r4R5j73J32l8k2L33l67J49J29
$$ -30 -19 175 15 -94 -9 -124 -153 119 -5 74 150 109 40 0 -94 1 -172 -40 -78 -100 233 -134 15 144
4645A44l04K73j05m6J02k49L48o3m60M16j24l9K45k07n0L89k32L0j92r4O9k17
$$ 144 -160 113 8 -38 64 -185 163 100 -360 56 -68 -107 138 -69 -119 270 38 68 -124 -218 -149 -366
4667c66J97J95N5J0P2j73J42m35J98O50r23l0L50n4N02m45j01L32p2m75N08l29
$$ -366 -169 26 81 91 163 -10 132 -303 -105 545 -378 -408 -58 -112 390 -55 -156 176 104 -371 137 -192
4689a92N27k67k78M85m24P1j04o7J01K56mP9j72R4J48l63L13Ql36J83j11j25K59
$$ -192 335 68 -210 275 -149 -78 -182 -249 -148 108 104 183 11 105 253 -110 203 211 -125 58 -53 -178 81
4712H1o0N5k2j37L14j21j84M30n68J15K29k35j29qK33L39k44j94K45j16q6k4O8
$$ 81 21 76 54 -83 231 110 -74 356 -212 -97 132 -103 -232 -240 -7 332 88 -106 139 23 -63 -87 -19
4735a9L99n20J75J46m2J01m09J39L43l54o2K33k55J46k0o6L27l59j0L00o07L65
$$ -19 380 -140 35 181 139 240 -169 -30 313 -41 -103 130 -125 21 1 -65 262 -97 -107 193 -414 -49
4757d9R1n8R1K1r0jj93K99j90k08L14j2j34L40j08K73l01k31K06k81K55J50m07
$$ -49 42 -16 75 96 6 5 -188 111 -79 -287 27 15 -119 221 113 386 85 -146 60 -221 34 184 -223
4780b23K64M5j82M84j72k47P9k12K76J5k11M53m95j52J29K39k20J72k48K51K7
$$ -223 41 86 -96 388 216 -31 48 -164 112 127 -84 369 -126 -278 -149 90 -130 42 -206 45 72
4801G2m2K94m51J01J45k02K27J55o91N49j37k09M52l14L8N7j48L99j63l01L31
$$ 72 30 324 -127 -26 119 -83 144 299 -392 157 20 -189 263 -51 -13 44 -104 295 132 -169 162
4822A62l21K23K7j55L93k46L1q7o4L78j95k45j8K14o2j19R9m0J25k35P5P9L9j44
$$ 162 -159 64 91 -64 329 83 114 27 -37 341 146 -99 -117 97 35 -84 15 -25 100 -135 -60 19 58 -86
4846h6K1J53K37m29P2N3j13J75j95N0L20l98l3M47l13L08l10k49L38k50N8J59
$$ -86 -65 88 325 -104 -32 21 -92 83 -112 -62 258 -140 -173 274 -39 269 -41 -290 48 -202 -144 15
4868A5l8Q8O6rN6l76R9K50r7k82K72j85K45j08K01j12j69L16j66k74K42k18J10
$$ 15 -23 65 131 122 178 -198 -99 151 54 -228 44 -141 104 -4 197 85 -84 232 66 -208 34 -184 -74
4891g4K89l91K35j6l46M76r4o5J13o5N6J06n09M05j27l04M92l13O3m9K9M12n86
$$ -74 215 -176 59 43 -303 173 79 14 127 62 118 224 -285 120 -7 -311 181 -132 -69 -118 -89 323 -263
4914b63L27J78n29J83K61k42J08P7p4j65LQ6P1j0O1j18p9R0J06j11J75j69L55
$$ -263 64 242 -287 -104 157 -85 23 100 26 -139 -136 -50 21 11 72 -46 -125 -35 71 -40 135 -34 321
4937C21l76j97L59M0N2k40o6J90j07k22K55O1n4J08k14QL09m88J87N0k04M41l85
$$ 321 -55 -252 107 147 199 -41 -107 83 -24 -246 9 70 16 124 -90 -82 227 -261 -74 -24 -228 213 -172
4960a72J98j39l55M26N9r4K28l87K05J25k85M09j11j81L6N2pL2j63J92j50q8K23
$$ -172 26 -113 -468 -42 17 -77 151 -236 -31 94 -191 218 107 -74 -38 14 7 39 -124 68 -82 -170 53
4983E3l20L74O1l03J89j44J04J31k13J3J52k85J35J31k26J67n5o0M37m82L35j23
$$ 53 -267 107 168 -135 54 -90 14 145 -68 -55 97 -188 -53 78 -148 19 -36 -96 341 -141 194 71
5005G1j33J89j17J73k78J7K47jp73O25K04k41K7P0j37J79k30K42k65J09J54k33
$$ 71 -62 127 10 183 -95 -78 169 168 -605 20 224 -17 10 80 -57 122 -108 134 -131 -22 132 -101
5027a01R4J70l92M30l15o4K54m87K43L20j36q2K48l96L02j01L3J8K6K13p5o34
$$ -101 -7 163 -229 201 -114 -178 76 -411 -168 152 16 -66 182 -214 88 -13 20 38 64 277 202 -432
5049d32L76k8j15K47j15J88P1k18j21K95j55J02k11n2K94k67K89k55Q2K26l27
$$ -432 -56 -84 -199 48 -67 121 192 -26 -147 148 -7 95 -116 -168 126 -141 148 -107 -25 201 -126
5070a26K78j11l79P66l11MQ1k29l0Q4j14J72N8k15J26l6j82K28q4p5N3L6j5j70
$$ -126 152 41 -338 428 117 121 202 -27 -57 27 -87 85 143 -72 54 18 -164 64 -20 -95 -42 -6 -21 -191
5094a91L33j93K3j0p6Q5J96j65l3M6q4o2J57o2P5j53k21M05q9K5Q5j26r1n3O9
$$ -191 142 -51 -28 -38 -114 -29 167 2 -31 15 -69 -131 26 -36 39 -114 -335 70 -19 6 91 -35 -126 -179 -110
5119a10N5J02j86M57n78K42Q9l21M11M4m9j35k79N97j30l64K33q6L4J84k81K89
$$ -110 -55 47 -139 318 -260 -18 71 -250 161 205 156 21 -258 339 209 -155 78 -8 26 210 -71 218
5141B18n9j47Q2j59J73k15j27Q5R6j68R1NJ30K58l44M1K30m25K76J7Nj01K79j28
$$ 218 159 12 94 -65 108 -107 -234 -149 -53 -221 -130 -125 5 263 -81 -40 190 -235 41 58 63 -38 241 113
5165A13O0m32L54j4l52K54j72N5L5J18r1J34PR2j35J01n6j62J85Q7l49J81m9j97
$$ 113 173 -259 95 81 -271 -17 -189 -134 -99 19 -72 62 69 161 26 127 71 -91 94 181 -168 13 -36 -233
5189b33N82k67j86J69k79K16R1N3j10k10L70m69J53K52p7p1O0p2J8k36J87K10
$$ -233 349 82 -104 65 -214 2 93 146 36 -174 196 -273 -120 132 55 -16 44 -28 -10 -246 -59 151
5211A51j44o2L13j93q2K34n21K92j16o5K08j13M6K00k87J63n9K06m6j40k09J04
$$ 151 7 -55 258 65 -17 217 -304 -12 -128 -193 15 -98 -52 148 -139 24 -35 171 125 -15 -224 -120
5233a20J18J10k09J54K1j53J56J43k60o5J94m7J29R4l03J53k40P7rQ7l4k33L25
$$ -120 -2 108 -101 53 74 -79 77 220 -40 -105 89 42 171 265 -38 115 -125 -48 -57 30 -4 -237 88
5256H8P3m52J85L4L9L10m33K49j04l5m93O66k81r7J25N1L45l30J55R8l96L51l00
$$ 88 161 -291 -106 -72 -33 277 -156 93 -11 -46 -539 127 -154 -251 -126 -75 270 -60 95 193 -203 148 -152
5279a52K41j09J58j76J86j64O8p5J40K0j68J09P2l91K50M7k46J90q1k5K44k34
$$ -152 89 -20 138 -38 148 -16 52 -23 117 137 -31 78 150 -241 9 56 -190 0 -81 -106 138 -96
5301i6q3K00j94J38j82k3L75k62K66kj67L59k74j00O4j57J37N6j19J87j63j44
$$ -96 -179 21 -173 -35 -217 -240 135 -127 139 137 -30 329 55 -45 19 -138 -1 55 -64 123 -40 -184
5323a84K08n3J14O6m37J35J76l7l1p3M6Q2j71L94k97k16L24m0j78O6J64P6O7j78
$$ -184 24 -29 85 151 -286 -151 25 -12 -43 -116 -70 12 -159 235 -62 -278 46 6 -172 -106 58 134 201 23
5347B3k87m1K45Q8o7K10o7k23L65k63K2k7m8Q5j45p9N50k40l43L65j40q9J31j13
$$ 23 -264 -305 -60 28 -39 171 104 -119 246 -17 5 -22 -70 15 -130 -209 341 101 -242 123 -17 -106 25 -88
5371h8K46L7L7ql18M7L16j80j59l1k9K91k96P1K61j67j6O4j12M8rl52K08J46Q7
$$ -88 158 195 232 224 -94 -47 269 89 -70 -101 -130 161 -135 -64 197 30 14 78 -34 14 5 -347 -139 7 94
5396I4P5l59K87j16O0kj29J75J67l22L3J32k81J90r6K78nl18J50k4j37K99l81
$$ 94 169 -190 97 -19 41 39 -90 85 252 -70 -37 95 -186 4 -92 186 181 -137 13 -11 -148 151 -230
5419b30P3L02m50L21j3k97L27j81J39J37p1m0J69o0j71j02N2n5J49J33p6J45k07
$$ -230 -157 145 -305 16 3 -294 33 -148 -9 128 57 17 186 126 -45 -147 -95 -150 -1 132 56 201 -6
5442fJ55k19K22l73J00r3K57J11k52J45J43j81Kq9J5J62K5r1M5l12J15R4j13J25
$$ -6 149 -70 152 -221 -121 -214 43 154 -98 47 190 9 11 -78 -63 99 124 33 78 -234 -119 -25 -138 -13
5466a3J34j42k3q4L1L18q7j91J25N1Lj94O6K7k35K80n1L3q0j03J94J56r4q3J31
$$ -13 121 -21 -44 -128 -97 221 134 -57 68 119 122 -72 -6 21 -214 66 15 48 -32 -135 59 215 121 38 169
5491A69m08J49N5j71L25k24L02m6k22o6J57M9j16j5J14o4J6K7j23J41K0j41K37
$$ 169 -239 -90 -35 -206 119 -105 197 151 -71 -137 20 69 -47 -62 52 -12 4 31 -92 49 69 -72 165
5514A65k09l8K25K6m29L68j09j22J13J47Pk35R0K88j34j95K02m5m2j30k5J86j90
$$ 165 -44 -82 143 169 -260 108 -1 -123 -10 137 144 -91 -1 287 153 -42 160 115 73 -57 -82 104 -86
5537h6j89M18k54J99K17k32J03m13K11r7L43k30K19j96OR1l16K69k03P8P3p9M3
$$ -86 -275 143 -111 88 305 73 176 -237 -26 -123 220 -10 209 13 19 110 -206 63 -140 -62 11 -68 -25
5560b5q8j85N17j04l44L31k91L96k73n5Q8K36k02n3oK41l00n6M89n44K30J33j07
$$ -25 -113 -298 219 115 -229 102 -189 207 -66 -121 -33 203 1 -52 -58 183 -117 -173 316 -228 2 135 28
5583B8No5q3J16k43K61o0lOK27j30k4j63J7O4M3j20J95k69K89q1j19n1J94q9k
$$ 28 33 -32 -115 1 -242 19 -41 -44 -38 189 59 35 -128 -111 -47 -4 -124 71 -198 91 10 -109 -160 34 -55 -57
5609e7k45M21p0o6J17k28J81mj30m6O5j64j42J75J07K28o6n9J28l52L30k55NJ60
$$ -57 -302 119 49 -17 100 -128 53 49 -81 -127 -62 -226 -368 -193 -86 142 76 17 145 -207 123 -132 -127 33
5633C3k21J25L13m90L02l17L14k9k57M07m6o6k97N8N2p8J05P9L9j44K03j63q8
$$ 33 -188 -63 250 -240 62 -255 59 30 -227 180 134 68 -229 -171 -119 -197 -92 -13 26 -118 85 -78 -166
5656a66M51n16L94k01p1K72k38m5J85k14J27P1j78K69Nj78J76k3j66K63l35K64
$$ -166 285 -231 163 -38 -109 163 -75 -120 65 -149 -22 49 -129 140 145 -33 143 120 -46 217 -118 146
5678A46Lk10kK44o2J19l32K75k81j64L67J64n35L73l28L7L00j05M58p16nJ77J36
$$ 146 149 -61 -63 181 119 238 -94 181 -100 -264 103 267 -268 105 -223 -186 114 9 467 -249 -254 -77 59
5701E9q4J07m7q0Ok11J57j71R7K66n8M1p0n8M10n87O3K09k33J79q7k4J09J47p7
$$ 59 -25 82 35 -45 -39 -250 -93 -264 -167 99 41 82 12 -46 364 -223 -160 49 -184 -5 -92 -116 -7 140 63
5726F3R2k22J36R3j61J54J05l09p3R2N9J8j30m6K92j00j91R5J68O4l37J96k13
$$ 63 155 -67 69 162 1 155 260 -49 -122 -30 29 47 -83 -129 163 63 -128 -33 135 199 -138 58 -155
5749a55J63M9j44K95l43k1K33l6k15M38k33j39J77k75N6L12k27o5J1r8J49j8L09
$$ -155 8 57 -87 208 -135 -156 77 41 -174 264 31 -108 69 -206 -150 162 -65 -130 -119 -217 -68 -86 223
5772B23k16k93K21r2QJ8M04k27r2j79K17P0K11r7j67L0J62k74q4K38k50L64l3
$$ 223 7 -286 -65 -157 -149 -131 273 46 -46 -225 -8 62 273 176 9 39 201 -73 -157 81 -169 195 162
5795A62j93k27J34J67j69R9L8j06L48l43K80k19J25k32J79O0k78L18j67J95j54
$$ 162 -31 -258 -124 43 -126 -27 11 -95 253 -90 190 -29 96 -136 43 103 -175 143 -24 171 17
5816A7j93M2J27J91j03j21J94q4PR9q0j29K7Q1k2q3J33r2j78J29J1j15j37K72
$$ 17 -176 -134 -7 184 81 -40 154 70 77 176 96 -33 -6 75 53 -30 103 11 -167 -38 -27 -142 -279 -7
5840gO7r7J44l00P29o58K8Q6j16K53J16k84M8J10k43L03q2J07l20p4M34m23r0
$$ -7 60 -37 107 -193 536 -122 -94 -8 -124 129 245 -39 9 119 -124 179 97 204 -116 -190 244 -179 -269
5863b69N25k71Q9k2l10L89j93o8K05k7k74K5K74j53L67m16J16qP1K5j51J18k15
$$ -269 256 -15 74 52 -258 131 -62 -130 75 48 -226 -201 73 -80 287 -129 -13 -21 50 75 -76 42 -173
5886a73K3R1R3O6j18m1OP6l54L24J84r8J03J19m69K22r3j06J28k29K22j15L06
$$ -173 -150 -59 34 100 -18 -59 -53 23 -331 -7 177 79 182 301 -168 54 -39 -145 -17 -246 -24 -139 167
5909A67J9l27J54J75l58K68K1j50J38k73L85o8j80J67j40M8K4j03K34l74J33J38
$$ 167 186 -141 13 188 -170 98 119 -31 107 -166 219 151 -29 138 -2 46 70 -33 201 -173 -40 98
5931I8J4J6O3k43Rj00K56J2j72K11j2l41L09r3r8MJ65j08j96P9J75J57l24K76
$$ 98 112 128 191 -52 -43 -143 113 125 -47 164 152 -189 120 27 -71 -67 98 -10 -206 -127 48 205 -119 157
5955A57k40J88l0j5r1j7k23N09k51k23L39m9Nml0n6n8MJ94Q2Q2k16l0j11m6J69
$$ 157 -83 105 75 60 -31 -48 -271 238 -13 -236 103 54 59 55 25 -31 -89 -85 109 191 273 57 27 -84 -130 39
5981C9K30m66K11j43K03k9J30l06K81k51O8L0p6L39l27J71J13j69p3j06J14J5
$$ 39 269 -197 14 -129 74 45 175 -131 150 -101 -33 -3 -79 260 -67 104 217 48 -25 -131 -17 -2
6003bk14j21M36k7l3j13M5j55J69J89l34L7K11M7j15K3l5L2K03m40K41j32K39
$$ -2 -216 -337 99 72 39 -74 -29 -184 -15 174 -160 -123 88 135 20 43 8 40 243 -197 44 -88 151
6026A51n5J55l77k9j06J02K95j93P3J94k12K21k07j38J93j90pK46q1l2p0j91J45
$$ 151 96 251 -126 -155 -261 -159 136 -57 16 210 -2 219 12 -126 67 -123 -130 116 35 3 -67 -258 -113
6049a13K7R3kk9j80K10R3L5j07j99K52k68L56o4l06K73k73J23L55k45J7k0j31
$$ -113 -86 7 5 -24 -204 6 99 134 27 -172 80 -188 168 104 -202 71 -202 -79 276 31 48 28 -103
6072a03L3J40j37K00j77j21K74k68K67q0J21M0l98L71q9O3k06P2j85J28R5LK2
$$ -103 -70 70 -67 133 -44 -165 109 -159 108 28 149 189 -209 162 73 136 -70 2 -183 -55 40 43 65
6095F5k55K80l55K71j9j67J35J10k21O0J94j78L35k77K02j44m0N7Q9j47J73J03
$$ 65 -190 90 -265 6 -13 -180 -45 65 -156 -96 98 -80 255 -22 180 36 -4 53 142 -5 168 271
6117B71k79lk52M90k76J39lO5l30J65R5K5j47k20K91j9j6O8L3M2l0k02Rl6R1O1
$$ 271 -8 -11 -263 227 -49 90 87 152 -178 -13 82 107 -40 -260 31 12 -4 64 97 139 109 -93 -84 -120 -29 32
6143C2l7n7R7qk4K71j63j29m6K51k43Qn8L93j92r1k74L06k5k09l6J93Qo3J81j60
$$ 32 -5 -62 35 27 3 274 111 -18 -64 187 -56 -48 -106 287 95 4 -270 36 11 -198 -234 -41 -33 -96 85 -75
6169g5j59M21j84K7k2R3j66L0M7n4l1M05l79K20%k03q5K06rN1l28K09O4n08P40
$$ -75 -234 187 3 30 8 101 -65 -35 12 -42 -73 332 -47 173 173 -30 -115 91 82 133 -195 14 78 -430 310
6194C10m04RJ27K8j55L08j60j80J24k18K79j30J07j32j21M37k10J34N6k82j08
$$ 310 -94 -85 42 70 -85 223 63 -117 7 -211 68 -62 45 -87 -208 229 19 153 209 -73 -181
6215a81K00k25K54Kj72K09j94R4J21j04J23Q2l58J83j29L72k00j50N3J4o4J03
$$ -181 19 -206 48 50 -122 87 -107 -13 108 4 127 209 -149 34 -95 277 77 -73 -20 -6 -70 33
6237C3k1n4J02K7j24K02l64J65L6J63P1l09J77l92J87l7J05J19j66R4j88J52o8
$$ 33 12 -42 60 87 -37 165 -199 -34 2 165 236 -73 104 -288 -101 -138 -33 86 -80 14 -174 -22 -90
6260i0n7R8J43P6q2N1m8q7j09R3o6L75m40N2K39k61K16M0l3K3k15K20M1m98J39
$$ -90 -147 -49 94 170 88 139 91 4 -105 -12 -78 297 -143 -91 148 -113 103 143 110 133 -82 138 179 -319 -180
6285a80J59j03L35m1k56J66m03L08K48k56R1k0j81K65j77J0L07l17L40m52J13
$$ -180 -21 -124 211 170 -86 80 -323 -15 233 -23 68 48 -133 132 -45 -35 272 -45 295 -157 -44
6306d4L65n43J87L25j85Lj88o4K16J53p0k23n5K28k45L60m03K60j94R6k15J95
$$ -44 321 -222 -35 290 105 108 -80 -144 72 225 155 -68 -123 105 -140 220 -183 77 -117 -21 -236 -41
6328d1L08l64K88k60J8n9k1m8J61K9J92m00J59J91j27j45J05K1M5R2j49L14k94
$$ -41 267 -97 191 -69 -51 -110 -131 -179 -18 11 203 -197 -38 153 26 -119 -14 7 52 144 -5 309 15
6351A5k0J81j20J7Kj45J53j84k6O8Q2K42l96j60K24MM32k79l09J88P8q1J21N9
$$ 15 -5 176 56 73 75 -70 83 -101 -127 -59 23 265 -131 -291 -67 -63 369 90 -219 -31 47 -34 87 146
6375A46m7r5J83j65n6M4rJ61m04L81k45K32jj01k40J79j47K91n7q1J24k07K64
$$ 146 99 4 187 22 -34 10 1 162 -242 139 -106 126 125 24 -216 -37 -184 107 50 -31 93 -114 150
6398A50M9l53L20q3j02J19l50M61k19o5K70j75L3K2l1Q2j49J36l33K75j13k5L3
$$ 150 199 -154 166 83 -19 100 -250 211 -8 -73 197 22 55 77 46 128 -21 115 -218 57 -56 -81 -48
6421d8P3k84L06k6j31ml1m3J47R8p8K79j04k26K27k40J46J92l55K35k6j90j92
$$ -48 25 -259 47 21 -110 -114 -145 -188 -41 57 -21 258 154 -72 155 -85 61 253 -102 133 107 -83 -275
6444b75K66p0L5l7J37k46jL20l08L93n1k27o2L35k33k0k03K41J80k65KJ80k47
$$ -275 -9 -79 -44 -81 56 -190 -191 129 -179 214 163 -64 -126 209 -24 -44 -247 -6 174 -91 -89 91 -156
6467a56L69k90J15j70M9K77j12j51on1P2J56nj06K8l64O40k88p6J75k48K82L7
$$ -156 213 -77 38 -132 -83 194 82 -69 -75 -126 -54 102 97 -9 19 -345 295 7 -69 106 -142 140 177
6490A77l06K75o4R7j07l36M60j29j82J77l13R0Q2r0K08j4j89J34K41k51L4o0L7
$$ 177 -129 146 82 179 72 -264 196 67 -115 62 -251 -161 -79 -169 39 25 -164 -30 211 -40 -6 -66 -29
6513b9J80j59J92j80j65K82o5NP9k29j69J12J48J76r6k5J17n8j13r9Q6K20j96
$$ -29 151 -8 184 4 -161 121 56 61 140 -89 -258 -146 2 178 82 57 174 116 3 -96 -10 210 14
6536A4k11K93q5k4J97j87J20k49j01K23j08J48N7j56K1J34n9J32k5l93L54k92
$$ 14 -197 96 11 -13 184 -3 117 -132 -233 -10 -118 30 87 -69 -48 86 27 159 134 -259 95 -197
6558a97J75n4j27L48q2P0k01j89N56m24K31q2k59M42J09k45k66N1L39P7j63J25
$$ -197 -22 -76 -203 145 63 133 -68 -257 299 -125 106 24 -235 207 316 71 -195 -144 195 272 109 234
6580B34k77R1m5J49j64K42l61O6P1Q2l30M17r7n4n1M3M6o7p7L85n38L29n0L1J40
$$ 234 -43 48 3 152 -12 230 -131 -65 6 88 -242 175 78 24 -27 16 62 -5 -82 303 -235 94 44 75 215
6605B15j62m5R7l23N8J95j31R8j11L80j84k76Q8R4j70M88k85J35q8j85J76j26
$$ 215 53 8 105 -218 -160 35 -96 2 -109 271 87 -189 -101 -7 -177 311 26 161 73 -112 64 -62
6627f2K7j60J41J88J0q4M5o10J75J98j0r3L93k47J62K40k15p7LJ18Mk32q8L46
$$ -62 -35 -195 -54 134 144 60 105 -505 -330 -132 -142 -235 158 -89 73 313 98 21 24 142 146 -86 -174 172
6651A72j50J70j2j33j4p3l0j15J32L86k25l98K85J85m0J55m04o1J99l2k20L44
$$ 172 22 192 180 47 33 -40 -70 -185 -53 333 108 -290 -5 180 140 295 -109 -170 29 -3 -223 121
6673A21m44L46pj05J25n9OJ57P4l78K27RJ09k68K6O9N4L6jk46J30J14N6k7q4J45
$$ 121 -323 23 16 -89 36 -23 -17 140 214 -164 63 72 181 -87 -61 8 62 98 97 -149 -19 95 151 124 40 185
6699A85l50K78k89J08L14j87k09R9J56J19k17rL06j64j48M3n6j18J76LQ6J16l98
$$ 185 -165 113 -176 -68 246 59 -150 -51 105 224 7 -2 304 140 -8 35 -21 -139 37 40 126 242 -156
6722a56L75j75J71q0L5o6j09r8j30L92j83K51k94M2N6Q8j37r8L10l80J4J75n7
$$ -156 219 44 215 135 170 104 -5 -103 -233 159 -24 227 -67 -25 31 119 -18 -116 194 -186 -172 3 -54
6745e4R7l7J1k29K70j27L19r1l51L19j85j40L40l7k9k3m3J31j73J7P9L7k5po0
$$ -54 43 6 17 -212 58 -69 250 159 -192 127 -58 -198 142 105 76 53 10 141 -32 -15 64 101 76 69 9
6770IK58k80j4J69L4k46R0J67j02n2j99RR5R5Q6j09j38K61j78K3NM0K74j84k23
$$ 9 267 -13 -27 142 176 -70 20 187 85 33 -166 -157 -62 33 119 10 -128 133 -45 -22 -17 23 297 113 -110
6795a10J43m15L47J86o0k26N6j57L70j12K04k35nN7k59L68k14k7K23o7LR0l31
$$ -110 33 -382 -35 151 91 -135 -79 -236 134 22 226 -9 -14 43 -216 152 -62 -89 134 67 70 160 -171
6818a71K47j97L30l58K80m16M34n2R2k94n8L40k38K64J7k90J79l6kO1J72m64R3
$$ -171 76 -121 209 -149 131 -285 149 97 189 -105 -163 177 -61 203 220 -70 109 73 71 132 304 -160 -67
6841f7K15k73J72J11k18k7R0Nj75L2K83j24j55L52k99kK99l26J58P5p5k00m7J22
$$ -67 148 -125 47 158 -60 -87 3 8 -167 -135 148 24 -131 221 -78 -80 219 -107 51 126 51 -149 -196 -74
6865g4L17k67j33J59RK10l93R1K23k6k14j45K99J56l23N1K91j59qM2j13k3rJ10
$$ -74 243 -24 -157 2 11 221 -172 -81 142 116 -98 -243 56 212 -111 -60 231 72 64 106 -7 -30 -39 71
6889G1j03J92j13L3j28O6k7n7K95k95K11m8k05N96o37M6J24m1k5K42l56N04l10
$$ 71 -32 160 47 80 -48 18 -9 -66 229 -66 145 97 -108 488 -149 -103 21 -20 -45 197 -159 345 35
6912C5k75K91j39J30j23r7k6R6N6J18j99N72m68l4K26N7l25J97k22J5J34k19L35
$$ 35 -240 51 -88 42 -81 -178 -204 -108 -52 66 -133 439 -29 -63 163 220 -105 92 -130 -115 19 -200 135
6935A35j27O6R7j55J01J34l44K08k76k44N73l07Q0n4M9J94j11r7L73l32M9Mj50
$$ 135 8 74 171 16 117 251 -93 115 -161 -405 168 -139 -59 -113 -64 130 19 -78 295 -37 12 16 -134
6958a34J42j43j14M45m18M9L94l05K41j33j96L73l53j8M30k54k07J75M1Jr1J9
$$ -134 8 -135 -249 196 -222 -173 221 -84 157 24 -172 201 -152 -170 260 6 -201 -26 15 16 -75 -56
6980e6O8k10J35J54l25M96k01l16L91k8r8L1j59M31j93n5Lj03n7j49r0M03M1j32
$$ -56 12 -198 -63 91 -234 262 61 -255 136 108 10 41 -118 313 120 65 68 -35 -92 -241 -331 72 113 -19
7004a9P4j07K77j88P0j70J84j21k93M57l98L36p7j49K69k28K57l40L20K26m20
$$ -19 55 -52 225 37 107 -63 121 0 -293 164 -234 102 25 -124 145 -83 174 -166 154 380 -40
7025d0J49Nr2J29k12m5j0J47r1K22n0k1k6l00K53j82J52J19k02J75K3j59J71m9
$$ -40 109 114 22 151 -61 -106 -116 31 -60 162 112 91 65 -235 18 -164 -12 107 -95 80 103 -56 115 66
7049F6k05R0oM8J38k88J89j17J95N3n53K98K09l5k79J48J26L3k39K78j76J04j53
$$ 66 -139 -49 -55 -7 131 -157 32 -85 110 163 -390 -92 117 82 -197 -49 77 110 -129 149 -27 77 -76
7072g6J84l09L20l03L33k90k46M85P9j34j06J68J0p9lJ09k22k2j3MP2R7o8K08
$$ -76 108 -201 119 -184 149 -141 -387 98 177 43 -63 105 115 36 33 142 -80 -102 -115 -111 -39 58 -10 198
7096A98p1k25R0J33k91R4J66r4K3j13L2J87l15K30j58L73j54p5K00kl08j06j72
$$ 198 127 -98 -8 125 -166 -72 94 0 23 -90 -58 129 -186 44 -114 259 105 30 230 228 -80 -186 -358
7119c58N25k47N9L46k58m13M36j47J42l4j87J87j6k2J02k82N6K72n5N5j85K1J20
$$ -358 167 -80 -21 325 67 -346 90 -57 85 51 -136 51 35 13 115 -167 -111 161 106 161 -24 -3 117
7142A17j63m6K51l43R9L55k61R2J41m20L53j25K05l49OJ59J3K3l9j79K80n7l27
$$ 117 -46 -92 159 -184 -85 270 9 101 242 -178 175 50 255 -94 -88 71 84 107 68 -111 169 112 -215
7165b15K89J0q2J48l95K78J4n9j9j07R3M4M8j58N34n98K37l6q3M6o4J4J16J9j36
$$ -215 74 84 2 150 -245 33 47 -12 -31 -138 -45 -1 47 -111 423 -175 62 26 -57 -11 -75 -61 55 74 -62
7190f2K70k88M70l21j54J63o1k72L08q8K9K2l48M85m32J82K68r9n8o2J71k82p7
$$ -62 208 -80 390 69 -85 78 17 -255 53 -35 -6 16 -332 153 -279 -97 171 72 14 -48 123 -159 -236
7213b36K12k31L28m8J4l58L43q8%K62l96M91m04J05j54rJ97Q9lj79O4j68R2J49
$$ -236 -24 -255 73 25 39 -319 24 -64 -64 198 -198 293 -111 -6 -160 -169 28 117 114 -65 -1 -169 -77 72
7237G2j7O5j12M2j16j6R7K0o0P7k53L99j14j22l4j55K09J11j53JJ59l19K24QO
$$ 72 55 120 8 50 -66 -82 15 35 -25 52 -201 198 84 -38 -72 -227 -18 93 -60 -59 100 -219 5 13 19
7262A9J72k34J08j1l24M30j03j42K56k37J46p9j82M63j92j39L24l83J01K00l38
$$ 19 191 -43 65 54 -270 160 57 -85 171 -66 80 1 -181 282 90 -49 275 -108 -7 193 -145
7283a45J15L1J22N9j89rR5l25L74l04K06P3k94J66R5j68k05L52m3J87j63Q9J66
$$ -145 -30 1 123 182 -7 -16 79 -246 128 -176 30 103 -191 -25 70 -98 -303 49 6 193 30 119 285
7306B85l51K44j41O7J57k45k2n2k1oK04j08j46K2L7P9J63l77P0J73p2J74m16M09
$$ 285 -66 178 37 104 261 16 -6 -58 -79 -85 119 11 -135 -113 -76 3 166 -211 -141 32 -40 134 -282 127
7330A27k08L29j81k5M9o4p4J33J30j00k5l73J36J77j27K17r4k16K73q7PJ28k9
$$ 127 -81 248 67 42 91 27 -47 86 216 116 91 -282 -146 31 -96 121 27 -189 84 -3 4 132 103
7353A03K26k23l11R0J72k32J50k9L8J60lj6j92L84k06p1J96j10l50K95j33J0K07
$$ 103 329 106 -205 -115 57 -175 -25 -54 -16 144 141 125 -67 317 111 40 236 126 -224 71 -62 -52 155
7376A55j18k7r6J24m7O6k49K81k78N8K80k93K38R7j27J05j84M18k58k24J10l9
$$ 155 37 10 -86 38 -9 57 -192 89 -189 -131 149 -144 94 191 64 169 -15 403 145 -79 31 -8
7398ho4J27K6j43J40j8LK7L16j50m19l6J44QJ40k15P2J54l04K50j22j10K07Nj0
$$ -8 -72 55 81 -62 78 60 63 90 406 256 -163 -199 -55 -47 93 -122 -50 104 -200 50 -72 -182 25 30 20
7423B0L5O2j68J93j79K87k89r0L70l14J45J0m4J37l10K78k67R0pK43m04K01n0
$$ 20 55 117 -51 142 -37 250 -39 -129 241 -73 72 82 38 175 -135 143 -124 -34 -41 202 -202 -1 -51
7446e1R4j2J23l35J32q0J18L12l20K38m64L49n4m7j78N72m49K37k49J9rJ30l2
$$ -51 43 31 154 -181 -49 -129 -11 301 -19 219 -245 104 50 3 -175 397 -52 185 -64 -45 -54 76 44
7469D4N2j86J06k9mP5L5j97K01p8K3p1M4J50m74L45q4J19J81j40j38J44j88J94
$$ 44 96 -90 16 -13 -17 58 93 -104 97 19 42 -29 15 165 -309 36 -48 71 252 112 -26 118 -70 124
7493A24O4k45K08p7k39Q0J46j52J80j02M7m9l3J44j35R9j89L22j42p2p9J89R8
$$ 124 188 -57 151 74 -165 -85 61 -91 89 -13 34 -15 -48 96 -39 60 -129 193 51 -21 -100 89 187
7516A87k59PP6j29J47l30K87K09n06O03m98L70j34j97M15k30j5k81K29R6J18k40
$$ 187 -72 -65 11 -118 29 -301 -14 195 -311 292 -206 164 30 -167 248 18 3 -278 -49 47 165 -75
7538g5K53k88L2J91j97J89m9M1J77l94K4K02l2k37m9J52J1R6j23J06k82o6L24
$$ -75 178 -110 -78 113 -84 105 56 97 274 -120 -96 106 74 -163 -212 -60 -49 47 -76 30 -252 -318 6
7561Fk6j26L97l04M2K03j95J94n12K12Q1J37j22p0Rj59L28J78j84j08o9Q9j72
$$ 6 -20 -146 251 -53 -11 192 -3 191 -321 -109 -28 109 -13 -83 -74 -233 95 273 89 -19 -88 1 -171
7584a71K48k96J76J41n1p5l5J53J5j50K7K8P1j05j1j5l25M61j33J87p8M0J19l19
$$ -171 77 -219 -43 98 47 -28 -63 90 105 -45 -18 10 81 -24 -35 -50 -375 86 -47 140 62 102 221 -98
7608i8K89j25pk1k24J91J00j23m9QkK11k96L97k09j00j22J29k58L83j60J81l7
$$ -98 191 66 59 38 -186 5 105 -18 -67 -59 -61 150 -146 251 42 -58 -180 -51 -309 74 -86 95 58
7631E8j42J52L2o3R8k30l4L11j45j99q6J19J8nK23k23P2O2K4j08J59k20j5J70
$$ 58 -84 68 100 37 135 -95 -129 182 37 -162 -248 -129 -111 -116 107 -116 -44 18 42 -66 93 -127 -142 28
7655B8r0J81k23K3K7pK6J88j06O5K4k27J66J54k96l1J79p9M6Rj82K80qOj58J74
$$ 28 -62 119 -104 -81 -54 -61 -35 153 47 112 136 -91 75 229 -67 -98 81 2 48 57 -125 155 147 153 -5 169
7681A69j39j40L22k63J1Q6j71K82j02j7J4Q5l21K76j59r3J48m8J79k53nP2J38
$$ 169 30 -110 212 -51 -40 46 -125 157 55 38 52 137 -184 92 -67 -160 -12 -60 119 -134 -139 -67 71
7704G1j92L81j98j56L12l90J65J57j27N5j40k48M29l89K35L05k31J19l61J00J89
$$ 71 -121 260 62 -94 218 -172 -7 150 23 78 -62 -310 119 -270 -35 270 39 158 -203 -103 86
7725H6k41L46q5j41j54K6J78J4j61R8Q2L1j24L2jK2p8J69r2j84K64j23j75K39
$$ 86 -155 191 106 -35 -189 -163 15 29 -132 -34 48 79 -45 -13 -14 8 -70 99 7 -177 87 -36 -211 28
7749B8j88J96O0k29O6J11p3k47L05J08j27j8J00j57Q8K0J8k50L59l27JR1J49P7
$$ 28 -160 36 96 -133 -67 44 -29 -276 29 137 10 -8 92 -65 23 43 61 -189 170 -157 -156 -65 84 161
7773A61m31K37L44m55J48J90m46M10l6j65j4J1K9J3R1J75k42j47J27k1O6k0J11
$$ 161 -270 -33 311 -144 4 194 -252 158 122 -43 -57 -46 -17 -4 87 262 20 -127 0 -21 45 25 136
7796A36o5J17k20O7k62L75l39J73%j14J02K6j4K07j51O8k55J51j80o0K58J81j2
$$ 136 71 188 -32 35 -227 148 -191 -18 -18 -132 -30 -4 -18 189 38 106 -149 2 -178 -238 20 201 189
7819A89k57L93o9o2q6j30O6Oj0M9o9NJ08k21J27j74j18L15m0l8R3l08K08r5p0
$$ 189 -68 325 256 194 108 -22 44 50 40 89 20 25 133 -88 39 -135 -253 62 22 -16 77 -231 -23 -118 -188
7844a88J23R2p7K11k5k25L90j83O8k91J08j50K64j92J82j47K91k02k4o8j11K84
$$ -188 -65 27 -50 161 136 -89 301 118 186 -105 3 -147 117 -75 107 -40 251 49 25 -43 -154 130
7866A30q4o2qL4J7O8r7N0l1M5O7p0p0n7Q0j64J84j38R1J33k58Q6J79r7O6q0n7
$$ 130 46 -16 -24 10 27 95 -2 48 17 62 129 59 -11 -68 12 -152 32 -106 -15 118 -140 -54 125 28 94 14 -43
7893d3l7q1L63k64j4r1L9L34Q3m44K24k13j17L44m0j1p5mk51J81R9O0j51K79q3
$$ -43 -80 -161 202 -62 -76 -167 -128 206 289 -155 69 -144 -261 83 43 32 -43 -47 -298 -117 -18 42 -109 170 87
7918H7pq2J28l29K69k34J30J83k71J75r2K20n9r8j44K95j61J9k3j58K31R7k24
$$ 87 80 -2 126 -203 66 -168 -38 145 -126 49 -43 177 118 20 -124 171 10 29 6 -152 79 176 -48
7941d8J21k17p0L78q9l4j3J80j84l0l1j7L4J41p5Jj36J84l33M43k04Q0Rj39J25
$$ -48 73 -144 -214 164 75 41 28 208 24 -6 -37 -54 -20 121 46 47 -89 95 -238 205 1 81 90 -49 76
7966G6m6p0o4Q2o1J90j53J87l19J61N2k24P9J68k29L85k49kK60M8m06J29j43O
$$ 76 30 -40 -104 -22 -83 107 -46 141 -178 -17 35 -189 -110 58 -171 214 -35 -37 223 271 -135 -6 -149 -143
7990a43J54J03q1J45j69N6J64k82L32k70N6r4n8K74j44j85J35K51k81J12j55K46
$$ -143 11 114 33 178 9 65 229 -53 279 9 65 -29 -87 187 43 -142 -7 244 -37 75 -80 166
8012A66k63K36N0k53P0J43o8K9p2o1J40j15J66k8m06L50K5k20M06j15j11r1K08
$$ 166 -97 139 189 -64 6 149 81 110 38 -23 117 2 168 140 -266 84 109 -111 295 180 69 -22 186
8035A86o4j05J39k5k85j66L63k9J37l02J0K53l0J01Rj65p6M4J95r1K1k13J9j49
$$ 186 122 17 156 131 -154 -320 43 14 151 -151 -141 112 82 183 192 27 -49 -5 190 99 120 -93 -74 -223
8059b23L07k05p7K65j07Lk6k0J86j5j42J91j15k24O8M01l99L65m71K28k12L53
$$ -223 84 -121 -198 67 -40 -37 -63 -83 103 88 -54 137 22 -202 -134 267 -132 233 -238 -10 -222 131
8081A31j5j87K04j69j53J39L33k51n0j26K6J65l35J71o1p6J80r7L23q2j92K73
$$ 131 116 -71 133 -36 -189 -50 283 32 -18 -144 -118 47 -288 -117 -178 -254 -74 -171 152 70 -122 151
8103A51k07R9J01j90q8j2J34ROj7J30j85l7O0j26K56k4j13R3j00J51k05j21P9
$$ 151 -56 43 144 -46 -134 -146 -12 -3 3 -14 116 -69 -106 -46 -172 84 60 -53 40 -60 91 -114 -235 -156
8127a56L06k57J98Q0j41K54m79J04K01j84Q4Q2K4l63L94r2L5j85Q8Q5j35J86k68
$$ -156 150 -107 91 171 30 284 -195 -91 110 -74 10 92 116 -247 147 55 90 -95 -7 78 -57 129 -139
8150a39L9L86l37l5p6J37J69k35J46Q1j18L20k44M4J30k87Q6j4K12j36j90P1J18
$$ -139 -100 286 -51 -86 -162 -25 144 -91 55 136 18 338 94 138 268 -19 67 53 265 129 -61 10 128
8173A28k32j3J31Q4j89K99l48O6R7R9k02J77l5J29L3k04k22P7
$$ 128 -104 -117 14 98 -91 208 -140 -74 23 122 -80 97 62 191 224 20 -202 -125
8191a25
$$ Imaginary data points
##PAGE= N=2
##DATA TABLE= (X++(I..I)), XYDATA
0@%%%%Qj6J6j6K4l2M0n6O5p5R8j21J45j71K00k38K82l29L79m37N03n76O60p53
$$ 0 0 0 0 0 8 -8 8 -8 16 -16 24 -32 33 -42 56 -65 80 -91 109 -129 153 -176 203 -234 269 -307 353 -400
28d00Q52r61J084j222J371j531J708j906K123k359K619k901L211l556L937m361
$$ -400 452 -509 575 -647 724 -807 901 -1005 1118 -1241 1378 -1523 1688 -1868 2069 -2292
44b292M828n352N947o619P387q278R326j0576J2101j4007J6466j9779K4509l1849
$$ -2292 2536 -2816 3131 -3488 3899 -4379 4947 -5629 6472 -7535 8931 -10848 13661 -18188
58a8188M4840p4444K51924M9275m66291L09314P5747k16232K4802j9682j74862
$$ -18188 26652 -47792 204132 253407 -212884 96430 172177 -44055 -19253 -38935 -213797
69b13797J90691N9221k66520J43771L30117l04873r1417M39343q2451l05003J62720
$$ -213797 -23106 36115 -230405 -86634 243483 -61390 -152807 286536 204085 -100918 61802
80F1802j514q5935J16333j93044j94411L29917R6950l53504P6114L38441j54324
$$ 61802 60288 -25647 90686 -102358 -296769 33148 130098 -223406 -147292 191149 36825
91C6825r7455K31865q5034r3837J40876j67494n6335K39672k14562k46821L28002
$$ 36825 -60630 171235 86201 -7636 133240 -34254 -90589 149083 -65479 -312300 15702
102A5702J29770l00235J8047K31082l9990N623O2794j77587O9604K16651k81753
$$ 15702 145472 -154763 -136716 94366 54376 59999 122793 -54794 14810 231461 -50292
113e0292j25003L01211j29243k35055K27714Q0967j70762N5168P6792m1015J31886
$$ -50292 -175295 125916 -3327 -238382 -10668 70299 -100463 -45295 31497 -9518 122368
124A22368J9629k70757J06539K88343k75190j90632K56591m1380j39849J29975
$$ 122368 141997 -128760 -22221 266122 -9068 -199700 56891 15511 -124338 5637
134E637m1312o6011J64826k4477j24897J80479O9474k66324N2182K57869j88427
$$ 5637 -35675 -101686 63140 38663 -86234 94245 163719 -102605 -50423 207446 19019
145A9019j63527J56809l2802k6019J01183j52841l4768K52160m2744j87913J40246
$$ 19019 -144508 12301 -20501 -46520 54663 -98178 -132946 119214 76470 -111443 28803
156B8803J08193j67023N734J33487j16272n3898Q6524r2741L0832J26981j85668
$$ 28803 136996 -30027 -24293 109194 -7078 -60976 25548 -67193 -36361 90620 -95048
167i5048m7429K55724k4039j73822P7233Q0956n6495J7478K869j02627N9404P8845
$$ -95048 -142477 113247 89208 -84614 -7381 73575 17080 34558 37427 -65200 -5796 73049
179G3049j55149J7360J52692j43569n2849J90207k8073j02919N7226R786p117
$$ 73049 -82100 -64740 87952 -55617 -108466 81741 53668 -49251 7975 17761 10644
190A0644O6201o1555j21408J13131J00206j69253k3050J40908p7741k6695J08680
$$ 10644 76845 15290 -106118 7013 107219 -62034 -85084 55824 -21917 -48612 60068
201F0068o7558k9067Q7763n2211k3572R7179n1888j17763R8857R5767j31788l6980
$$ 60068 -7490 -36557 51206 -1005 -24577 72602 20714 -97049 1808 97575 -34213 -71193
213g1193R7501l8178J0247N6207j06740Q490J21634p0974n5426Q4408j6618p0305
$$ -71193 26308 -11870 -1623 54584 -52156 -43666 77968 6994 -48432 35976 19358 -50947
225e0947N8180M9494p8576j2559N3757l3950K7064L5720j12520J6661J21354o1831
$$ -50947 7233 56727 -21849 -34408 19349 -14601 12463 48183 -64337 -47676 73678 11847
237A1847o0105N2647J566j0955L1272j0216m1649K6493K9488m7692J8631L0506
$$ 11847 -48258 4389 5955 -5000 26272 16056 -25593 900 30388 -17304 1327 31833
249C1833q5690J7153R0106n4643l6267L6597n554K4742K5545n0529k4459N3965
$$ 31833 -53857 -36704 53402 -1241 -37508 -911 -6465 18277 43822 -6707 -31166 22799
261B2799J8640n8273J43K7866m8304K0263N0057n7981l627M4051k2010K4467K6869
$$ 22799 41439 -16834 -16691 11175 -37129 -16866 33191 -24790 -28417 15634 -6376 18091 44960
274D4960n5889j3980N5131Q736n5255j1787K4754j9502J9398K1865n9282J6884
$$ 44960 -10929 -24909 30222 38958 -16297 -28084 -3330 -22832 -3434 18431 -40851 -23967
286b3967N7092k9434N642K1935l8234M42L6212o381m1065j1543K2995m463Q464
$$ -23967 33125 3691 9333 31268 -6966 -6524 29688 23307 -17758 -29301 -6306 -10769 -2305
299b305P685m5330K3045N6801k7852j0236J2593j7235J6052J2703k3489k1640
$$ -2305 5380 -39950 -16905 39896 12044 1808 14401 -2834 13218 25921 2432 -19208
311a9208l382K0118J139p697J391k0508K3431M1082k7327j1999R013m881K3928
$$ -19208 -22590 -2472 -1333 -9030 -7639 -28147 -4716 36366 9039 -2960 6053 1172 25100
324B5100n351l4850k106P293J2056j92j8778N25J967K1389K0533k9647m347J6100
$$ 25100 19749 -15101 -17207 -9914 2142 1950 -16828 -16303 -14336 7053 27586 -2061 -6408 9692
338I692l526J9056j2761l6234J3496J3594k14o141j8603N507J3210J4178N970
$$ 9692 6166 25222 12461 -23773 -10277 3317 3103 -3038 -21641 -16134 -2924 11254 17224
351A7224k9519M520K6811p530N298j1629k7413K0737J3469j2262j0902j2752J4669
$$ 17224 -12295 -7775 19036 11506 16804 5175 -22238 -1501 11968 -294 -11196 -23948 -9279
364i279J5229p18J367k0432Q188L2669j2319r426n315j3805K1078N567k0094r445
$$ -9279 5950 5232 6599 -13833 -5645 27024 14705 5279 -36 -13841 7237 12804 -7290 -16735
378a6735n518K0998J2899j6149P46l821R086K7479j5740j7246K011j410J6638
$$ -16735 -22253 -1255 11644 -4505 -3759 -7580 1506 28985 13245 -4001 -1990 -3400 13238
391A3238o352k4218J069P61J8021J0450k5059K005J2818P856J3887j8783j3847
$$ 13238 6886 -17332 -16263 -15502 2519 12969 -12090 -10085 2733 10589 24476 5693 -8154
404h154R430K347R460j4114k4097J4557P225M826O255k1588L731K1686N136r56
$$ -8154 1276 3623 13083 -1031 -25128 -10571 -3346 1480 7735 -13853 -10122 11564 16700 15744
418A5744j9375m455J6432l084J846j3563k1243K4859J1359j1390K261r501N920
$$ 15744 -3631 -8086 8346 5262 7108 -6455 -27698 -2839 8520 -2870 -609 -10110 -4190
431d190K0196j162q112j6640M388K0275j1207n861o035j4403K7589J0651k3664
$$ -4190 16006 14844 6732 -9908 -5520 14755 3548 -2313 -8348 -22751 4838 15489 -8175
444h175P49K940Q307J3089j0176r804n957Q042J7361j6790r322K933o612K3359
$$ -8175 -7426 -4486 3821 16910 6734 -3070 -9027 -985 16376 -414 -9736 -6803 -13415 9944
458I944M836k8006M523R850P021Q161j9498q778J0412Q233M641j8009n349J0741
$$ 9944 14780 -13226 -8703 1147 8168 16329 -3169 -11947 -1535 6698 11339 -6670 -12019 -1278
472a278k127J4770l815k4788J4683R166k826R552k0144j0848K3109Q680j0966
$$ -1278 -3405 11365 7550 -17238 -2555 6611 3785 13337 -6807 -17655 5454 14134 3168
485C168j6167M097J3723k063O978j1124j8950K8903M512k0518J4352r098j5221
$$ 3168 -12999 -8902 4821 2758 9736 -1388 -20338 8565 13077 -7441 6911 -2187 -17408
498a7408K6275P348k0959j0245J1267J1786l633L045j6063j2826M0463M38l8039
$$ -17408 8867 16215 -4744 -14989 -3722 8064 4431 7476 -8587 -21413 19050 19488 -18551
511a8551J7679O331j5181J9359j04k1517K376J2455J403l713N272j4530j0558
$$ -18551 -872 5459 -9722 9637 9533 -11984 -9608 2847 4250 537 5809 -8721 -19279
524a9279M2455r45m5163J6988J5189j0693J3396j4621j9406K3030J1316j6252
$$ -19279 23176 22231 -22932 -5944 9245 -1448 11948 -2673 -22079 951 12267 -3985
536c985l485J3212p412r895L0965k714l5165J7112P503q048J8273k6197k3416
$$ -3985 -7470 5742 -1670 -11565 19400 16686 -18479 -1367 6136 -1912 16361 -9836 -33252
549c3252M2485J1727l2469l548K0460J597n161J2146j2285j3606K6045j2002j7426
$$ -33252 9233 20960 -11509 -15057 5403 7000 1839 13985 1700 -11906 14139 2137 -15289
562a5289L2838k3592l2293M8061J3556l7583M74J8101M593O396j636k8931M067
$$ -15289 17549 -6043 -38336 9725 23281 -14302 -13828 4273 8866 15262 13626 -15305 -11238
575a1238M2987k9010l6026M3051o459l4268L7722O899k8346J4305O894o163K0747
$$ -11238 31749 2739 -33287 9764 3305 -30963 6759 13658 -14688 -383 6511 348 21095
588B1095j943m3244Q313N4003l0302m9834L8518J0500k1336K3301j2967j5574
$$ 21095 19152 -24092 -15779 38224 7922 -41912 -3394 7106 -14230 9071 -3896 -19470
600a9470M0136n313k8793K7435J0540m1847j89M4783k0000m0066K3512P840j429
$$ -19470 20666 15353 -13440 13995 24535 -17312 -17501 27282 7282 -32784 -9272 -1432 -2861
613b861K2987l6288j3966O5581p412n0385K2496K1038k4723m087J5266j3673p538
$$ -2861 20126 -16162 -30128 35453 28041 -22344 152 21190 -3533 -7620 7646 -6027 -13565
626a3565J5720j7303P804L9404m5160k4637P2658j339n3883J3213J5951n227P901
$$ -13565 2155 -15148 -7344 32060 -13100 -37737 34921 33582 -20301 -7088 8863 3636 11537
639A1537j5532k5124K8558K5317m5505l530N6515l1472l2802N5994j139l5587
$$ 11537 -3995 -29119 -561 24756 -20749 -24279 32236 764 -32038 23956 22817 -12770
651a2770J5812o724r33L3103k8862m5427M4508M2468n4624k3449N3837o078k3253
$$ -12770 3042 -3682 -4615 28488 -374 -45801 -1293 41175 -13449 -36898 16939 10861 -12392
664a2392K7971j6718q928L5339k9717j7970N1227j6460n4394L3357M4037l7964
$$ -12392 15579 -1139 -10067 25272 -4445 -22415 28812 12352 -42042 -8685 35352 -2612
676b612k7424K9778N466K728J1706m2388M910O2176l6978m2073M8637L644l9195
$$ -2612 -30036 -258 5208 7936 19642 -22746 -17836 44340 7362 -34711 13926 17570 -21625
689b1625J4168J8627j4566m007L760r085K5633J8411n8245k14P3390k7111n0817
$$ -21625 -7457 11170 -3396 -7403 -3643 -12728 12905 31316 -26929 -27143 46247 19136 -31681
702c1681L0792Q533r914R944k0326p758L4864l489l7262K7264L5792n0834j2764
$$ -31681 -889 7644 -2270 7674 -12652 -20410 14454 10965 -26297 967 36759 -14075 -26839
715b6839N9608j5791l4749J6743r114J0669K6874m6596k1258O1635Q008n4179
$$ -26839 32769 16978 -17771 -1028 -10142 527 27401 -19195 -40453 21182 29190 -24989
727b4989J0034M1425k4088j3445K7294j7826l932K0157l4330O752M8043m3758
$$ -24989 -14955 26470 2382 -11063 16231 -1595 -5527 14630 -19700 -12948 35095 -8663
739h663l5534N7598J9304m4577n967K5246n88L315p48l2793J8497L8070m7603
$$ -8663 -44197 13401 32705 -11872 -17839 7407 6819 10134 9386 -23407 -4910 33160 -14443
752a4443j3050N2835k1377l1815L3437J0129j7750j752k117K886K3751p639m6034
$$ -14443 -27493 25342 3965 -27850 5587 15716 -2034 -3786 -5903 -3017 20734 13095 -32939
765c2939K1473N0226m0000k7700L7646l702r344J3082j7093K005K1914j9972j2602
$$ -32939 -11466 38760 -1240 -28940 8706 5004 -4340 8742 -8351 -6346 15568 -4404 -17006
778a7006L2784K280m3930J1712M4382k4416k3073J7474n180J3332J1755m3341
$$ -17006 15778 18058 -25872 -14160 30222 5806 -17267 207 -4973 8359 20114 -23227
790b3227L419M6121j9898k9475K5116J2890k4505L530K0735j4648k632Q951k1305
$$ -23227 -19808 26313 6415 -23060 2056 14946 -9559 -6029 14706 58 -2574 6377 -14928
803a4928J9558K3293n0286n866N1381r935l0464J0644J0864j205N474m303j6581
$$ -14928 4630 27923 -22363 -28229 23152 13217 -17247 -6603 4261 3056 8530 4227 -12354
816a2354J7024J3562l4015Q000L0471l4639j1200L5856m763j5346L609j852J0649
$$ -12354 4670 18232 -15783 -7783 22688 -11951 -23151 12705 7942 -7404 -3795 -5647 5002
829E002J4294j7446k1857K3245K1173l2580p791K4954j3691l604J5295j2880L300
$$ 5002 19296 1850 -20007 3238 24411 -8169 -15960 8994 -4697 -8301 6994 -5886 -2586
842b586J0114j5295P528J9346j6090k0643J8163J9434k1682j1923J2103k898R160
$$ -2586 7528 -7767 -239 19107 3017 -17626 537 19971 -1711 -13634 -1531 -4429 4731
855D731L728k6264J2434K2914k0753k609J7107r000j0273J0304P508j1451l986
$$ 4731 8459 -17805 -5371 17543 -3210 -5819 11288 2288 -7985 2319 9827 -1624 -5610
868e610L229n871J5832M121l2478J1289K9370j8265q791J0367m141K476O194p092
$$ -5610 -2381 -8252 7580 11701 -20777 -9488 19882 1617 -7174 3193 -948 1528 7722 630
882F30o683P298K326j2308J0285Q694k5776N599K4987j3345o620N354m211J0455
$$ 630 -6053 1245 3571 -8737 1548 10242 -15534 -9935 15052 1707 -4913 441 -3770 6685
896F685N191j5135n689J2112N749j4354p82R722j1974L204J3948j1789J89O001
$$ 6685 11876 -3259 -8948 3164 8913 -5441 -6223 3499 -8475 -5271 8677 -3112 -2923 3078
910C078o445J1027M439j6015l191J0373N472j1016p581O383n52M782L702j3124
$$ 3078 -3367 7660 12099 -3916 -7107 3266 8738 -2278 -9859 -3476 -4028 754 4456 -8668
924h668P067J0173q945O318K763j2770K077O041q80n635o435K452L519O219o01
$$ -8668 -1601 8572 -373 5945 8708 -4062 -1985 4056 3176 -2459 -8894 -6442 -2923 3296 2695
939B695j3589J0030J3911j1282J991J403r541P382K577q838k070q54K033K207
$$ 2695 -10894 -864 13047 1765 3756 5159 -4382 3000 5577 -3261 -5331 -6185 -4152 -1945
953a945L442L51j0832R262J3719j1364j554J834o411Q463K32j2169j34L317L571
$$ -1945 1497 1848 -8984 278 13997 2633 1079 2913 -3498 4965 5197 -6972 -7106 -3789 -218
968b18o54j724K945l962N619J0146j0630k789L984m398O612k159j1229K385M144
$$ -218 -872 -2596 349 -3613 2006 12152 1522 -1267 2717 -1681 4931 2772 -8457 -6072 -1928
983a928L349r68o246M432K942J878M593q699j469O047k943K762l895q995P053
$$ -1928 1421 453 -5793 -1361 1581 3459 8052 -647 -2116 3931 988 3750 -145 -9140 -2087
998b087K576l82K24o832M334O794o52l63o078J190O933l789k54l284o327R248
$$ -2087 489 107 331 -6501 -2167 4627 3975 3612 -2466 -1276 5657 1868 1614 -1670 -7997 1251
1014A251J332n694J596l698L949O825l013j873l260L208P130o583j999k92n052
$$ 1251 2583 -3111 -1515 -5213 -1264 5561 2548 675 -2585 623 7753 1170 -829 -1121 -6173
1029f173R001M49r220K377O94L371M574m983n59k28L346O069q867l449M058l331
$$ -6173 2828 3277 -5943 -3566 -2872 499 5073 90 -469 -697 2649 8718 -149 -3598 460 -2871
1045b871M841p38q904L789L461K470K055o472J861L230M65L903q521m084O966
$$ -2871 1970 1232 -7672 -3883 -422 2048 4103 -2369 -508 2722 3187 7090 -1431 -5515 1451
1060A451j706O21k033o267O170L413p3J279o172L566N978l199J99n165k889O895
$$ 1451 -255 366 -1667 -7934 -1764 1649 1576 2855 -3317 249 6227 3028 3227 -1938 -4827 2068
1076B068j455k076k150l778Q987K139m118K329l841K887O502n886k769j140l74
$$ 2068 613 -1463 -3613 -7391 1596 3735 -383 1946 -1895 992 7494 1608 -1161 -2301 -2675
1091b675N134l266k080n50k332R962R91p987L496O3Q59N330p289l864K175J684
$$ -2675 2459 -807 -2887 -3437 -5769 4193 5184 -2803 693 756 1615 6945 -344 -4208 -2033 -349
1107c49L167n814j060L462j985P004N58r409M926K362j263L017o791k973M731
$$ -349 2818 -2996 -4056 -594 -2579 4425 4983 -4426 500 2862 1599 4616 -2175 -5148 -417
1122d17J734J061o332j054P275j393J854j98p548O327K745l942J794n174j155
$$ -417 1317 2378 -3954 -5008 2267 874 2728 2530 -5018 1309 4054 112 1906 -3268 -4423
1137d423O271l90o62l856j390Q133l23k084k262l748Q232Q05p272K903k186n27
$$ -4423 1848 1458 796 -3060 -4450 3683 3360 1276 -986 -4734 3498 4303 -2969 -66 -2252 -2779
1153b779O859l958k050J288j354M085J062k677k968j954R622n92r720M201k17
$$ -2779 4080 122 -1928 -640 -1994 2091 3153 476 -2492 -4446 5176 4584 -5136 -935 -1152
1168a152J68P242p970l821P386o57p90m02k34j262j900P863m17r737N381R39q35
$$ -1152 -984 6258 -1712 -5533 1853 1196 406 4 -230 -1492 -3392 4471 4054 -5683 -302 637 -198
1185a98P123r257o041J1147J681n301k330J432L336j618K554q76n896O632m08
$$ -198 6925 -2332 -8373 2774 4455 -846 -3176 -1744 1592 -26 2528 1652 -4244 2388 1980
1200A980m340P357o793o440J0943J493n396k715K41O675J568l489l327p23Q671
$$ 1980 -2360 4997 -1796 -8236 2707 4200 -1196 -3911 -3670 3005 4573 1084 -2243 -2966 5705
1215E705k910p998P173k584m923Q014j748k534J842l088M518N478n291o273J785
$$ 5705 2795 -5203 1970 -614 -5537 2477 729 -1805 37 -3051 1467 6945 1654 -4619 -2834
1230b834J0243l990j0721N961N81p80N826q029j178J0730n558k564P711k725o664
$$ -2834 7409 3419 -7302 -1341 -760 -1540 4286 -3743 -4921 5809 251 -2313 5398 2673 -3991
1245c991J194Q261k365r394L531Q30K050P161j2927k816J7575l989r278N325R96
$$ -3991 -2797 5464 3099 -6295 -2764 -1934 116 7277 -5650 -8466 9109 5120 -4158 1167 2163
1260B163k414l76J757j259l358L215l137K074R991j2372o435J8205m91j0744Q37
$$ 2163 -251 -627 1130 -129 -3487 -272 -3409 -1335 8656 -3716 -10151 8054 7563 -3181 -2344
1275b344R21M326J363o707k735M322N440p040k709J1556o185p277J2028q93m937
$$ -2344 -1423 2903 4266 -2441 -5176 -854 4586 -2454 -5163 6393 208 -7069 4959 4066 -871
1290h71R77m917O246P045j0929o545Q933Q083p969p448Q556R53l191M113n837
$$ -871 106 -4811 1435 8480 -2449 -8994 -61 8022 53 -7395 1161 2114 -1077 3036 -2801
1305b801J668P293j0716J699J2176r048r123P982P539m901p909K906L219L961
$$ -2801 -1133 6160 -4556 -2857 9319 271 -8852 -870 6669 1768 -6141 -3235 -16 3945
1319C945J273j3517L748J6719j1947p097J2198l127n846L333J119k61j981k068
$$ 3945 5218 -8299 -4551 12168 221 -6876 5322 2195 -3651 -318 801 540 -1441 -3509
1333c509m81P826M259j6155J06K0737p451j1656O380K0J681J322q367J035P179
$$ -3509 -3990 3836 8095 -8060 -7954 12783 5332 -6324 56 76 1757 3079 -5288 -4253 2926
1348B926k321o351N200R037j0928m987J5304j894q063J185l972P691M952j5468
$$ 2926 605 -5746 -546 8491 -2437 -7424 7880 5986 -2077 -892 -4864 2827 7779 -7689
1362g689j927J3635J288q706j201Q731j032m708M510k365N25J923j0627O449J0915
$$ -7689 -9616 4019 5307 -3399 -4600 4131 3099 -1609 2901 536 1061 2984 -7643 -1194 9721
1377I721j5100n414J3229L605n496m880K986N198J739l840q482O593R099j4864
$$ 9721 -5379 -10793 2436 6041 545 -4335 -1349 3849 5588 1748 -6734 -141 8958 -5906
1391e906n11J3172q813m039P628P47L21k331m498M774P517m296j3720O082J4738
$$ -5906 -6417 6755 -2058 -6097 1531 2278 2599 268 -4230 544 8061 3765 -9955 -3873 10865
1406A0865j1509o911Q975k207R53L044p232M155N335p729j164Q503J15j1988Q82
$$ 10865 -644 -7555 1420 -787 166 3210 -4022 133 5468 -2261 -3425 5078 5193 -6795 -5913
1421e913J3512m865p919L692j203O692K454j3857L222J1628n889n522L307L622
$$ -5913 7599 2734 -5185 -1493 -2696 3996 6450 -7407 -4185 7443 1554 -3968 -661 2961
1435B961l616k893N807m85k225L14m692Q148N114j5566M98J2441k483m958j851
$$ 2961 -655 -3548 2259 1774 -451 -137 -4829 3319 8433 -7133 -6635 5806 3323 -1635 -3486
1450c486J799N279j076m003j479N218J786r412M432P709j1193r34Q685k216j22
$$ -3486 -1687 3592 2516 -1487 -2966 2252 4038 -5374 -942 6767 -4426 -5360 3325 1109 987
1465I87k564l498Q342L708q122n051P321N941r806j656P447n535J174L876n760
$$ 987 -1577 -5075 3267 6975 -1147 -6198 1123 7064 -2742 -4398 3049 -2486 -1312 2564 -3196
1480c196M597J445p693N750N968o243o478M621P542n985n167L848p33M073J435
$$ -3196 1401 2846 -4847 903 6871 628 -5850 -1229 6313 328 -4839 -991 -1724 2349 3784
1495C784r892N577O590p663O46L690k312k504K74M676j799l768Q07j51N358J300
$$ 3784 -6108 -531 6059 -1604 -958 2732 420 -2084 -1810 2866 1067 -2701 -1894 -2045 3313 4613
1511D613j0470L265Q883n488j474k77n48L560j826j752J404l99K10j808M107J980
$$ 4613 -5857 -2592 6291 803 -671 -948 -1496 2064 238 -1514 -110 -509 -299 -2107 2000 3980
1527C980q684K501O914l867l38k076k326P756p81o683R79L512J449l355K8L103
$$ 3980 -4704 -2203 4711 844 506 -1570 -3896 3860 3079 -3604 -2625 887 2336 -1019 -991 2112
1543B112m567J964L828m691J958m38m295P130J043p097J23L648K266k821k862
$$ 2112 -2455 -491 3337 -1354 604 166 -4129 3001 4044 -3053 -2930 718 2984 163 -2699
1558b699K488q68K455J502o383L352L350n686L752J580n065O40J957J575j436
$$ -2699 -211 -1079 1376 2878 -3505 -153 3197 -2489 1263 2843 -2222 -1582 375 1950 514
1573E14l745K057J125J791P38o505L000N462m345K31J59k723L206p85r71Q83k635
$$ 514 -3231 -1174 -49 1742 2480 -4025 -1025 4437 92 323 482 -2241 965 180 -791 92 -2543
1590b543J635J696J95Q74m484J951N079l218r25j404j843N412j898l775K586q61
$$ -2543 -908 788 983 1857 -2627 -676 4403 1185 260 -1144 -2987 2425 527 -3248 -662 -1523
1606a523J579J384j350R98j790J481K881l695k73o59k395N417j188n317L429J036
$$ -1523 56 1440 90 1088 -702 779 3660 -35 -308 -967 -3362 2055 867 -4450 -1021 15
1622A5J258P11k293Q61J46J107J252m834M12J380k895L766m76m836L549K195j68
$$ 15 1273 1984 -309 552 698 1805 3057 -1777 -1365 15 -2880 886 410 -4426 -877 1318 1150
1639A150N62k775J489J578m70L28m529M56L707k746P86M2k953M073J018p76L92
$$ 1150 1712 -1063 426 2004 1534 1862 -2667 -2211 1496 -1250 -464 -422 -3375 698 1716 940 1332
1656A332k610K169K026k836O18l072L48L924k694p87N33j146M113l50k182J638
$$ 1332 -1278 891 2917 81 699 -2373 -2025 1899 -795 -1582 -1049 -2195 1918 1568 -614 1024
1672A024j945J932K053l759lq0l10L305l118r88J244j005M092j219l628L421o85
$$ 1024 -921 1011 3064 -695 -698 -778 -1088 2217 -901 -1889 -645 -1650 2442 1223 -2405 1016 331
1689C31M53K130m296L1J498j19J475l044m92J963j300L104q37m245M224N93q66
$$ 331 784 2914 -1382 -1351 147 28 1503 -1541 -2033 -70 -1370 1734 897 -3348 876 1469 603
1706F03J623l265L07K197r12L48l038l80L577k011J019q1k899M335J303k369J167
$$ 603 2226 -1039 -732 1465 553 901 -2137 -2517 1060 -951 68 -13 -2912 1423 2726 357 1524
1723A524k156J096J475k113N4k032p86M460k530n57J397j491L674J058k775O58
$$ 1524 -632 464 1939 -174 -120 -2152 -2938 1522 -1008 -1565 -168 -1659 2015 3073 298 956
1739I56q20R55J427l860j32l00n53L193j989j109K408o57L096K11l414K235j044
$$ 956 136 1091 2518 -1342 -1474 -1774 -2327 866 -1123 -2232 176 -481 2615 2826 -588 1647 603
1756F03J62K061n171o75K219r06J819j295j221K934J78J956m65l216L118p20j755
$$ 603 765 2826 -2345 -3020 -801 -1707 112 -1183 -2404 530 708 2664 2199 -1017 2101 1381 -374
1773c74J844l794j093L448q81L90j045m23L727l29N11n06l072L934K17l876J419
$$ -374 1470 -2324 -3417 31 -850 -460 -1505 -1928 1799 1470 1981 1475 -1597 2337 2554 -1322 97
1790I7j911n29L009j673J04m59R5L736j181j62O1k503L338O57m489J020m95J83
$$ 97 -1814 -2343 666 -1007 -903 -1362 -1267 2469 1288 1126 1187 -1316 2022 2679 -1810 -790 -1285 -1102
1808a102K516l242q9J952q72K934j223j108J379j552J974O29l798J015l45M69
$$ -1102 1414 -1828 -1917 35 -837 2097 874 -234 1145 -407 1567 2196 -1602 -587 -932 -463
1824d63K289m176m61L562p75Q91m94j580K797p28M55k79k245J793j072q00K733
$$ -463 1826 -2350 -2811 751 -24 867 373 -1207 1590 862 1317 1038 -1207 586 -486 -1286 1447
1841A447l739j251M675r19k68J59j583L135P65j235j315j320L279j071l090K837
$$ 1447 -2292 -3543 1132 213 -55 104 -1479 1656 2421 1186 -129 -1449 1830 759 -2331 506
1857E06j976j256L600j064k37J019j367K565J130k035j022j345L702l24m918J661
$$ 506 -1470 -2726 874 -190 -427 592 -775 1790 2920 885 -137 -1482 2220 1896 -3022 -1361
1873a361M66q51K775k355j35L114j911J523J317j900k75j538K117Q38m316K73
$$ -1361 -895 -1746 1029 -1326 -1461 1653 -258 1265 2582 682 407 -1131 986 1824 -2492 -2219
1889b219J166P57K299m184J48M804j643m50N17j590J418q74n94Q69j848K11l7
$$ -2219 -1053 -296 2003 -2181 -2033 2771 1128 678 1195 -395 1023 149 -445 424 -1424 -1213 -1250
1906a250Q48L045m482j112N965j188j550L7k357L458P32l594K1Q98J268j374p72
$$ -1250 -402 2643 -1839 -2951 3014 1826 276 313 -2044 1414 2146 -1448 -1427 -529 739 -635 -1407
1923a407L516l000j744M732j490r10O83k901L149K616m187j631K328K731j447
$$ -1407 2109 -891 -2635 2097 607 -303 380 -2521 628 3244 -943 -2574 -246 2485 1038
1938A038l374K698K81j706K147k385J26K883l415J162L774k945j690R05K645J52
$$ 1038 -2336 362 643 -1063 1084 -1301 -1175 1708 -1707 -545 3229 284 -1406 -501 2144 2296
1954B296m444N57J445M63P01m211Q80M971k655j150K923r59J30o71j73J882k747
$$ 2296 -2148 -1591 -146 317 1018 -3193 -2313 2658 3 -1147 1776 817 947 276 103 1985 -762
1971g62j731J189J649J111m845mO246j411j895J229q60K782j51m373J790R27k047
$$ -762 -2493 -1304 345 1456 -3389 -3393 2853 1442 -453 776 -84 2698 2547 -1826 -36 891 -1156
1988a156j086J122K024l050r75N070l11r64L22k398M212J912o978l42L603l72
$$ -1156 -2242 -1120 904 -2146 -3121 1949 1638 674 996 -1402 2810 4722 -2256 -2598 1005 633
2004F33k555j153K762p5j142K679p13N82J192l715K570L932o204j678K744J175
$$ 633 -1922 -3075 -313 -388 -1530 1149 436 1018 2210 -1505 1065 4997 -1207 -2885 -141 1034
2020A034j053l317J121K793J19j81k000J716L724m528M0L811l144j303M03J91
$$ 1034 -19 -3336 -2215 578 697 516 -1484 232 3956 -572 -532 3279 135 -1168 -765 -574
2036e74J653k713j848L341K151j252l180J491N141k554k450J634r83J493q46l165
$$ -574 1079 -1634 -3482 -141 2010 758 -2422 -931 4210 1656 -794 840 -143 1350 504 -2661
2052b661K893r2l238J741K235p3k433N2M751p25k207R0j336L350no271J854L484
$$ -2661 232 140 -3098 -1357 878 805 -1628 -1576 3175 2450 243 333 -1003 2347 2342 -3929 -2075 1409
2070A409k958l41Q57J238j42p35K230K75l64k11l033L375J750o875J35M080r30
$$ 1409 -1549 -1890 -1033 205 63 -672 1558 1833 1469 1258 -1775 1600 3350 -3525 -3390 690 -240
2087b40j001q23R00K738o28j41l30R31J636m044Q86K784m563j206K432%O28k006
$$ -240 -1241 -2064 -1164 1574 946 805 475 1406 3042 -1002 -116 2668 -1895 -3101 -669 -669 -41 -2047
2105b047l87M217Q10j630j501J311K743l023k183K026j402j19K32j426K805n26
$$ -2047 -2434 1783 2593 963 -538 773 3516 493 -1690 336 -1066 -1185 -953 -2379 426 -100
2121a00k198L442J802j971j380L04K713j037l323O13k17K056n68l791L463J642
$$ -100 -2298 1144 2946 975 -405 -101 2612 1575 -1748 -1135 -1352 704 136 -3655 -192 1450
2137A450k559J659J092r50K26j067J440J08k017p83n94L170K20n154K393L626
$$ 1450 -1109 550 1642 692 918 -149 1291 1399 -618 -1401 -1995 1175 1395 -3759 -1366 2260
2153B260k337M98l91m41K341j384q37N70j47k76j205J531J529m076M74L336j033
$$ 2260 -77 421 30 -411 1930 546 -291 279 132 -144 -1349 182 1711 -2365 -1891 1445 412
2170D12K8j093o23L038m15k127K73L67J559j479j263K148j779j49J554j007J079
$$ 412 440 -653 -1276 1762 1347 -780 -507 -140 1419 -60 -1323 825 -954 -1103 451 -556 523
2187E23p72j365L291m5k037k14M29J920o90k485J152J00K10K02j753J555P52k159
$$ 523 -249 -1614 1677 1632 -405 -619 -190 1730 1040 -1445 -293 -193 17 219 -1534 21 773 -1386
2205a386K468J24j856J201o58R18N05k304k12Q28P93O7k707J566K107k080J445
$$ -1386 1082 1206 -650 551 -107 811 1316 -988 -1200 -372 421 488 -2219 -653 1454 -626 819
$$ [...]
8191F2
##END NTUPLES=NMR FID
##END=
