##TITLE=1H_71-2022
 CDCl3
 8 sc, 
 1.09.2022
##JCAMPDX= 6.0         $$ Bruker NMR JCAMP-DX V2.0
##DATA TYPE= NMR SPECTRUM
##DATA CLASS= NTUPLES
##ORIGIN= UXNMR, Bruker Analytische Messtechnik GmbH
##OWNER= root
$$ XWIN-NMR		Version 3.5
$$ Thu Sep  1 10:00:42 2022 Russian Standard Time (UT+4h)  she@DPX200
##.OBSERVE FREQUENCY= 200.1313499994
##.OBSERVE NUCLEUS= ^1H
##.ACQUISITION MODE= SIMULTANEOUS
##.ACQUISITION SCHEME= undefined
##.AVERAGES= 8
##.DIGITISER RES= 18
##SPECTROMETER/DATA SYSTEM= spect
##.PULSE SEQUENCE= zg30
##.SOLVENT NAME= CDCl3
##.SHIFT REFERENCE= (INTERNAL, CDCl3, 0, 15.7458)
##AUDIT TRAIL= $$ (NUMBER, WHEN, WHO, WHERE, WHAT)
$$ ##TITLE= Audit trail, XWIN-NMR		Version 3.5
$$ ##JCAMPDX= 5.01
$$ ##ORIGIN= Bruker BioSpin GmbH
$$ ##OWNER= she
$$ F:/spectra/data/she/nmr/H-F/1/pdata/1/auditp.txt
$$ ##AUDIT TRAIL=  $$ (NUMBER, WHEN, WHO, WHERE, WHAT)
(   1,<2022-09-01 09:59:31.18 +0400>,<she>,<DPX200>,
      <created by zg, POWCHK disabled, PULCHK disabled
       configuration hash MD5:
       00 E9 B6 7A A2 85 ED C7 34 08 36 98 17 FE 4E 26
       data hash MD5: 16K
       5E 9F 43 F9 66 4D 46 D0 04 44 17 3B 06 4B CC 1A>)
(   2,<2022-09-01 09:59:33.57 +0400>,<she>,<DPX200>,
      <Start of raw data processing
       efp BC_mod = 2 LB = 0.24 FT_mod = 6 PKNL = 1 PHC0 = -18037.94 PHC1 = 11.80069 SI = 16K 
       data hash MD5: 16K
       D7 92 F8 59 9A 83 78 58 0A 69 39 71 E0 6D 15 47>)
(   3,<2022-09-01 09:59:49.17 +0400>,<she>,<DPX200>,
      <pk PHC0 = -0.3740607 PHC1 = 2 
       data hash MD5: 16K
       00 D7 2C 38 56 7F D7 F2 59 35 89 85 4E 3B 28 D7>)
(   4,<2022-09-01 09:59:52.07 +0400>,<she>,<DPX200>,
      <abs ABSG = 5 
       data hash MD5: 16K
       AC EB 2F C8 BF DF 00 D8 D0 2E F0 F8 4B 55 E5 14>)
$$ ##END=
$$ 
$$ hash MD5
$$ 20 36 AC A5 F4 82 5B 37 9A 81 40 E1 01 5F C9 F0
##$RELAX= 
##$RELAX= 
##$RELAX= 
##$RELAX= 
##$RELAX= 
##$RELAX= 
$$ Bruker specific parameters
$$ --------------------------
##$DU= <F:/spectra>
##$EXPNO= 1
##$NAME= <H-F>
##$PROCNO= 1
##$TYPE= <nmr>
##$USER= <she>
##$AMP= (0..31)
100 100 100 100 100 100 100 100 100 100 100 100 100 100 100 100 100 100 
100 100 100 100 100 100 100 100 100 100 100 100 100 100 
##$AQSEQ= 0
##$AQ_mod= 1
##$AUNM= <au_zg>
##$AUTOPOS= <>
##$BF1= 200.13
##$BF2= 200.13
##$BF3= 200.13
##$BF4= 200.13
##$BF5= 200.13
##$BF6= 200.13
##$BF7= 200.13
##$BF8= 200.13
##$BYTORDA= 1
##$CFDGTYP= 0
##$CFRGTYP= 5
##$CHEMSTR= <none>
##$CNST= (0..31)
1 1 145 1 1 1 1 1 1 1 1 1 1 1 1 1 1 1 1 1 1 1 1 1 1 1 1 1 1 1 1 1 
##$CPDPRG= <>
##$CPDPRG1= <>
##$CPDPRG2= <>
##$CPDPRG3= <>
##$CPDPRG4= <mlev>
##$CPDPRG5= <mlev>
##$CPDPRG6= <mlev>
##$CPDPRG7= <mlev>
##$CPDPRG8= <mlev>
##$CPDPRGB= <>
##$CPDPRGT= <>
##$D= (0..31)
0 1.2 0 0 0 0 0 0 0 0.06 0 0.03 0 0 0 0 0.0002 0 0 0 0 0 0 0 0 0 0 0 0 
0 0 0 
##$DATE= 1662011970
##$DBL= (0..7)
120 120 120 120 120 120 120 120 
##$DBP= (0..7)
150 150 150 150 150 150 150 150 
##$DBP07= 0
##$DBPNAM0= <>
##$DBPNAM1= <>
##$DBPNAM2= <>
##$DBPNAM3= <>
##$DBPNAM4= <>
$$ [...]
##$SUBNAM3= <"">
##$SUBNAM4= <"">
##$SUBNAM5= <"">
##$SUBNAM6= <"">
##$SUBNAM7= <"">
##$SUBNAM8= <"">
##$SUBNAM9= <"">
##$SW= 18.0517283424941
##$SWIBOX= (0..15)
0 0 2 0 0 0 0 0 0 0 0 0 0 0 0 0 
##$SW_h= 3612.71676300578
##$TD= 16384
##$TD0= 1
##$TE= 0
##$TE2= 300
##$TE3= 300
##$TEG= 300
##$TL= (0..7)
0 120 120 120 120 120 120 120 
##$TP= (0..7)
150 150 150 150 150 150 150 150 
##$TP07= 0
##$TPNAME0= <>
##$TPNAME1= <>
##$TPNAME2= <>
##$TPNAME3= <>
##$TPNAME4= <>
##$TPNAME5= <>
##$TPNAME6= <>
##$TPNAME7= <>
##$TPOAL= (0..7)
0.5 0.5 0.5 0.5 0.5 0.5 0.5 0.5 
##$TPOFFS= (0..7)
0 0 0 0 0 0 0 0 
##$TUNHIN= 0
##$TUNHOUT= 0
##$TUNXOUT= 0
##$USERA1= <user>
##$USERA2= <user>
##$USERA3= <user>
##$USERA4= <user>
##$USERA5= <user>
##$V9= 5
##$VALIST= <valist>
##$VCLIST= <CCCCCCCCCCCCCCC>
##$VD= 0
##$VDLIST= <DDDDDDDDDDDDDDD>
##$VPLIST= <PPPPPPPPPPPPPPP>
##$VTLIST= <TTTTTTTTTTTTTTT>
##$WBST= 1024
##$WBSW= 4
##$XGAIN= (0..3)
0 0 0 0 
##$XL= 0
##$YL= 0
##$YMAX_a= 580574
##$YMIN_a= -645347
##$ZGOPTNS= <>
##$ZL1= 120
##$ZL2= 120
##$ZL3= 120
##$ZL4= 120
##$ABSF1= 15.76452
##$ABSF2= -2.28733
##$ABSG= 5
##$ABSL= 3
##$ALPHA= 0
##$AQORDER= 0
##$ASSFAC= 0
##$ASSFACI= 0
##$ASSFACX= 0
##$ASSWID= 0
##$AUNMP= <proc_1d>
##$AZFE= 0.1
##$AZFW= 0.1
##$BCFW= 0
##$BC_mod= 2
##$BYTORDP= 0
##$COROFFS= 0
##$CY= -3
##$DATMOD= 1
##$DC= 0
##$DFILT= <>
##$DTYPP= 0
##$F1P= 0
##$F2P= 0
##$FCOR= 1
##$FTSIZE= 16384
##$FT_mod= 6
##$GAMMA= 0
##$GB= 0
##$INTBC= 1
##$INTSCL= 3.70164e-10
##$ISEN= 128
##$LB= 0.24
##$LEV0= 0
##$LPBIN= 0
##$MAXI= 10000
##$MC2= 0
##$MEAN= 0
##$ME_mod= 0
##$MI= 1.114404
##$NCOEF= 0
##$NC_proc= -5
##$NLEV= 6
##$NOISF1= 3.799351
##$NOISF2= 2.8
##$NSP= 0
##$NTH_PI= 0
##$NZP= 0
##$OFFSET= 15.74579
##$PC= 1
##$PHC0= -18038.31
##$PHC1= 13.80069
##$PH_mod= 1
##$PKNL= yes
##$PPARMOD= 0
##$PSCAL= 0
##$PSIGN= 0
##$REVERSE= no
##$SF= 200.130005153874
##$SI= 16384
##$SIGF1= 3
##$SIGF2= 2
##$SINO= 5.538805
##$SIOLD= 16384
##$SREGLST= <1H.CDCl3>
##$SSB= 0
##$STSI= 16384
##$STSR= 0
##$SW_p= 3612.71676300578
##$SYMM= 0
##$S_DEV= 0
##$TDeff= 16384
##$TDoff= 0
##$TI= <>
##$TILT= no
##$TM1= 0
##$TM2= 0
##$TOPLEV= 0
##$USERP1= <user>
##$USERP2= <user>
##$USERP3= <user>
##$USERP4= <user>
##$USERP5= <user>
##$WDW= 1
##$XDIM= 16384
##$YMAX_p= 452685406
##$YMIN_p= -629766
$$ End of Bruker specific parameters
$$ ---------------------------------
##NTUPLES= NMR SPECTRUM
##VAR_NAME=  FREQUENCY,     SPECTRUM/REAL,   SPECTRUM/IMAG
##SYMBOL=    X,             R,               I
##VAR_TYPE=  INDEPENDENT,   DEPENDENT,       DEPENDENT
##VAR_FORM=  AFFN,          ASDF,            ASDF
##VAR_DIM=   16384,         16384,           16384
##UNITS=     HZ,            ARBITRARY UNITS, ARBITRARY UNITS
##FACTOR=    0.220516191357247, 1,           1
##FIRST=     3151.20493936905, 0,            0
##LAST=      -461.511823636725, 0,           0
##MIN=       -461.511823636725, -629766,     0
##MAX=       3151.20493936905, 452685406,    0
$$ Real data points
##PAGE= N=1
##DATA TABLE= (X++(R..R)), XYDATA
$$ [...]
$$ plain form
6449 -61786 -20697 44137 34064 23996 8478 51353 80935 105379 117526 54593 72629 12891
6437 12891 -35886 -19319 -45156 26897 39548 74193 82387 77409 44679 -45400 45079 67190
6425 67190 -7788 -17903 74645 82397 39425 62597 58584 87264 106234 81842 28960 -34770
6413 -34770 -71217 -4866 92802 102426 110646 80678 50529 94483 142078 195126 192588 166334
6401 166334 93752 44852 56394 52642 74507 174442 187494 128046 104601 146003 173296 183175
6389 183175 261433 178820 130023 169352 199688 197038 271355 256054 248951 276991 248325 218255
6377 218255 219589 202250 191548 300204 298087 302715 289952 185859 178562 185242 303078 340015
6365 340015 316429 288007 354591 349552 269548 256656 293021 296438 246514 241802 235270 252568
$$ packed form
6449f1786M1089O4834j0073j0068j5518M2875K9582K4444J2147o2933J8036n9738
6437A2891m8777J6567k5837P2053J2651L4645Q194m978l2730r0079R0479K2111
6425F7190p4978j0115R2548P752m2972K3172m013K8680J8970k4392n2882o3730
6413c4770l6447O6351R7668R624Q220k9968l0149M3954M7595N3048k538k6254
6401A66334p2582m8900J1542l752K1865R9935J3052n9448k3445M1402K7293R879
6389A83175P8258q2613m8797L9329L0336k650P4317j5301p103K8040k8666l0070
6377B18255J334j7339j0702J08656k117M628j2763j04093p297O680J17836L6937
6365C40015k3586k8422O6584n039q0004j2892L6365L417m9924m712o532J7298
$$ plain form
6353 252568 239737 234998 163377 218706 138867 96392 126584 131850 197760 186996 111638 61114
6341 61114 152407 124198 91233 128535 58431 95896 105366 136179 138872 144630 132844 111804
6329 111804 196085 179194 221246 205676 160954 126485 110103 150779 181674 150451 110508 134371
6317 134371 109261 99471 106257 94929 86313 174701 168204 138267 170643 222502 287708 208350
6305 208350 158299 129900 153197 190868 162131 161245 133463 117072 106758 190280 196348 176721
6293 176721 208040 168144 176157 174694 194450 154771 200564 192570 179410 177352 176862 169738 249289
6280 249289 292696 198595 273281 243511 235235 214832 224417 240097 290251 211816 220550 282720
6268 282720 310630 312257 296967 291776 228183 197445 267295 270257 264540 252459 257137 265097 271911
$$ packed form
6353B52568j2831m739p1621N5329p9839m2475L0192N266O5910j0764p5358n0524
6341F1114R1293k8209l2965L7302p0104L7465R470L0813K693N758j1786k1040
6329A11804Q4281j6891M2052j5570m4722l4469j6382M0676L0895l1223l9943K3863
6317A34371k5110r790O786j1328q616Q8388o497k9937L2376N1859O5206p9358
6305B08350n0051k8399K3297L7671k8737q86k7782j6391j0314Q3522O068j9627
6293A76721L1319l9896Q013j463J9756l9679M5793p994j3160k058m90p124P9551
6280B49289M3407r4101P4686k9770q276k0403R585J5680N0154p8435Q734O2170
6268B82720K7910J627j5290n191o3593l0738O9850K962n717j2081M678P960O814
$$ plain form
6255 271911 343114 376991 425233 467294 440457 448961 321864 297159 385437 369830 412410 395851
6243 395851 347563 312805 383844 332983 367005 228225 267890 345924 386980 355551 344445
6232 344445 381758 383900 396205 407964 390074 406112 432939 349165 379962 426688 438324 394616
6220 394616 425981 434874 439378 409251 444634 524944 546606 528182 520871 503347 522652 527300
6208 527300 524096 541754 577947 539526 526348 579630 562120 615343 600056 544911 544439 591290
6196 591290 628193 582634 663837 641233 639853 681448 661944 704679 770402 737707 621724 749843
6184 749843 848624 837324 805871 791699 780222 829041 856334 809506 858630 873417 909034 998458
6172 998458 993539 980580 971584 1069911 1081829 1016334 983595 1006148 1044808 1061826 1071641 1108581
$$ packed form
6255B71911P1203L3877M8242M2061k6837Q504j27097k4705Q8278j5607M2580j6559
6243C95851m8288l4758P1039n0861L4022j38780L9665P8034M1056l1429j1106
6232C44445L7313K142J2305J1759j7890J6038K6827q3774L0797M6726J1636m3708
6220C94616L1365Q893M504l0127L5383Q0310K1662j8424p311j7524J9305M648
6208E27300l204J7658L6193l8421j3178N3282j7510N3223j5287n5145m72M6851
6196E91290L6903m5559Q1203k2604j380M1595j9504M2735O5723l2695j15983J28119
6184G49843R8781j1300l1453j4172j1477M8819K7293m6828M9124J4787L5617Q9424
6172I98458m919j2959q996R8327J1918o5495l2739K2553L8660J7018R815L6940
$$ plain form
6160 1108581 1139861 1177995 1160154 1151565 1160054 1128388 1137619 1240580 1293602 1306296 1338428 1403837
6148 1403837 1534644 1500256 1486701 1549111 1580652 1683427 1649466 1669182 1755571 1809832 1891150
6137 1891150 2008454 2061765 2068047 2060713 2077445 2122580 2160784 2274019 2391433 2429960 2405096
6126 2405096 2511562 2565349 2572677 2682025 2813603 2790405 2893312 3024345 3041589 3086530 3258262
6115 3258262 3331866 3426932 3553104 3662703 3776218 3954870 4100466 4183177 4298328 4531790
6105 4531790 4764173 5013102 5218072 5455548 5655396 5885535 6112593 6458956 6685599 6908549
6095 6908549 7212161 7612336 8006728 8402825 8823115 9384519 9997511 10566261 11348344 12247946
6085 12247946 13311143 14500265 15954980 17507495 19361546 21400870 23536551 25337527
$$ packed form
6160A108581L1280L8134j7841q589Q489l1666R231J02961N3022J2694L2132O5409
6148A403837J30807l4388j3555O2410L1541J02775l3961J9716Q6389N4261Q1318
6137A891150J17304N3311O282p334J6732M5135L8204J13235J17414L8527k4864
6126B405096J06466N3787P328J09348J31578k3198J02907J31033J7244M4941J71732
6115C258262P3604R5066J26172J09599J13515J78652J45596Q2711J15151K33462
6105D531790K32383K48929K04970K37476J99848K30139K27058L46363K26643K22950
6095F908549L03612M00175L94392L96097M20290N61404O12992N68750P82083Q99602
6085A2247946J063197J189122J454715J552515J854051K039324K135681J800976
$$ plain form
6077 25337527 26654936 27136863 26636573 25466277 24000196 22368964 20881637 19764181
6069 19764181 18736487 17980774 17469264 17184581 17093691 17072735 17191668 17328030 17551524 17923165
6059 17923165 18391936 18852098 19438230 20218401 21224190 22174945 23335679 24790053 26314892
6050 26314892 28196240 30347213 32781694 35400711 38336153 41539988 44870432 48286359
6042 48286359 51375493 53802583 55135728 55217015 53986969 51497352 48263253 44573263
6034 44573263 40861115 37324466 34097351 31102840 28430392 26176471 24073525 22244149
6026 22244149 20519905 19081485 17769418 16515180 15521401 14617146 13762694 12925885 12178528
6017 12178528 11615802 11056473 10524497 10045852 9652856 9261921 8925685 8619001 8327715
$$ packed form
6077B5337527J317409M81927n00290j170296j466081j631232j487327j117456
6069A9764181j027694p55713n11510k84683r0890k0956J18933J36362K23494L71641
6059A7923165M68771M60162N86132P80171J005789R50755J160734J454374J524839
6050B6314892J881348K150973K434481K619017K935442L203835L330444L415927
6042D8286359L089134K427090J333145Q1287j230046k489617l234099l689990
6034D4573263l712148l536649l227115k994511k672448k253921k102946j829376
6026B2244149j724244j438420j312067j254238r93779r04255q54452q36809p47357
6017A2178528n62726n59329n31976m78645l92996l90935l36236l06684k91286
$$ plain form
6008 8327715 8043409 7730620 7460275 7287844 7161560 6904352 6685762 6485404 6358614 6222606
5998 6222606 5964158 5784937 5572062 5472897 5406716 5286356 5196687 5139666 5041349 5007552 4951175
5987 4951175 4809280 4761256 4778047 4671211 4656869 4648160 4596695 4541713 4547938 4572861 4587408
5976 4587408 4632921 4574484 4610383 4617646 4667870 4741601 4871785 4867882 4897019 4935489 5080158
5965 5080158 5222395 5309507 5516092 5605636 5779459 6016894 6237414 6525915 6677258 6847906
5955 6847906 7199802 7477030 7712435 7998237 8240255 8410119 8551490 8696577 8887213 8938728
5945 8938728 8923464 8918255 8833309 8813393 8835810 8846675 8869214 9006186 9242158 9535450 9841454
5934 9841454 10279083 10933822 11758865 12553694 13680663 15054209 16552201 18345901 20154381
$$ packed form
6008H327715k84306l12789k70345j72431j26284k57208k18590k00358j26790j36008
5998F222606k58448j79221k12875r9165o6181j20360q9669n7021r8317l3797n6377
5987D951175j41895m8024J6791j06836j4342q709n1465n4982O225K4923J4547
5976D587408M5513n8437L5899P263N0224P3731J30184l903K9137L8470J44669
5965E080158J42237Q7112K06585Q9544J73823K37435K20520K88501J51343J70648
5955F847906L51896K77228K35405K85802K42018J69864J41371J45087J90636N1515
5945H938728j5264n209q4946j9916K2417J0865K2539J36972K35972K93292L06004
5934I841454M37629O54739Q25043P94829J126969J373546J497992J793700J808480
$$ plain form
5925 20154381 21771192 22910727 23128124 22248705 20576296 18558046 16459359 14592081
5917 14592081 12972468 11627952 10455177 9482019 8649583 7947290 7419825 6881981 6347385
5908 6347385 5951553 5650063 5284995 5010311 4711281 4396255 4184131 3960017 3757796 3553013
5898 3553013 3411473 3334531 3230897 3139473 3003718 2906931 2881044 2823216 2728598 2620452 2538831
5887 2538831 2490728 2439861 2318073 2282039 2224401 2212472 2252933 2170190 2083174 2057015 1997318
5876 1997318 1942217 1887926 1869070 1768336 1729565 1768063 1728853 1583430 1481288 1473550 1462492
5865 1462492 1428132 1364051 1382280 1366716 1278747 1261586 1267290 1202975 1155133 1133596 1136166 1127177
5853 1127177 1209832 1159149 1067505 1103576 1086721 956003 1039152 1025109 937196 938363 979839
$$ packed form
5925B0154381J616811J139535K17397q79419j672409k018250k098687j867278
5917A4592081j619613j344516j172775r73158q32436p02293n27465n37844n34596
5908F347385l95832l01490l65068k74684k99030l15026k12124k24114k02221k04783
5898C553013j41540p6942j03634r1424j35755r6787k5887n7828r4618j08146q1621
5887B538831m8103n0867j21788l6034n7638j1929M0461q2743q7016k6159n9697
5876A997318n5101n4291j8856j00734l8771L8498l9210j45423j02142p738j1058
5865A462492l4360o4081J8229j5564q7969j7161N704o4315m7842k1537K570q989
5853A127177Q2655n0683r1644L6071j6855j30718Q3149j4043q7913J167M1476
$$ plain form
5842 979839 931068 926153 975724 925025 966102 1008484 957357 953191 1022712 1084009 1007127 1050526
5830 1050526 1041678 1082602 1137071 1209148 1233021 1308754 1387796 1315326 1368576 1416080 1428442 1520136
5818 1520136 1483832 1530053 1502038 1423906 1518469 1485632 1483557 1468680 1501648 1411322 1299398
5807 1299398 1331673 1302424 1253147 1187747 1140532 1012383 1057391 961442 975837 920704 861619
5796 861619 868861 798345 763867 690284 672704 586167 612127 555876 555209 536169 538044 564992
5784 564992 553048 537448 519143 522694 486688 518142 478574 514543 559094 555101 528793 481736
5772 481736 507506 468132 532334 512390 461886 393373 322024 392271 397951 398901 399695 363282 433027
5759 433027 373248 370356 360601 425943 391019 443670 397215 413939 441176 470123 496310 471958
$$ packed form
5842I79839m8771m915M9571n0699M1077M2382n1127m166O9521O1297p6882M3399
5830A050526q848M0924N4469P2077K3873P5733P9042p2470N3250M7504J2362R1694
5818A520136l6304M6221k8015p8132R4563l2837k075j4877L2968r0326j11924
5807A299398L2275k9249m9277o5400m7215j28149M5008r5949J4395n5133n9085
5796H61619P242p0516l4478p3583j7580q6537K5960n6251o67j9040J875K6948
5784E64992j1944j5600j8305L551l6006L1454l9568L5969M4551l993k6308m7057
5772D81736K5770l9374O4202j9944n0504o8513p1349P0247N680R50P94l6413O9745
5759D33027n9779k892r755O5342l4924N2651m6455J6724K7237K8947K6187k4352
$$ plain form
5747 471958 468760 489426 452849 427482 416711 434454 403577 412898 350713 299848 336073 301211
5735 301211 294176 290784 323996 322494 353564 326469 332570 335182 368615 333639 353618 411232 408376
5722 408376 420135 408350 410805 353021 345157 375563 484523 487178 448228 433502 406752 367136
5710 367136 430071 469481 534127 472487 428197 366611 317993 388301 286375 270558 232857
5699 232857 242922 237708 271187 277445 270260 266513 268659 307268 263581 308935 235077 150844 250042
5686 250042 240503 235734 239540 289253 243713 226251 245119 220286 184594 250966 249413 256866 205247
5673 205247 227928 202688 170918 182545 255047 229225 254527 195485 202807 151466 86373 132116
5661 132116 101429 226735 250943 225461 183014 148719 81351 157600 248722 260890 173294
$$ packed form
5747D71958l198K0666l6577k5367j0771J7743l0877R321o2185n0865L6225l4862
5735C01211p035l392L3212j502L1070k7095O101K612L3433l4976J9979N7614k856
5722D08376J1759j1785K455n7784p864L0406J08960K655l8950j4726k6750l9616
5710C67136O2935L9410O4646o1640m4290o1586m8618P0308j01926j5817l7701
5699B32857J0065n214L3479O258p185l747K146L8609m3687M5354p3858q4233R9198
5686B50042r539m769L806M9713m5540j7462J8868k4833l5692O6372j553P453n1619
5673B05247K2681k5240l1770J1627P2502k5822K5302n9042P322n1341o5093M5743
5661A32116l0687J25306K4208k5482m2447l4295o7368P6249R1122J2168q7596
$$ plain form
5650 173294 193221 177066 158660 172589 147940 186317 130757 111899 144038 95413 114800 211706
5638 211706 188346 233213 137459 189266 169251 138848 233791 209834 143548 240275 206568 137835
5626 137835 143617 137151 156933 184371 245092 239767 194232 223265 259307 217692 94015 79017
5614 79017 182444 166413 150712 221827 175425 135761 207329 184281 114706 153780 189787 216929
5602 216929 155320 195762 188989 187581 138064 36922 94918 46993 163949 198229 227236 192727
5590 192727 258740 301601 255585 156907 128432 77642 115115 154686 188370 152241 175219 136095
5578 136095 146482 68894 67096 185956 144066 126228 96964 70856 51012 119187 141434 105573
5566 105573 124212 151554 172903 80102 102353 99103 53139 45440 77334 123333 108220 4865
$$ packed form
5650A73294J9927j6155j8406J3929k4649L8377n5560j8858L2139m8625J9387R6906
5638B11706k3360M4867r5754N1807k0015l0403R4943k3957o6286R6727l3707o8733
5626A37835N782o466J9782K7438O0721n325m5535K9033L6042m1615j23677j4998
5614G9017J03427j6031j5701P1115m6402l9664P1568k3048o9575L9074L6007K7142
5602B16929o1609M0442o773j408m9517j01142N7996m7925J16956L4280K9007l4509
5590A92727O6013M2861m6016r8678k8475n0790L7473L9571L3684l6129K2978l9124
5578A36095J0387p7588j798J18860m1890j7838k9264k6108j9844O8175K2247l5861
5566A05573J8639K7342K1349r2801K2251l250m5964p699L1894M5999j5113j03355
$$ plain form
5554 4865 37040 65089 96688 153793 69873 103614 149569 88195 51315 83880 128184 79683
5542 79683 96018 128077 75384 101734 70049 69363 86089 26366 60089 151643 116151 77481
5530 77481 81828 158939 204305 77945 39267 154887 69604 96115 140790 119382 181723 148453
5518 148453 28527 6556 77937 36730 51816 52768 72603 138692 114068 62404 7114 49875
5506 49875 91145 130476 155354 40429 -15342 53895 31146 81395 98681 110489 174677 121888
5494 121888 98397 88996 72849 121840 128012 99051 77855 159595 171881 177724 147466 143196
5482 143196 181679 209401 138791 116514 41859 35425 95426 222121 223500 146667 163206 120073
5470 120073 179430 227082 233559 236405 151734 131064 163527 235220 161509 174339 221174 204695
$$ packed form
5554D865L2175K8049L1599N7105q3920L3741M5955o1374l6880L2565M4304m8501
5542G9683J6335L2059n2693K6350l1685o86J6726n9723L3723R1554l5492l8670
5530G7481M347P7111M5366j26360l8678J15620q5283K6511M4675k1408O2341l3270
5518A48453j19926k1971P1381m1207J5086R52J9835O6089k4624n1664n5290M2761
5506D9875M1270L9331K4878j14925n5771O9237k2749N0249J7286J1808O4188n2789
5494A21888k3491r401j6147M8991O172k8961k1196Q1740J2286N843l0258m270
5482A43196L8483K7722p0610k2277p4655o434O0001J26695J379p6833J6539m3133
5470A20073N9357M7652O477K846q4671k0670L2463P1693p3711J2830M6835j6479
$$ plain form
5458 204695 243994 289279 279499 202450 284849 266302 229894 219249 183293 154146 274913 274683
5446 274683 285248 178264 128704 236456 276376 256279 232607 276261 308121 248054 193770
5435 193770 290083 268707 243780 285291 278729 269716 203045 234240 246131 267153 282678 238394
5423 238394 308824 327435 253510 205568 268746 286749 275440 215017 141337 191596 190298 183475
5411 183475 231148 269535 324900 331628 378849 309210 258182 253058 193075 225233 296845 294049
5399 294049 303202 248231 288323 329590 264379 311174 345410 309216 267889 287734 319326 364768
5387 364768 295873 237186 296850 349351 345658 283977 275588 275650 315805 306664 313828 349333 309801
5374 309801 294960 278490 270459 215843 291902 318055 341676 368149 377381 354168 395950 407864
$$ packed form
5458B04695L9299M5285r780p7049Q2399j8547l6408j0645l5956k9147J20767k30
5446B74683J0565j06984m9560J07752L9920k0097k3672M3654L1860o0067n4284
5435A93770R6313k1376k4927M1511o562r013o6671L1195J1891K1022J5525m4284
5423B38394P0430J8611p3925m7942O3178J8003j1309o0423p3680N0259j298o823
5411A83475M7673L8387N5365O728M7221o9639n1028n124n9983L2158P1612k796
5399B94049R153n4971M0092M1267o5211M6795L4236l6194m1327J9845L1592M5442
5387C64768o8895n8687N9664N2501l693o1681q389O2M0155r141P164L5505l9532
5374C09801j4841j6470q031n4616P6059K6153K3621K6473R232k3213M1782J1914
$$ plain form
5362 407864 380141 354283 274403 305975 237852 268384 282302 308739 305618 291469 327562 371529
5350 371529 413072 304352 347569 381961 413527 360548 349003 341072 230087 227407 346575
5339 346575 411624 462965 417089 371747 344327 413602 368314 349011 371848 412431 391609 449708
5327 449708 389861 342218 444054 504303 450676 487130 536721 430924 379171 396337 473511
5316 473511 479319 484815 421561 511899 434174 491736 519442 470566 493789 491172 477912 549082
5304 549082 481740 510563 537161 519419 500195 527774 541046 520217 571601 592707 575495 543169
5292 543169 562788 531130 533070 583992 656720 597759 602077 586441 597407 673879 695738 701566
5280 701566 626994 669702 718456 690240 646681 634782 602285 624708 591394 650999 686353 683241
$$ packed form
5362D07864k7723k5858p9880L1572o8123L0532J3918K6437l121j4149L6093M3967
5350C71529M1543j08720M3217L4392L1566n2979j1545p931j10985k680J19168
5339C46575O5049N1341m5876m5342k7420O9275m5288j9303K2837M0583k0822N8099
5327D49708n9847m7643J01836O0249n3627L6454M9591j05797n1753J7166P7174
5316D73511N808N496o3254R0338p7725N7562K7706m8876K3223k617j3260P1170
5304E49082o7342K8823K6598j7742j9224K7579J3272k0829N1384K1106j7212l2326
5292E43169J9619l1658J940N0922P2728n8961M318j5636J0966P6472K1859N828
5280G01566p4572M2708M8754k8216m3559j1899l2497K2423l3314N9605L5354l112
$$ plain form
5268 683241 752380 776472 815423 804653 808973 786041 672406 710868 753379 713555 713156 763870
5256 763870 805802 726650 735124 789937 806198 841455 782211 712955 774436 773180 814115 867880
5244 867880 941991 989852 844672 836450 935484 1002360 1047814 1031124 1021637 936584 978601 1021858
5232 1021858 1023357 1064189 1116472 1230769 1188622 1130619 1173589 1219084 1212179 1228281 1309992 1331198
5220 1331198 1271905 1279159 1327447 1356114 1412194 1427285 1425823 1481896 1545385 1631725 1665411 1697315
5208 1697315 1690980 1706841 1779307 1753553 1785228 1832748 1832458 1828665 1903945 1972104 2049711 2082435
5196 2082435 2157307 2265553 2327827 2401518 2510231 2550128 2579342 2703736 2781484 2860903 2973699
5185 2973699 3018157 3134874 3244774 3392909 3466195 3512688 3652446 3794407 3931962 4163581
$$ packed form
5268F83241O9139K4092L8951j0770M320k2932j13635L8462M2511l9824l99N0714
5256G63870M1932p9152Q474N4813J6261L5257n9244o9256O1481j256M0935N3765
5244H67880P4111M7861j45180q222R9034O6876M5454j6690r487q5053M2017M3257
5232A021858J499M0832N2283J14297m2147n8003M2970M5495o905J6102Q1711K1206
5220A331198n9293P254M8288K8667N6080J5091j462N6073O3489Q6340L3686L1904
5208A697315o335J5861P2466k5754L1675M7520k90l793P5280O8159P7607L2724
5196B082435P4872J08246O2274P3691J08713L9897K9214J24394P7748P9419J12796
5185B973699M4458J16717J09900J48135P3286M6493J39758J41961J37555K31619
$$ plain form
5175 4163581 4368875 4532852 4782993 4960059 5239297 5646740 6071747 6437462 6841267 7270371
5165 7270371 7647164 7953022 8169417 8300505 8178550 8047495 7957393 7755582 7594402 7431187
5155 7431187 7376696 7338493 7414285 7519931 7640574 7793798 7915989 8093915 8337996 8595654
5145 8595654 8857200 9251501 9656654 10100663 10579476 11033929 11606230 12190064 12691029 13222168
5135 13222168 13789087 14309089 14913327 15467595 16021368 16677910 17285082 17956473 18599233
5126 18599233 19238273 19985512 20664874 21322871 22085181 22671996 23108241 23356527 23426569 23164500
5116 23164500 22598923 21984136 21323487 20575587 19978374 19477773 18976809 18643983 18465034
5107 18465034 18479347 18453087 18565497 18873212 19191674 19637174 20280955 21126348 22030981 22932317
$$ packed form
5175D163581K05294J63977K50141J77066K79238M07443M25007L65715M03805M29104
5165G270371L76793L05858K16395J31088j21955j31055r0102k01811j61180j63215
5155G431187n4491l8203P5792J05646J20643J53224J22191J77926K44081K57658
5145H595654K61546L94301M05153M44009M78813M54453N72301N83834N00965N31139
5135A3222168N66919N20002O04238N54268N53773O56542O07172O71391O42760
5126A8599233O39040P47239O79362O57997P62310N86815M36245K48286P0042k62069
5116B3164500n65577o14787o60649p47900n97213n00601n00964l32826j78949
5107A8465034J4313k6260J12410L07715L18462M45500O43781Q45393R04633R01336
$$ plain form
5097 22932317 23994062 25033057 26095175 27040718 27744657 28302541 28584210 28666647 28755557
5088 28755557 28717249 28659916 28496737 28227535 27898497 27485429 26995098 26524963 26028447 25458682
5078 25458682 24920933 24345567 23793753 23200236 22526601 21782433 21103312 20379118 19675576
5069 19675576 18968624 18387984 17877307 17506649 17205330 17022917 16933266 16950640 16982319 17125510
5059 17125510 17403826 17701981 18154728 18700349 19322640 19929188 20406883 20891841 21214292
5050 21214292 21342929 21268312 20923175 20287272 19481593 18660880 17824242 17031723 16322467 15751027
5040 15751027 15236425 14728545 14294760 13958939 13726957 13553569 13451887 13538702 13639166 13674980
5030 13674980 13748325 13996818 14346115 14799694 15252378 15711922 16142890 16745990 17308792 17855187
$$ packed form
5097B2932317J061745J038995J062118R45543P03939N57884K81669Q2437Q8910
5088B8755557l8308n7333j63179k69202l29038m13068m90331m70135m96516n69765
5078B5458682n37749n75366n51814n93517o73635p44168o79121p24194p03542
5069A9675576p06952n80640n10677l70658l01319j82413q9651J7374L1679J43191
5059A7125510K78316K98155M52747N45621O22291O06548M77695M84958L22451
5050B1214292J28637p4617l45137o35903q05679q20713q36638p92519p09256n71440
5040A5751027n14602n07880m33785l35821k31982j73388j01682Q6815J00464L5814
5030A3674980P3345K48493L49297M53579M52684M59544M30968O03100N62802N46395
$$ plain form
5020 17855187 18228251 18479441 18586822 18560633 18472629 18210537 17795975 17460299 17102778 16795362
5010 16795362 16564589 16250503 16059145 15901027 15887789 15905281 16068536 16201093 16475632 16777495
5000 16777495 16964680 17478942 17913010 18408771 18932001 19559918 20185789 20803515 21409017
4991 21409017 21914485 22487208 22899314 23254110 23514133 23696519 23800478 23772387 23590548 23451030
4981 23451030 23153199 22760620 22411283 21895967 21462253 21006486 20448400 19928318 19342344
4972 19342344 18789128 18301959 17792647 17382870 16955644 16471397 16121433 15813918 15606086
4963 15606086 15475211 15479567 15477789 15462752 15595227 15797507 16114752 16527692 16926952 17264431
4953 17264431 17597613 17902855 18198825 18407284 18387661 18318617 18071694 17577939 17108677 16632882
$$ packed form
5020A7855187L73064K51190J07381k6189q8004k62092m14562l35676l57521l07416
5010A6795362k30773l14086j91358j58118j3238J7492J63255J32557K74539L01863
5000A6777495J87185N14262M34068M95761N23230O27917O25871O17726O05502
4991B1409017N05468N72723M12106L54796K60023J82386J03959k8091j81839j39518
4981B3451030k97831l92579l49337n15316m33714m55767n58086n20082n85974
4972A9342344n53216m87169n09312m09777m27226m84247l49964l07515k07832
4963A5606086j30875M356j778j5037J32475K02280L17245M12940L99260L37479
4953A7264431L33182L05242K95970K08459j9623o9044k46923m93755m69262m75795
$$ plain form
4943 16632882 16107819 15606154 15202667 14793179 14488319 14200789 13923593 13565768 13221996
4934 13221996 12834090 12324959 11808576 11211639 10645874 10207156 9823142 9397282 9106324
4925 9106324 8767291 8588589 8419526 8270311 8229140 8161051 8016629 8058823 8059814 8091913 8180927
4914 8180927 8328619 8436161 8594091 8842149 9071942 9278296 9513470 9695498 9837898 9981437
4904 9981437 10034478 10082978 10138392 10160180 10060286 9881772 9615206 9378903 9090854 8915806
4894 8915806 8665415 8473773 8263789 8054571 7760697 7498514 7255180 6959918 6705406 6455315
4884 6455315 6263045 6109756 5943602 5878976 5791475 5710910 5625745 5602362 5666838 5804568 5848135
4873 5848135 6006168 6196528 6286605 6537013 6828828 7064317 7232317 7407213 7367212 7201837
$$ packed form
4943A6632882n25063n01665m03487m09488l04860k87530k77196l57825l43772
4934A3221996l87906n09131n16383n96937n65765m38718l84014m25860k90958
4925I106324l39033j78702j69063j49215m1171o8089j44422M2194R91L2099Q9014
4914H180927J47692J07542J57930K48058K29793K06354K35174J82028J42400J43539
4904I981437N3041M8500N5414K1788r9894j78514k66566k36303k88049j75048
4894H915806k50391j91642k09984k09218k93874k62183k43334k95262k54512k50091
4884F455315j92270j53289j66154o4626q7501q0565q5165k3383O4476J37730M3567
4873E848135J58033J90360R0077K50408K91815K35489J68000J74896m0001j65375
$$ plain form
4863 7201837 6904341 6555613 6119569 5746906 5374137 5035543 4705331 4393863 4167873 3953167
4853 3953167 3815264 3686895 3523955 3335506 3200828 3115752 3006727 2951452 2933702 2880618
4843 2880618 2755131 2659295 2600580 2580973 2525001 2523705 2530033 2472629 2416390 2379710 2406875 2475389
4831 2475389 2370037 2382340 2338697 2237473 2217821 2164723 2294844 2323378 2305169 2284206 2282765
4820 2282765 2241344 2244573 2257691 2303062 2255073 2295737 2317014 2308494 2305238 2248491 2259639 2299683
4808 2299683 2330617 2385403 2426278 2401926 2420094 2428616 2438247 2393027 2430243 2521832 2499798 2546478
4796 2546478 2615865 2616292 2636437 2670614 2675902 2672637 2660046 2651477 2773682 2804326 2821655 2839375
4784 2839375 2886267 2971193 2905660 2912895 2965696 2931277 2942530 3020201 3026261 3059834 3094397 3173120
$$ packed form
4863G201837k97496l48728m36044l72663l72769l38594l30212l11468k25990k14706
4853C953167j37903j28369j62940j88449j34678q5076j09025n5275j7750n3084
4843B880618j25487r5836n8715j9607n5972j296O328n7404n6239l6680K7165O8514
4831B475389j05352J2303m3643j01224j9652n3098J30121K8534j8209k0963j441
4820B282765m1421L229J3118M5371m7989M0664K1277q520l256n6747J1148M0044
4808B299683L0934N4786M0875k4352J8168Q522R631m5220L7216R1589k2034M6680
4796B546478O9387M27K0145L4177N288l265j2591q569J22205L0644J7329J7720
4784B839375M6892Q4926o5533P235N2801l4419J1253P7671O060L3573L4563P8723
$$ plain form
4772 3173120 3103198 3145085 3177282 3169188 3155118 3224520 3204224 3223041 3246735 3161231 3143032 3137749
4760 3137749 3171934 3152096 3171961 3199614 3196623 3216614 3270322 3283332 3292274 3247420 3274699 3225522
4748 3225522 3214464 3198783 3256171 3259463 3318582 3230638 3180290 3214615 3211446 3254832 3303252 3223739
4736 3223739 3199357 3205555 3170186 3168662 3148167 3107925 3136038 3128528 3078125 3105879 3066719 3036666
4724 3036666 3052107 3004760 2965725 2978692 2919023 2897387 2840400 2741888 2730030 2789819 2831251
4713 2831251 2723966 2641132 2643958 2604148 2583157 2547281 2513251 2483113 2441005 2395101 2374875
4702 2374875 2344706 2335956 2364122 2301162 2233518 2261558 2203845 2195618 2135871 2195797 2132531 2074336
4690 2074336 2108340 2005347 1906646 1887362 1857090 1792792 1772349 1746062 1755885 1721779 1637529
$$ packed form
4772C173120o9922M1887L2197q094j4070O9402k0296J8817K3694q5504j8199n283
4760C137749L4185j9838J9865K7653k991J9991N3708J3010Q942m4854K7279m9177
4748C225522j1058j5681N7388L292N9119q7944n0348L4325l169M3386M8420p9513
4736C223739k4382O198l5369j524k0495m0242K8113p510n0403K7754l9160l0053
4724C036666J5441m7347l9035J2967n9669k1636n6987r8512j1858N9789M1432
4713B831251j07285q2834K826l9810k0991l5876l4030l0138m2108m5904k0226
4702B374875l0169q750K8166o2960o7644K8040n7713q227n9747N9926o3266n8195
4690B074336L4004j02993r8701j9284l0272o4298k0443k6287R823l4106q4250
$$ plain form
4679 1637529 1581990 1587646 1518262 1462795 1512220 1558665 1450810 1408257 1409982 1378869 1409212 1381192
4667 1381192 1300872 1289558 1303416 1226889 1262631 1166937 1113733 1186048 1160258 1072638 1008699
4656 1008699 1071344 1078684 1030786 990722 944486 868728 853488 830693 768403 831528 929948 923199
4644 923199 897794 896735 801964 871025 760714 688530 679815 746435 772489 717754 708787 625669
4632 625669 592176 611095 600803 519888 574123 529781 585984 520379 426047 434716 504587 565539
4620 565539 538353 467256 500962 494892 374303 345691 407973 430541 448469 387872 426434 424170
4608 424170 328089 342632 348719 374795 416315 363843 297362 303128 292465 240891 306403 341525
4596 341525 378088 360189 306355 298618 170834 221963 291266 306710 267863 213297 294995 343933
$$ packed form
4679A637529n5539N656o9384n5467M9425M6445j07855m2553J725l1113L0343k8020
4667A381192q0320j1314J3858p6527L5742r5694n3204P2315k5790q7620o3939
4656A008699O2645P340m7898m0064m6236p5758j5240k2795o2290O3125R8420o749
4644I23199k5405j059r4771O9061j10311p2184q715O6620K6054n4735q967q3118
4632F25669l3493J8919j0292q0915N4235m4342N6203o5605r4332Q669O9871O0952
4620E65539k7186p1097L3706o070j20589k8612O2282K2568J7928o0597L8562k264
4608D24170r6081J4543O087K6076M1520n2472o6481N766j0663n1574O5512L5122
4596C41525L6563j7899n3834p737j27784N1129O9303J5444l8847n4566Q1698M8938
$$ plain form
4584 343933 369580 304494 318187 317225 213564 228459 226434 221088 197250 211407 243478 217692
4572 217692 233197 195058 231421 286251 206411 222799 210100 219251 249387 184072 155601 108173
4560 108173 31391 103163 95188 89811 222283 221367 166186 195194 209908 134642 127397 120001 36253
4547 36253 53197 115974 53386 59282 61148 60615 39502 16511 78483 135373 79071 59182 83213
4534 83213 24250 106481 84711 35979 44299 125200 94684 71949 43743 58466 110707 65644
4522 65644 83000 127628 133135 50845 24912 5032 7754 74946 41267 12108 30079 24230
4510 24230 37637 13549 32992 60782 -36773 -55391 -33386 10717 -5865 80120 136917 149687
4498 149687 102111 42365 33912 52236 71853 108943 96775 101547 62614 64871 55104 -19756
$$ packed form
4584C43933K5647o5086J3693r62j03661J4895k025n346k3838J4157L2071k5786
4572B17692J5505l8139L6363N4830p9840J6388j2699R151L0136o5315k8471m7428
4560A08173p6782P1772p975n377J32472r16n5181K9008J4714p5266p245p396q3748
4547C6253J6944O2777o2588N896J866n33k1113k2991O1972N6890n6302j9889K4031
4534H3213n8963Q2231k1770m8732Q320Q0901l0516k2735k8206J4723N2241m5063
4522F5644J7356M4628N507q2290k5933j9880K722O7192l3679k9159J7971n849
4510B4230J3407k4088J9443K7790r7555j8618K2005M4103j6582Q5985N6797J2770
4498A49687m7576n9746q453J8324J9617L7090j2168M772l8933K257r767p4860
$$ plain form
4486 -19756 35635 75916 100934 127871 122998 114990 41399 -7410 68719 58105 28270 24582
4474 24582 10230 22424 -35782 -61885 -10619 -2750 -4007 -64863 524 -6423 -35323 -3078
4462 -3078 35569 15365 68961 65270 65051 77302 -11941 15210 7804 15420 107020 66163 -23843
4449 -23843 -36894 57962 63742 -14543 -27237 29183 72642 62098 22597 -4986 -5425 -10887 5930
4436 5930 -19778 29720 30809 -2450 33922 -2839 51578 29579 23087 58764 81379 98680
4424 98680 65424 952 59936 64819 7659 12229 15917 23974 34547 -17963 -4123 5169 66048
4411 66048 118628 120062 -15830 -28351 14882 33392 61085 68030 72257 50590 15525 -2894
4399 -2894 110141 113322 132915 126035 41798 58588 65134 30682 72991 131258 138943 123540 24673
$$ packed form
4486a9756N5391M0281K5018K6937m873q008p3591m8809P6129j0614k9835l688
4474B4582j4352J2194n8206k6103N1266P869j257o0856O5387o947k8900L2245
4462c078L8647k0204N3596l691k19J2251q9243K7151p406P616R1600m0857r0006
4449b3843j3051R4856N780p8285j2694N6420M3459j0544l9501k7583m39n462J6817
4436E930k5708M9498J089l3259L6372l6761N4417k1999o492L5677K2615J7301
4424I8680l3256o4472N8984M883n7160M570L688Q057J0573n2510J3840R292O0879
4411F6048N2580J434j35892j2521M3233J8510K7693O945M227k1667l5065j8419
4399b894J13035L181J9593o880q4237J6790O546l4452M2309N8267P685j5403r8867
$$ plain form
4386 24673 70230 125788 82091 100583 149812 135111 146039 133816 55494 77578 64957 108619
4374 108619 169986 191869 154857 120328 57976 87530 95743 153508 150890 138218 157800 162479
4362 162479 136722 112467 76507 120495 18437 28079 199660 190147 109164 111919 21011 40956
4350 40956 87023 61912 127827 176723 181025 95015 213402 263835 150040 184082 194964 87112
4338 87112 47539 114614 133416 103473 87658 93862 48322 35333 21995 18945 25445 35205 3566
4325 3566 35079 34957 8286 59980 81463 16990 68923 9825 12556 -30558 -14682 49810 127703
4312 127703 115759 71138 33539 -29135 -10910 -26919 10852 27120 105984 67689 30366 21397
4300 21397 -258 -18317 -10371 -62273 -41368 15168 29880 5933 16480 -5077 2076 103603
$$ packed form
4386B4673M5557N5558m3697J8492M9229j4701J0928j2223p8322K2084j2621M3662
4374A08619O1367K1883l7012l4529o2352K9554Q213N7765k618j2672J9582M679
4362A62479k5757k4255l5960M3988j02058R642J71581r513q0983K755r0908J9945
4350D0956M6067k5111O5915M8896M302q6010J18387N0433j13795L4042J0882j07852
4338H7112l9573O7075J8802k9943j5815O204m5540j2989j3338l050O500R760l1639
4325C566L1513j22k6671N1694K1483o4473N1933n9098K731m3114J5876O4492P7893
4312A27703j1944m4621l7599o2674J8225j6009L7771J6268P8864l8295l7323q969
4300B1397k1655j8059P946n1902K0905N6536J4712k3947J0547k1557P153J01527
$$ plain form
4288 103603 47075 42670 72055 58465 26458 19625 91115 -13533 2060 94404 35887 -60581
4276 -60581 -9681 1634 15141 -7789 -98532 -67036 -31469 6316 1111 -82814 -18809 -51171
4264 -51171 72281 46767 18036 75569 90130 33053 103752 115487 125086 72302 -19450 7184
4252 7184 9544 15458 -49102 -75126 -38452 -19275 -22587 -58298 -82931 -18483 71444 25136 -23813
4239 -23813 27591 50077 62110 48707 81965 76185 45631 80577 24675 76610 131022 28876
4227 28876 60061 117921 40901 65283 141538 96110 44749 13944 15051 63482 109207 18038
4215 18038 -64848 -147806 -66270 17321 31877 9876 5818 7627 29713 79131 52612 64095
4203 64095 9416 1945 17975 29780 20750 71333 17739 -41441 18849 33043 6332 -26582
$$ packed form
4288A03603n6528m405K9385j3590l2007o833P1490j04648J5593R2344n8517r6468
4276f0581N0900J1315J3507k2930r0743L1496L5567L7785n205q3925O4005l2362
4264e1171J23452k5514k8731N7533J4561n7077P0699J1735R599n2784r1752K6634
4252G184K360N914o4560k6024L6674J9177l312l5711k4633O4448Q9927m6308m8949
4239b3813N1404K2486J2033j3403L3258n780l0554L4946n5902N1935N4412j02146
4227B8876L1185N7860p7020K4382P6255m5428n1361l0805J107M8431M5725r1169
4215A8038q2886q2958Q1536Q3591J4556k2001m058J809K2086M9418k6519J1483
4203F4095n4679p471J6030J1805r030N0583n3594n9180O0290J4194k6711l2914
$$ plain form
4191 -26582 37175 -17828 -9078 -45114 41433 54913 10693 -28236 90877 64312 130784 99354
4179 99354 27834 78715 77275 99893 91968 109843 96075 118465 140040 160281 188888 221928
4167 221928 180036 126123 108691 119304 83973 123369 55535 24395 50660 -23168 -53511 -63249
4155 -63249 -43824 -12257 3695 29395 -22520 -8820 88174 46181 69240 37882 37602 4865
4143 4865 74139 122100 144001 145195 107514 46975 102306 32242 -25690 24240 28951 5202
4131 5202 -2865 -728 -42277 39430 -20268 -6352 7842 -19073 -5466 102941 36935 32989
4119 32989 96723 74722 124744 83011 18188 56406 -23425 10528 2100 24939 52804 -29178
4107 -29178 32760 96969 47162 23816 24344 74482 104778 60575 -49476 -60780 -18120 38549
$$ packed form
4191b6582O3757n5003Q750l6036Q6547J3480m4220l8929J19113k6565O6472l1430
4179I9354p1520N0881j440K2618p925J7875j3768K2390K1575K0241K8607L3040
4167B21928m1892n3913j7432J0613l5331L9396o7834l1140K6265p3828l0343r738
4155f3249J9425L1567J5952K5700n1915J3700R6994m1993K3059l1358k80l2737
4143D865O9274M7961K1901J194l7681o0539N5331p0064n7932M9930M711k3749
4131E202q067K137m1549Q1707n9698J3916J4194k6915J3607J08407o6006l946
4119C2989O3734k2001N0022m1733o4823L8218p9831L3953q428K2839K7865q1982
4107b9178O1938O4209m9807k3346N28N0138L0296m4203j10051j1304M2660N6669
$$ plain form
4095 38549 25720 -20095 2333 -236 12098 -19846 4998 39920 29273 -4182 21605 55144
4083 55144 6339 5671 39001 94072 66419 104152 130886 88084 56290 79859 127134 153000
4071 153000 95217 79356 146099 160153 106518 89399 29819 -10333 -39337 2973 -19625 -29713
4059 -29713 29430 32654 18263 79942 101238 45645 28835 18904 -14831 -38908 23047 18564
4047 18564 653 12873 46634 -21302 -72388 76489 59488 107408 91164 21747 65442 108010
4035 108010 94488 11655 -15880 26897 102452 60115 65762 123061 110242 66531 39008 47644
4023 47644 87803 88183 75794 44374 26286 10888 43598 -5511 -26404 -4014 89969 73278
4011 73278 104117 49487 1664 18295 36980 31783 52957 38001 82804 72918 100934 72779
$$ packed form
4095C8549j2829m5815K2428k569J2334l1944K4844L4922j0647l3455K5787L3539
4083E5144m8805o68L3330N5071k7653L7733K6734m2802l1794K3569M7275K5866
4071A53000n7783j5861O6743J4054n3635j7119n9580m0152k9004M2310k2598j0088
4059b9713N9143L224j4391O1679K1296n5593j6810r931l3735k4077O1955m483
4047A8564j7911J2220L3761o7936n1086J48877j7001M7920j6244o9417M3695M2568
4035A08010j3522q2833k7535M2777P5555m2337N647N7299j2819m3711k7523Q636
4023D7644M0159L80j2389l1420j8088j5398L2710m9109k0893K2390R3983j6691
4011G3278L0839n4630m7823J6631J8685n197K1174j4956M4803r886K8016k8155
$$ plain form
3999 72779 69426 89031 117528 198273 175641 141516 141694 46074 100834 171025 156472 177034
3987 177034 215036 158697 151719 209371 182138 191063 189019 152184 176963 157812 167720 210719
3975 210719 117023 85452 88569 148766 174488 163474 123470 132670 111587 81309 114349 141519
3963 141519 155868 129811 158647 138515 183100 158580 191013 272863 238223 282771 165337
3952 165337 174385 220299 178719 123298 208944 236165 143234 149026 172958 152006 129500 138353
3940 138353 105294 176345 191933 134237 147399 81606 75190 78716 97336 58180 106253 177692
3928 177692 187772 229755 188428 145746 112488 117375 132172 93382 119065 97520 172751 167357
3916 167357 145835 148563 151469 86158 170011 257061 263337 219197 235190 199503 209083 205365 202640
$$ packed form
3999G2779l353J9605K8497Q0745k2632l4125J78r5620N4760P0191j4553K0562
3987A77034L8002n6339o978N7652k7233Q925k044l6835K4779j9151R908M2999
3975B10719r3696l1571L117O0197K5722j1014m0004R200k1083l0278L3040K7170
3963A41519J4349k6057K8836k0132M4585k4520L2433Q1850l4640M4548j17434
3952A65337R048M5914m1580n5421Q5646K7221r2931N792K3932k0952k2506Q853
3940A38353l3059P1051J5588n7696J3162o5793o416L526J8620l9156M8073P1439
3928A77692J0080M1983m1327m2682l3258M887J4797l8790K5683k1545P5231n394
3916A67357k1522K728K906o5311Q3853Q7050O276m4140J5993l5687R580l718k725
$$ plain form
3903 202640 179040 192853 235082 264540 210538 199922 204384 198772 210246 189824 208620 230892
3891 230892 286154 266771 285182 244498 313139 296261 271561 301814 275369 217492 255666 227999
3879 227999 241242 227264 236285 226042 190491 244663 191640 214412 249995 276478 296905 296825
3867 296825 370352 288767 165578 162954 238632 306145 318992 323995 303811 345772 335551 335322
3855 335322 411801 398338 363284 336743 313752 327677 370251 389537 373229 359705 370762 338661
3843 338661 346580 408457 474854 479248 481096 449574 469306 546222 537715 476402 425411 416421 529175
3830 529175 552712 622478 655914 630059 665207 673990 605653 575565 617592 674932 638190 612276
3818 612276 576919 647736 730818 781503 789872 797594 732470 794849 799151 796678 897833 882261
$$ packed form
3903B02640k3600J3813M2229K9458n4002j0616M462n612J1474k0422J8796K2272
3891B30892N5262j9383J8411m0684O8641j6878k4700L0253k6445n7877L8174k7667
3879B27999J3243j3978R021j0243l5551N4172n3023K2772L5583K6483K0427q0
3867B96825P3527q1585j23189k624P5678O7513J2847N003k0184M1961j0221k29
3855C35322P6479j3463l5054k6541k2991J3925M2574J9286j6308j3524J1057l2101
3843C38661P919O1877O6397M394J848l1522J9732P6916q507o1313n0991q990J12754
3830E29175K3537O9766L3436k5855L5148Q783o8337l0088M2027N7340l6742k5914
3818F12276l5357P0817Q3082N0685Q369P722o5124O2379M302k473J01155j5572
$$ plain form
3806 882261 838124 874471 853094 886194 950124 878888 842073 913347 920078 878359 971621 1034686
3794 1034686 1002440 1022675 1077326 963950 1056292 1188592 1157953 1190653 1167695 1164074 1191071
3783 1191071 1114181 1117812 1176712 1206844 1295486 1331384 1332266 1433367 1410129 1439069 1430051 1489755
3771 1489755 1443151 1429552 1491292 1514709 1588560 1706719 1693346 1641863 1683075 1685498 1693147 1680711
3759 1680711 1693262 1846837 1865979 1931280 1950034 1963468 1963189 1983948 2033228 2056003 2141622 2121007
3747 2121007 2153446 2172588 2188588 2226864 2273616 2216810 2243801 2276374 2329687 2388482 2445865
3736 2445865 2489450 2519338 2580982 2526067 2581240 2591383 2680103 2639578 2665261 2696784 2710772
3725 2710772 2756813 2846391 2919748 2977969 3018646 3043847 3030259 2982816 3024600 2982188 3151518
$$ packed form
3806H82261m4137L6347k1377L3100O3930p1236l6815P1274O731m1719R3262O3065
3794A034686l2246K0235N4651j13376R2342J32300l0639L2700k2958l621K6997
3783A191071p6890L631N8900L0132Q8642L5898Q82J01101k3238K8940r018N9704
3771A489755m6604j3599O1740K3417P3851J18159j3373n1483M1212K423P649j2436
3759A680711J2551J53575J9142O5301J8754J3434k79K0759M9280K2775Q5619k0615
3747B121007L2439J9142J6000L8276M6752n6806K6991L2573N3313N8795N7383
3736B445865M3585K9888O1644n4915N5173J0143Q8720m0525K5683L1523J3988
3725B710772M6041Q9578P3357N8221M0677K5201j3588m7443M1784m2412J69330
$$ plain form
3714 3151518 3212945 3193551 3242755 3310131 3355161 3397359 3418877 3383227 3403277 3345737 3363671
3703 3363671 3427963 3467587 3470442 3455833 3496807 3595188 3560237 3489936 3549833 3617527 3628346 3570766
3691 3570766 3599527 3671472 3692998 3637665 3673651 3741170 3696604 3645556 3652337 3624987 3651425 3714038
3679 3714038 3704133 3717867 3749854 3740475 3702797 3634383 3556818 3613398 3714558 3668055 3586632 3593922
3667 3593922 3579221 3608657 3614602 3572057 3582874 3570983 3635096 3616716 3606317 3660729 3529914
3656 3529914 3472904 3527687 3465333 3499053 3472513 3504335 3491006 3487987 3449836 3500841 3528383 3508718
3644 3508718 3484439 3486538 3377885 3366720 3389825 3362525 3416969 3426097 3398124 3349349 3369206 3377917
3632 3377917 3344634 3316307 3353650 3406653 3460390 3507362 3508033 3483690 3459567 3448218 3481058 3488027
$$ packed form
3714C151518O1427j9394M9204O7376M5030M2198K1518l5650K0050n7540J7934
3703C363671O4292L9624K855j4609M0974R8381l4951p0301N9897O7694J0819n7580
3691C570766K8761P1945K1526n5333L5986O7519m4566n1048O781k7350K6438O2613
3679C714038r905J3734L1987r379l7678o8414p7565N6580J01160m6503q1423P290
3667C593922j4701K9436N945m2545J0817j1891O4113j8380j0399N4412j30815
3656C529914n7010N4783o2354L3720k6540L1822j3329l019l8151N1005K7542j9665
3644C508718k4279K099j08653j1165K3105k7300N4444R128k7973m8775J9857Q711
3632C377917l3283k8327L7343N3003N3737M6972O71k4343k4123j1349L2840O969
$$ plain form
3620 3488027 3494511 3556683 3551957 3505349 3595394 3659244 3660717 3679593 3682145 3752558 3884994 3916873
3608 3916873 3914606 3904452 3962494 4087735 4109505 4182364 4270528 4282419 4324269 4355216 4479798
3597 4479798 4553833 4656602 4653377 4768744 4895575 5011617 5119856 5245297 5349680 5469291
3587 5469291 5646059 5643441 5783576 5896479 6070657 6214569 6374696 6510162 6620847 6856969
3577 6856969 7074648 7282741 7565333 7765582 7925464 8126959 8342211 8600925 8840952 9104580
3567 9104580 9294197 9605094 9899143 10128374 10362379 10687227 10963710 11265512 11620739 11970503
3557 11970503 12341882 12702618 13127306 13518654 13860398 14334356 14860162 15353234 15829611
3548 15829611 16353868 16846889 17326026 17772952 18271434 18674280 19124192 19674261 20230923
$$ packed form
3620C488027O484O2172m726m6608R0045O3850J473J8876K552P0413J32436L1879
3608C916873k267j0154N8042J25241K1770P2859Q8164J1891M1850L0947J24582
3597D479798P4035J02769l225J15367J26831J16042J08239J25441J04383J19611
3587E469291J76768k618J40135J12903J74178J43912J60127J35466J10685K36122
3577F856969K17679K08093K82592K00249J59882K01495K15252K58714K40027K63628
3567I104580J89617L10897K94049K29231K34005L24848K76483L01802L55227L49764
3557A1970503L71379L60736M24688L91348L41744M73958N25806M93072M76377
3548A5829611N24257M93021M79137M46926M98482M02846M49912N50069N56662
$$ plain form
3539 20230923 20751236 21138040 21572915 21961168 22462754 22988405 23422430 23962523 24552461
3530 24552461 25098060 25565807 26136281 26760566 27289571 28020884 28684541 29353585 30016172
3521 30016172 30717779 31435804 32041590 32735254 33467201 34136358 34732160 35379283 36074738
3512 36074738 36677314 37179037 37738497 38245972 38626873 39008967 39442657 39734370 39990925
3503 39990925 40291775 40649986 40925435 41241276 41511097 41763659 42059858 42293331 42480042
3494 42480042 42715371 43075394 43382847 43603721 43810296 44033924 44298260 44601733 44860072
3485 44860072 45046027 45257762 45494760 45598313 45718777 45792016 45791478 45721176 45727047 45532808 45459087
3474 45459087 45296225 45148708 45008684 44759684 44501800 44295366 44033370 43744242 43450022
$$ packed form
3539B0230923N20313L86804M34875L88253N01586N25651M34025N40093N89938
3530B4552461N45599M67747N70474O24285N29005P31313O63657O69044O62587
3521C0016172P01607P18025O05786O93664P31947O69157N95802O47123O95455
3512C6074738O02576N01723N59460N07475L80901L82094M33690K91713K56555
3503C9990925L00850L58211K75449L15841K69821K52562K96199K33473J86711
3494D2480042K35329L60023L07453K20874K06575K23628K64336L03473K58339
3485D4860072J85955K11735K36998J03553J20464P3239n38p0302N871j94239p3721
3474D5459087j62862j47517j40024k49000k57884k06434k61996k89128k94220
$$ plain form
3465 43450022 43150184 42864960 42436271 42026586 41610037 41211724 40844643 40382969 39917383
3456 39917383 39497895 39130716 38756745 38244916 37880613 37489200 37038101 36649919 36216939
3447 36216939 35849290 35476146 35045605 34593712 34131532 33642736 33117057 32563579 31968030
3438 31968030 31466895 30872148 30234678 29608524 29034444 28462312 27922130 27344386 26767215
3429 26767215 26174765 25711465 25178879 24640521 24158630 23676033 23191886 22766652 22347066
3420 22347066 21981981 21563884 21087665 20753774 20372246 20062688 19745952 19488378 19190083
3411 19190083 18782003 18453019 18141087 17850986 17504067 17267542 16910425 16606195 16398909
3402 16398909 16152608 15906867 15629489 15496835 15263504 15083351 14911090 14728339 14598828
$$ packed form
3465D3450022k99838k85224m28689m09685m16549l98313l67081m61674m65586
3456C9917383m19488l67179l73971n11829l64303l91413m51099l88182m32980
3447C6216939l67649l73144m30541m51893m62180m88796n25679n53478n95549
3438C1968030n01135n94747o37470o26154n74080n72132n40182n77744n77171
3429B6767215n92450m63300n32586n38358m81891m82597m84147m25234m19586
3420B2347066l65085m18097m76219l33891l81528l09558l16736k57574k98295
3411A9190083m08080l28984l11932k90101l46919k36525l57117l04230k07286
3402A6398909k46301k45741k77378j32654k33331j80153j72261j82751j29511
$$ plain form
3393 14598828 14568773 14475497 14285330 14231855 14179838 14112464 14054253 13946656 13943094 13924378 13993869
3382 13993869 13993753 13927404 13947287 14017127 14097946 14189138 14317932 14384198 14470549 14560513 14688675
3371 14688675 14780251 14990292 15144195 15271412 15515251 15658732 15814639 16074779 16325696 16624518
3361 16624518 16965048 17228975 17559462 17883218 18225528 18523446 18851788 19268655 19667188
3352 19667188 20028476 20496450 21009135 21464379 21913727 22435031 22957718 23489819 24005798
3343 24005798 24530069 25152714 25827110 26374826 26949040 27634545 28243907 28921702 29658559
3334 29658559 30314434 31128103 31992446 32832120 33712731 34593633 35388043 36376474 37471376
3325 37471376 38534292 39546353 40701851 41918096 43020393 44245977 45499312 46868911
$$ packed form
3393A4598828l0055r3276j90167n3475n2017o7374n8211j07597l562j8716O9491
3382A3993869j16o6349J9883O9840Q0819R1192J28794O6266Q6351Q9964J28162
3371A4688675R1576K10041J53903J27217K43839J43481J55907K60140K50917K98822
3361A6624518L40530K63927L30487L23756L42310K97918L28342M16867L98533
3352A9667188L61288M67974N12685M55244M49348N21304N22687N32101N15979
3343B4005798N24271O22645O74396N47716N74214O85505O09362O77795P36857
3334B9658559O55875Q13669Q64343Q39674Q80611Q80902P94410R88431J094902
3325C7471376J062916J012061J155498J216245J102297J225584J253335J369599
$$ plain form
3317 46868911 48135683 49413130 50703048 52138394 53524412 54966855 56412155 57848351
3309 57848351 59457676 61023454 62652024 64332103 66018084 67913810 69964100 72166073
3301 72166073 74295168 76607658 79094387 81718619 84565103 87494727 90557939 93785403
3293 93785403 97338418 100944577 104733470 108767987 112912448 117162045 121723902 126437038
3285 126437038 131285012 136284605 141466555 146805008 152416238 158272544 164273728 170615783
3277 170615783 177191645 184003913 191234233 198841313 206767837 214920921 223429479 232220348
3269 232220348 241248526 250521412 259897159 269418719 278836623 288238458 297603198 307106841
3261 307106841 316619971 326318868 336297849 346501832 356964529 367794001 378958355
$$ packed form
3317D6868911J266772J277447J289918J435346J386018J442443J445300J436196
3309E7848351J609325J565778J628570J680079J685981J895726K050290K201973
3301G2166073K129095K312490K486729K624232K846484K929624L063212L227464
3293I3785403L553015L606159L788893M034517M144461M249597M561857M713136
3285A26437038M847974M999593N181950N338453N611230N856306O001184O342055
3277A70615783O575862O812268P230320P607080P926524Q153084Q508558Q790869
3269B32220348R028178R272886R375747R521560R417904R401835R364740R503643
3261C07106841R513130R698897R978981J0203983J0462697J0829472J1164354
$$ plain form
3254 378958355 390341606 401784666 413059234 423734471 433352985 441426484 447576344
3247 447576344 451438067 452685406 451180160 447106711 440466790 431385975 420163630 407338321
3239 407338321 393328119 378557242 363499890 348239768 333263817 318621603 304453283
3232 304453283 290740679 277705346 265465585 253737572 242755471 232213985 222311526
3225 222311526 212935428 203836782 195182449 186892557 178937364 171338503 164044402 156959342
3217 156959342 150225176 143768864 137684057 131819019 126245108 120911978 115881747 111122092
3209 111122092 106520219 102272597 98269262 94381322 90771851 87319145 84041610 80935551
3201 80935551 77962235 75064640 72370541 69834822 67430142 65112409 62872293 60835519
$$ packed form
3254C78958355J1383251J1443060J1274568J0675237R618514Q073499O149860
3247D47576344L861723J247339j505246m073449o639921r080815j1222345j2825309
3239D07338321j4010202j4770877j5057352j5260122j4975951j4642214j4168320
3232C04453283j3712604j3035333j2239761j1728013j0982101j0541486r902459
3225B22311526r376098r098646q654333q289892p955193p598861p294101p085060
3217A56959342o734166o456312o084807n865038n573911n333130n030231m759655
3209A11122092m601873m247622m003335l887940l609471l452706l277535l106059
3201H0935551k973316k897595k694099k535719k404680k317733k240116k036774
$$ plain form
3193 60835519 58863804 56851720 54983467 53123834 51394138 49663673 48040473 46425339
3185 46425339 44952695 43608098 42184752 40887134 39690954 38518465 37408142 36334228
3177 36334228 35274119 34283998 33353222 32296871 31389106 30573275 29564744 28753034 28033589
3168 28033589 27262470 26439723 25729474 25025540 24383587 23718931 23042594 22470271 21894526
3159 21894526 21352134 20715419 20129816 19618252 19083222 18520334 18024710 17556971 17106175
3150 17106175 16704096 16238062 15723509 15248006 14901599 14666204 14280040 13882034 13630931
3141 13630931 13364909 13186900 12905132 12654427 12414643 12270467 12006939 11807735 11538579
3132 11538579 11356863 11217095 11023289 10906131 10747103 10565579 10435020 10236267 10026729
$$ packed form
3193F0835519j971715k012084j868253j859633j729696j730465j623200j615134
3185D6425339j472644j344597j423346j297618j196180j172489j110323j073914
3177C6334228j060109r90121r30776j056351r07765q15831j008531q11710p19445
3168B8033589p71119q22747p10249p03934o41953o64656o76337n72323n75745
3159B1894526n42392o36715n85603n11564n35030n62888m95624m67739m50796
3150A7106175m02079m66034n14553m75503l46407k35395l86164l98006k51103
3141A3630931k66022j78009k81768k50705k39784j44176k63528j99204k69156
3132A1538579j81716j39768j93806j17158j59028j81524j30559j98753k09538
$$ plain form
3123 10026729 9927912 9786053 9521477 9223848 9031629 8875687 8685692 8518477 8310127 8103844
3113 8103844 7875655 7761418 7623299 7418673 7232075 7113774 7026257 6866589 6808621 6621483
3103 6621483 6579422 6509049 6329348 6252694 6168091 6169886 6122946 6051479 6027913 5923783 5898091
3092 5898091 5859488 5789181 5648459 5603824 5541248 5525092 5514750 5452046 5394417 5313287 5316879
3081 5316879 5208891 5146281 5107371 5037652 4947001 4887808 4874987 4873369 4800185 4765219 4693393
3070 4693393 4680734 4661563 4605115 4550752 4547944 4571907 4426674 4454865 4348028 4360351 4376376
3059 4376376 4417363 4389788 4336932 4299205 4324422 4326189 4310943 4270829 4230205 4213667 4275163 4335686
3047 4335686 4258878 4232926 4298483 4323960 4203839 4272076 4240805 4267767 4323524 4357083 4348690
$$ packed form
3123A0026729r8817j41859k64576k97629j92219j55942j89995j67215k08350k06283
3113H103844k28189j14237j38119k04626j86598j18301q7517j59668n7968j87138
3103F621483m2061p0373j79701p6654q4603J795m6940p1467k3566j04130k5692
3092E898091l8603p0307j40722m4635o2576j6156j0342o2704n7629q1130L592
3081E316879j07988o2610l8910o9719r0651n9193j2821j618p3184l4966p1826
3070D693393j2659j9171n6448n4363k808K3963j45233K8191j06837J2323J6025
3059D376376M0987k7575n2856l7727K5217J767j5246m0114m0624j6538O1496O0523
3047D335686p6808k5952O5557K5477j20121O8237l1271K6962N5757L3559q393
$$ plain form
3036 4348690 4318422 4300131 4331663 4322957 4393999 4518330 4447519 4436205 4446035 4523467 4588053 4598576
3024 4598576 4629181 4674080 4739514 4772222 4834295 4847988 4918055 4881381 4927668 5069195 5163821
3013 5163821 5241025 5274988 5273380 5328519 5465513 5630589 5675967 5768375 5859592 5898912 5978632
3002 5978632 6062469 6185558 6232380 6350325 6515789 6660225 6678728 6785808 6945131 7049394
2992 7049394 7228563 7325001 7411394 7653971 7788569 7896723 8073484 8202695 8337588 8534131
2982 8534131 8799788 8993978 9089257 9268549 9466822 9656990 9963900 10205952 10314770 10571520
2972 10571520 10790535 11050208 11278420 11515919 11877828 12184107 12374850 12717464 13092702
2963 13092702 13333290 13707391 14027891 14355193 14763603 15175685 15555229 15880826 16335083
$$ packed form
3036D348690l0268j8291L1532q706P1042J24331p0811j1314R830P7432O4586J0523
3024D598576L0605M4899O5434L2708O2073J3693P0067l6674M6287J41527R4626
3013E163821P7204L3963j608N5139J36994J65076M5378R2408R1217L9320P9720
3002E978632Q3837J23089M6822J17945J65464J44436J8503J07080J59323J04263
2992G049394J79169R6438Q6393K42577J34598J08154J76761J29211J34893J96543
2982H534131K65657J94190R5279J79292J98273J90168L06910K42052J08818K56750
2972A0571520K19015K59673K28212K37499L61909L06279J90743L42614L75238
2963A3092702K40588L74101L20500L27302M08410M12082L79544L25597M54257
$$ plain form
2954 16335083 16851317 17271560 17877009 18483060 19146003 19793071 20419835 21094686 21926282
2945 21926282 22917656 23883557 24833367 25849376 26915259 28160248 29567305 31089132 32567192
2936 32567192 34192958 36009988 37975539 40155667 42511037 45059582 47677221 50380269
2928 50380269 53241031 56153969 59108830 62049074 64919279 67716735 70241948 72463671
2920 72463671 74423901 76215411 77857346 79271767 80417907 81272749 81884734 82471491 82960331
2911 82960331 83387201 83955944 84630140 85460710 86624141 87961005 89769035 92074631 94829390
2902 94829390 98206093 102164528 106212579 110129003 114211824 118967304 124069894 128869231
2894 128869231 131899290 132232801 130629377 128678188 127046012 125451527 122894157 118429622
$$ packed form
2954A6335083N16234M20243O05449O06051O62943O47068O26764O74851Q31596
2945B1926282R91374R65901R49810J016009J065883J244989J407057J521827J478060
2936C2567192J625766J817030J965551K180128K355370K548545K617639K703048
2928E0380269K860762K912938K954861K940244K870205K797456K525213K221723
2920G2463671J960230J791510J641935J414421J146140Q54842O11985N86757M88840
2911H2960331M26870N68743O74196Q30570J163431J336864J808030K305596K754759
2902I4829390L376703L958435M048051L916424M082821M755480N102590M799337
2894A28869231L030059L33511j603424j951189j632176j594485k557370m464535
$$ plain form
2886 118429622 112487937 106053218 99611846 93468419 87904160 83126117 79124558 75738356
2878 75738356 72984367 70658223 68861038 67394925 66203477 65386737 64862944 64585979 64521414
2869 64521414 64590419 64744285 64928381 65164343 65331815 65196473 64788551 64119198 63010330
2860 63010330 61628423 59960054 58049785 55785963 53316038 50657576 47815827 45065054
2852 45065054 42334534 39708973 37202748 34801557 32589804 30678322 28810313 27048858
2844 27048858 25500390 24132004 22786903 21644777 20582460 19501737 18502009 17634398
2836 17634398 16817694 16047329 15434039 14749851 14211842 13728491 13231255 12591040 12156947
2827 12156947 11746405 11312991 10952448 10587450 10274282 9918872 9591891 9250559 8888688
$$ packed form
2886A18429622n941685o434719o441372o143427n564259m778043m001559l386202
2878G5738356k753989k326144j797185j466113j191448q16740n23793k76965o4565
2869F4521414O9005J53866J84096K35962J67472j35342m07922o69353j108868
2860F3010330j381907j668369j910269k263822k469925k658462k841749k750773
2852D5065054k730520k625561k506225k401191k211753j911482j868009j761455
2844B7048858j548468j368386j345101j142126j062317j080723r99728q67611
2836A7634398q16704p70365o13290o84188n38009m83351m97236o40215m34093
2827A2156947m10542m33414l60543l64998l13168l55410l26981l41332l61871
$$ plain form
2818 8888688 8622972 8329626 8103024 7765192 7492094 7247773 7053746 6917654 6703536 6537314
2808 6537314 6415569 6132006 5914984 5761969 5543935 5491184 5387223 5229656 5166959 5007370
2798 5007370 4867796 4724992 4566532 4419487 4395798 4306736 4155048 4046687 4002572 3938968
2788 3938968 3783668 3661314 3588351 3552778 3470472 3434395 3310006 3265522 3189619 3189189 3137833
2777 3137833 3105579 3033566 2930761 2815700 2750035 2725638 2657425 2601373 2567470 2562019 2553635
2766 2553635 2509426 2479904 2404660 2312903 2204604 2200552 2195522 2120652 2042482 2076865 2034570 1941869
2754 1941869 1928801 1982920 1998688 1914930 1790272 1763430 1837111 1807434 1740659 1700912 1676311
2743 1676311 1706166 1760958 1650437 1609175 1568415 1595783 1647373 1612687 1551633 1502525 1485637
$$ packed form
2818H888688k65716k93346k26602l37832k73098k44321j94027j36092k14118j66222
2808F537314j21745k83563k17022j53015k18034n2751j03961j57567o2697j59589
2798E007370j39574j42804j58460j47045k3689q9062j51688j08361m4115o3604
2788C938968j55300j22354p2963l5573q2306l6077j24389m4484p5903m30n1356
2777C137833l2254p2013j02805j15061o5665k4397o8213n6052l3903n451q384
2766B553635m4209k9522p5244r1757j08299m052n030p4870p8170L4383m2295r2701
2754A941869j3068N4119J5768q3758j24658k6842P3681k9677o6775l9747k4601
2743A676311K9855N4792j10521m1262m0760K7368N1590l4686o1054m9108j6888
$$ plain form
2732 1485637 1366458 1341335 1412158 1418875 1352233 1325293 1358244 1372099 1318327 1258171 1265689 1202654
2720 1202654 1125176 1211085 1255435 1160455 1121576 1129854 1103758 1160274 1040247 953349 1047892
2709 1047892 1142444 1139158 1156424 1178246 1043203 1025763 1019198 1067259 1061544 995708 943803 964699
2697 964699 949775 919107 839813 836765 813350 729203 818633 807756 869620 905980 928635 955785
2685 955785 842491 831231 801491 734679 753818 848968 854899 773110 785821 805800 853002 821490
2673 821490 749404 742583 754521 744251 752510 756093 753525 826300 899533 854888 783130 777450 751727
2660 751727 753142 756898 796008 803579 727880 723985 724266 700273 671119 711575 805428 823617 805730
2647 805730 835006 825934 825348 881236 922113 929629 911772 897945 876868 846312 901686 934741
$$ packed form
2732A485637j19179k5123P0823O717o6642k6940L2951J3855n3772o0156P518o3035
2720A202654p7478Q5909M4350r4980l8879Q278k6096N6516j20027q6898R4543
2709A047892R4552l286J7266K1822j35043j7440o565M8061n715o5836n1905K0896
2697I64699j4924l0668p9294l048k3415q4147Q9430j0877O1864L6360K2655K7150
2685I55785j13294j1260k9740o6812J9139R5150N931q1789J2711J9979M7202l1512
2673H21490p2086o821J1938j0270Q259L583k568P2775P3233m4645p1758n680k5723
2660G51727J415L756L9110P571p5699l895K81k3993k9154M0456R3853J8189j7887
2647H05730K9276r072n86N5888M0877P516j7857j3827k1077l0556N5374L3055
$$ plain form
2635 934741 916260 966927 931187 910313 883370 1031693 967999 896863 972337 995149 917780
2624 917780 900144 893161 879674 949166 960035 919946 952200 1019974 1053981 1033267 1035875 1105781
2612 1105781 1128135 1133834 1134979 1134445 1083722 1054785 1084471 1108057 1088050 1031293 972671 933039
2600 933039 880336 909146 875553 776645 720491 695450 689576 737971 774959 722684 702756 731370
2588 731370 733705 707105 617427 640481 625934 612527 662000 715915 717153 737931 739304 727700
2576 727700 706339 660637 592486 603458 590245 571185 520461 541992 495293 557607 510655 473878
2564 473878 455297 455386 419255 358934 321771 319556 332888 282490 292200 294803 328638 325217 383256
2551 383256 310974 300334 363689 347954 301827 323580 329243 338730 294592 239539 317711 328580
$$ packed form
2635I34741j8481N0667l5740k0874k6943J48323o3694p1136P5474K2812p7369
2624I17780j7636o983j3487O9492J0869m0089L2254O7774L4007k0714K608O9906
2612A105781K2354N699J145n34n0723k8937K9686K3586k0007n6757n8622l9632
2600I33039n2703K8810l3593r8908n6154k5041n874M8395L6988n2275j9928K8614
2588G31370K335k6600q9678K3054j4547j3407M9473N3915J238K0778J373j1604
2576G27700k1361m5702o8151J0972j3213j9060n0724K1531m6699O2314m6952l6777
2564D73878j8581Q9l6131o0321l7163k215J3332n0398R710K603L3835l421N8039
2551C83256p2282j0640O3355j5735m6127K1753N663R487m4138n5053P8172J0869
$$ plain form
2539 328580 228465 299818 281149 226625 215221 259559 274565 302373 218279 129378 136839 190213
2527 190213 171429 171878 150585 165883 128387 87107 125827 195921 209168 211822 146416 196374
2515 196374 162197 196861 97521 121040 158792 70884 21182 -14693 56448 43860 105932 63660
2503 63660 136184 139199 83770 95520 146873 135685 121043 78095 149770 105000 76752 55813
2491 55813 95146 75133 73925 186900 139268 77950 113755 181834 173503 171060 141982 108748
2479 108748 155102 145059 81998 161344 195734 188188 142523 185303 227481 156249 175768 151215
2467 151215 167450 164049 90036 107395 156209 60125 138167 106681 54460 90414 94365 31072
2455 31072 37873 158331 178222 172512 104768 149802 117966 42820 44274 30297 150421 114839
$$ packed form
2539C28580j00115P1353j8669n4524j1404M4338J5006K7808q4094q8901P461N3374
2527A90213j8784M49k1293J5298l7496m1280L8720P0094J3247K654o5406M9958
2515A96374l4177L4664r9340K3519L7752q7908m9702l5875P1141j2588O2072m2272
2503F3660P2524L015n5429J1750N1353j1188j4642m2948P1675m4770k8248k0939
2491E5813L9333k0013j208J12975m7632o1318L5805O8079q331k443k9078l3234
2479A08748M6354j0043o3061P9346L4390p546m5665M2780M2178p1232J9519k4553
2467A51215J6235l401p4013J7359M8814r6084P8042l1486n2221L5954L951o3293
2455C1072O801J20458J9891n710o7744M5034l1836p5146J454j3977J20124l5582
$$ plain form
2443 114839 89298 66410 79501 44067 4255 7079 75346 42992 -38519 -15850 17372 32902
2431 32902 47062 117652 110954 68958 36206 62956 62759 68366 153280 91098 84458 117551 203873
2418 203873 170237 134800 40318 89623 129822 136746 157925 62028 96255 60373 105034 54522
2406 54522 37040 -137 5218 20066 105418 117478 105384 -6418 15229 13666 77521 120766
2394 120766 123987 131880 106121 71205 91696 138399 171478 114640 60295 66756 22464 -46833
2382 -46833 -8850 74677 36896 44064 128802 175300 156804 73240 84585 81435 81986 -19192
2370 -19192 -66966 25911 51754 109824 109117 150356 160207 136177 189514 215922 324655 316721
2358 316721 237267 177075 123350 115171 126772 120935 113778 137740 133408 81614 83605 121532 130764
$$ packed form
2443A14839k5541k2888J3091l5434l9812K824O8267l2354q1511K2669L3222J5530
2431C2902J4160P0590o698m1996l2752K6750j97N607Q4914o2182o640L3093Q6322
2418B03873l3636l5437r4482M9305M0199O924K1179r5897L4227l5882M4661n0512
2406E4522j7482l7177N355J4848Q5352J2060j2094j11802K1647j563O3855M3245
2394A20766L221P893k5759l4916K0491M6703L3079n6838n4345O461m4292o9297
2382d6833L7983Q3527l7781P168Q4738M6498j8496q3564J1345l150N51j01178
2370a9192m7774R2877K5843N8070p07M1239R851k4030N3337K6408J08733p934
2358C16721p9454o0192n3725q179J1601n837p157K3962m332n1794J991L7927R232
$$ plain form
2345 130764 132787 115046 194547 108095 -1617 36674 92587 108889 163682 89208 44020 57135
2333 57135 -27542 -5079 74541 85152 190946 164603 108394 82351 103646 101351 116708 83334
2321 83334 78957 86913 86778 67793 48366 45870 48078 1632 -4646 60205 15571 6286 82949
2308 82949 101075 104438 132258 107224 81881 121134 178969 134094 88732 102619 149092 20978
2296 20978 4661 25169 31062 111537 106919 65655 7286 -32131 -86289 -18882 66832 32258
2284 32258 99462 72757 31722 38131 109830 57354 -20076 11271 55840 114953 15980 38375
2272 38375 19190 50999 58319 2771 -10802 84089 93830 29909 661 24879 -25393 27857
2260 27857 73992 -6629 101934 111855 98068 82495 101091 109149 140810 136086 120100 91971
$$ packed form
2345A30764K023j7741P9501q6452j09712L8291N5913J6302N4793p4474m5188J3115
2333E7135q4677K2463P9620J0611J05794k6343n6209k6043K1295k295J5357l3374
2321H3334m377P956j35j8985j9427k496K208m6446o278O4851m4634r285P6663
2308H2949J8126L363K7820k5034k5343L9253N7835m4875m5362J3887M6473j28114
2296B0978j6317K0508N893Q0475m618m1264n8369l9417n4158O7407Q5714l4574
2284C2258O7204k6705m1035O409P1699n2476p7430L1347M4569N9113r8973K2395
2272C8375j9185L1809P320n5548j3573R4891R741o3921k9248K4218n0272N3250
2260B7857M6135q0621J08563R921j3787j5573J8596Q058L1661m724j5986k8129
$$ plain form
2248 91971 36192 54165 110017 175856 175934 104564 87407 64717 100988 185665 153275 144593 169626
2235 169626 183357 118457 101382 52017 38570 65188 22649 28311 51877 29048 64346 174102
2223 174102 139730 100469 131590 82664 58287 95981 19879 8903 101387 128329 143286 63232
2211 63232 72360 110125 63613 80795 50477 49845 96802 93912 123495 144470 187960 227179 250871
2198 250871 193486 34535 73402 145030 182953 224652 252080 229942 298000 267468 166686
2187 166686 151335 154364 182771 209877 190703 275537 251544 166317 167466 214603 242059 246934
2175 246934 223398 234055 328040 332580 327353 304571 303934 315314 285891 298205 343519 358281
2163 358281 358578 365389 354983 420149 367790 436659 454774 418656 503339 475071 486884 474680
$$ packed form
2248I1971n5779J7973N5852O5839P8p1370j7157k2690L6271Q4677l2390q682K5033
2235A69626J3731o4900j7075m9365j3447K6618m2539N662K3566k2829L5298J09756
2223A74102l4372l9261L1121m8926k4377L7694p6102j0976R2484K6942J4957q0054
2211F3232R128L7765m6512J7182l0318o32M6957k890K9583K0975M3490L9219K3692
2198B50871n7385j58951L8867P1628L7923M1699K7428k2138O8058l0532j00782
2187A66686j5351L029K8407K7106j9174Q4834k3993q5227J149M7137K7456M875
2175B46934k3536J0657R3985M540n227k2782o37J1380k9423J2314M5314J4762
2163C58281K97O811j0406O5166n2359O8869J8115l6118Q4683k8268J1813j2204
$$ plain form
2151 474680 480265 519964 543527 584868 621868 637807 577792 618885 721645 671833 761920 776206
2139 776206 843378 854960 804535 832765 851360 799656 936737 1016284 991807 934585 1043020
2128 1043020 1154295 1186906 1225351 1294400 1357018 1475898 1583827 1692381 1870344 1957635
2118 1957635 2110470 2345940 2439461 2513741 2719322 2891851 3089531 3282990 3501599 3820249
2108 3820249 4177544 4412036 4611018 4831175 5215664 5749899 6370941 7146948 8137016 9515244
2098 9515244 11231966 13594543 16490538 20607925 25842449 30600756 30539966 25420428 20472135
2089 20472135 16162307 13086171 10925985 9189947 7851612 6926766 6197379 5661554 5293557
2080 5293557 4938620 4729235 4487867 4194075 3850381 3537389 3169434 2877235 2706019 2478209
$$ packed form
2151D74680N585L9699K3563M1341L7000J5939o0015M1093J02760m9812R0087J4286
2139G76206O7172J1582n0425K8230J8595n1704J37081P9547k4477n7222J08435
2128A043020J11275L2611L8445O9049O2618J18880J07929J08554J77963Q7291
2118A957635J52835K35470R3521P4280K05581J72529J97680J93459K18609L18650
2108C820249L57295K34492J98982K20157L84489N34235O21042P76007R90068J378228
2098I515244J716722K362577K895995M117387N234524M758307o0790n119538m948293
2089B0472135m309828l076136k160186j736038j338335r24846p29387n35825l67997
2080E293557l54937k09385k41368k93792l43694l12992l67955k92199j71216k27810
$$ plain form
2070 2478209 2259700 2073650 1983581 1909496 1843871 1744585 1617672 1627572 1592010 1537509 1485780
2059 1485780 1442488 1527482 1521547 1363222 1301822 1193655 1105225 1092419 1011165 1013020 966563
2048 966563 981349 942776 807722 789002 746762 774782 729260 664742 659839 719914 667310 643853
2036 643853 699065 708650 623536 564718 542378 554763 524329 518963 534767 468191 402824 450620
2024 450620 522267 419947 368233 303627 233955 333691 334466 342444 329627 289063 227582 323418
2012 323418 349221 342097 284114 248480 222048 259448 241030 219146 214009 194140 204175 128143
2000 128143 108671 125502 101397 82596 119394 152536 124056 125706 206480 168152 70533 140903
1988 140903 184635 154836 140668 69723 113628 105607 91656 81069 56759 148299 148510 115303
$$ packed form
2070B478209k18509j86050r0069p4085o5625r9286j26913R900l5562n4501n1729
2059A485780m3292Q4994n935j58325o1400j08167q8430j2806q1254J855m6457
2048I66563J4786l8573j35054j8720m2240K8020m5522o4518m903O0075n2604k3457
2036F43853N5212R585q5114n8818k2340J2385l0434n366J5804o6576o5367M7796
2024D50620P1647j02320n1714o4606o9672R9736P75P978j2817m0564o1481R5836
2012C23418K5803p124n7983l5634k6432L7400j8418k1884n137j9869J0035p6032
2000A28143j9472J6831k4105j8801L6798L3142k8480J650Q0774l8328r7619P0370
1988A40903M3732k9799j4168p0945M3905q021j3951j0587k4310R1540K11l3207
$$ plain form
1976 115303 150455 108892 79715 140952 81372 122670 84249 19398 54968 50571 18753 86341
1964 86341 96907 -8515 -17512 11014 70818 105185 110121 41371 34471 15665 25263 52864
1952 52864 52965 94869 102861 52877 63680 98963 119547 21275 42096 117772 29595 89516
1940 89516 120602 43613 55613 25895 41693 49797 40966 46076 46322 24520 62055 34503 -31856
1927 -31856 -4477 44107 -32469 -18803 -1519 -51494 -25229 39008 46835 70218 23623 -5155
1915 -5155 59947 133553 81847 33686 -70970 24802 123702 45395 8249 -7576 17549 56834
1903 56834 49090 91685 29357 -20577 -10379 34451 58023 7954 2409 52453 59473 30918
1891 30918 -3891 -30300 -59720 -56309 3903 -38122 705 -38481 -50996 -86193 -53349 -29893
$$ packed form
1976A15303L5152m1563k9177O1237n9580M1298l8421o4851L5570m397l1818O7588
1964H6341J0566j05422q997K8526N9804L4367M936o8750o900j8806R598K7601
1952E2864J01M1904P992m9984J0803L5283K0584r8272K0821P5676q8177N9921
1940H9516L1086p6989J2000k9718J5798Q104q831N110K46k1802L7535k7552o6359
1927c1856K7379M8584p6576J3666J7284m9975K6265O4237P827K3383m6595k8778
1915e155O5102P3606n1706m8161j04656R5772R8900p8307l7146j5825K5125L9285
1903E6834p744M2595o2328m9934J0198M4830K3572n0069n545N0044P020k8555
1891C0918l4809k6409k9420L411O0212m2025L8827l9186j2515l5197L2844K3456
$$ plain form
1879 -29893 -23854 -17894 -5476 -22293 -54110 -36259 -15543 -49229 -42429 -23599 -100694 -198593
1867 -198593 -85013 -2647 -118715 -68322 17709 54259 -12102 10640 -21996 -50918 2574
1856 2574 -15611 -22166 11764 84038 60835 57592 61026 53971 80906 99526 42853 35325 48357
1843 48357 -2301 -43370 -61920 7760 39102 4220 31058 -27368 -45576 -10350 72968 73091
1831 73091 84097 24920 -15805 -15399 94516 148137 223204 153343 100790 121413 86264 25185
1819 25185 30972 71763 3405 -30571 -5119 -13860 -50121 -12757 -6577 -89257 -124356 -41972
1807 -41972 -44505 -23347 -82021 -92746 -9757 23329 40442 38757 24572 48447 -45718 -125994
1795 -125994 -73279 42418 21705 -15801 6551 25663 -66057 -85638 -115315 -84399 -1310
$$ packed form
1879b9893O039N960J2418j6817l1817J7851K0716l3686O800J8830p7095r7899
1867a98593J13580Q2366j16068N0393Q6031L6550o6361K2742l2636k8922N3492
1856B574j8185o555L3930P2274k3203l243L434p055K6935J8620n6673p528J3032
1843D8357n0658m1069j8550O9680L1342l4882K6838n8426j8208L5226Q3318J23
1831G3091J1006n9177m0725M06J09915N3621P5067o9861n2553K0623l5149o1079
1819B5185N787M0791o8358l3976K5452q741l6261L7364O180q2680l5099Q2384
1807d1972k533K1158n8674j0725Q2989L3086J7113j685j4185K3875r4165q0276
1795a25994N2715J15697k0713l7506K2352J9112r1720j9581k9677L0916Q3089
$$ plain form
1784 -1310 12734 87650 44521 -27199 -36700 -56754 -61817 -15739 -35013 -35917 -79467 -24256 43307
1771 43307 1866 -23467 5221 32695 75590 21714 -28668 6763 -51360 -90691 -92391 -96424
1759 -96424 -69234 -141393 -97518 -18831 -41967 -86183 -22468 67022 11540 -45176 37156 93132
1747 93132 71319 9816 6073 27590 8556 13856 -5344 -77003 -64245 5699 88449 63092
1735 63092 -57761 -120754 -80914 73268 -58676 -69163 -51957 -34532 -37283 -62054 -101328
1724 -101328 -65677 -49953 -54470 -25068 44602 12048 -18554 -118379 -85122 -50453 -26497 11927
1712 11927 -36414 -49671 -95556 -63151 -29027 -19198 11561 -56876 -117749 -61702 -8089 40876
1700 40876 -40322 -66779 -64935 -41608 -13622 8772 -56657 -28427 28825 21740 50367 54622
$$ packed form
1784a310J4044P4916m3129p1720r501k0054n063M6078j9274r04m3550N5211O7563
1771D3307m1441k5333K8688K7474M2895n3876n0382L5431n8123l9331j700m033
1759i6424K7190p2159M3875P8687k3136m4216O3715Q9490n5482n6716Q2332N5976
1747I3132k1813o1503l743K1517j9034N300j9200p1659J2758O9944Q2750k5357
1735F3092j20853o2993L9840J54182j31944j0487J7206J7425k751k4771l9274
1724a01328L5651J5724m517K9402O9670l2554l0602r9825L3257L4669K3956L8424
1712A1927m8341j3257m5885L2405L4124R829L0759o8437o0873N6047N3613M8965
1700D0876q1198k6457J844K3327K7986K2394o5429K8230N7252p085K8627M255
$$ plain form
1688 54622 -17707 -33499 -70289 -72796 35563 12839 2314 25724 5560 -59298 -117284 -64094
1676 -64094 -22569 -11349 -3984 -17947 3865 -99757 -138407 -128048 -95493 -34816 1500 -33906
1664 -33906 -60380 -9404 -16737 -30785 -58692 -13127 1961 -25749 -98718 -62154 -98174 -151055
1652 -151055 -93792 -10068 -3822 -43627 -67458 -32698 -25667 -91292 -84203 -11596 10956 -33802
1640 -33802 -12280 -66830 -57700 -56116 -40238 -36825 -7929 -3391 -88957 -64910 8971 -7587 11880
1627 11880 -55202 -84454 -148375 -118419 -42581 -61653 -2501 -36827 -42628 -33751 22089 86217
1615 86217 51396 -29167 45773 37589 -22585 -15543 45801 -41217 -47115 -36337 6624 -37429
1603 -37429 -126879 -130741 -85706 -111567 -63814 -22980 -71838 -134202 -51825 37936 -4902 -56221
$$ packed form
1688E4622p2329j5792l6790k507J08359k2724j0525K3410k0164o4858n7986N3190
1676f4094M1525J1220P365j3963K1812j03622l8650J0359L2555O0677L6316l5406
1664c3906k6474N0976p333j4048k7907M5565J5088k7710p2969L6564l6020n2881
1652a51055N7263Q3724O246l9805k3831L4760P031o5625P089P2607K2552m4758
1640c3802K1522n4550R130J584J5878L413K8896M538q5566K4047P3881j6558J9467
1627A1880o7082k9252o3921K9956P5838j9072N9152l4326n801Q877N5840O4128
1615H6217l4821q0563P4940q184o0174P042O1344q7018n898J0778M2961m4053
1603c7429q9450l862M5035k5861M7753M0834m8858o2364Q2377Q9761m2838n1319
$$ plain form
1591 -56221 -62913 -22878 3162 -115874 -172358 -58796 -70924 -108643 -156389 -83445 -87616 -58379
1579 -58379 -126548 -143326 -131329 -112841 -73452 -24694 -64006 -97615 -110316 -68835 75035 54840
1567 54840 11506 -36500 -87659 -51259 2577 -44160 -29304 -57198 -66265 -139297 -108947 -48230
1555 -48230 -48315 28604 7409 14232 -12483 -72306 -62543 -6958 -46008 -128753 -71145 -5965 -108817
1542 -108817 -111550 -33384 12764 -25526 -8509 -21638 -58614 -58891 17689 51057 -39816 10546
1530 10546 -16962 5093 -37957 -101742 -81518 -48267 -66496 -86881 -56064 -68759 -75899 -69757
1518 -69757 -67979 -91451 -88570 -75557 -68203 -113140 -61608 -70247 -38944 -106254 -62312 -50249 -51801
1505 -51801 -44248 -132050 -83690 -40986 -28416 -92159 -92430 -106264 -48813 -69008 -94005 -152415
$$ packed form
1591e6221o692M0035K6040j19036n6484J13562j2128l7719m7746P2944m171K9237
1579e8379o8169j6778J1997J8488L9389M8758l9312l3609j2701M1481J43870k0195
1567E4840m3334m8006n1159L6400N3836m6737J4856k7894r067p3032L0350O0717
1555d8230q5P6919k1195O823k6715n9823R763N5585l9050q2745N7608O5180j02852
1542a08817k733P8166M6148l8290J7017j3129l6976k77P6580L3368r0873N0362
1530A0546k7508K2055m3050o3785K0224L3251j8229k0385L0817j2695p140O142
1518f9757J778k3472K881J3013P354m4937N1532q639L1303o7310M3942J2063j552
1505e1801P553q7802M8360M2704J2570o3743k71j3834N7451k0195k4997n8410
$$ plain form
1493 -152415 -122573 -168423 -76883 9444 -34362 89310 30984 -10777 3204 -87969 -192093
1482 -192093 -150506 -30399 20846 -72665 -91415 -53854 -49765 -72271 -72148 -67699 -63710 -28627
1470 -28627 32094 14639 -88697 -170624 -89665 -104827 -103687 -64390 -64561 4510 25521 -55429
1458 -55429 -84965 -70213 -69964 -57126 25975 77975 -45732 -19626 -39276 -21974 3458 -37515
1446 -37515 -11008 -41813 5711 -23593 -125707 -76057 -44093 -48830 -100810 -157208 -66512 -25760
1434 -25760 -39076 -53637 -65886 -71994 -65715 -78709 -54303 -27363 -54561 -61879 -102910 -104826 -115961
1421 -115961 -69385 52095 43391 -11493 -85149 -79898 -45248 -12993 -82302 -104825 -35492 -20839
1409 -20839 -17636 -19877 -30278 -77500 1305 -16879 9936 -26462 -94299 -57460 -15767 -24226
$$ packed form
1493a52415K9842m5850R1540Q6327m3806J23672n8326m1761J3981r1173j04124
1482a92093M1587J20107N1245r3511j8750L7561M089k2506J23M449L989L5083
1470b8627O0721j7455j03336q1927Q0959j5162J140L9297j71O9071K1011q0950
1458e5429k9536J4752K49J2838Q3101N2000j23707K6106j9650J7302K5432m0973
1446c7515K6507l0805M7524k9304j02114M9650L1964m737n1980n6398R0696M0752
1434b5760j3316j4561j2249o108O279j2994K4406K6940k7198p318m1031j916j1135
1421a15961M6576J21480q704n4884p3656N251L4650L2255o9309k2523O9333J4653
1409b0839L203k241j0401m7222P8805j8184K6815l6398o7837L6839M1693q459
$$ plain form
1397 -24226 -72116 -89219 -115634 -91052 -97918 -143404 -66646 -17109 -68509 -73540 -77148 -61018
1385 -61018 -58852 6079 -11085 -43722 14513 -53756 -40757 -14496 -38226 -52925 -1970 1865
1373 1865 14289 10937 -46470 -57741 -15519 -68030 -83617 -20453 -2362 13042 -21177 -23443
1361 -23443 -23137 -22911 -1287 11711 -23070 -21358 8475 -41238 -35118 -38345 -62379 -44007 -45698
1348 -45698 -58670 -34125 -68157 -49929 1071 -15491 -122029 39552 29875 -53320 -29433 -34064
1336 -34064 -89573 -70799 16859 -14436 -42354 -44496 -96481 -87319 -62965 -85933 19798 52657
1324 52657 27962 12347 -17137 -38246 -38086 -71516 -95603 -123531 -55320 -87394 -123131 -46447
1312 -46447 -54693 -112119 -99607 -84632 -59329 -57853 -35436 -72052 -63358 -3253 -2492 -44316 -92671
$$ packed form
1397b4226m7890j7103k6415K4582o866m5486P6758M9537n1400n031l608J6130
1385f1018K166O4931j7164l2637N8235o8269J2999K6261k3730j4699N0955L835
1373A865J2424l352n7407j1271M2222n2511j5587O3164J8091J5404l4219k266
1361b3443L06K26K1624J2998l4781J712K9833m9713O120l227k4034J8372j691
1348d5698j2972K4545l4032J8228N1000j6562j06538J61581r677q3195K3887m631
1336c4064n5509J8774Q7658l1295k7918k142n1985R162K4354k2968J05731L2859
1324E2657k4695j5615k9484k1109J60l3430k4087k7928O8211l2074l5737P6684
1312d6447q246n7426J2512J4975K5303J476K2417l6616Q694O0105P61m1824m8355
$$ plain form
1299 -92671 -55263 -79025 -69443 18710 63421 74876 4315 71600 5064 -17938 -26075 -103413
1287 -103413 -115044 -73438 -21902 20739 -16938 -10374 -33980 -52624 -76593 -69836 -75519 -17999
1275 -17999 17555 12767 20713 78142 64042 27948 -48017 17551 -4121 -25769 6389 9562
1263 9562 53853 28044 31156 -20342 -126584 -104068 -62775 -85882 -77899 -93503 -29182 13705
1251 13705 -149 -120346 -98301 -53714 -15792 -57144 -13872 -22598 -8710 -21962 -39644 -28379
1239 -28379 -40161 3339 -61386 -91238 -53353 -32932 2263 29931 -15268 -61135 -4313 -105332
1227 -105332 -146570 -116456 -28710 -59053 -76683 -28077 25281 -37055 8019 59036 70804 50234
1215 50234 52327 40655 -27420 -1987 -14042 12437 22496 -90207 -118302 -31060 -27540 -3387
$$ packed form
1299i2671L7408k3762R582Q8153M4711J1455p0561O7285o6536k3002q137p7338
1287a03413j1631M1606N1536M2641l7677O564k3606j8644k3969O757n683N7520
1275a7999L5554m788P946N7429j4100l6094p5965O5568k1672k1648L2158L173
1263I562M4291k5809L112n1498j06242K2516M1293k3107P983j5604O4321M2887
1251A3705j3854j20197K2045M4587L7922m1352M3272q726J3888j3252j7682J1265
1239b8379j1782M3500o4725k9852L7885K0421L5195K7668m5199m5867N6822j01019
1227a05332m1238L0114Q7746l0343j7630M8606N3358o2336M5074N1017J1768k0570
1215E0234K093j1672o8075K5433j2055K6479J0059j12703k8095Q7242L520K4153
$$ plain form
1203 -3387 -65637 -45186 -31854 -47039 -73313 -37413 -6383 -17110 -11969 -28425 -46969 -95035
1191 -95035 -60631 -13581 -72308 -28161 -29768 -41877 -53767 -53606 -46508 25561 -6808 -85509 -60214
1178 -60214 -43441 9910 40724 3404 -26833 -69949 -36162 -75760 -60278 21371 -85487 -93969
1166 -93969 10062 -75067 -179432 -103320 -124429 -48440 -110723 -36537 -84941 -112578 -27349
1155 -27349 -65500 -44677 -49797 -52783 -95240 -113054 -73329 -41365 -19424 -2689 -71477 -59911
1143 -59911 -70692 -88248 -38924 -19931 -19744 -56282 19804 -11703 -71001 -111964 -61227 -70835
1131 -70835 -11635 19929 -73519 -118688 -101153 -40211 -22967 -5880 -49989 -85869 -33777 8567
1119 8567 -12398 -65642 -33172 34583 28424 56435 8964 22796 40774 37447 -8396 58030
$$ packed form
1203c387o2250K0451J3332j5185k6274L5900L1030j0727N141j6456j8544m8066
1191i5035L4404M7050n8727M4147j607j2109j1890J61P098P2069l2369p8701K5295
1178f0214J6773N3351L0814l7320l0237m3116L3787l9598J5482Q1649j06858q482
1166i3969J04031q5129j04365P6112k1109P5989o2283P4186m8404k7637Q5229
1155b7349l8151K0823n120k986m2457j7814L9725L1964K1941J6735o8788J1566
1143e9911j0781j7556M9324J8993J87l6538P6086l1507n9298m0963N0737r608
1131g0835N9200L1564r3448m5169J7535O0942J7244J7087m4109l5880N2092M2344
1119H567k0965n3244L2470O7755o159K8011m7471J3832J7978l327m5843O6426
$$ plain form
1107 58030 72666 -4607 -63965 -6566 -78530 -98053 -94411 -2754 -34344 -76936 -23262 12998
1095 12998 81375 56407 4066 5128 -70414 -118145 -60588 -52308 -19856 -55633 -89312 -63214
1083 -63214 -32363 6432 -37300 -106545 -43062 -8635 -2505 28944 -15607 -48956 -44849 -24800
1071 -24800 30002 35126 -6821 -75644 -87652 -48653 -67920 -55014 -25128 -78942 -95418 -78305
1059 -78305 -71942 -50701 -21414 34861 90582 102589 85078 65542 52352 5431 850 4162
1047 4162 -55321 -4657 -79543 -135062 -92521 -135114 -155371 -121275 -11563 -3925 -39177 -53048
1035 -53048 -7985 -18706 4285 89439 73541 33612 36680 -22924 -42973 -29942 -84368 6117
1023 6117 41572 35565 -41184 -55595 -36250 -26297 -57139 -70176 -13935 20072 -25792 -51211
$$ packed form
1107E8030J4636p7273n9358N7399p1964j9523L642R1657l1590m2592N3674L6260
1095A2998O8377k4968n2341J062p5542m7731N7557Q280L2452l5777l3679K6098
1083f3214L0851L8795m3732o9245O3483L4427O130L1449m4551l3349M107K0049
1071b4800N4802N124m1947o8823j2008L8999j9267J2906K9886n3814j6476J7113
1059g8305O363K1241K9287N6275N5721J2007j7511j9536j3190m6921m581L312
1047D162n9483N0664p4886n5519M2541m2593k0257L4096J09712P638l5252j3871
1035e3048M5063j0721K2991Q5154j5898l9929L068n9604k0049J3031n4426R0485
1023F117L5455o007p6749j4411J9345R953l0842j3037N6241L4007m5864k5419
$$ plain form
1011 -51211 31287 -88963 -118422 -63088 -44696 -94140 -48928 -60300 -46856 79499 60238
1000 60238 19769 39164 37128 52291 55502 -14680 -121352 -134978 -95543 -35814 -44163 -82470
988 -82470 -74966 3103 -78553 -4849 -13694 2020 13598 -26959 -28366 -2468 10077 -32478 -6686
975 -6686 3563 -23015 37244 62256 608 -18851 53951 90573 76613 36993 -17554 -2562
963 -2562 18532 61309 59159 70525 22779 51944 -42500 -69061 -113920 -98469 -110139 -41814
951 -41814 -40491 -50118 -37393 -14540 39295 31996 62072 -44 -36181 -33626 -6323 75877 42164
938 42164 109639 49678 -75685 -69293 -17361 10122 -1868 -11697 -120968 -81087 -41076 -48055
926 -48055 -8093 17448 -11002 -24065 -5839 -77209 -42772 29785 16038 68278 26177 44408
$$ packed form
1011e1211Q2498j20250k9459N5334J8392m9444M5212j1372J3444J26355j9261
1000F0238m0469J9395k036J5163L211p0182j06672j3626L9435N9729q349l8307
988h2470P504P8069q1656P3704q845J5714J1578m0557j407K5898J2545m2555K5792
975f686J0249k6578O0259K5012o1648j9459P2802L6622j3960l9620n4547J4992
963b562K1094M2777k150J1366m7746K9165r4444k6561m4859J5451j1670O8325
951d1814J323r627J2725K2853N3835p299L0076o2116l6137K555K7303Q2200l3713
938D2164O7475n9961j25363O392N1932K7483j1990r829j09271L9881M0011o979
926d8055L9962K5541k8450j3063J8226p1370L4437P2557j3747N2240m2101J8231
$$ plain form
914 44408 19187 -38161 30650 85562 -2066 -14608 -26046 52432 82264 21710 96278 88207
902 88207 -67138 -30402 33930 29676 -83194 -97984 18392 22803 5670 -6903 -15120 -20622
890 -20622 43352 -8593 1479 -34253 -7171 27064 -41631 -44519 -102077 -65394 33221 10558
878 10558 -17510 -118185 -6888 -9516 2873 13395 13986 30600 -6915 -57661 -102281 -71528
866 -71528 -63219 -72642 -9861 6598 -50275 -98919 -80640 -102917 -53642 -54750 -78788 -27564 -76117
853 -76117 -137010 -93381 -24768 19793 9699 17406 100869 51124 87789 27895 18653 4230
841 4230 24284 83697 33262 58783 78442 11911 -53411 -119500 -140839 -54641 -52820 -30457
829 -30457 -12582 -28178 -55832 -70769 -23437 -71681 -13861 49863 64109 41916 -41488 27663
$$ packed form
914D4408k5221n7348O8811N4912q7628j2542j1438P8478K9832o0554P4568q071
902H8207j55345L6736O4332m254j12870j4790J16376M411j7133j2573q217n502
890b0622O3974n1945J0072l5732K7082L4235o8695k888n7558L6683R8615k2663
878A0558k8068j00675J11297k628J2389J0522N91J6614l7515n0746m4620L0753
866g1528Q309r423O2781J6459n6873m8644J8279k2277M9275j108k4038N1224m8553
853g6117o0893M3629O8613M4561j0094P707Q3463m9745L6665n9894r242j4423
841D230K0054N9413n0435K5521J9659o6531o5322o6089k1339Q6198J821K2363
829c0457J7875j5596k7654j4937M7332m8244N7820O3724J4246k2193q3404O9151
$$ plain form
817 27663 101336 32341 -13804 -12192 39298 6926 14271 57782 143393 77105 61517 92835
805 92835 -16524 22613 61761 -9686 -2562 -27710 -25633 -60459 -61580 -43963 21376 14084 97630
792 97630 90637 89467 161653 70722 31387 15253 -10862 -51205 -60953 -62345 14216 24384 -64489
779 -64489 4042 21842 -54812 -52827 -36560 3723 33587 16148 -6842 26162 32698 -32568
767 -32568 -125109 -94398 -27303 -2891 -3986 89713 48459 -10139 50084 54427 64961 -35815
755 -35815 -45950 -9182 -40391 -32566 -74320 -49450 -39612 230 26716 49956 64492 48015
743 48015 -2496 -25424 9560 55356 76644 41656 10142 12077 17982 -41559 -33507 -7441 7839
730 7839 -71659 -114798 -56658 -50839 17616 36014 60648 41982 -24758 -32795 -29747 22537 97797
$$ packed form
817B7663P3673o8995m6145J612N1490l2372P345M3511Q5611o6288j5588L1318
805I2835j09359L9137L9148p1447P124k5148K077l4826j121J7617O5339p292Q3546
792I7630o993j170P2186r0931l9335j6134k6115m0343r748j392P6561J0168q8873
779f4489O8531J7800p6654J985J6267M0283K9864j7439k2990L3004O536o5266
767c2568r2541L0711O7095K4412j095R3699m1254n8598O0223M343J0534j00776
755c5815j0135L6768l1209P825m1754K4870R838L9842K6486K3240J4536j6477
743D8015n0511k2928L4984M5796K1288l4988l1514J935N905n9541Q052K6066J5280
730G839p9498m3139N8140N819O8455J8398K4634j8666o6740q037L048N2284P5260
$$ plain form
717 97797 40647 51950 -29468 -17577 17973 -47867 -71305 -38164 -27907 6132 16560 34116
705 34116 25492 48126 64985 3931 -12878 -69182 -41337 -26177 -4060 17651 72689 62841
693 62841 -8651 -18339 40094 22318 -2151 15149 37837 83438 107194 89329 61326 41578
681 41578 11204 16948 -10955 20104 66078 38339 11560 -36740 -21071 -22244 -38496 -52912
669 -52912 -51588 -7605 -53799 -14895 57399 -2162 -34626 -6550 -19967 20372 23589 -7626
657 -7626 -30050 -52724 11630 -13909 29826 17103 5373 -16144 10374 -16202 -45710 5139
645 5139 -49622 -30217 -42410 -16659 -54959 -56231 -83347 10332 42881 78422 97397 54225
633 54225 67898 37521 18895 63223 27251 -15194 27348 42069 18922 71628 98153 17933
$$ packed form
717I7797n7150J1303q1418J1891L5550o5840k3438L3141J0257L4039J0428J7556
705C4116q624K2634J6859o1054j6809n6304K7845J5160K2117K1711N5038r848
693F2841p1492r688N8433j7776k4469J7300K2688M5601K3756j7865k8003j9748
681D1578l0374N744k7903L1059M5974k7739k6779m8300J5669j173j6252j4416
669e2912J324M3983m6194L8904P2294n9561l2464K8076j3417M0339L217l1215
657g626k2424k2674O4354k5539M3735j2723j1730k1517K6518k6576k9508N0849
645E139n4761J9405j2193K5751l8300j272k7116R3679L2549L5541J8975m3172
633E4225J3673l0377j8626M4328l5972m2445M2542J4721k3147N2706K6525q0220
$$ plain form
621 17933 14481 7484 65105 94759 79829 2266 54787 51140 48930 -4773 -35841 -97395 -32188
608 -32188 45711 71061 12675 14678 90098 110490 71186 -36098 -43451 8244 46793 -60625
596 -60625 -97528 -29868 -25927 -25775 -2528 -36903 25021 10169 48271 76045 -19962 23542 63535
583 63535 125162 96656 46094 39767 14664 93938 77285 44978 14611 31905 49905 41993
571 41993 -10211 11362 14769 -21201 43058 49516 108511 110075 85882 40082 42784 152583 115115
558 115115 77426 93694 -10108 39214 95031 104914 85650 108126 22559 59569 80786 89029
546 89029 55861 16756 10786 1295 48108 30038 26382 10585 114869 108576 57666 68616 55098
533 55098 61115 89832 150388 120987 57951 -18854 -41399 61137 63456 58109 45703 -11950
$$ packed form
621A7933l452o997N7621K9654j4930p7563N2521l647k210n3703l1068o1554O5207
608c2188P7899K5350n8386K003P5420K0392l9304j07284p353N1695L8549j07418
596f0625l6903O7660L941J52K3247l4375O1924j4852L8102K7774r6007M3504L9993
583F3535O1627k8506n0562o327k5103P9274j6653l2307l0367J7294J8000p912
571D1993n2204K1573L407l5970O4259O458N8995J564k4193m5800K702J09799l7468
558A15115l7689J6268j03802M9322N5817R883j9264K2476q5567L7010K1217Q243
546H9029l3168l9105n970r491M6813j8070l656j5797J04284o293n0910J0950j3518
533E5098O017K8717O0556k9401o3036p6805k2545J02536K319n347j2406n7653
$$ plain form
521 -11950 21217 16256 96645 117249 8177 -55313 -59242 -22237 -6521 32023 3160 11172
509 11172 -6357 26392 47161 125857 86615 40857 14028 23630 52173 89474 24516 143967
497 143967 74823 67270 91611 57342 78794 17938 -56565 -2713 9598 36007 12838 35871
485 35871 107827 66209 -31845 -36953 68380 25410 4977 25868 60834 46387 106054 47242
473 47242 7911 111604 61135 96110 61687 1274 -51144 -164946 -72876 26641 55694 -27900
461 -27900 -33107 45787 4890 -3293 82657 124074 53949 71739 86975 11928 60882 52540 34845
448 34845 114576 167019 133856 97829 89097 138613 94817 120031 141352 70458 10038 34149
436 34149 -34985 25277 49116 72085 90607 97542 44254 16270 29110 69759 88708 84106
$$ packed form
521a1950L3167m961Q0389K0604j09072o3490l929L7005J5716L8544k8863Q012
509A1172j7529L2749K0769P8696l9242m5758k6829R602K8543L7301o4958J19451
497A43967o9144p553K4341l4269K1452o0856p4503N3852J2311K6409k3169K3033
485C5871P1956m1618r8054n108J05333m2970k0433K0891L4966j4447N9667n8812
473D7242l9331J03693n0469L4975l4423o0413n2418j13802R2070R9517K9053q3594
461b7900n207P8894m0897q183Q5950M1417p0125J7790J5236p5047M8954q342j7695
448C4845P9731N2443l3163l6027q732M9516m3796K5214K1321p0894o0420K4111
436C4149o9134O0262K3839K2969J8522O935n3288k7984J2840M0649J8949m602
$$ plain form
424 84106 144748 204884 143961 169175 112122 71075 78236 74406 63515 75569 46602 67523
412 67523 123885 79474 60609 102393 102688 36354 128676 64188 61532 33316 -26739 -23787 28623
399 28623 54931 59309 59100 22626 63509 111115 59403 113386 136053 110293 92460 103810 76279
386 76279 73051 89540 74386 40441 -4120 14777 61294 86250 43940 78044 110722 109251
374 109251 48509 91178 92641 125980 151251 156959 105139 112565 67483 78437 110517 69463
362 69463 14109 42340 57112 20236 67536 126940 108256 95508 165952 58407 51570 31341
350 31341 94089 103173 39147 108763 146430 115877 90386 29612 145205 104995 66680 25565
338 25565 -30340 4634 -16568 67441 82807 107616 63180 -5542 89818 125868 137454 168258
$$ packed form
424H4106O0642O0136o0923K5214n7053m1047P161l830j0891J2054k8967K0921
412F7523N6362m4411j8865M1784K95o6334R2322o4488k656k8216o0055K952N2410
399B8623K6308M378k09l6474M0883M7606n1712N3983K2667k5760j7833J1350k7531
386G6279l228J6489j5154l3945m4561J8897M6517K4956m2310L4104L2678j471
374A09251o0742M2669J463L3339K5271N708n1820P426m5082J0954L2080m1054
362F9463n5354K8231J4772l6876M7300N9404j8684j2748P0444j07545o837k0229
350C1341O2748R084o4026O9616L7667l0553k5491o0774J15593m0210l8315m1115
338B5565n5905L4974k1202Q4009J5366K4809m4436o8722R5360L6050J1586L0804
$$ plain form
326 168258 155724 169109 146710 108247 107668 115456 96868 102826 72081 55585 18536 37905 119611
313 119611 122235 120727 101567 71958 44454 42798 30275 46540 42689 83726 94658 87716 110581
300 110581 103326 11085 36162 87389 55044 8467 55376 78846 65727 100751 126687 99761
288 99761 46784 -1029 63641 55870 68994 13630 30495 96083 71508 105731 150940 60986
276 60986 54593 79351 81408 112348 104578 86999 128004 97225 56726 76589 135507 108518 108792
263 108792 156831 89504 93585 22008 48508 87584 97947 58070 97786 82205 73293 -359
251 -359 -2459 49612 71768 53918 127560 146701 164210 153536 130459 107619 100427 97588 100024
238 100024 98588 51334 44937 57840 19086 73112 65317 44809 100850 187661 228626 200410
$$ packed form
326A68258j2534J3385k2399l8463n79P788j8588N958l0745j6496l7049J9369Q1706
313A19611K624j508j9160k9609k7504j656j2523J6265l851M1037J0932o942K2865
300A10581p255r2241K5077N1227l2345m6577M6909K3470j3119L5024K5936k6926
288I9761n2977m7813O4670p771J3124n5364J6865O5588k4575L4223M5209q9954
276F0986o393K4758K057L0940p770j7579M1005l0779m0499J9863N8918k6989K74
263A08792M8039o7327M081p1577K6500L9076J0363l9877L9716j5581q912p3652
251c59k100N2071K2156j7850P3642J9141J7509j0674k3077k2840p192k839K436
238A00024j436m7254o397J2903l8754N4026p795k0508N6041Q6811M0965k8216
$$ plain form
226 200410 129284 53057 29729 5029 127203 166296 75158 5867 80339 76901 66553 76788
214 76788 66695 80466 58426 170663 193504 130713 35977 32255 44317 114854 78629 77020
202 77020 47545 -32502 14128 87982 156238 100371 115772 88127 119223 102352 83880 143218
190 143218 180168 200217 187460 142375 138859 155764 142229 89497 110869 169642 109017 49686
178 49686 103001 121269 121189 107009 49689 80773 136815 116442 126367 161916 136717 105089 20410
165 20410 48146 154289 123845 93773 59363 99495 81609 51491 75753 112111 99755 56567
153 56567 113373 148233 125033 140907 149119 170579 159324 178885 152230 114908 71805 11819
141 11819 35952 42173 13172 15468 54017 129478 74415 11201 105206 63221 20829 -20505
$$ packed form
226B00410p1126p6227k3328k4700J22174L9093r1138o9291P4472l438j0348J0235
214G6788j0093J3771k2040J12237K2841o2791r4736l722J2062P0537l6225j609
202G7020k9475q0047M6630P3854O8256n5867J5401k7645L1096j6871j8472N9338
190A43218L6950K0049j2757m5085l516J6905j3535n2732K1372N8773o0625n9331
178D9686N3315J8268q0j4180n7320L1084N6042k0373R925L5549k5199l1628q4679
165B0410K7736J06143l0444l0072l4410M0132j7886l0118K4262L6358j2356m3188
153E6567N6806L4860k3200J5874Q212K1460j1255J9561k6655l7322m3103n9986
141A1819K4133O221k9001K296L8549P5461n5063o3214R4005m1985m2392m1334
$$ plain form
129 -20505 17141 103069 177991 212714 191866 139225 132112 139077 139574 126755 125429 103640 91399
116 91399 95261 84119 89039 111986 97804 24760 21925 91706 131767 99407 149339 159445 189630
103 189630 147417 75118 29944 53469 75131 29554 124408 136172 108283 105755 85910 139660
91 139660 132782 112945 74266 121851 161357 113507 136673 153335 170787 196142 120005 64994
79 64994 57700 124775 160687 127748 128708 124705 42277 25649 98401 119500 136461 91762 53579
66 53579 34657 54114 156410 166829 122739 133941 137042 66497 21559 72556 121170 186990
54 186990 183273 124267 89006 64735 58986 86377 102526 73772 116556 86919 113179 161975
42 161975 144545 85818 116630 93707 69080 142324 145266 110731 95536 172162 155433 97780
$$ packed form
129b0505L7646Q5928P4922L4723k0848n2641p113O965M97j2819j326k1789j2241
116I1399L862j1142M920K2947j4182p3044k835O9781M0061l2360M9932J0106L0185
103A89630m2213p2299m5174K3525K1662m5577R4854J1764k7889k528j9845N3750
91A39660o878j9837l8679M7585L9506m7850K3166J6662J7452K5355p6137n5011
79F4994p294O7075L5912l2939R60m003q2428j6628P2752K1099J6961m4699l8183
66E3579j8922J9457J02296J0419m4090J1202L101p0545m4938N0997M8614O5820
54A86990l717n9006l5261k4271n749K7391J6149k8754M2784k9637K6260M8796
42A61975j7430n8727L0812k2923k4627P3244K942l4535j5195P6626j6729n7653
$$ plain form
30 97780 66491 54612 92268 67165 95625 127008 112101 131729 130791 149583 155543 159990 146442
17 146442 136881 149292 145600 64337 81261 103802 182663 166332 109923 105527 164808 132724 169177
4 169177 123922 82674 25570 82042
0 82042
$$ packed form
30I7780l1289j1879L7656k5103K8460L1383j4907J9628r38J8792N960M447j3548
17A46442r561J2411l692q1263J6924K2541P8861j6331n6409m396N9281l2084L6453
4A69177m5255m1248n7104N6472
0H2042
$$ Imaginary data points
##PAGE= N=2
##DATA TABLE= (X++(I..I)), XYDATA
$$ plain form
16383 -1697566 -1678922 -1641301 -1596669 -1582570 -1505123 -1529673 -1536656 -1546412 -1497293 -1463151 -1481277 -1449092
16371 -1449092 -1430722 -1455702 -1430574 -1389321 -1344375 -1329933 -1315173 -1273769 -1218643 -1219707 -1248871
16360 -1248871 -1247702 -1204812 -1145496 -1108206 -1077963 -1083678 -1080038 -1053803 -995323 -956932 -990378 -976613
16348 -976613 -937070 -907246 -888468 -894040 -854613 -786282 -799025 -889102 -860935 -791272 -761371 -743448
16336 -743448 -749017 -733253 -722744 -689111 -655089 -671274 -613299 -616951 -635939 -600700 -532963 -476981
$$ packed form
16383a697566J8644L7621M4632J4099P7447k4550o983r756M9119L4142j8126L2185
16371a449092J8370k4980K5128M1253M4946J4442J4760M1404N5126j064k9164
16360a248871J169M2890N9316L7290L0243n715L640K6235N8480L8391l3446J3765
16348i76613L9543K9824J8778n572L9427O8331j2743r0077K8167O9663K9901J7923
16336g43448n569J5764J0509L3633L4022j6185N7975l652j8988L5239O7737N5982
$$ [...]
##END NTUPLES=NMR SPECTRUM
##END=
