##TITLE=1H_70-2026
 200.13Hz, CDCl3.
 8 sc
4.8.2026
##JCAMPDX= 6.0         $$ Bruker NMR JCAMP-DX V2.0
##DATA TYPE= NMR FID
##DATA CLASS= NTUPLES
##ORIGIN= UXNMR, Bruker Analytische Messtechnik GmbH
##OWNER= pz
$$ XWIN-NMR		Version 3.5
$$ Tue Aug  4 13:48:36 2026 Russian Standard Time (UT+4h)  she@DPX200
##.OBSERVE FREQUENCY= 200.1313
##.OBSERVE NUCLEUS= ^1H
##.DELAY= (6, 6)
##.ACQUISITION MODE= SIMULTANEOUS
##.ACQUISITION SCHEME= undefined
##.AVERAGES= 8
##.DIGITISER RES= 18
##SPECTROMETER/DATA SYSTEM= spect
##.PULSE SEQUENCE= zg30
##.SOLVENT NAME= CDCl3
##.SHIFT REFERENCE= (INTERNAL, CDCl3, 0, 14.3821)
##AUDIT TRAIL= $$ (NUMBER, WHEN, WHO, WHERE, WHAT)
$$ ##TITLE= Audit trail, XWIN-NMR		Version 3.5
$$ ##JCAMPDX= 5.01
$$ ##ORIGIN= Bruker BioSpin GmbH
$$ ##OWNER= she
$$ F:/spectra/data/she/nmr/H-C/1/audita.txt
$$ ##AUDIT TRAIL=  $$ (NUMBER, WHEN, WHO, WHERE, WHAT)
(   1,<2026-08-04 13:47:23.23 +0400>,<she>,<DPX200>,
      <created by zg, POWCHK disabled, PULCHK disabled
       configuration hash MD5:
       00 E9 B6 7A A2 85 ED C7 34 08 36 98 17 FE 4E 26
       data hash MD5: 16K
       CA 7B 6E 02 7D 66 68 86 06 99 27 0B 68 25 71 12>)
$$ ##END=
$$ 
$$ hash MD5
$$ 9C 6B 0E 0A 38 17 E2 92 13 A0 ED AE 59 D0 57 83
##$RELAX= 
##$RELAX= 
##$RELAX= 
##$RELAX= 
##$RELAX= 
##$RELAX= 
$$ Bruker specific parameters
$$ --------------------------
##$DU= <F:/spectra>
##$EXPNO= 1
##$NAME= <H-C>
##$PROCNO= 1
##$TYPE= <nmr>
##$USER= <she>
##$AMP= (0..31)
100 100 100 100 100 100 100 100 100 100 100 100 100 100 100 100 100 100 
100 100 100 100 100 100 100 100 100 100 100 100 100 100 
##$AQSEQ= 0
##$AQ_mod= 1
##$AUNM= <au_zg>
##$AUTOPOS= <>
##$BF1= 200.13
##$BF2= 200.13
##$BF3= 200.13
##$BF4= 200.13
##$BF5= 200.13
##$BF6= 200.13
##$BF7= 200.13
##$BF8= 200.13
##$BYTORDA= 1
##$CFDGTYP= 0
##$CFRGTYP= 5
##$CHEMSTR= <none>
##$CNST= (0..31)
1 1 145 1 1 1 1 1 1 1 1 1 1 1 1 1 1 1 1 1 1 1 1 1 1 1 1 1 1 1 1 1 
##$CPDPRG= <>
##$CPDPRG1= <>
##$CPDPRG2= <>
##$CPDPRG3= <>
##$CPDPRG4= <mlev>
##$CPDPRG5= <mlev>
##$CPDPRG6= <mlev>
##$CPDPRG7= <mlev>
##$CPDPRG8= <mlev>
##$CPDPRGB= <>
##$CPDPRGT= <>
##$D= (0..31)
0 0.7 0 0 0 0 0 0 0 0 0 0.03 0 0 0 0 0 0 0 0 0 0 0 0 0 0 0 0 0 0 0 0 
##$DATE= 1785836842
##$DBL= (0..7)
120 120 120 120 120 120 120 120 
##$DBP= (0..7)
150 150 150 150 150 150 150 150 
##$DBP07= 0
##$DBPNAM0= <>
##$DBPNAM1= <>
##$DBPNAM2= <>
##$DBPNAM3= <>
##$DBPNAM4= <>
##$DBPNAM5= <>
##$DBPNAM6= <>
##$DBPNAM7= <>
##$DBPOAL= (0..7)
0.5 0.5 0.5 0.5 0.5 0.5 0.5 0.5 
##$DBPOFFS= (0..7)
0 0 0 0 0 0 0 0 
##$DE= 6
##$DECBNUC= <off>
##$DECIM= 32
##$DECNUC= <off>
##$DECSTAT= 4
##$DIGMOD= 1
##$DIGTYP= 9
##$DL= (0..7)
0 120 120 120 120 120 120 120 
##$DP= (0..7)
150 150 150 150 150 150 150 150 
##$DP07= 0
##$DPNAME0= <>
##$DPNAME1= <>
##$DPNAME2= <>
##$DPNAME3= <>
##$DPNAME4= <>
##$DPNAME5= <>
##$DPNAME6= <>
##$DPNAME7= <>
##$DPOAL= (0..7)
0.5 0.5 0.5 0.5 0.5 0.5 0.5 0.5 
##$DPOFFS= (0..7)
0 0 0 0 0 0 0 0 
##$DQDMODE= 0
##$DR= 18
##$DS= 0
##$DSLIST= <SSSSSSSSSSSSSSS>
##$DSPFIRM= 0
$$ [...]
##$SUBNAM0= <"">
##$SUBNAM1= <"">
##$SUBNAM2= <"">
##$SUBNAM3= <"">
##$SUBNAM4= <"">
##$SUBNAM5= <"">
##$SUBNAM6= <"">
##$SUBNAM7= <"">
##$SUBNAM8= <"">
##$SUBNAM9= <"">
##$SW= 18.0517328524113
##$SWIBOX= (0..15)
0 0 2 0 0 0 0 0 0 0 0 0 0 0 0 0 
##$SW_h= 3612.71676300578
##$TD= 16384
##$TD0= 1
##$TE= 0
##$TE2= 300
##$TE3= 300
##$TEG= 300
##$TL= (0..7)
0 120 120 120 120 120 120 120 
##$TP= (0..7)
150 150 150 150 150 150 150 150 
##$TP07= 0
##$TPNAME0= <>
##$TPNAME1= <>
##$TPNAME2= <>
##$TPNAME3= <>
##$TPNAME4= <>
##$TPNAME5= <>
##$TPNAME6= <>
##$TPNAME7= <>
##$TPOAL= (0..7)
0.5 0.5 0.5 0.5 0.5 0.5 0.5 0.5 
##$TPOFFS= (0..7)
0 0 0 0 0 0 0 0 
##$TUNHIN= 0
##$TUNHOUT= 0
##$TUNXOUT= 0
##$USERA1= <user>
##$USERA2= <user>
##$USERA3= <user>
##$USERA4= <user>
##$USERA5= <user>
##$V9= 5
##$VALIST= <valist>
##$VCLIST= <CCCCCCCCCCCCCCC>
##$VD= 0
##$VDLIST= <DDDDDDDDDDDDDDD>
##$VPLIST= <PPPPPPPPPPPPPPP>
##$VTLIST= <TTTTTTTTTTTTTTT>
##$WBST= 1024
##$WBSW= 4
##$XGAIN= (0..3)
0 0 0 0 
##$XL= 0
##$YL= 0
##$YMAX_a= 635397
##$YMIN_a= -572948
##$ZGOPTNS= <>
##$ZL1= 120
##$ZL2= 120
##$ZL3= 120
##$ZL4= 120
##$ABSF1= 10
##$ABSF2= 0
##$ABSG= 5
##$ABSL= 3
##$ALPHA= 0
##$AQORDER= 0
##$ASSFAC= 0
##$ASSFACI= 0
##$ASSFACX= 0
##$ASSWID= 0
##$AUNMP= <proc_1d>
##$AZFE= 0.1
##$AZFW= 0.1
##$BCFW= 1
##$BC_mod= 2
##$BYTORDP= 1
##$COROFFS= 0
##$CY= -3
##$DATMOD= 1
##$DC= 2
##$DFILT= <>
##$DTYPP= 0
##$F1P= 0
##$F2P= 0
##$FCOR= 0.5
##$FTSIZE= 0
##$FT_mod= 4
##$GAMMA= 1
##$GB= 0.15
##$INTBC= 1
##$INTSCL= 1
##$ISEN= 128
##$LB= 0.25
##$LEV0= 0
##$LPBIN= 0
##$MAXI= 10000
##$MC2= 0
##$MEAN= 0
##$ME_mod= 0
##$MI= 1.114404
##$NCOEF= 0
##$NC_proc= 0
##$NLEV= 6
##$NOISF1= 3.799351
##$NOISF2= 2.8
##$NSP= 1
##$NTH_PI= 0
##$NZP= 0
##$OFFSET= 14.38212
##$PC= 1
##$PHC0= -4379.457
##$PHC1= 12.7923
##$PH_mod= 1
##$PKNL= yes
##$PPARMOD= 0
##$PSCAL= 0
##$PSIGN= 0
##$REVERSE= no
##$SF= 200.129724274929
##$SI= 16384
##$SIGF1= 3
##$SIGF2= 2
##$SINO= 400
##$SIOLD= 16384
##$SREGLST= <1H.CDCl3>
##$SSB= 0
##$STSI= 0
##$STSR= 0
##$SW_p= 3205.1282051282
##$SYMM= 0
##$S_DEV= 0
##$TDeff= 0
##$TDoff= 0
##$TI= <>
##$TILT= no
##$TM1= 0
##$TM2= 0
##$TOPLEV= 0
##$USERP1= <user>
##$USERP2= <user>
##$USERP3= <user>
##$USERP4= <user>
##$USERP5= <user>
##$WDW= 1
##$XDIM= 8192
##$YMAX_p= 0
##$YMIN_p= 0
$$ End of Bruker specific parameters
$$ ---------------------------------
##NTUPLES= NMR FID
##VAR_NAME=  TIME,          FID/REAL,        FID/IMAG
##SYMBOL=    X,             R,               I
##VAR_TYPE=  INDEPENDENT,   DEPENDENT,       DEPENDENT
##VAR_FORM=  AFFN,          ASDF,            ASDF
##VAR_DIM=   8192,          8192,            8192
##UNITS=     SECONDS,       ARBITRARY UNITS, ARBITRARY UNITS
##FACTOR=    0.0002768,     1,               1
##FIRST=     0,             0,               0
##LAST=      2.2672688,     0,               0
##MIN=       0,             -572948,         0
##MAX=       2.2672688,     635397,          0
$$ Real data points
##PAGE= N=1
##DATA TABLE= (X++(R..R)), XYDATA
$$ [...]
1223i23k71k358K631J953N36J233k605j280M17k683K441K967j618J629O80l470
$$ -923 -1194 -3552 -921 1032 1568 2801 196 -1084 -667 -3350 -909 2058 440 2069 2749 -721
1239g21q72j90L18J491M50K250m44l846J100o70k858M194K129j988J713o36k676
$$ -721 -1593 -1783 -1465 26 476 2726 2282 -1564 -464 -1134 -3992 202 2331 343 2056 1420 -1256
1256a256k96q5J342Q83K04K266j414l072Q51j649l48L765J52r1O85k912l16O0
$$ -1256 -1552 -1637 -295 588 792 3058 1644 -1428 -577 -2226 -2574 1191 1343 1252 1937 -975 -1291 -1231
1274a231j240K767J146r28J932j055k634k7n74J107J810L50J475k518k686K201
$$ -1231 -2471 296 1442 514 2446 1391 -1243 -1270 -1844 -737 1073 1423 2898 380 -2306 -105
1290a05j520r03M157p17q44K353j894k374j7M77J691P10R39P63l314q60J383k004
$$ -105 -1625 -2528 1629 912 68 2421 527 -1847 -1864 -1387 304 1014 1953 2716 -598 -1458 -75 -2079
1308b079J275K627j517R00M24k734j81o16o7L134N19m74L10k407n73N98l72J713
$$ -2079 -804 1823 306 1206 1630 -1104 -1285 -1901 -1968 1166 1685 1211 1521 -886 -1459 -861 -1233 480
1326D80N05J09J335k671j180J114k156J173L558j397j26O54k793p31J041O14J081
$$ 480 985 1094 2429 -242 -1422 -308 -2464 -1291 2267 870 744 1398 -1395 -2126 -1085 -471 610
1343F10o6J425j85l112N90J00j916L288J494j988J158q39k365O87j32N69J813
$$ 610 544 1969 1784 -1328 -738 -638 -2554 734 2228 240 1398 559 -1806 -1119 -1251 -682 1131
1360A131k09L70p09j967M84l27J43K535k32M1L72k841L7J014j674K137J744j609
$$ 1131 922 1292 583 -1384 -900 -1227 -1084 1451 1219 1260 1632 -1209 -1172 -158 -1832 305 2049 440
1378D40N32n53k242K14O72Q73Q91N2Q48j390k207J603o48p19L546j02j679J299
$$ 440 972 419 -1823 -1609 -937 -64 827 879 1727 337 -1870 -267 -915 -1634 1912 1810 131 1430
1396A430j609j760J027J37J035Q12j39J2j650o17P34q80J031K201j233M73j10
$$ 1430 -179 -1939 -912 -775 260 1072 933 945 -705 -1322 -588 -1468 -437 1764 531 1004 894
1413H94k526Q02M42q17K584M05j387K55j217j130P50M80Q12L28j3P79k091r77
$$ 894 -1632 -830 -388 -1205 1379 1784 397 652 -565 -1695 -945 -465 347 675 662 1441 -650 -1627
1431a627J558j304P53L130j384r89Q82k187n07J599J97N81Q6L1j96j668Q9J63
$$ -1627 -69 -1373 -620 2510 1126 137 1019 -1168 -1675 -76 121 702 788 819 623 -1045 -956 -793
1449g93q33K409J130j732O94j042j823J696L36m02J822m54q19K93j077n06K13
$$ -793 -1626 783 1913 181 875 -167 -1990 -294 42 -360 1462 1008 189 482 -595 -1101 -888
1466h88M62J396m3K8k70k543N09J636j228J172J636k087M70O40k273J38J063M78
$$ -888 -426 970 927 955 685 -1858 -1349 287 -941 231 1867 -220 250 890 -1383 -1245 -182 296
1484B96O83O7j24j211j255J127J1l91K264p46j454J614j204j319J396k28N38J578
$$ 296 979 1046 922 -289 -1544 -417 -406 -797 1467 721 -733 881 -323 -1642 -246 -474 64 1642
1502A642o30r76l68o72L95K96O70P76q89L97l63j939J109N96j380K267P43k047
$$ 1642 1012 36 -332 -1004 -609 -313 357 1133 244 641 278 -1661 -552 44 -1336 931 1674 -373
1520c73N30l14j510J106J129m0O3K16J9j501l76J079j023O87K206j491q96J181
$$ -373 157 -157 -1667 -561 568 528 591 807 826 -675 -1051 28 -995 -308 1898 407 -489 692
1538F92j884l20J761l62M90J000j154n09k39q0L40q9J262K23j046P44j086j584
$$ 692 -1192 -1512 249 -113 377 1377 223 -286 -525 -605 -265 -354 908 1131 85 829 -257 -1841
1556a841J810R2p29J917l40j625Q63p90p23J241O85r8l3K79k53j546L15R57r32
$$ -1841 -31 61 -668 1249 909 -716 147 -643 -1366 -125 560 462 429 708 455 -1091 -776 181 -751
1575g51J424J315k597L12Q49k134P92J286o45N39O99j023o31j46L81j41L01J633
$$ -751 673 1988 -609 -297 552 -1582 -790 496 -149 390 1089 66 -565 -711 -330 -471 -170 1463
1593A463p74q16O72j386m83J850n31k79J667j008r65N50r66p6J211M47j63j17
$$ 1463 689 -127 545 -841 -1324 526 -5 -284 1383 375 -590 -40 -1006 -1082 129 576 413 296
1611B96K80o53j183J162M11r57J885J4k076J041J3j889J300J092p68N79Q7r34
$$ 296 576 -77 -1260 -98 313 -644 1241 1255 -821 220 233 -1656 -356 736 -32 547 634 -300
1629c00n63L03N24l79O57J325j422l26P52j707K07J882j089K53J162j305n37L24
$$ -300 -863 -560 -36 -415 242 1567 145 -181 571 -1136 -929 953 -136 117 1279 -26 -563 -239
1647b39n65K47Q54K64l56k01K87q38p48J608jo72J843q20j570J364o38j201J653
$$ -239 -804 -557 297 561 205 4 291 -547 -1295 313 312 -360 1483 663 -907 457 -181 -1382 271
1666B71L01n78N47j82q03n95P24L61n02J072O16j782M49N51j784J103J182j135
$$ 271 572 -6 541 359 -444 -1039 -315 46 -456 616 1232 -550 -101 450 -1334 -231 951 -184
1684a84O80O72j533k46L69l90M10P35K21n85l58M57r85l91J665m92j61J641j467
$$ -184 496 1168 -365 -611 -242 -632 -222 513 734 149 -209 248 -737 -1128 537 45 -116 1525 58
1703E8r74J332q62m53J559j5m55K41k72n91n30Q85J38m76J284j8j715R46O6j401
$$ 58 -916 416 -446 -899 660 645 190 431 159 -432 -962 -77 61 -415 869 851 -864 82 148 -1253
1723a253J335Q10j129Q79K03j429J36M39k55K84M43L28r71j02L30j050L09J502
$$ -1253 82 892 -237 642 845 -584 -448 -9 -264 20 463 791 -180 -282 48 -1002 -693 809
1741H09j053L85J126j664k79R03q28J75J381m72k43M2j60o30k81R51j56l28J370
$$ 809 -244 141 1267 -397 -676 227 -601 -426 955 483 240 282 122 -508 -789 162 6 -322 1048
1760A048q06j257J335p89p44J852P3r53R25m30r06K83M06r8J19O35R5j154J41
$$ 1048 242 -1015 320 -469 -1213 639 712 -241 684 254 -652 -369 37 -61 58 693 788 -366 -225
1779b25K92j261J048R85j085N81M32j626M05M71n48N12P45l18k96O2j73p68L50
$$ -225 67 -1194 -146 839 -246 335 767 -859 -454 17 -531 -19 726 408 112 174 1 -767 -417
1798d17R95m60j96R22j151m76J146r20l31J701m89m52P91p15m98J89M57j9n5P93
$$ -417 578 118 -78 844 -307 -783 363 -557 -888 813 324 -128 663 -52 -550 -361 96 77 22 815
1818H15j64j227N62k3q91J168N08j250R69q4j338N50M55m76P46K44j69m14q9J33
$$ 815 651 -576 -14 -37 -928 240 748 -502 467 383 -955 -405 50 -426 320 564 395 -19 -108 25
1838B5p78N28J101p95L1P26j351j11J036j184M56J143o63j76K15m69l15M21M38
$$ 25 -753 -225 876 81 112 838 -513 -624 412 -772 -316 827 164 -12 203 -266 -581 -160 278
1857B78j31k8P32o84q41Q26l55o19J545k45p09P75n78r31P26J55j48N48K48k92
$$ 278 147 119 851 167 -674 152 -203 -822 723 478 -231 544 -34 -965 -239 -84 -232 316 564 272
1877B72m59K0R8o30Q06O91r64L88M54j390M55M67j025Q79M89n54K2K2m33k54M94
$$ 272 -187 -167 -69 -699 107 798 -166 222 676 -714 -259 208 -817 62 551 -3 19 41 -392 -646 -152
1898a52M53j07j09N55r15l91J043p70q6J355n37l78O67r72m49P45K1J24J67J03
$$ -152 301 194 85 640 -275 -666 377 -393 -479 876 339 -39 628 -344 -793 -48 -27 97 264 367
1918C67k52n86N42j64o46J149K93q61P26j37j314O72L82n54P78K82o81j17Qk13
$$ 367 115 -471 71 -93 -739 410 703 -158 568 431 -883 -211 171 -383 395 677 -4 -121 -113 -326
1938c26j06J74O55l69J58M21j123n5Q82p39M47R59r76r0M48q24o4O92j05O2J03
$$ -326 -432 -258 397 28 186 607 -516 -571 311 -428 19 978 2 -88 360 -464 -528 164 59 121 224
1959B24K88n67o22O30k07k21J204l30q46R66o19o48P41P4k97O30Nm01j12k17R9
$$ 224 512 -55 -677 -47 -254 -475 729 399 -447 519 -100 -748 -7 67 -230 400 405 4 -108 -325 -226
1980b26k03N94M80p32K23J22j041M84O85q12O90N83r60J33R7o78K12N04n4J14
$$ -226 -429 165 645 -87 136 258 -783 -299 386 -426 264 847 -113 20 117 -561 -349 155 101 215
2000B15j9K28p51k10O89m42K3J016o91l36P13q97j43Q73j56k2M32j92m47m3M7
$$ 215 196 424 -327 -537 152 -290 -267 749 58 -278 435 -462 -605 268 112 90 522 330 -117 -160 -113
2021a13Rk06O21K27q98O69k30j012Q71K54o41J037p7p72K66j86j82L55J48R9n2
$$ -113 -104 -310 311 538 -360 309 79 -933 -62 192 -449 588 511 -261 5 -181 -363 -8 140 239 187
2042A87o5K11r37K11P38q61N20O78r23J46M66r39K19O19k56J18K45k76j71j26
$$ 187 122 333 -604 -393 345 -516 4 682 -241 -95 371 -568 -349 270 14 132 377 101 -70 -196
2062a96J98l4l07R31k71o43O18m89o82J182l32k91R75l90n77K14r8jJ38K37J78
$$ -196 2 -32 -339 592 321 -322 296 -193 -875 307 -25 -316 659 269 -308 -94 -192 -193 -55 182 360
2083C60k58J91j17q08N15M06p23O98L02r88L96J76r31N50M70k50K84k1k21k17
$$ 360 102 293 176 -632 -117 289 -434 264 566 -422 -26 150 -781 -231 239 -11 273 252 31 -186
2103a86k3L04k45P4Q74p94k71P95q99l14J052m82N2P61p43k79K28n8L7O3M40j02
$$ -186 -209 95 -150 -76 798 4 -267 528 -371 -685 367 -115 -63 698 -45 -324 -96 -154 -117 -54 386 284
2125B84l89M25k67p08Q12J27o47R57k68q10N81j61o51P82M7j60K72j06j4m58J13
$$ 284 -105 320 53 -655 157 284 -363 594 326 -484 97 -64 -715 67 114 -46 226 120 106 -352 -239
2146b39L88m13M06N37r37J20N00r55L64O69n82J68L13n55j01K65m7l1J93K87k11
$$ -239 149 -264 142 679 -258 -138 362 -593 -229 440 -142 26 339 -216 -317 -52 -99 -130 63 350 139
2167A39l18N75n91l64J042l88l73R65o46m67O81n18jM71M0k09o2p6L3m33N49K30
$$ 139 -179 396 -195 -559 483 95 -278 687 41 -426 255 -263 -264 207 247 38 -24 -100 -67 -500 49 279
2189B79n72O67K4q14O25j44p28Q00M32p74K69L16p06j4J14K55j82K81K51m51j25
$$ 279 -293 374 398 -416 209 65 -663 137 569 -205 64 380 -326 -340 -226 29 -153 128 379 -72 -197
2210a97N27o89%Q21n33JN74o13j64L89m31J07M44j19Rj47n2j13j98M98o2k63N87
$$ -197 330 -359 -359 462 -71 -70 504 -109 -273 116 -315 -208 236 117 126 -21 -73 -186 -384 114 52 -211 376
2233C76j42p48O69k66m00Q15m1k37L20k59l17M7P9J91j36K84J2m66J47L10q49
$$ 376 234 -514 155 -111 -511 304 263 26 346 87 -230 -183 -104 87 -49 235 247 -219 -72 238 -611
2254f11M62P24p86L33L07p06Q0L51l24J57K08m8o0j99J59l16l3O12k72k63O30
$$ -611 -149 575 -211 122 429 -277 -197 154 -170 -13 195 147 87 -112 47 -269 -302 310 38 -225 405
2275D05o13j44O38m49j95P39l76l1L71l14k47O8J94O5j36L34m1o80M33j4m90N62
$$ 405 -208 -352 286 -163 -358 381 5 -26 345 31 -216 -148 46 111 -25 309 268 -412 21 7 -483 79
2297G9L35p22N54m2m83J73J84j07J2K53K6k40j49J12l52K95L84l97L3M14n91j71
$$ 79 414 -308 246 204 -279 -106 78 -29 -17 236 262 22 -127 -15 -367 -72 312 -85 -52 362 -229 -400
2319d00N65n08K40L97l14J23M8j82j06PK28n9n0L04k53m97N88k69k90P41j68l30
$$ -400 165 -343 -103 294 -20 103 151 -31 -137 -130 98 39 -11 293 40 -457 131 -138 -428 313 145 -185
2341a85M44k85l47L82L7r4J25O6J48m85J99J30l61K54L65n13J07L06o48K07L08
$$ -185 259 -26 -373 9 46 -48 77 143 291 -194 5 135 -226 28 393 -120 -13 293 -355 -148 160
2362A60l27K24J72j90J5j4r3j12J09L61k68n2M05m15l92N92l52PN61l74j59L04
$$ 160 -167 57 229 39 54 40 -53 -165 -56 305 37 -15 390 -25 -417 175 -177 -170 391 17 -142 162
2384A62l82j69M06J0O9m9K46j37l60J25N9l36N62Qm21L10Q6n47L33K2k70L89o0
$$ 162 -220 -389 17 27 96 47 293 156 -204 -79 -20 -356 206 214 -207 103 189 -358 -25 -3 -273 116 56
2407E6j13k2r4M2j8j3L43k03n5L40m78J88K88m73J50M85m24P3Ll49J33J28n1J35
$$ 56 -57 -79 -173 -131 -149 -162 181 -22 -77 263 -215 -27 261 -212 -62 423 -1 72 75 -274 -141 -13 -64 71
2431G1m2K12l19m0J57r4j72M34n1k70M24l04k74L37k9j07K01q0o5j7j24L4j9J01
$$ 71 29 241 -78 -118 39 -55 -227 207 156 -114 310 6 -268 69 40 -67 134 54 -11 -28 -152 -118 -137 -36
2455c6L12l96J72Q6l64R2K33k61L82J72m84J16qj93J02N8J20j30O5J29l32j06
$$ -36 276 -120 52 138 -226 -134 99 -162 220 392 -92 24 16 -177 -75 -17 103 -27 38 167 -165 -271
2477b71L62k33QM61j93k34L03l64oK45j47P3J58k23N5j16R4q5l6K65L1k48K25
$$ -271 91 -142 -134 327 134 -100 203 -161 -167 78 -69 4 162 -61 -6 -122 -28 -113 -149 116 147 -101 124
2500A24j6l78L36O5l74N80j91l88K56p1m8J33j4J00o3n4Q3k74l4M41l61P2L48
$$ 124 108 -270 66 131 -243 337 146 -242 14 -57 -105 28 14 114 51 -3 80 -194 -228 213 -148 -76 272
2523B72l94J43O6l50J68J52K2P7j38J15q9j68J00k2K2J76r8l64L41j35j96N17
$$ 272 -122 21 87 -263 -95 57 79 156 18 133 44 -124 -24 -46 -24 152 54 -310 31 -104 -300 217
2545B17k51o1L55j46j46J69k81K12j37J15J40k56Q2J17l17M3K31k76K91J60n32
$$ 217 -34 -95 260 114 -32 137 -144 68 -69 46 186 -70 12 129 -188 -145 86 -190 101 261 -271
2566b71K53N4l68L01J15j48J22j06O9m2j66K21j47Q1J78j10k51K89k12j03L77
$$ -271 -18 36 -332 -31 84 -64 58 -48 21 -21 -187 34 -113 -32 146 36 -215 74 -138 -241 136
2587A36k09J12O3j07J6j15k2J58N2L9M1k33Q3j0k45J88J34k20K57n9l62K84Rj32
$$ 136 -73 39 102 -5 11 -104 -126 32 84 123 164 -69 14 4 -241 -53 81 -139 118 59 -303 -19 -10 -142
2611a42K51L0p2k5o0R4j48j04M54l80N2L79m32Q2J65k94P1K22k54J34m2j39J68
$$ -142 109 139 67 42 -18 76 -72 -176 278 -102 -50 329 -103 -21 144 -150 -79 143 -111 23 -19 -158 10
2634A0o0J36Qj22Q9J03k40J90j48j64L24j04j71L99j61k93J83j20rK36j56J51
$$ 10 -50 86 94 -28 61 164 -76 114 -34 -198 126 22 -149 250 89 -204 -21 -141 -150 86 -70 81
2656H1k1Pk0k11K34O8j53p1J25q5K37k11j87K43P0k08J75p9j1l2r6J54L8n8K47
$$ 81 60 67 47 -164 70 138 -15 -86 39 -46 191 -20 -207 36 106 -102 73 -6 -17 -49 -145 9 47 -11 236
2681B36p7k14K37l56J42J63j39MJ39j88qK9r5J75n0m1M4K4M4j20j20K85n7j13
$$ 236 159 -55 182 -174 -32 131 -8 -4 135 -53 -61 -32 -127 48 -2 -43 1 25 69 -51 -171 114 57 -56
2705e6J89j23k27K42q8jL7j0l5J07j0r3O7K3r8J26q3J80l01O4K01k86J30K11j94
$$ -56 133 10 -217 25 -63 -64 -27 -37 -72 35 25 -68 -1 22 -76 50 -33 147 -154 -90 111 -175 -45 166 -28
2730b8J2O4j36Q8l3M3N6j07N8L6j89P9jm6J55K8q4J85o8j78J34n4o9J19j6nl0
$$ -28 -16 48 -88 0 -33 10 66 -41 17 53 -136 -57 -58 -104 51 79 -5 180 112 -66 68 14 -55 64 48 43 13
2757A3j62J46m6j8J73p5j66J76m6L2%m14L73J86j46J48k20MO4O7r5J3o4l0J14
$$ 13 -149 -3 -49 -67 106 31 -135 41 -5 27 27 -387 -14 172 26 174 -46 -42 22 89 -6 7 -57 -87 27
2782B7j34J01m7j61K94n6k5J41j88J5N6Jj4j4p2J22o9P0j20j18J78J1n8Q2P6j79
$$ 27 -107 -6 -53 -214 80 24 -1 140 -48 -33 23 24 10 -4 -76 46 -23 47 -73 -191 -13 -2 -60 22 98 -81
2808h1L6M0j98K66j23l1O5M1n4N9j49J77j4o6P2m2l6K00k62KJ92j16L8n0k13J04
$$ -81 -45 -5 -203 63 -60 -91 -26 15 -39 20 -129 48 34 -32 40 -2 -38 162 -100 -98 94 -22 16 -34 -247 -143
2834a43K30j18K3J20m3M2j70J07j9o1J87j57j14K58q2j86K54j05k03J98j9rL5
$$ -143 87 -31 -8 112 69 111 -59 48 29 -32 155 -2 -116 142 60 -126 128 23 -180 18 -1 -10 25
2857B5j42L9J11q9L4O3j56J68n3nN4j14N4N9m3J56j66r6Q6k6M1M6K5k9L4r2L6
$$ 25 -117 -78 33 -56 -22 41 -115 53 0 -5 49 -65 -11 48 5 161 -5 -101 -15 -41 0 46 71 42 76 -16 20
2884B0Jj11K68k32N3J43j38j16Q1l1NR7j5k1N4o5K0q3k5K60p7l0M0j00O7K7j41
$$ 20 21 -90 178 -54 -1 142 4 -112 -31 -62 -57 40 25 4 58 -7 13 -70 -95 165 88 58 98 -2 65 92 -49
2911d9m6J47q8J21j52oL6o8P8J52j44L3Nj21J82j83J40J30j99p3K14k81Q5M5J5
$$ -49 -95 52 -36 85 -67 -73 -37 -105 -27 125 -19 14 19 -102 80 -103 37 167 -32 -105 109 -172 -87 -42 -27
2936b7M1M1r0L2R2j49J22r3o2J80m7M5l2j40J39j6p6K15o3j18M9r7q7J27j32J16
$$ -27 14 55 -35 -3 89 -60 62 -31 -93 87 40 85 53 -87 52 36 -40 175 112 -6 43 -54 -141 -14 -146 -30
2962c0J8p4J04nq0J44q5o2J89j44J93j70m5M4%r1J27n0j1J4Km1R1j38J96N4k05
$$ -30 -12 -86 18 13 -67 77 -8 -70 119 -25 168 -2 -47 -3 -3 -94 33 -17 -28 -14 -12 -53 38 -100 96 150 -55
2989e5J40j64j00Q5J95j10K04r9j87J39j53K35o1q7O5l4N2o2j11J06J14j73L9
$$ -55 85 -79 -179 -94 101 -9 195 96 -91 48 -105 130 69 -18 47 13 65 3 -108 -2 112 -61 -22
3012b2J35j39Jn0n0J80M4pr4l4l0O3n1M2J17j63J81q4p1K8Or9J20o4N1L2k44K10
$$ -22 113 -26 -25 -75 -125 55 99 92 -2 -36 -66 -3 -54 -12 105 -58 123 39 -32 -4 2 -97 23 -41 10 42 -202 8
3040Hq6J1N5R1k20K62j05K9q2q7P7L8j19J63j29Q3j2O6q9J13j03J64j1j59O9J58
$$ 8 -78 -67 -12 79 -141 121 16 45 -37 -124 -47 -9 -128 35 -94 -11 -23 43 -46 67 -36 128 117 -42 27 185
3066A85k24O0l2M8ql2n3Q8K5j37P1q7J80j40O5l0L4j19P1M8k3J22o1l5M8j67M1
$$ 185 -39 21 -11 37 29 -3 -56 32 57 -80 -9 -96 84 -56 9 -21 13 -106 -35 13 -10 112 51 16 64 -103 -62
3093f2J08o8P5m6J0J60l46J82rj43J37oq9J47j83N0O0Ro3J66j13Q4r4l5J47K3
$$ -62 46 -22 53 7 17 177 -169 13 4 -139 -2 -8 -97 50 -133 -83 -23 -14 -77 89 -24 60 -34 -69 78 101
3119A01m6N0n5p2M7p2P5J38j47M3M7q6J02n9j03Q9J1o4J42j66P8j92J36l6R2j02
$$ 101 55 105 50 -22 25 -47 28 166 19 62 109 23 125 66 -37 52 63 -1 141 -25 53 -139 -3 -39 53 -49
3145d9J12j9n4Q6j24k5K03k03Q3j1j55Q2o5QN5k9J16L8j13N5j36J50j04J62q6
$$ -49 63 44 -10 76 -48 -73 130 -73 10 -1 -156 -74 -139 -131 -76 -105 11 49 -64 -9 -145 5 -99 63 -23
3170b3J68o2k14K32k18J0K24k49J13J46j64M6nL5j42J39j29J71k04R6J50j53Q2
$$ -23 145 83 -131 101 -117 -107 117 -132 -19 127 -37 9 4 39 -103 36 -93 78 -126 -30 120 -33 49
3193D9q1k8J71m6j70J10j25k9P9M8j5J56j56N5n3o3J73j23O8M8q2L4J7j24J57
$$ 49 -32 -60 111 65 -105 5 -120 -149 -70 -22 -37 119 -37 18 -35 -98 75 -48 20 68 -14 20 37 -87 70
3218G0p9L3O3n2k7oj09R4J33k28J6J09j53J48K2r4J31r5M4J01k57J21Qp6R6J18
$$ 70 -9 24 87 35 8 2 -107 -13 120 -108 -92 17 -136 12 34 -60 71 -24 20 121 -136 -15 -7 -83 13 131
3244A31j94J62j15OJ0Pn6LJ9R7k3j19q8J29nJ78P3j81PQ3j39J79k32J2J72k09
$$ 131 -63 99 -16 -10 0 7 -49 -46 -27 70 47 -72 -160 -31 -36 142 215 34 41 124 -15 164 -68 -56 116 -93
3270i3K27q8j47J70M8k23J37p4O4k5L2r9N2n0J59p7m8J37r2Jk5k4Q6n8j60K31
$$ -93 134 46 -101 69 117 -106 31 -43 21 -4 28 -71 -19 -69 90 13 -35 102 10 11 -14 -38 48 -10 -170 61
3296F1l8j04J91j74n2K39j76J05Oj02K7N5j12J77p8l8O3p2n6J33j10k5J18j84
$$ 61 23 -81 110 -64 -116 123 -53 52 58 -44 -17 38 -74 103 25 -13 50 -22 -78 55 -55 -80 38 -146
3320a46J81J20k24J76n2j74J60j24qN3k6QJ27j44J09n0R5M5j12j7j01J06m1M8
$$ -146 35 155 -69 107 55 -119 41 -83 -91 -38 -64 -56 71 -73 36 -14 81 126 14 -3 -104 2 -39 9
3344Il0m0R4j11J98j86QK07k03m0nl1N3J63j54P2L6P1qk01P9N8j07J23n0Rl9R8
$$ 9 -21 -61 33 -78 120 -66 -58 149 -54 -94 -99 -130 -77 86 -68 4 40 111 103 -98 -19 39 -68 55 5 14 -25 73
3372G3j50J95k56Q7J87j50P8j00jLN3p5M1P8n8n1K9Q9J5j53Q9q9J8N7j5j97K56
$$ 73 -77 118 -138 -51 136 -14 64 -36 -37 -34 19 -56 -15 63 5 -46 -17 72 87 -66 23 -66 -48 9 -6 -203 53
3399E3j70J39n9J70j36J03j04p3M0K4L2N3j30R6J6q3J25j75J9J61p9L3l3n2J53
$$ 53 -117 22 -37 133 -3 100 -4 -77 -37 -13 19 72 -58 38 54 -29 96 -79 -60 101 22 55 22 -30 123
3424A23q9o1J68j76J32J0k39L0J12n3k4P4j21J67m4n4K62k61O3P3Qk07M1P4j4
$$ 123 34 -27 141 -35 97 107 -132 -102 10 -43 -67 7 -114 53 9 -45 217 -44 19 92 100 -107 -66 8 -6
3449fr7QJ89j52OO8j07L1J43j28Q7l2m7R6j57J9N2k8NR9k19L17j20j22O5J70k51
$$ -6 -103 -95 94 -58 -52 16 -91 -60 83 -45 42 10 -37 59 -98 -79 -27 -55 -50 49 -170 147 27 -95 -30 140 -111
3476a11K92k2l17J73j08j8J21j11O9J14r5M6n0qJ31o7j44L01l01J51k1m5K4R9
$$ -111 181 159 -158 15 -93 -111 10 -101 -32 82 -13 33 -17 -25 106 39 -105 196 -105 46 25 -20 4 103
3500A03j55P1n8N1J7o7NJ34r6qoo5N6LjO3j52N7P5j02j8Q6j00J37r4%N5L0pr6
$$ 103 -52 19 -39 12 29 -38 -33 101 5 -3 -9 -74 -18 -15 -16 47 -105 -48 27 -75 -93 -7 -107 30 -64 -64 -9 21 14 -82
3530h2N2M7J04n8O0L5l04R9R4n4J41k50J3L09j26P3p7j43J83j31K7K4J3j41J48
$$ -82 -30 17 121 63 123 158 -146 -47 47 -7 134 -116 -103 206 80 153 76 -67 116 -15 12 36 49 -92 56
3555E6k08N1K01j49QK61k66RoJ6J06j14oN0j6m6J9k6M4J8n1J38K9j49Q0p6q2P1
$$ 56 -152 -101 100 -49 -41 220 -46 -37 -43 -27 79 -35 -41 9 -7 -53 -34 -60 -16 2 -49 89 118 -31 49 -27 -109 -38
3583c8J3l5P1j07N9k2K7P1o8j3O8k3R7K2j14K3j3j18R7j00J9J01j13J44n4NM0
$$ -38 -25 -60 11 -96 -37 -59 -32 39 -29 -42 26 3 100 122 8 31 18 -100 -3 -103 -84 17 -96 48 -6 -1 39
3610C9Np6Q3m2j74K52j00j12K06k40J51R8p8jJ15m9l4q6p2J76o0p7O6j30J60n
$$ 39 44 -32 51 9 -165 87 -13 -125 81 -159 -8 90 12 11 126 77 43 -43 -115 61 1 -76 -10 -140 20 15
3636A5k1J00J9p1J33k03pJ35r9o3J70j36LJ2K5r3J37j29K3R8L4p1J0L0M3k23J91
$$ 15 -6 94 113 42 175 -28 -35 100 1 -62 108 -28 -25 -13 12 -81 56 -73 -50 48 82 11 21 51 94 -129 62
3663F2O9k88L30Pj70l2L3j73K91l37J56R1p8J1j7L3J1nK0R2j49k2J63k70J84J5
$$ 62 131 -157 173 180 10 -22 11 -162 129 -208 -52 39 -39 -28 -45 -12 -1 -6 14 106 -43 -65 98 -172 12 27
3689B7m9R6n5l0O9m7n6N1K0j11J86j59M8Q6j86J10j7o5Q8K1r3O6j2j7Mq2J19m6
$$ 27 -22 74 19 -11 58 11 -45 6 26 -85 101 -58 -10 76 -110 0 -17 -82 6 27 -66 0 -12 -29 -25 -107 12 -34
3717c4p5K30r4j18J1kL8R4k8lo0j23K72m4k8l4m6J98j16q4l4O2M4J4o5k8J43j98
$$ -34 -109 121 27 -91 -80 -82 -44 50 22 19 -41 -164 108 64 36 2 -44 154 38 -46 -80 -18 26 40 -25 -53 90 -108
3745a08N4R2p7j8Q5j19L8N3o7J33k34J15N5ln5O9l2k8n7J05m6K1o1J16j18j5Q8
$$ -108 -54 38 -39 -57 28 -91 -53 0 -67 66 -168 -53 2 -1 -56 13 -19 -47 -104 1 -45 -24 -85 31 -87 -102 -14
3772a4K7p2P4L5j4p0j01K12r2J1J22r8J7O5j72M0J05j55JJ75r7J08o9N1p0J3o6
$$ -14 13 -59 15 50 36 -34 -135 77 -15 -4 118 20 37 102 -70 -30 75 -80 -79 96 -1 107 38 89 19 32 -34
3799c4N7L0j9l0r5K10o0q8P7o3J36j41qk2k2K7L6L5Qk0n8q0J51p1O8ln5k5R2o6
$$ -34 23 53 34 4 -91 119 59 -29 48 -15 121 -20 -28 -50 -72 -45 -9 26 34 14 -44 -124 27 -44 24 21 -34 -59 33 -33
3829c3l4R0p1J62k43P8M1j21J06k8J2J08j10j29J83Q9j12J26j23j8N9j28R3r9
$$ -33 -67 23 -48 114 -129 -51 -10 -131 -25 -53 -41 67 -43 -172 11 100 -12 114 -9 -27 32 -96 -3 -102
3853a02JP2N6K0j04R2l5j5K3L5J9j84J55K9l2J21k59K8J07q6j2PJ07oj6pR4k4
$$ -102 -101 -29 27 47 -57 35 0 -15 8 43 62 -122 33 62 30 151 -108 -80 27 -59 -71 -64 43 37 21 14 108 84
3881H4j44J4m6J20J17j42l8M2o4P4J7p9kR4p3Q0q5L0N9q5J42k23J22l8L1Q9k6
$$ 84 -60 -46 -92 28 145 3 -35 7 -57 17 34 -45 -47 47 -26 54 -31 -1 58 -27 115 -108 14 -24 7 96 70
3908G0j05j8P2P8k32K27r3L7pL8j0j24J43m1m5K0J1o3J49l3m4p7K7j50J78p7P6
$$ 70 -35 -53 19 97 -135 92 -1 36 29 67 57 -67 76 35 -10 10 21 -42 107 74 30 -47 -20 -170 8 -69 7
3935GK6j02r2J10J0QO8kJ7r7j6J46q3l9J43j35k3J19j92J61K3j74J79j74J05p2
$$ 7 33 -69 -161 -51 -41 -33 35 33 50 -47 -63 83 0 -39 104 -31 -54 65 -127 34 57 -117 62 -112 -7 -79
3961g9K7J7J28r2Q0m4q3K30k07j14J70L8j63K73j34j09RK0l1J72j4n1L1j60K11
$$ -79 -52 -35 93 1 81 37 -46 184 -23 -137 33 71 -92 181 47 -62 -53 -33 -64 108 94 43 74 -86 125
3986A25k59J72j03O6J3Q1j85J0J02p1K5R3p7J01q9p1O5m5O7r6J8J6J1k1J28n2
$$ 125 -134 38 -65 1 14 95 -90 -80 22 -49 -24 69 -8 93 4 -67 -2 -47 20 -76 -58 -42 -31 -52 76 24
4012B4j07P9L4Qo4q5J31nN8p3m6J07j06nP3n2N3k7J34k03J76o1j54J61l4k5rQ6
$$ 24 -83 -4 30 38 -26 -111 20 15 73 0 -46 61 -45 -50 23 -29 24 -3 131 -72 104 43 -111 50 16 -9 -18 68
4040F8j69J63j00o6P7O9l6J4o2J41k13R3J6qm6J18o9N3m1j01P1o4J81k9q8J40
$$ 68 -101 62 -38 -104 -27 42 6 20 -42 99 -114 -21 -5 -13 -59 59 -10 43 2 -99 -28 -92 89 60 -28 112
4066A12j61J03Q4o6l6JJo3J2O9j57J94j80L6k0P7O3j44J28Jl7n3P4r6J62n7j07
$$ 112 -49 54 138 72 36 37 38 -25 -13 56 -101 93 -87 -51 -71 6 69 -75 53 54 17 -36 38 -58 104 47 -60
4093f0K2L9L8r6JP1k4m1M8k5L0L9m2rk2j1K0O3o5P1J9L6k34J37j25J70p1K3K5
$$ -60 -38 1 39 -57 -56 15 -9 -50 -2 -27 3 42 0 -9 -31 -42 -22 41 -24 47 66 102 -132 5 -120 50 -21 2 27
4122B7j7q7l7J20J3l0l4k2P7k5K2L0j41J79j02k7J79j19k7J1lm9J15j62N5O0m9
$$ 27 10 -77 -114 6 19 -11 -45 -67 10 -15 7 37 -104 75 -27 -54 125 6 -21 -10 -13 -62 53 -109 -54 6 -43
4149d3J49j06j72J35Q9o8O6m3JM7q6Q2j47Q4P4j26M0M3j11L5R6O4p2l5k1J09l0
$$ -43 106 0 -172 -37 52 -16 50 7 8 55 -31 51 -96 -12 62 -64 -24 19 -92 -57 39 103 31 -4 -25 84 54
4176E4p1J46j15J5L0k3p1P0o8P5p7J1p4R1o1J58j67R3O0r6J35j41J6knLL3l3o2
$$ 54 -17 129 14 29 59 36 -35 35 -33 42 -35 -24 -98 -7 -68 90 -77 16 76 -20 115 -26 -10 -12 -17 -14 19 -14 -76
4205g6J69j0j34K0J3R8j00m8O5l5J1O9p6n0J62kJ6l4n1j0Q8r4J58k06O5Ko1O7
$$ -76 93 83 -51 -31 -18 80 -20 -68 -3 -38 -27 42 -34 -84 78 76 92 58 7 -3 85 -9 149 -57 8 10 -51 16
4233A6r0M7M7N8n8ooMK1O3j21J16j54R6L0k9J4j35N0L0r5J42Np8M6J19q3j2o8
$$ 16 -74 -27 20 78 20 14 8 12 33 96 -25 91 -63 33 63 34 48 -87 -37 -7 -102 40 45 -33 13 132 49 37 -31
4262c1j4m8O6J03r2qqL2lQk5ML8n1N5L3q8p7J54qn1j7N3L3j77J5%O0m9J05q1L5
$$ -31 -45 -93 -27 76 -16 -24 -32 0 -3 5 -20 -16 22 -29 26 59 -29 -106 48 40 -11 -28 25 58 -119 -104 -104 -44 -93 12 -69 -34
4294c4lR8m1k6j6j07jQ4J30o9l2p2J61o6k7L1j2o6QJ32J9j2rj73R7N9j18Q8j7
$$ -34 -37 61 20 -6 -22 -129 -130 -46 84 15 -17 -89 72 6 -21 10 -2 -68 -60 72 91 79 70 -103 -6 53 -65 23 6
4323FJl4j09J40r0J57o6N4J4r7Q6j59M9J31j28L4P2o1N7r4kP0k0m8J07k45J53
$$ 6 7 -27 -136 4 -86 71 5 59 73 -24 62 -97 -48 83 -45 -11 61 0 57 -37 -39 31 11 -37 70 -175 -22
4350b2Q9q6J7k2J07q5j4l6J12p8j5P5l8J6j4pJ0o1P9n4L5l9qk4J00N9lj18L5K9
$$ -22 67 -19 -2 -24 83 -2 -16 -52 60 -18 -33 42 4 20 6 -1 9 -52 27 -27 8 -31 -39 -63 37 96 93 -25 10 39
4380C9o8m5o0K38k11N6o9J94o8jM3K6p9K9M8p2j1m0k7M4P3n9l1Q7j74K33j5o3
$$ 39 -29 -74 -134 104 -107 -51 -120 74 6 5 48 74 -5 24 72 0 -11 -51 -78 -34 39 -20 -51 36 -138 95 80 17
4408A7j01N1J52j07j0ON0j44J26j16N2Q7K1r3pj9N6L6j85J31l9rM5mn6P3L5nm2
$$ 17 -84 -33 119 12 2 8 58 -86 40 -76 -24 63 84 -9 -16 -35 21 57 -128 3 -36 -45 0 -4 -60 13 48 43 1
4437Ak5J1q8KJ39K3p1r1J00Lr3J58n9r5O1n1n9PJ29o0J10r0o1j4O0M4J95j12m7
$$ 1 -24 -13 -101 -99 40 63 -8 -99 1 4 -89 69 10 -85 -24 -75 -134 -127 2 -58 52 -38 -99 -113 -53 -9 186 74 27
4466B7K8Pn6J69j44K8k7p7J18p8j7%Ll5Q8j7n1Q5kk0m3m4o0J82q8O7P5j36L6L2
$$ 27 55 62 6 175 31 59 32 -45 73 -5 -22 -22 -19 -54 34 17 -34 51 49 29 -14 -58 -118 64 -24 43 118 -18 18 50
4496E0j02J48j56O4K5J2k13K49j82J07N7r9M0k1L4Po1Q9j9l5j4L9r8R6m7O8Ol2
$$ 50 -52 96 -60 4 29 41 -172 77 -105 2 59 -40 0 -21 13 20 -41 48 29 -6 -20 19 -79 17 -30 38 44 12
4524A2p7J1N7O5j7r5P1p2K0j5M3o0j6J49j95O9k9N3N3p3M2J4j7j09J07J17j69
$$ 12 -65 -54 3 68 51 -44 27 -45 -25 -40 3 -57 -73 76 -119 -50 -79 -26 27 -46 -4 10 -7 -116 -9 108 -61
4551f1k9K0P4K4j3n6rK9L3p2M8L9j05J90j08Q0o3m3K5N2m1M4m6oqm5O0RO9j46
$$ -61 -90 -70 4 28 15 -41 -50 -21 12 -60 -12 27 -78 112 4 84 21 -22 3 55 14 58 12 6 -2 -47 13 22 91 -55
4581e5M3J%J08o9k2k6N4JOq6Q0ol2j6MK7J01r7L9q1R3n2JO3j49N5P8r1P8l6K9
$$ -55 -12 -11 -11 97 28 6 -20 34 35 41 -45 35 29 -3 -19 -15 12 113 16 55 -26 67 15 16 79 -70 -15 63 -28 50 14 43
4613D3r1L2J23j59J10n9m0R1pm8J09j30P3j10L3OQ6o8P3m5J9M7j59J02m8q4J51
$$ 43 -48 -16 107 -52 58 -1 -41 50 43 -5 104 -26 47 -63 -30 -24 62 -6 67 22 41 88 -71 31 -17 -101 50
4640E0j51J36q1P8j01N8J26k02N5J5J6R7j56K4J19m0rl3q5J06p6J28n1l9J28j12
$$ 50 -101 35 -46 32 -69 -11 115 -87 -32 -17 -1 96 -60 -36 83 43 34 1 -84 22 -54 74 23 -16 112 0
4666@l8J11o3J30j34L8o8j2M7l2l7J03q0QJ2j7L3m2M7O1q7k8M1l6M4k0Q8j59J30
$$ 0 -38 73 10 140 6 44 -24 -36 11 -21 -58 45 -35 -27 -15 -32 1 -41 6 67 -20 -48 -7 -43 1 -19 69 -90 40
4695D0p1J5j03R1j37Q1J16oj6k5J31o6p5J9m1L3M5q5N2JJ1j00J16o7K9p9J7J22
$$ 40 -31 -16 -119 -28 -165 -84 32 26 10 -15 116 50 -25 -6 -47 -14 31 -54 -2 -1 10 -90 26 -41 -12 -91 -74 48
4723D8ql5n7O4m9Q2n8Q8K9l9j04J63j52J4J78k17j8O5o4K6O4K2r2J9M3K1j41J87
$$ 48 40 5 -52 12 -37 45 -13 75 104 65 -39 124 -28 -14 164 -53 -71 -6 -70 -44 20 42 -50 -31 12 33 -108 79
4751G9j00l6O9M6m5J1p3R6p2r3J88j18R6k4J9r2R3o0mJ32j93J21j2m2L5j1K9M4
$$ 79 -21 -57 12 58 13 24 -49 47 -25 -118 70 -48 48 24 43 -49 44 -16 -20 112 -81 40 28 -14 21 10 39 83
4779H3j29q6J51J20j28L9j4JRr7P4r0N5l4J9l5p6R4K0J40r4l7r9K43k41J43k3
$$ 83 -46 -132 19 139 11 50 36 37 46 -51 23 -67 -12 -46 -27 -62 -138 -44 -24 116 22 -15 -114 129 -112 31 8
4806Hrq9J36p1J89r2q7k2J46q6Q3p5j78J48N4K3j36J47j64K5J22o9LJ3j01K1K1
$$ 8 -1 -90 46 -25 164 72 -15 -37 109 23 106 31 -147 1 55 78 -58 89 -75 -50 72 3 6 19 -82 -61 -40
4833d0N6j2m9J1n5Q6Q0o1J2No9O4p0N7kqOO6j08J15p9l0k9J90j97O5l2N3p7J43
$$ -40 16 4 -45 -34 -89 -3 77 16 28 33 -36 28 -42 15 13 5 11 77 -31 84 5 -25 -54 136 -61 4 -28 25 -52 91
4863I1j34Lj0J07P6j44L8N9j12KL6r6Q7O6l7m2k2O6p3k5J47q6k2J1ln5m5J82l5
$$ 91 -43 -40 -50 57 133 -11 27 86 -26 -24 12 -84 3 69 32 -10 -32 34 -39 -64 83 -3 -25 -14 -17 -72 -117 65 30
4892C0J6l5m3L5n7p2Q9R7p4J64j11k9p3LJ87o9r8K7KJ35j42q7K06j52N0j6J1j5
$$ 30 46 11 -32 3 -54 -126 -37 60 -14 150 39 10 -63 -60 127 58 -40 -13 -11 124 -18 -105 101 -51 -1 -17 -6 -21
4920b1N9o7J11n7m2o4J00j62J88o8k9m9L7J12o9M3j5P5q2N4M4j55J55j32J4R9
$$ -21 38 -29 82 25 -17 -81 19 -143 45 -23 -52 -101 -64 48 -21 22 7 82 0 54 98 -57 98 -34 -20 79
4946G9j5j01q3J39m1QL6K9p0P6k7m9L2J1k4l6O6j13k3J58M1j38J20k7oN1j64R8
$$ 79 64 -37 -120 19 -22 -14 22 51 -19 57 30 -19 13 24 0 -36 30 -83 -106 52 93 -45 75 48 42 93 -71 27
4974B7n7L4J2r1KJ09j19J78j95J01J38j15j32R4m5J08n3KmQj6k6K4lJ16j06P2
$$ 27 -30 4 16 -75 -73 36 -83 95 -100 1 139 24 -108 -14 -59 49 -4 -2 -6 2 -14 -40 -16 -19 97 -9 63
5001F3l1q6L7nJ25l8j31O4qQ2r8J03j91J01K1j0k9J8pJ2K5p1j8J44J6p3Ml0l0
$$ 63 32 -54 -17 -22 103 65 -66 -2 -10 72 -26 77 -114 -13 8 -2 -31 -13 -20 -8 17 -54 -72 72 88 15 19 -11 -41
5030d1Q1L4j13j4J40r0J33q4o0O6j27P4q1J4N4n1J05n5nN0l7P0o8M0j02Q4kl0
$$ -41 40 74 -39 -53 87 -3 130 46 -14 52 -75 -1 -82 -68 -14 -65 40 -15 -20 30 -7 63 -5 35 -67 17 15 -15
5058a5n4Q4j16J43K0j71J10P3j13J62j86rJ34O7q3J9J4q4l8PJ40o4j56J75j36
$$ -15 -69 15 -101 42 62 -109 1 74 -39 123 -63 -72 62 129 46 65 79 -5 -43 -36 104 40 -116 59 -77
5083g7J4K25j10r6M0p9N2J30j41j9J65j43N2j07J85q3J2M7K3j90J29m6r1K56j39
$$ -77 -63 162 52 -44 -4 -83 -31 99 -42 -61 104 -39 13 -94 91 8 20 67 90 -100 29 -17 -108 148 9
5108Ij20J97j39O9Pp6J11j13K5O9Q3j38K6P5j12M3k5j9J21l8p8L6O1op0k6o1J7
$$ 9 -111 86 -53 16 23 -53 58 -55 -30 39 122 -16 10 85 -27 16 -9 -28 93 55 -23 13 74 68 -2 -28 -89 -72
5136g2O9rj1K8j0L2k4Nm8R1r1N3K7j28J29o9oK9M1j17O4J04p2n1J16r0p0J08o9
$$ -72 -3 -12 -23 5 -5 27 3 8 -40 51 -40 13 40 -88 41 -28 -34 -5 36 -81 -17 87 15 -36 80 -10 -80 28 -41
5165d1Rm1O9m3jR2o6K7k2L5j26J39j27M3k0QM3J67j44j6Nk3N6m4J7R7j89J59j20
$$ -41 -32 -73 -4 -47 -48 44 -22 5 -17 18 -108 31 -96 -53 -73 -65 -22 145 1 -15 -10 -33 23 -21 -4 93 -96 63 -57
5194e7J7l5m0J71j32K6j2Q1r2K03j55mN9pon3M7M7n0l5J24r6L1k9J2J07j05j16
$$ -57 -40 -75 -115 56 -76 -50 -62 19 -73 130 -25 -29 30 23 17 -36 11 58 8 -27 97 1 32 3 15 122 17 -99
5222i9J03KK4J5o1L5P6n7j64J53o0rJ18n2j15J22n6j01J72r0j1J43r9k9N3p9O1
$$ -99 4 6 30 45 -16 19 95 38 -126 27 -33 -42 76 24 -91 31 -25 -126 46 -44 -55 88 -11 -40 13 -66 -5
5249eLj5J35r5j9Q4j45M8k9k2Qj1N5Q3j61J22j07N4P1M9j02oj2K2k8L8M2l7j23
$$ -5 -2 -17 118 23 4 88 -57 -9 -38 -60 -52 -63 -8 75 -86 36 -71 -17 54 103 1 -5 -17 5 -23 15 57 20 -103
5278a03J69m6j6m5n9J50L4j06j7N0j14R2N4m5J18j48Km0J44k0J17j21n9M1j31
$$ -103 66 20 4 -41 -100 50 84 -22 -39 11 -103 -11 43 -2 116 -32 -30 -70 74 54 171 50 -9 32 -99
5303i9P3k5L1r3J70j31J15p2p6K49j72j0J56j04O5j55J12j08P9q9J7J8K8R9j3
$$ -99 -26 -51 -20 -113 57 -74 41 -31 -107 142 -30 -40 116 12 77 -78 34 -74 5 -84 -67 -49 -21 78 65
5328F5q8k4k9R1P9j53Q2n5k8L0r0J41J4n9M6O5j21N2n2J3M1q2J23k2Kp1Q2q7k
$$ 65 -23 -47 -76 15 94 -59 23 -32 -60 -30 -120 21 35 -24 22 87 -34 18 -34 -21 20 -62 61 39 41 -30 52 -35 -37
5357c7nK8O6k6l2p9N7N1n2MnL4j55J64L5j26J29Nn6k6Q9j28J04m4l5L6r9J20o8
$$ -37 -42 -14 52 26 -6 -85 -28 23 -29 -25 -30 4 -151 13 48 -78 51 56 0 -26 63 -65 39 -5 -40 -4 -103 17 -51
5386e1j4P7j5oMr9J16k5j07K1J37j86J42jj0P3j56O1J07K0k3o9J5N0m6l3R7j32
$$ -51 -65 12 -3 -9 -5 -104 12 -13 -120 -99 38 -148 -6 -7 -17 56 -100 -39 68 88 65 -4 11 61 15 -18 79 -53
5414e3M8P2o8J07p9j21J28r7J59loq1L4O4k05J47k6L7N6j89K4J26j74J99p0j14
$$ -53 -5 67 -1 106 27 -94 34 -63 96 93 87 6 40 104 -101 46 20 57 113 -76 -52 74 -100 99 29 -85
5440h5J80j74J48kj6K1k4j77K82j81rK0k2Q9m5q7N3J12r1J8LR7j10n8J1P6o5L9
$$ -85 95 -79 69 67 51 72 48 -129 153 -28 -37 -17 -39 50 5 -82 -29 83 -8 10 13 110 0 -58 -47 29 -36 3
5468CL6l6k5m1O1Q3n0mO7j73O6J13j76M4Q2nl5l6K4kL4k1On1M8j7k6k5J46j63
$$ 3 39 3 -22 -63 -2 81 31 27 94 -79 -13 100 -76 -32 50 45 10 -26 -2 -4 30 9 15 -36 12 -5 -31 -56 90 -73
5498g3J97r8l5m9P0MN4K2r1m6O6Q0j72J73o1j8L7M7o9r3P0r0O4K9j1J4l4q7L9
$$ -73 124 26 -9 -58 12 16 70 92 1 -45 21 101 -71 102 41 23 60 107 38 -55 15 -75 -11 18 7 21 -13 -100 -61
5527f1N5j0M4m4Lrj4L9J0j27Q5%MJ9jJ6M2k5l3J15q9%k0m8M9K9J4P6j45o0K5K6
$$ -61 -6 -16 28 -16 -13 -22 -36 3 13 -114 -29 -29 -25 -6 -7 9 51 26 -7 108 19 19 -1 -49 0 29 43 119 -26 -86 -61 -35
5559c5N1l1Ql6M2j11J1M5R5Rj6q6OJ27j62O4M2P6j2j8m9K7l2N1o5j22JK4J36J2
$$ -35 16 -15 -7 -43 -1 -112 -101 -56 39 48 32 -54 -48 79 -83 -19 23 99 87 69 20 47 15 66 1 -121 -120 -96 40 52
5589E2q2j6J12q4j2m4j6Q4Q7r9O4L6j42R2j6Q0j71L0J03o3Lr1l9J07j18J13PK8
$$ 52 -30 -46 66 -18 -30 -74 -90 -6 81 -18 46 82 -60 32 16 96 -75 -45 58 -5 -2 -93 -132 -25 -143 -30 -23 5
5617Em4P2p0N8M4j03M2m7O5N4J5m6j0K0n9p7L2J5J47k67K64j83P7j3m7Q2j2n9
$$ 5 -39 33 -37 21 65 -38 4 -43 22 76 91 45 35 55 -4 -81 -49 -34 113 -154 110 -73 4 -9 -56 26 14 -45
5645d5Q5MJ3j09L0L9n1M5k2J89j98L9q3P8n9J3J9K5N8j43M6m9L7JK3m0M8m5R1
$$ -45 40 44 57 -52 -22 17 -34 11 -11 178 -20 19 -64 14 -45 -32 -13 12 70 -73 -27 -76 -39 -38 -15 -55 -7 -52 39
5674C9J5j44J00qo4M7K2J00j08J7J07j12k3pJ86k27L8jP5k1j18M6J31j37J3M9
$$ 39 54 -90 10 2 -62 -15 7 107 -1 16 123 11 -12 -19 167 -60 -22 -23 52 31 -87 -41 90 -47 -34 15
5700A5l3L8j5q7R4j6l2jJ01l9k7j55K42j41J0o7P1J90j24L9n2J04j87M0Q3j68
$$ 15 -18 20 5 -82 12 -4 -36 -37 64 25 -2 -157 85 -56 -46 -113 -42 148 24 63 11 115 -72 -32 51 -117
5726a17J23Q0m7Q1j45JM2j19J12m4n5J20k2l4M5m4Q0n3N3j20J03K7J3o6qk7l1
$$ -117 6 86 39 120 -25 -24 18 -101 11 -33 -88 32 10 -24 21 -23 57 4 57 -63 40 67 80 14 6 -21 -52
5753e2m0L3L5M7L8Ml8J9r9J28m8k7L6j0Rq0L0L1N2j28j2j6P1J13p3m1%M3N8N2
$$ -52 -92 -59 -24 23 61 65 27 46 -53 75 27 0 36 26 35 -45 -15 16 68 -60 -72 -88 -17 96 23 -18 -18 25 83 135
5783A35j95n8J20n4M7M8J3k3O0k14J52o9K9lOK2k0m0P3m9j9O0j5o4O2J17j83k1
$$ 135 -60 -118 2 -52 -5 43 56 33 93 -121 31 -38 -9 -12 -6 16 -4 -44 29 -20 -39 21 6 -58 4 121 -62 -83
5811h3P4J37o1m6m2J3n3k9J3O5P4j41Q4R2j64N9o8Q6Mq2Q3K1m2l4J4L5q1j0O6
$$ -83 -9 128 67 21 -21 -8 -61 -90 -77 -12 62 -79 5 97 -67 -8 -76 10 14 -68 15 36 -6 -40 -26 9 -72 -82 -16
5840a6k2o3J94j13K5J40m8L3m7pj44J43q9jL6n3Q6o0J8O8k2r2M1R2j37R0Jj18
$$ -16 -38 -101 93 -20 5 145 97 130 83 76 -68 75 -14 -15 21 -32 54 -6 12 80 58 -34 7 99 -38 52 53 -65
5868f5N6j7M1j7Q1j34L9J0n5p0O0K2N1l9N2Om3J37j89J11N6j33M5m9lO8k7K6J5
$$ -65 -9 -26 15 -2 79 -55 -16 -6 -61 -131 -71 -49 2 -37 15 21 -22 115 -74 37 93 -40 5 -44 -47 21 -6 20 35
5897C5r8L8K6M4j46n0J86J10k02P1OK2k9l9n5L0J35j25n8J77j63O1O1j6KO1j19
$$ 35 -63 -25 1 45 -101 -151 35 145 -57 14 20 42 13 -26 -81 -51 84 -41 -99 78 -85 -24 37 21 23 84 -35
5924c5J36m1n7k7j8O5m8j3O6mK1pj80J99r6o7M0J7L1R5j0n7jj04L0N3oN9j6n6
$$ -35 101 60 3 -24 -42 23 -25 -38 28 24 45 38 -142 57 -39 -106 -66 -49 -18 77 67 10 9 -95 -65 -12 -18 41 25 -31
5954c1J1k3M2o3R4j9mJ5j0J7m8M8KM5k04P2m0P8l4J45q6M2j36J29r4N3j5J9N0
$$ -31 -20 -43 -1 -64 30 11 7 22 12 29 -19 29 31 76 -128 -56 -96 -18 -52 93 7 49 -87 42 -52 1 -14 5 55
5983E5q7J06j56JJ50p2n4J33L7k14J32m3JP4q6N5o3k8R6L2r9Pk3J06p8J8j10J46
$$ 55 -32 74 -82 -81 69 -3 -57 76 113 -101 31 -12 -11 63 -23 32 -31 -59 37 69 -30 -23 -46 60 -18 0 -110 36
6011C6N5r3P4j35K7N7qK7P4j39M9J3P8j45rJ4J40j83P9o3K7NJ4j7K1l9Q4L3k6
$$ 36 91 -2 72 -63 -36 21 13 40 114 -25 24 37 115 -30 -39 -25 115 -68 11 -52 -25 -20 -6 -23 -2 -41 43 76 50
6040E0J2n6N0j36Q0p6J15k1n2N5o1kM8o4l0O9K3o5O7Kj0O6j00J23m9m6q8J15Q
$$ 50 62 6 56 -80 0 -76 39 18 -34 21 -40 -42 6 -58 -88 -19 4 -61 6 8 -2 64 -36 87 38 -8 -96 19 27
6069B7m1k5P9M3r4Rq4L3J7R4j01l4P5LP5m2nr2J1J29j51J39j04N5nL0r9J9m5R0
$$ 27 -14 -39 40 83 -11 -2 -86 -53 -36 58 -43 -77 -2 1 76 34 29 -63 -52 77 -74 65 -39 16 11 41 -58 -39 -84 6
6099FK7P1j31l9J43%j7n2q1j0K47j24n5j5l2kP2k4Q8p0J11j77j4N6kL6j49J12
$$ 6 33 104 -27 -66 77 77 60 8 -73 -83 164 40 -15 -30 -62 -64 8 -16 72 2 113 -64 -78 -22 -24 12 -137 -25
6127b5Q2L7nj74j1J19p8L9J36j69Q2l5n9J04kj4j28K60j30L9l7r7J13j12L7Po5
$$ -25 57 94 89 -85 -96 23 -55 -16 120 -49 33 -2 -61 43 41 27 -101 159 29 68 31 -66 47 -65 -28 -21 -86
6154h6R7Pn9%J6l6P5Ml5K6M1L4j96J8Q5Ln4L7o9Q5rJ3P6j07P0J7j56J44R4j95
$$ -86 11 18 -41 -41 -25 -61 14 18 -17 9 50 84 -112 -94 -9 -6 -60 -23 -92 -7 -16 -3 73 -34 36 53 -103 41 135 -60
6184f0R9o3k0J29m7J8pRl3JRl4L3r7MQ6PM2p0q8K0o4L0JO7lJ75n1r4O8j12jK1
$$ -60 39 -24 -44 85 38 56 49 58 25 26 35 1 34 -63 -59 27 34 76 6 -82 -62 -126 -96 -95 -28 -31 144 93 -1 67 -45 -46 -25
6217b5N4r4MN4M3op5l3L9KO6l8J4O9m3p3N9n0N7J2m4K4nJ57j35m1k8RK3nj4k6
$$ -25 29 -65 -61 -7 36 30 -45 -78 -39 -37 29 -9 5 74 31 -42 17 -33 24 36 -8 16 11 168 33 -8 -36 -27 -4 -9 -23 -49
6249d9QQ0m1N5j07J49q4L7m4L8q0K21j94rL2m4J10j62J14j13J61j69Q8n4M0n3
$$ -49 -41 39 -2 53 -54 95 11 48 4 42 -38 183 -11 -20 12 -32 78 -84 30 -83 78 -91 -3 -57 -17 -70
6275g0j0J0k0J45q9K6O2M0j24n0J73p6K7M7j69J16j35J41R6k75J70p8R9n4J7o
$$ -70 -80 -70 -90 55 -34 -8 54 94 -30 -80 93 17 44 91 -78 38 -97 44 140 -135 35 -43 56 2 19 13
6301A3n2q7K61k03L7NN2j41O9P7l8J1k9Q1p7PJ12j05k6J0O9m0mj0j33J87j34J25
$$ 13 -39 -126 135 -68 -31 -26 26 -115 -46 31 -7 4 -25 56 -21 -14 98 -7 -33 -23 46 6 2 -8 -141 46 -88 37
6329C7l6J30j90j6R4nN6o2l1k1k3M8Nk1J20q2k2P0lo6R1j62J56m7p3L6p2P2j23
$$ 37 1 131 -59 -75 19 14 70 8 -23 -44 -67 -19 -14 -35 85 3 -19 51 48 -18 73 -89 67 20 -53 -17 -89 -17 -140
6358a40M5K7M6OR6j38Q4L7j9l2k4J7M7k3Q%K5j71J35P6j11p4R3qj7K1j7m4O5j68
$$ -140 -95 -68 -22 -16 80 -58 26 63 44 12 -12 5 52 29 37 37 62 -109 26 102 -9 -83 10 2 -15 6 -11 -55 10 -158
6388a58Q8J33l0l1o1N4M1J4j4n6L5l8L0l9K4n2M4Nr4J60n7lJ1n0M6J5q2N7qo6
$$ -158 -70 63 33 2 -59 -5 36 50 36 -20 15 -23 7 -32 -8 -60 -16 -11 -105 55 -2 -5 6 -44 2 17 -65 -8 -16 -82
6418h2J28k0k9l0RK6j31L8J94j3k05J22K4j3K2m2rNp1Q2N6o7O2j52Q8K1N5p3N5
$$ -82 46 26 -3 -33 -24 2 -129 -91 103 90 -115 7 31 18 40 -2 -11 -6 -77 5 61 -6 56 -96 -8 13 68 -5 50
6447E0K0j40N5M9l2Q4j55Q2L2m2Lj46K06n2r8O0O7q0N0L5j25K4Q8lmNj78J28k5
$$ 50 70 -70 -15 34 2 86 -69 13 45 3 6 -140 66 14 -84 -24 43 -37 13 48 -77 -53 35 32 28 33 -145 -17 -42
6476d2P5j2m8q6J33p1J38j00N1l8n3J22j59j1J82m7m5pK8q8J00k0J12p1r4MQ2
$$ -42 33 21 -27 -113 20 -51 87 -13 38 0 -53 69 -90 -101 81 34 -11 -18 10 -78 22 2 114 43 -51 -47 35
6503C5O3j16NNnj6K0J03j88Q3j1k3Rl2M2P4j08P8Qj40J85j43K7k1jL5p2J64n5
$$ 35 98 -18 -13 -8 -13 -29 -9 94 -94 -11 -22 -45 -36 -68 -26 48 -60 18 26 -114 71 -72 -45 -66 -67 -32 -104 60 5
6532Ep6R8k7n7NQ1O5j38J18o9L9j40J37m8N7l6j19J10N5P9j6l5k26J17M2N7j58
$$ 5 -71 27 0 -57 -52 29 94 -44 74 5 44 -96 41 -7 50 14 -105 5 60 139 123 88 -138 -21 21 78 -80
6559h0J46p2Q2j35J23qJ9q9r0K38p2m8J1M9j00J41j01J2q3M6j0J3k7P0q0P4k2
$$ -80 66 -6 76 -59 64 56 75 -14 -104 134 62 14 25 74 -26 115 14 26 -57 -11 -21 -8 -35 35 -45 29 7
6586Gr8J12P7j23qP7K3j11M2K4p4N8P6k0j93J51k1o5J6J43j61l5J21p6O7Pj10
$$ 7 -91 21 98 -25 -33 44 67 -44 -2 22 -52 6 82 62 -131 20 -1 -66 -50 93 -68 -103 18 -58 9 16 -94
6613i4L6J3J8J15j88J87j3p7N4j0n2m5J02q6J05r0K1KL1l3K9j17J44j8k0p8L3
$$ -94 -58 -45 -27 88 -100 87 74 -3 51 41 -11 -56 46 -40 65 -25 -4 -2 29 -4 25 -92 52 34 14 -64 -31
6640c1k5Q4j79J56K2l7m0kJ6O7r4O2J2j19j9M2R6n0k9Q1j15J75l3L1o2Q6j00l5
$$ -31 -56 28 -151 5 27 -10 -50 -52 -36 31 -63 -1 11 -108 -127 -85 11 -39 -68 13 -102 73 40 71 9 95 -5 -40
6668d0OJ3J13k13J22M0n2m7Q6K1j24O4J45k17O9Q4j13J07j03J26j56J13j5o5P4
$$ -40 -34 -21 92 -121 1 41 -11 -58 28 49 -75 -11 134 -83 -14 70 -43 64 -39 87 -69 44 29 -36 38
6693C8MK1m7oM7p6m9oJ67n4O0m8k7j34M0K8L7Q4j03qK2J04qn0j13J13l6k5M4J9
$$ 38 42 63 16 10 57 -19 -68 -74 93 39 99 51 24 -110 -70 -42 -5 79 -24 -32 -10 94 86 36 -77 36 0 -25 19 38
6723C8q8J01j60P3M2q6J61K1L6j24r9K3N7o2M3M2j19J13q6P0N5k02R7j0k6M0J44
$$ 38 -50 51 -109 -36 6 -80 81 102 138 14 -85 -62 -5 -67 -24 18 -101 12 -74 -4 51 -151 -54 -64 -90 -50 94
6750I4j79n5J78l2M6L2j34n8j9Q1R2k6q3M1J14j20J2L2o9N4j47J62p2p3J84jj09
$$ 94 -85 -140 38 6 52 84 -50 -108 -127 -46 46 20 -63 -22 92 -28 -16 16 -53 1 -146 16 -56 -129 55 54 -55
6777e5R9j07J2M3M0j40J62j36K21j45o0O7L9J8K6j29J07o4N7o8M0Jn6J13K7j21
$$ -55 44 -63 -51 -8 32 -108 54 -82 139 -6 -66 1 40 58 84 -45 62 -2 55 -13 27 28 -28 85 112 -9
6803im8J74j19j06J58J2k5n7%K9mp2N4l0ON1O9j29Q2j0n5J3m5J05L3M2j47J0n7
$$ -9 -57 117 -2 -108 50 62 37 -20 -20 9 5 -67 -13 -43 -37 14 83 -46 36 26 -29 -16 -61 44 77 119 -28 -18 -75
6832g5N0l6O1j7L4j32J80k6k9N5j62Q9J29r2m3m0P9J6n8J9Kp8J17k4j5J28r0N
$$ -75 -25 -61 0 -17 17 -115 65 39 10 65 -97 -8 121 29 -14 -54 25 41 -17 2 4 -74 43 19 4 132 42 47
6860D7l2J7M3m4m1M8jkr7M8J07j07J00j12Q3j46J52L3k16K74j48p5J94j36n5J11
$$ 47 15 32 75 31 -10 38 37 35 -62 -14 93 -14 86 -26 57 -89 63 96 -120 154 6 -69 125 -11 -66 45
6886D5M0p1n9m0N7P6j9Ro1kL1n5J14l5p3M2O3k2Q6r7k5%r4R7p5P1n3j0O9j1RK3
$$ 45 85 14 -45 -85 -28 48 29 38 -23 -25 6 -49 65 30 -43 -1 62 40 126 29 4 4 -90 7 -68 3 -50 -60 9 -2 7 30
6918C0PJ8p0J24k10M8Q4j23oK1p9K13K2j62K36j44L2j14J26n2j1N3p8n3K5%M1
$$ 30 37 55 -15 109 -101 -53 31 -92 -98 -77 -156 57 79 -83 153 9 41 -73 53 1 -10 43 -35 -88 -63 -63 -22
6945b2R3n5j38J30pJ5p2k1J9m7K09j54k9R3J3Q6j05r5O4n2P7Q6k10O5K5M8j8j08
$$ -22 71 16 -122 8 1 16 -56 -77 -58 -105 104 -50 -79 14 27 113 8 -87 -23 -75 2 88 -122 -57 -32 16 -2 -110
6973a10J71N0j25k7R0jJ64j68p7Jm2m4J72r2K9R7m0n2N6o3p0J32j67O8L0mQ8j63
$$ -110 61 111 -14 -41 49 48 212 44 -33 -32 -74 -118 54 -38 -9 88 48 -4 52 -11 -81 51 -116 -48 -18 -22 66 -97
7001i7J40m7m1Q4nj15rk7J23qL1ko7O2J3lj41J79K5p4l2j2j00J28L0n4K3jn1Q2
$$ -97 43 -4 -45 39 34 -81 -90 -117 6 -2 29 27 -40 22 35 32 -109 70 95 21 -11 -23 -123 5 35 -19 4 3 -48 34
7031C4j0k5k1n1J44o5J2k5O3j57PJ23p5N1N5r6J00Kj14mN5Pp9J53j1j21n2J20
$$ 34 24 -1 -22 -73 71 6 18 -7 56 -101 -94 29 -46 5 60 -36 64 66 -48 -52 3 10 -69 84 73 -48 -100 20
7059B0qnN9q4K3k6p9J17j17J01L8q2J3R7j24P4M8r7J3Q7r9R1n8m6j3O5n6%R3j18
$$ 20 12 7 66 -18 5 -21 -100 17 -100 1 39 -43 -30 67 -57 17 65 -32 -19 68 -31 60 2 -44 -57 8 -48 -48 45 -73
7089g3J14q5R9q6M5Jj1J3kJ0l4K6j5R3j33RM6Om9O2m0Q2n3o6K2j03J02P1o5K9
$$ -73 41 -44 55 -31 14 15 4 17 15 25 -9 17 2 95 -38 -29 17 23 -26 36 -4 78 25 -41 -19 -122 -20 51 -14 15
7119A5P7j29k2Q9j57RK09j21M9N4j97J21M3j02J82j42R0j43j3J53j86J38N4q3
$$ 15 92 -37 -59 30 -127 -118 91 -30 19 73 -124 -3 40 -62 120 -22 68 -75 -88 65 -121 17 71 -12
7143a2Rl7k0J10q0p3J82q4J5M4J1j0l2k0N3k8m8l5J29j10M5p4O7joLKo3J80q1
$$ -12 -3 -40 -60 50 -30 -103 79 -5 10 54 65 55 23 3 56 28 -20 -55 74 -36 9 -65 2 1 -5 -2 0 -63 117 36
7173C6n3K5L8Qk8mN7p7p9M0J9j4K9k9R1l8o2Kn8J24j20J89j71J75k5m3r3O5OO2
$$ 36 -17 8 46 54 26 22 79 2 -77 -37 -18 -32 -3 -32 59 21 -41 -39 -97 27 -93 96 -75 100 75 32 -61 4 10 72
7203G2p3k9oN4mL3m9M1l3p7N4M6j08qJ38r2j0oJ31k2r5R1k72K20J40j30L0m6M
$$ 72 -1 -30 -36 18 14 47 -2 39 6 -71 -17 29 -79 -87 51 -41 -51 -57 74 52 -43 48 -224 -4 136 6 36 -10 -6
7232fQ8p8j4j4N1j13K8M1rO1n3mJ1j4J65k08M7N8m8l3R9Pj60J85j67K45j50R1
$$ -6 82 4 -10 -24 27 -86 -58 -17 -26 35 -18 -22 -11 -25 140 -68 -21 37 -11 -44 55 62 -98 87 -80 165 15 106
7260A06p0o4l6N0%M7n5J8k2QkN1k9J3kK5p0k1K57k31J04k9n0n3j17J28P1j00J11
$$ 106 36 -28 -64 -14 -14 33 -22 -4 -26 -18 -20 31 2 15 13 38 -32 -53 204 -27 77 48 -2 -55 -172 -44 27 -73 38
7289C8j12J36k5p5K2K6n8M2K8L6j2m3Q9j0lk4l5j38K19k6j59N6R7o0Q5j92P8K19
$$ 38 -74 62 37 -38 -16 10 -48 -6 22 58 46 3 92 82 79 55 20 -118 101 75 -84 -28 69 9 94 -98 -20 199
7317A99j52j24O6O9j13LO3Kj2rrj44K1J52r7P8Jm6L5k8O6m6O7m6j6N5Ml9j5K4
$$ 199 47 -77 -11 58 -55 -52 11 13 1 -8 -17 -161 -140 12 -85 -7 -6 -52 -17 -45 21 -25 42 -4 -20 35 39 0 -15 9
7347IOLJ60j89J5k3P8j47J12m4k1R8m9j0j6K3mRj5K7L1j12R0k9Ok2J9k2K6Pl2
$$ 9 15 18 178 -11 4 -19 59 -88 24 -20 -41 57 8 -2 -18 5 1 10 -5 22 53 -59 31 2 8 -14 5 -17 9 16 -16
7378a6N0m2M9o8M4L7m0m7lM5Q6n9j8n5%J32j00n4K6J2Q4j10N9K3R0j50o1J41J9
$$ -16 34 -8 41 -27 17 54 14 -33 -36 9 95 36 18 -37 -37 95 -5 -59 -33 -21 63 -47 12 35 125 -25 -86 55 74
7407G4j19J30l7j58J91j49J61j42PJ6Q9n3J43j97L4n8j1P6L3q0O8j36R8J55j98
$$ 74 -45 85 48 -110 81 -68 93 -49 -42 -26 63 10 153 -44 -10 -68 -79 -3 30 -50 18 -118 -20 135 -63
7432f3P6m7l5R1k7J0j7Q1rM1k3p4rn3J18m2L8j15l7Q2rLJ7R6l3q5k8J6Q7q9J06
$$ -63 13 -34 -69 22 -5 5 -12 69 60 101 78 4 -5 -58 60 18 56 -59 -96 -14 -23 -20 -3 93 60 -25 -53 -37 50 -39 67
7463F7j21K8lJ08r8Q2q6Mo3J17m5l0J15j75J43p5rQ7o9P3p0P4nj17J22p4l9j21
$$ 67 -54 -26 -29 79 -19 63 -23 -19 -82 35 -10 -40 75 -100 43 -32 -41 46 -23 50 -20 54 49 -68 54 -20 -59 -180
7491a80K51j26O1Q3j25Q5J8j9r9O0j06R8n9J26o4q6j5J06q0%K06j55jJ10m6j5
$$ -180 71 -55 6 89 -36 49 67 48 -51 9 -97 1 -58 68 4 -82 -97 9 -71 -71 135 -20 -21 89 43 28
7517B8j08R7Jj00J9J30ko1pL8m7N7j29J07n7N3m9kJ8J19j29K3K5M8q2k6j4oK1
$$ 28 -80 17 18 -82 -63 67 65 4 -3 35 -12 45 -84 23 -34 19 -30 -32 -14 105 -24 -1 24 72 -10 -36 -50 -56 -35
7546c5J07q5p6N9P9n0K2M2j60Q7O6l3j1j60L1J95j9r8Q3j5MPj42K03j35K4r2J2
$$ -35 72 -13 -89 -30 49 -1 21 63 -97 -10 56 23 12 -148 -117 78 59 -39 44 29 33 40 -102 101 -34 -10 -102 -90
7574i0L63k01j13R2LKM1m1l7K5r3N5j00J8l7J90k39J04L8Q9j34O2o0J32j26R9
$$ -90 273 72 -41 51 54 56 97 56 19 44 -49 6 -94 -76 -113 77 -162 -58 -20 69 -65 -3 -63 69 -57 42
7600D2j4r4J42n2J7N0j18jLo2J13K4j05KN0l8N4qJ22j15M3o8Q2j73k7K57j38J01
$$ 42 28 -66 76 24 41 91 -27 -28 -25 -87 26 50 -55 -53 -3 -41 13 5 127 12 55 -13 69 -104 -131 126 -12 89
7628H9j49j2Q7q5K8R2j22P6j1j1q4O8Q7n3l7MQ9kp1n7O6j9L2J3K7J9p1L8p7J25
$$ 89 -60 -72 15 -70 -42 50 -72 4 -7 -18 -102 -34 53 0 -37 -33 56 54 -17 -74 -8 -27 5 18 45 64 -7 31 -46 79
7658G9q3n6Q7On6Q6q4P0k0O0j19O0O5r5Kj2J25o2j19J7J13o2Q0r2n4J21L0Q4n3
$$ 79 -4 -60 27 33 -23 63 -21 49 29 89 -30 30 95 0 2 -10 115 53 -66 -49 64 2 82 -10 -64 57 87 171 118
7687A18j11k2M2p9P0K2P2M1n2j68K2J40p7m7J3P4q6m5J21n4J09p6mJ5q3l0J16
$$ 118 7 -15 27 -52 18 40 112 153 101 -67 -45 95 18 -29 -16 58 -28 -73 48 -6 103 27 23 38 -45 -75 41
7714D1p6L1Q0j17o8J29j1l9KJ7k5J22j40O0m0n1P1j06J75n1r9N3L0J07n4k4m0
$$ 41 -35 -4 76 -41 -109 20 9 -30 -28 -11 -36 86 -54 6 -34 -85 -14 -120 55 4 -95 -42 -12 95 41 17 -23
7741b3j6M6L4n7q5O2L4Lk1J40j68J00jj15L8L1o3J8J50j20n6N1J7k5m1J64j06
$$ -23 -39 7 41 -16 -101 -39 -5 -2 -23 117 -51 49 48 -67 -29 2 -61 -43 107 -13 -69 -18 -1 -26 -67 97 -9
7768iR2j61R9O1j33J03j17R5q5M6N7o9O2r9r9J27K3l9R2p1J6M2j15R8j6l3R4j52
$$ -9 83 -78 21 82 -51 52 -65 30 -55 -9 48 -21 41 -58 -157 -30 -7 -46 46 -25 -9 33 -82 16 0 -33 61 -91
7796i1J79r7M7k6M0j06R8l0r0qQ8Nqj3l2O3k4n1lQ3j45J30N9j25P2l6ml5Q4j05
$$ -91 88 -9 38 12 52 -54 44 14 -76 -84 4 9 1 -12 -44 19 -5 -56 -59 24 -121 9 68 -57 15 -21 -25 -60 24 -81
7826h1R9l4Q4j34J00J9J0o9j08J31k3J01q9rL4j47J15nl0j2J07l1k29K64q4m1
$$ -81 18 -16 68 -66 34 53 63 -6 -114 17 -6 95 6 -3 31 -116 -1 -6 -36 -48 59 28 -201 63 -21 -62
7852f2J02o4k6J65n8j26N5R3j00J13k7J1k6Pk5j36J32j14L6k5P4n2jJ43j01M2
$$ -62 40 -24 -50 115 57 -69 -14 79 -21 92 65 76 50 57 32 -104 28 -86 -50 -75 -1 -53 -54 89 -12 30
7878C0J5o0J05m5m2l8o9R7lM9m4kl0j5J32l3p7J3M3J9j72J37m2l4J18n1n0J03
$$ 30 45 -15 90 45 3 -35 -104 -7 -10 39 -5 -7 -37 -52 80 47 -30 -17 26 45 -127 10 -32 -66 52 1 -49 54
7906E4j7Rj34J17l6J33j6j77L8j3J48l0j34K2N6Oj6L0R3p4j2j4jj8p0m3N9P5N5
$$ 54 37 46 -88 29 -7 126 110 -67 -29 -42 106 76 -58 -36 20 26 10 40 133 59 47 33 32 14 -56 -99 -40 35 90
7935I0k00J63m8j43K67p7m7j1p0K9j26J36M4l8n3L4J22j04L7o6o3O9J16j16J39
$$ 90 -110 53 5 -138 129 52 5 -6 -76 -47 -173 -37 7 -31 -84 -50 72 -32 5 -61 -124 -55 61 -55 84
7960H4j28M2M7q1Ql0M4PJJ3q6J52k0n0p4Pl0P2K3n5J09n4j00K71o3j73j20J93
$$ 84 -44 -2 45 -36 -28 -58 -14 -7 -6 7 -79 73 53 3 -71 -64 -94 -22 1 -54 55 1 -99 172 109 -64 -184 9
7988IPq1kK2P9lJ2j26Q8J4n1njJ96j77OK9j6j46N1L9M6M1Pn7L7q5K3o7J04J4j03
$$ 9 16 -65 -67 -45 34 31 43 -83 5 19 -32 -37 -38 158 -19 -13 16 0 -146 -95 -56 -10 31 38 -19 18 -67 -44 -111 -7 7 -96
8020i6M7m8P2P2j36Q8n0J31j0j16N6j5P2j29R2Qn0J01r3P5n8M2n0q8P3J00q4q5
$$ -96 -49 -97 -25 47 -89 -1 -51 80 70 -46 10 -5 67 -62 30 38 -12 89 -4 71 13 55 5 -83 -10 90 6 -79
8048g9P4n7J37r7J31j63M7Q7j06K9j62N4J28NL8j41O7Q4j56p1K10o7J6r1K5Q5
$$ -79 -5 -62 75 -22 109 -54 -7 80 -26 3 -159 -105 23 28 66 -75 -8 76 -80 -151 59 -8 8 -83 -58 27
8074B7J0L5j37O2L0n2k9Q6m8N0m4M8N7m5l3m1k4K2j7r5J77J8j42J52%p5o8L7J06
$$ 27 37 72 -65 -3 27 -25 -54 32 -16 34 -10 38 95 50 17 -24 -48 -26 -43 -138 39 57 -85 67 67 -8 -76 -39 67
8103F7p5k2J46q5m3N5p0l0J07n0j83K72k6OJ9p4n8K4L0M2mk1j07J33j68lJ57m0
$$ 67 -8 -30 116 31 -12 43 -27 -57 50 0 -183 89 63 69 88 14 -44 -20 10 52 48 27 -80 53 -115 -118 39 -1
8131aL0Oj4Rn2L2n8J35j6q1k6o6J14J10k54K11l4j69M4R8m8Qj1M9o6R0n0K7r7
$$ -1 29 35 21 30 -22 10 -48 87 71 -10 -36 -102 12 122 -132 79 45 -124 -80 18 -30 -22 -33 16 -50 40 -10 17 -80
8160h0K01j18l5n3P5k8N0o6l5J50j04l4lJ47j24Q2j0k0N1n7l1J06j31J35p0%k9
$$ -80 121 3 -32 -85 -10 -38 12 -54 -89 61 -43 -77 -80 67 -57 25 15 -5 46 -11 -42 64 -67 68 -2 -2 -31
8187c1%k8K4N1
$$ -31 -31 -59 -35 16
8191A6
$$ Imaginary data points
##PAGE= N=2
##DATA TABLE= (X++(I..I)), XYDATA
0@%%%%%%%qQqJ6k4L2l2M0n6P2q6J00j18J44j75K05k38K78l26L77m33N00n75O58
$$ 0 0 0 0 0 0 0 0 -8 0 -8 8 -16 16 -16 24 -32 40 -46 54 -64 80 -95 110 -128 150 -176 201 -232 268 -307 351
31C51p50Q52r63J088j228J378j542J724j925K143k380K638k921L236l577L943
$$ 351 -399 453 -510 578 -650 728 -814 910 -1015 1128 -1252 1386 -1535 1701 -1876 2067
47B067m344M787n276N812o401P054p785Q605r527J0573j1773J3168j4816J6791
$$ 2067 -2277 2510 -2766 3046 -3355 3699 -4086 4519 -5008 5565 -6208 6960 -7856 8935
61H935j9206K2245k6201L1576l9322N1494p3395J24361m41129j33512J129551
$$ 8935 -10271 11974 -14227 17349 -21973 29521 -43874 80487 -360642 -494154 635397
72F35397n87719n48006Q12956P2116r25238M14720O83707o69614l84658P62768
$$ 635397 47678 -500328 312628 384744 -540494 -125774 557933 -111681 -496339 266429
82B66429R651n72140L08610L34372n55280j45330N55676M4616m24215J05076K79915
$$ 266429 276080 -296060 12550 346922 -208358 -353688 201988 246604 -177611 -72535 207380
93B07380k55507j84538L86741K5681m60701J63788M63627l08477k90378L88748
$$ 207380 -48127 -232665 154076 179757 -280944 -117156 346471 37994 -252384 136364
103A36364k8468m51052L46670M00328n36838j45637N88214k36672m70160N40007
$$ 136364 107896 -343156 3514 403842 -132996 -278633 309581 72909 -397251 142756
113A42756J55099o60153K47718N81432n26790k99508O08450j16466n50479M77973
$$ 142756 297855 -362298 -114580 466852 -59938 -359446 249004 132538 -417941 60032
123F0032L73986o34500o3948N95001k69951m29911M58055J74342m79274R1996
$$ 60032 434018 -200482 -264430 330571 60620 -369291 88764 263106 -216168 -124172
133a24172M28805k56557l38843L13173J83630l58366m577M07659j30698l72614
$$ -124172 304633 48076 -290767 22406 206036 -152330 -156907 250752 120054 -252560
143b52560K46799K39497l79062q2052M66250q6953m29016L06862K76984n09698
$$ -252560 -5761 233736 -145326 -227378 238872 151919 -277097 29765 306749 -202949
153b02949n5004N46761k19223l94553M68809J55554n54309J01755M33649l53127
$$ -202949 -257953 288808 69585 -324968 143841 299395 -254914 -153159 280490 -72637
163g2637k09441N12450k4584m77589K51318K82166m10855m5982M04363j62358
$$ -72637 -282078 230372 205788 -271801 -20483 261683 -149172 -195154 209209 46851
173D6851k53286L11196R1138l47175K1255K60638j33729j41493K41794N7234k71086
$$ 46851 -206435 104761 195899 -151276 -130021 130617 -3112 -144605 97189 154423 -116663
184a16663K3800K21859j22451j63134J92173J01941k16962J2778K44809j59766
$$ -116663 -92863 128996 6545 -156589 35584 137525 -79437 -66659 178150 18384
194A8384k56362K63032J56006l04740N4406K96850k49609k10873L46084L2388
$$ 18384 -237978 25054 181060 -123680 -69274 227576 -22033 -232906 113178 145566
204A45566l64503J62805L05705k93250j30236L55575j07652l45119K76796K18715
$$ 145566 -218937 -56132 249573 -43677 -173913 181662 74010 -271109 5687 224402
214B24402l22521j854K94109j81608k18013K57676Q4477k72461N9241K54215j48559
$$ 224402 -98119 -99973 194136 12528 -205485 52191 136668 -135793 -76552 177663 29104
225B9104j64455J90009J8903k16240Q6573K03925j19994j29312J51895L9907k01334
$$ 29104 -135351 54658 73561 -142679 -56106 147819 27825 -101487 50408 90315 -111019
236a11019K9638K03068j12238j34086K11520M2638k51208M9768J91507j61317
$$ -111019 -81381 121687 9449 -124637 86883 129521 -121687 -71919 119588 -41729
246d1729r6278K52878Q734k57181J04292J78105k31459o5277K79419o2802k09541
$$ -41729 -138007 114871 123605 -133576 -29284 148821 -82638 -147915 131504 68702 -140839
257a40839J93658R6238k60130M093K22809j09375j36840K06335N6019k30548L7272
$$ -140839 52819 149057 -111073 -106980 115829 6454 -130386 75949 131968 -98580 -61308
268f1308J71114j47830r0831K02967J8553j69026O4259J14650j36884q2323J59310
$$ -61308 109806 -38024 -128855 74112 92665 -76361 -12102 102548 -34336 -116659 42651
279D2651K7573j45949P1130J29319j45225q6229J53356o118j41414R6131J28703
$$ 42651 70224 -75725 -4595 124724 -20501 -106730 46626 40508 -100906 -4775 123928
290A23928j36001p3998J52490k9246j67645J19183J31891j60901k0330J74267
$$ 123928 -12073 -86071 66419 37173 -130472 -11289 120602 -40299 -60629 113638
300A13638r0381j53023J38198P4744j54410K9701J66457j02793j30247J41718
$$ 113638 23257 -129766 8432 83176 -71234 -41533 124924 22131 -108116 33602
310C3602K5994j67535P4426J49426j18239o6472J33045k5002j40268P0283J10734
$$ 33602 59596 -107939 -33513 115913 -2326 -68798 64247 39245 -101023 -30740 79994
321G9994r6176l8558J35476k7104j41622O8045P9976j06225o930J31407k8188
$$ 79994 -16182 -54740 80736 53632 -87990 -19945 60031 -46194 -53124 78283 50095
332E0095j11523N7124O1738j10157k1334J39304k3522j06489R2969N0351j41451
$$ 50095 -61428 -4304 57434 -52723 -74057 65247 41725 -64764 28205 78556 -62895
343f2895m745J24565m7564p5369J09990M0673j37599M450J13295q3648p0079J40225
$$ -62895 -67640 56925 9361 -66008 43982 84655 -52944 -48494 64801 -18847 -88926 51299
355E1299J8582j24865N0891P4559j10744l9548J17943K51q9422O4826O6804j09917
$$ 51299 69881 -54984 -4093 70466 -40278 -79826 38117 38368 -51054 13772 80576 -29341
367b9341l4785J02630l1008p3311Q8527N1176r0245j7136O8046l5716o8614P1327
$$ -29341 -64126 38504 7496 -65815 22712 73888 -16357 -33493 34553 -1163 -69777 1550
379A550O0939q1365p002Q8442n4719q3846P5135L9325p5018K3646Q7830n7723
$$ 1550 62489 -18876 -25878 62564 7845 -76001 -866 38459 -36559 -12913 74917 17194
391A7194q1569P2181K7345r4820L8677R7984p6709m6490R3511k2947r8198N2749
$$ 17194 -64375 7806 35151 -59669 -20992 76992 283 -46207 47304 24357 -73841 -21092
403b1092O8114n9635r111Q0829l6057q9265N6350M7913p2540J1634P9432l8385
$$ -21092 47022 -12613 -21724 59105 23048 -66217 -9867 38046 -34494 -22860 56572 18187
415A8187n0489M5932Q485o4494M808P2367q932m7614M2693J3721q1904O151P5656
$$ 18187 -32302 13630 22115 -42379 -37571 34796 25864 -21750 20943 34664 -47240 -41089 34567
428C4567k8999m0346O1262K0523p2913q73N8969m8343m2489R5361K0113r0292
$$ 34567 5568 -34778 26484 47007 -25906 -26779 32190 -16153 -58642 36719 56832 -33460
440c3460K9788M9501q2276j7097Q7294j2079n6120N1983L2399p7184j2187O5720
$$ -33460 -3672 45829 -36447 -53544 33750 21671 -34449 17534 49933 -27251 -39438 26282
452B6282l1890l9538P3854J9420o5840P541L0366l7987j8105M4544K0275l1454
$$ 26282 -5608 -45146 28708 48128 -17712 -10171 20195 -17792 -35897 8647 28922 -2532
464b532J069L1563l4237m1817M2838K4505l8049J1955M4159k8014m3121L1266
$$ -2532 -1463 30100 -4137 -45954 -3116 21389 -16660 -4705 39454 11440 -31681 -415
476d15J3830n4239K3865P6221m5417m7266O0723j5812p0420N4840M9438o2179
$$ -415 13415 -40824 -16959 59262 13845 -33421 27302 11490 -58930 -4090 45348 -16831
488a6831k801O5404l2246n8097M6354J6561o3682L3647P4173m9619m2897L9439
$$ -16831 -19632 45772 13526 -44571 1783 18344 -45338 -11691 62482 12863 -30034 9405
500I405j2222l1599L7997K5504l0859j1158L1818L130m1853n728K7638o358j736
$$ 9405 -2817 -34416 3581 29085 -1774 -12932 18886 22016 -19837 -25565 2073 -4285 -6021
513f021L5328J338m8568j5906L6534K489k5734L5417J8217n7038J3702N4925n5959
$$ -6021 29307 30645 -17923 -33829 2705 5194 -20540 14877 33094 -23944 -10242 44683 -11276
526a1276m1407O2441J0220l3292L9970J2955p5897p512O9062j6954l8403N2729
$$ -11276 -52683 9758 19978 -13314 26656 39611 -36286 -43798 25264 8310 -30093 22636
538B2636N084n7889L2411L1132o1253q170N1129l213j0991K4182r350m4287p02
$$ 22636 27720 -30169 2242 33374 -27879 -36049 15080 11867 876 25058 15708 -28579 -29281
551b9281L8884M093j8228R400O771j2481k467M300o864j8054J0791M5939p209
$$ -29281 9603 13696 -4532 4868 11639 -842 -3309 991 -5873 -23927 -13136 32803 25594
564B5594m3298J9187N886m5309K7044N0261l8926k0901M7820j0709n0174K8686
$$ 25594 -17704 1483 7369 -37940 -10896 39365 439 -20462 27358 16649 -33525 -4839
576d839K6307n1542J0842P0738l4028n0314M1392n455m3381M3335L0662m2293
$$ -4839 21468 -30074 -19232 51506 17478 -32836 8556 3101 -40280 3055 33717 -8576
588h576K90L2782k1093k8166J9441J1179j6511J4274K2511j9313j5754M122n916
$$ -8576 -8286 24496 3403 -24763 -5322 5857 -10654 3620 26131 6818 -8936 -4814 -10730
601a0730M43R283R400R362j6667j1931J9305j3389k2990L1896J4863k4897J2984
$$ -10730 -10287 -1004 8396 17758 1091 -10840 8465 -4924 -27914 3982 18845 -6052 6932
614F932J8111l6609j7492L7995j328l1910L7210K6373n4507l047L8790l7383j4413
$$ 6932 25043 -11566 -29058 8937 7609 -24301 12909 39282 -15225 -18272 20518 -16865 -31278
627c1278N5392o822l5607K9329J1797m3169k846L3700r628j3236L2313J783l4677
$$ -31278 24114 17292 -18315 11014 22811 -20358 -23204 10496 868 -12368 19945 21728 -12949
640a2949O476R923j9232P795J9778j987m720n495r73Q27j4583K898K2576l489
$$ -12949 -6473 3450 -15782 -7987 11791 9804 5084 -411 -1384 -557 -15140 -12242 10334 6845
654F845o386J3787p858k6831P950K3464j4255o814L4761p958l8791K2847J0959
$$ 6845 459 14246 6388 -20443 -12493 10971 -3284 -10098 24663 16705 -22086 761 11720
667A1720m0231J8521L8624k8815j0014L1529j7443l4138K3094K1580k3136N694
$$ 11720 -28511 -9990 28634 -181 -10195 21334 3891 -30247 -7153 14427 -8709 -3015
679c015L1003k3167k4485K4687m689k1486K4122J5718j6028j921L855p452r024
$$ -3015 27988 4821 -19664 5023 334 -21152 2970 18688 2660 739 4594 -2858 -11882
692a1882R35J2982M220l605P213j924j7683n086J2398O203p346Q577J5184k1463
$$ -11882 -10947 2035 6255 2650 9863 7939 -9744 -14830 -2432 3771 -3575 5002 20186 -1277
706a277j2952K2766j2320j9876L2816J0476k6580J0994J1379l0779q047L0591
$$ -1277 -14229 8537 -3783 -23659 9157 19633 -6947 4047 15426 -15353 -23400 7191
718G191J349j8466J9423J0760l2694P35K3849k2420p473L3221j096j7392Q713
$$ 7191 8540 -9926 9497 20257 -12437 -11702 12147 -10273 -17746 15475 14379 -3013 5700
731E700j490j7883k75J7186N174q595N052M925j5382n030Q647j226j433P559R976
$$ 5700 4210 -13673 -13948 3238 8412 -183 4869 9794 -5588 -10618 -1971 -3197 -4630 2929 12905
746A2905k715j7458J401P703j5067P246K5445j3311j3038J6150o167k1140J0325
$$ 12905 10190 -7268 -5867 1836 -13231 -5985 19460 6149 -6889 9261 3094 -18046 -7721
759g721J6600j1040k556K2522q304k7897J4586R673k2067J3595K4096j7820q915
$$ -7721 8879 -2161 -4717 17805 9501 -18396 -3810 5863 -16204 -2609 21487 3667 -5248
772e248J2679q941j4145J0819J3942o421l582J2173o845j7306P304N461p372Q188
$$ -5248 7431 -1510 -15655 -4836 9106 2685 -897 11276 4431 -12875 -5571 -110 -7482 706
786G06J0545l260q407n887L498k093m057J6305N640j5340L643O084j4827m312
$$ 706 11251 7991 -416 -6303 -2805 -4898 -8955 7350 12990 -2350 1293 7377 -7450 -11762
800a1762J2536K249n964R071R523j9530j2268J7522k971r872K2149L504k0912
$$ -11762 774 3023 -2941 6130 15653 -3877 -16145 1377 -1594 -11466 10683 14187 -6725
813f725N430Q673j4584m597J3801M346p199O990P228j9497r108J5428j026l363
$$ -6725 -1295 7378 -7206 -11803 1998 6344 -855 6135 13363 -6134 -15242 186 -840 -4203
827d203J3583r08j1037p69K703j798n771M413J2991l115m716N458r730j0791R866
$$ -4203 9380 8472 -2565 -3334 -631 -2429 -8200 -3787 9204 6089 1373 6831 -2899 -13690 -3824
842c824R132k304r93M900k457j3310L165R614j1713J486J9746o837j0943P760
$$ -3824 5308 3004 2011 6911 4454 -8856 -5691 3923 -7790 -6304 13442 6605 -4338 3422
856C422n230j1393Q970J2968l406o268P362j363j5650N376R471j0439M789J4092
$$ 3422 -1808 -13201 -4231 8737 5331 -937 6425 5062 -10588 -5212 4259 -6180 -1391 12701
870A2701p902q309J810k346l284L122R957K094q096K114J355j1266J121Q823r03
$$ 12701 4799 -3510 -1700 -4046 -7330 -4208 5749 7843 -253 1861 3216 -8050 -6929 1894 991
885I91Q73M637J25p617p769O199K663o487J0545P551j3335j150N635r673k576
$$ 991 1864 6501 6626 -991 -8760 -2561 102 -6385 4160 11711 -1624 -2774 2861 -6812 -9388
900i388J1141M639m846N32N458r512r513J1437K369p676J1716M375j2818j187
$$ -9388 1753 6392 1546 2078 7536 -1976 -11489 -52 2317 -5359 6357 10732 -2086 -3273
914c273K691n159n15P241O233l767m129M084o040p310Q453L954k130N177Q36n358
$$ -3273 -582 -5741 -6256 985 7218 3451 -678 3406 -2634 -9944 -1491 2463 333 5510 6346 988
930I88n171j524N131r00m90J0432k299r887L798j358p831N795P826p19k353J915
$$ 988 -4183 -5707 -576 -1476 -1966 8466 6167 -3720 78 -1280 -9111 -3316 4510 3791 1438 3353
946C353o08j0023J15J1040m509j657J2083m791r348M140k030n221N595P329N53
$$ 3353 2745 -7278 -7163 3877 -632 -2289 9794 5003 -4345 -205 -2235 -7456 -1861 5468 6021
961F021n899k99J469p933P35Q786k881M50O448l452n183k141l33K733O31M724
$$ 6021 122 -177 1292 -6641 -5906 2880 -1 449 6897 3445 -1738 -3879 -4212 -1479 -848 3876
977C876N239q720m614M451m061j508O988J034j713J579J662m725q716M878P513
$$ 3876 9115 395 -4219 232 -3829 -5337 1651 2685 972 2551 4213 -512 -9228 -4350 3163
992C163m040M794N360j1245k984N900l739j078N699K525j947j824K160l978q199
$$ 3163 -877 3917 9277 -1968 -4952 948 -2791 -3869 1830 4355 2408 584 2744 -1234 -9433
1007i433O056O616k240M004J30q359j020K569N67R00l46M585J785o197k40q26
$$ -9433 -3377 3239 999 5003 5133 -3226 -4246 -1677 -1110 -210 -556 4029 5814 -383 -623 -1449
1023a449n675M799O571p84p35j532k212l403j058O715P96m421O894R88q374J784
$$ -1449 -7124 -2325 4246 3462 2727 1195 -1017 -4420 -5478 1237 2033 -2388 4506 5494 -2880 -1096
1039a096j09n055N220O711n01m036k104J131l845j577P243m53k380O139k688o502
$$ -1096 -1205 -6260 -1040 5671 5170 1134 -970 161 -3684 -5261 1982 1529 -851 5288 2600 -3902
1055c902J570l08j37L015K631K880l651n216K167j542j381O122P93j964J767j560
$$ -3902 -2332 -2640 -2777 238 2869 5749 2098 -3118 -951 -2493 -3874 2248 3041 1077 2844 1284
1071A284l177k876O89N793o18l60M833m846n157L837j855j282O417J926k027k062
$$ 1284 -1893 -4769 -4080 1713 1095 735 5568 722 -4435 -598 -2453 -3735 2682 4608 2581 519
1087E19p59k55l944J629N860k113P61L391o474l047K937r35J186K809J558O70
$$ 519 -240 -495 -4439 -2810 3050 937 1698 5089 -1385 -4432 -1495 -2430 -1244 1565 3123 3793
1103C793m456j844J783k926K181N318k113O2J274l847k525l40K237L513j368J657
$$ 3793 -663 -2507 -724 -3650 -1469 3849 1736 1798 3072 -775 -3300 -3640 -1403 2110 742 2399
1119B399J482o454m95K453l150K737N287j397j514j215j182p96j827L676L278
$$ 2399 3881 -2573 -3068 -615 -3765 -1028 4259 2862 1348 133 -1049 -1845 -3672 4 3282
1134C282k287K151l18o320M18J933j162K818K050L40j060m360M88P30k082M535
$$ 3282 995 3146 2828 -3492 -3074 -1141 -2303 515 2565 2905 1845 -2515 -2027 -1297 -3379 1156
1150A156K497k993J833o05m411n41Q46K510J945p71J679k363m779K603L32k080
$$ 1156 3653 660 2493 1888 -2523 -3064 -2218 292 2237 1466 3145 782 -3997 -1394 -1062 -3142
1166c142M941J498k505N79j479j937n70J26M329J250j463J396l590l610L074N14
$$ -3142 1799 3297 792 1371 -108 -2045 -2615 -2489 1840 3090 1627 3023 -567 -4177 -1103 -589
1182e89l06K582l5K95j259l174R62q88j21N590%k502J397k735k457J826J365J236
$$ -589 -895 1687 1652 1947 688 -2486 -1524 -2412 -2533 3057 3057 555 1952 -783 -3240 -1414 -49 1187
1200A187L77j40J299l455k217K323k146J112N443j508k172L85k664n29J423J241
$$ 1187 1564 1424 2723 -732 -2949 -626 -2772 -1660 3783 2275 103 488 -2176 -2705 -1282 -41
1216d1K293p03j78Q38l848r07K143j145K095K640j620l23k289k074J920m81J382
$$ -41 2252 1549 1371 2209 -1639 -2546 -403 -1548 547 3187 1567 1244 -1045 -3119 -1199 -1680 -298
1233b98L601k162j099J329l342o30J948P24J711K9K18n37m098N98J975k274L180
$$ -298 3303 1141 42 1371 -1971 -2601 -653 71 1782 1811 2029 1492 -2606 -2008 -33 -2307 873
1250H73L076l692l57K90k882O40J475J187J055n78O41j108l411J400Q88n80L568
$$ 873 3949 257 -100 190 -2692 -2052 -577 610 1665 1087 1728 620 -2791 -1391 -503 -1083 2485
1267B485M17k491mk072o06J775n69J804J646k208L37l55l002R19J358J123J890
$$ 2485 2902 411 407 -1665 -2271 -496 -1065 739 2385 177 514 159 -2843 -1924 -566 557 2447
1284B447o39l46j841k753K641Q98j786L587K42l146J461r61k840J279J618J383
$$ 2447 1808 1462 -379 -3132 -491 407 -1379 2208 2450 -696 765 -196 -3036 -1757 -139 1244
1300A244O04q47r7k326j301K761k60J16L043j676j276Q86k550l64J554Q7K263
$$ 1244 1848 1001 904 -1422 -2723 38 -222 -106 2937 1261 -15 871 -1679 -2043 -489 -402 1861
1317A861M35k304k05j517n46J885M06R38P41j149M03j807j580K357l43K71L409
$$ 1861 2296 -8 -213 -1730 -2276 -391 15 953 1694 545 948 -859 -2439 -82 -425 -154 3255
1334C255j737k229R72j813q11K379P21K98j79k20k38k544M34K019j232J897K250
$$ 3255 1518 -711 261 -1552 -2363 16 737 1035 856 636 398 -2146 -1712 307 -925 972 3222
1351C222l051o23O34k134R02J586l4J344q04j058l11j647O42J138j09J851j44
$$ 3222 171 -452 182 -1952 -1050 536 502 1846 1042 -16 -327 -1974 -1332 -194 -303 1548 1404
1368A404j530L47j957k32K431o24Q11K181k428q99M81j803M27K017K79M06p56
$$ 1404 -126 221 -1736 -1968 463 -161 650 2831 403 -496 -15 -1818 -1391 626 905 1311 555
1385E55q9r94k077J902J123j202K493L68l074Q82k09j883K029J101R8P16j167
$$ 555 466 -528 -2605 -703 420 -782 1711 2079 -995 -113 -322 -2205 -176 925 1023 1739 572
1402E72q47q28o46J546K09M2J887j414j220P30j886N77J984q09J439O82k313k83
$$ 572 -275 -1103 -1749 -203 6 48 1935 521 -699 31 -1855 -1278 706 -103 1336 2018 -295 -578
1420e78l3q06J338R50J55J3q14J99j366j222K217Q0m33K664j317k452J197q42
$$ -578 -611 -1417 -79 871 1026 1039 225 424 -942 -2164 53 133 -300 2364 1047 -1405 -208 -1050
1438a050p30K555M38l35No06l38j059J5J419o29J218J336k672l97K83j522J671
$$ -1050 -1780 775 1213 878 883 277 -61 -1120 -1105 314 -315 903 2239 -433 -830 -547 -2069 -398
1456c98J591j207J051j96j630M17k70m61J041P73P89k46j448j6j468K23K625q57
$$ -398 1193 -14 1037 841 -789 -372 -642 -1103 -62 711 1500 1254 -194 -210 -1678 -1455 1170 313
1474C13k56J700k155p55J424j530M3J966J38Q8k09p75q36p10J297J175p45J261
$$ 313 57 1757 -398 -1153 271 -1259 -1216 750 888 976 767 -8 -844 -1554 -257 918 173 1434
1492A434k63k457J007J53j699J787P80o13J220r86j438J82J4P87O17K60M26j111
$$ 1434 1171 -1286 -279 -126 -1825 -38 742 129 1349 363 -1075 -893 -879 -92 525 785 1211 100
1510A00k92L38j469P15J578j309J031R95k541j32Q11j203J132J599o84l94j72
$$ 100 -192 146 -1323 -608 970 -339 692 1687 -854 -986 -175 -1378 -246 1353 669 275 103
1527A03k12o07m55J663k9l29J759j416j784J450q32p68K422o6p42O11j043r50
$$ 103 -109 -716 -1171 492 463 134 1893 477 -1307 143 -689 -1457 965 899 157 768 -275 -1225
1545a225M29L34O09p6O96L83j456k7J54j364J676J213j608J252Lk216O07M56q04
$$ -1225 -796 -462 147 71 767 1150 -306 -333 -179 -1543 133 1346 -262 990 993 -1223 -616 -160 -964
1564i64J286Q05o77l79j92r2j004L88J701o82M37J105k296o71J776j256r9K166
$$ -964 322 1127 450 71 -121 -213 -1217 -829 872 190 627 1732 -564 -1235 541 -715 -814 1352
1582A352q17n07M68r90o66M06O56K56J04Q65m58j709Q10j66q08K166M7j383J456
$$ 1352 535 28 496 -494 -1160 -754 -98 158 262 1127 669 -1040 -230 -396 -1204 962 1009 -374 1082
1601A082o35j637R25q7k02J240L50q11l52o4k56q59J131J205j072P42N52k375
$$ 1082 447 -1190 -265 -352 -554 686 1036 225 -127 -191 -447 -1306 -175 1030 -42 700 1252 -1123
1619a123L34J343j598R57J560j145j78K08j109l22O61P55l17J86R68j174j163
$$ -1123 -789 554 -1044 -87 1473 328 150 358 -751 -1073 -412 343 26 212 1180 6 -1157
1636a157J173p10j22K049n46r24J203j111r98J161k93J44R67r9n01o93K69l17
$$ -1157 16 -694 -816 1233 687 -237 966 -145 -1143 18 -275 -131 836 737 236 -457 -188 -505
1654e05o25J586L66j200J099j32j992J321M17j236J416Q10j349K00K0q67j80Q74
$$ -505 -1130 456 822 -378 721 589 -1403 -82 335 -901 515 1325 -24 176 196 -671 -851 23
1672B3P03o79K42O44j579l62J416j233L26J796j142k76R44j450l90J108p0K00
$$ 23 726 47 289 933 -646 -1008 408 -825 -499 1297 155 -121 823 -627 -1017 91 21 221
1690B21M42q3o13n07M16k81m99J636j32j011J284r58j436J686o0p82J457K18j087
$$ 221 663 580 -33 -540 -124 -405 -904 732 600 -411 873 -85 -1521 165 105 -677 780 998 -89
1709h9J38j23n84Q5P80M32o79N22K11j787M17J190j297R15J142j497J41N56j268
$$ -89 49 -74 -658 -573 207 639 -40 482 693 -1094 -677 513 -784 131 1273 -224 -83 473 -795
1728g95J28Q03Q7R4K84mr30k99P37o04J07J427q43n80J196j324p92J509l30k44
$$ -795 -667 136 223 317 601 597 -333 -632 105 -499 -392 1035 192 -388 808 -516 -1308 201 -129 -373
1748c73J314m15o98Q4o3k51m0J024L9p55Q04l09j572R82M77j059J492L82j551
$$ -373 941 526 -172 -88 -151 -402 -442 582 621 -134 670 361 -1211 -229 248 -811 681 1063 -488
1767d88M72J14j086N52N85N0Q5J89M0j104lQ32p76N07J349j381j52Q36j400k09
$$ -488 -16 98 -988 -436 149 199 284 473 513 -591 -594 238 -538 -31 1318 -63 -215 621 -779 -988
1787i88J363n91J28Q92o16m71J3O3j97J75J085l87o03P22o28j095J351j46p14
$$ -988 375 -216 -88 804 188 -283 -270 -207 -404 -229 856 469 -134 588 -40 -1135 216 70 -644
1806f44J448k11j081M47j34p20O96N86l4k68L00p7j222M58Q74q58Q17Q58j567
$$ -644 804 593 -488 -41 -175 -895 -199 387 353 85 385 308 -914 -456 418 -440 377 1235 -332
1825c32L07N25j482L66J031m23K99K84o84k23j09K35q2J85J116o75n65Q12r85
$$ -332 -25 500 -982 -616 415 -8 291 575 -109 -332 -441 -206 -288 -103 1013 338 -227 585 -400
1844d00m78J357m92l13J289o22q67N36k93k08N36J92K04m20J94j61r28P74L97
$$ -400 -878 479 -13 -326 963 341 -526 10 -283 -491 45 237 441 21 215 54 -874 -100 297
1863B97o55J005K65j386O35N2j131P40O77n93M50Qm82l41n9O34m06M88Q37j066
$$ 297 -358 647 912 -474 161 213 -918 -178 499 -94 356 364 -118 -459 -518 116 -290 198 1035 -31
1883c1k97P73j072Q5J107p03J44R53r35l59K64k59PL15M42j68m98L89k93o33R19
$$ -31 -328 445 -627 -542 565 -138 6 959 24 -335 -71 -330 -323 -8 434 266 -232 157 -136 -769 150
1904A50J37o55J239l62j006P14l51o09R61K34l58K03j52l22l72K23M79m80M90
$$ 150 287 -368 871 509 -497 217 -134 -743 218 452 94 297 145 -177 -549 -326 153 -327 163
1923A63O46j237L12M58j178M71R48o21L58L01r25n1K43j9Q4L3M85m46j93M37p06
$$ 163 809 -428 -116 342 -836 -365 583 -38 320 621 -304 -355 -112 -131 -47 -14 471 25 -168 269 -437
1944d37l61J134k27k28J050q87n76P08m04o0O03O9j85m7P9m19m71N59K90m38Q60
$$ -437 -798 336 109 -119 931 44 -532 176 -228 -288 315 384 199 152 231 -188 -659 -100 190 -248 612
1965F12j32j219O53J51q56Q79L86n74M72jp15L7Q8J00J28L17L18o66k98M95p77
$$ 612 480 -739 -86 65 -791 88 474 -100 372 371 -344 -307 -219 -119 9 326 644 -22 -320 175 -602
1986f02K77R79q02Q3P67r66j19N81o02K91N92p3j40l05J30l27k92P71M7m98Q50
$$ -602 -325 654 -148 -65 702 -264 -383 198 -404 -113 479 406 266 -39 91 -236 -528 243 290 -208 642
2007F42m15j031R63k48o31J070l1l47L00j56m23N1K06K10mJ61K88r98K74M57j027
$$ 642 227 -804 159 -89 -720 350 319 -28 272 116 -307 -256 -50 160 156 317 605 -393 -119 338 -689
2028f89M72Q48q74M56L24j095K17L51l04K98J91P1j74j14J85m92k7R00m59j54
$$ -689 -217 631 -243 213 537 -558 -341 10 -294 4 195 266 92 -22 163 -329 -356 544 85 -69
2048f9R01r04n40R11o03j69R83j80l92L33m24k07RL67J05j83M97k3r32N34O7p40
$$ -69 832 -72 -612 299 -304 -473 510 330 -62 271 -153 -360 -351 16 121 -62 435 412 -520 14 81 -659
2070f59R59K00p33N45K9q85L19M8J14K23Q6Rk55j29Q6n22N33O58o95K12N11j133
$$ -659 300 500 -233 312 341 -544 -225 -177 -63 160 246 255 0 -129 -43 -565 -32 626 -69 143 654 -479
2092d79J39O25o52J36Q34n73l7J44l79K1K3K96N5k46P35o35o09J000m85m04J140
$$ -479 -340 285 -367 -231 603 30 -7 137 -242 -221 -198 98 153 -93 642 7 -602 398 -87 -491 649
2113F49k90n20N29l94n04N37j8mJ86J4l3l83J97J17p43Q14M57p27L92K19j082
$$ 649 359 -161 368 -26 -530 7 -11 -15 171 185 152 -231 -34 83 -660 154 611 -116 276 495 -587
2134e87M13M11n54M91K98n97J67j9k51j15J75M34k37nN28q46j99Q07o03j4J048
$$ -587 -174 237 -317 174 472 -125 42 23 -228 -343 -168 266 29 24 552 -294 -493 314 -289 -303 745
2155G45o18j42N43o33k44L75L9R4K8R1j73m95K66N8m70Q35J41p65N74r1p58O71
$$ 745 127 -15 528 -105 -349 26 65 159 187 278 105 -390 -124 -66 -536 299 440 -325 249 158 -600 71
2177G1L3m39P10ml44p1j42q3PK02M51n52K25L59q99J83N53o32L34P07o68j9L46
$$ 71 104 -335 375 371 27 -44 -186 -269 -262 -60 391 -161 64 423 -476 -293 260 -372 -38 669 1 -18 328
2200C28o62P4L95K0l5l9K01m44j56N10l01l44R25l91l02P53o45m81P67j33j33
$$ 328 -334 -260 135 155 120 81 282 -162 -318 192 -109 -453 472 81 -221 532 -113 -594 173 40 -93
2221i3N44k67j90p1K0Mj73K75K42m03K75J20r59P11O8n19O46J95o89L44j4k46
$$ -93 451 184 -6 -77 -57 -53 -226 49 291 -112 163 283 -676 35 103 -416 230 425 -264 80 66 -180
2243a80N0L20J01k34J31O0m69q1N92m92J67N92n07l61N59n49l5N45k56N9M42l02
$$ -180 -130 190 291 57 188 248 -221 -302 290 -202 -35 557 50 -311 248 -301 -336 209 -47 12 454 152
2265A52j74j28J90n8k20N46J9n35N24k89n87P06K1m96O52j32l72L54k00j62P2
$$ 152 -22 -150 40 -18 -238 308 327 -208 316 27 -560 146 167 -329 323 191 -181 173 -27 -189 -117
2286a17J70J39k10J17J00o43M43K88o83M62M54p99J62L20p08K02M41j47K7J85
$$ -117 53 192 -18 99 199 -444 -1 287 -396 66 520 -279 -117 203 -505 -303 138 -9 18 203
2306B03j32o0k49K16m9o8O08k72m26N02l49l09O65l39q4O65m56k97K07k07J14
$$ 203 71 11 -238 -22 -71 -139 469 197 -229 273 -76 -385 280 -59 -143 522 66 -231 -24 -231 -117
2327a17P2K06Mj86J33rn43M46J12n36O93K16r03L56J52n04L40J22j06J94N8j09
$$ -117 -45 161 165 -21 112 103 -440 6 118 -418 275 491 -412 -56 96 -408 -68 54 -52 142 200 91
2349I1k75j0L82k83J50M48m44j65M07o39J04M61l36J91J82l85l8J68j09R3j11
$$ 91 -184 -194 188 -95 55 503 59 -106 301 -338 -234 227 -109 82 264 -121 -159 9 -100 -7 -118
2370a18L72j32k41K76k46k53N27m4l02N84l27l63L54k14q8L60oj54J92k15l4j81
$$ -118 254 122 -119 157 -89 -342 185 141 -161 423 96 -267 87 -127 -215 145 139 -15 177 -38 -72 -253
2392b53N3L90l78K19K45n11J72K34m61J90L28j79J14rk49J02j67R3O6O7K13k76
$$ -253 -200 190 -188 31 276 -235 -63 171 -290 -100 228 49 163 154 -95 7 -160 -67 -1 66 279 3
2414Ck04L23k31q2M52k71l8M80m71j43L19j64OK09j20o0j9rp0k10K74J64l03M76
$$ 3 -201 122 -109 -191 261 -10 -48 432 -39 -182 137 -27 -21 188 68 8 -11 -20 -90 -300 -26 138 -165 311
2438C11j60l66K66O4m66M45P0k96K53K8k36N9p4J68J9q4L01m08K2K23m06K08L75
$$ 311 151 -215 51 115 -351 94 164 -132 121 149 -87 -28 -102 66 85 1 302 -106 -84 139 -267 -59 316
2461C16m75J74K64m57J49J91k52Q5J34n6O8l01J70j52NK45Q4k37K92k13k44K49
$$ 316 -159 15 279 -178 -29 162 -90 -5 129 73 141 -160 10 -142 -137 108 192 -45 247 34 -210 39
2483C9r2k61L91O0q2J18k38N6k15K46R1k27J81J75l62K2K39n09L97J98l02K80
$$ 39 -53 -314 77 137 55 173 -65 -9 -224 22 113 -114 67 242 -120 -98 141 -368 29 227 -75 205
2505B05o3l30J46km6J49n8Q3P4k54J72j42K8J42o5r5K89k21l78L90j60pK05j9
$$ 205 142 -188 -42 -44 -90 59 1 84 158 -96 76 -66 -38 104 39 -56 233 12 -366 24 -136 -143 62 43
2529D3K4J21k92N7m1M8J81j41J4K04m18L12n1k66J69J51k21M1J52j71L6J20l6
$$ 43 67 188 -104 -47 -88 -40 141 0 14 218 -200 112 61 -205 -36 115 -106 -65 87 -84 -48 72 36
2552C6K3j10J87j29POj72M3L71k75M0J55l90K14J3j50J19R0j90J01N6j91%PJ52
$$ 36 59 -51 136 7 14 20 -152 -109 262 -13 27 182 -208 6 19 -131 -12 78 -112 -11 45 -146 -146 -139 13
2577A3n7l9K21M3m03K91o2k08K66%j47K11j09k38J72MJ65j23P0l1j63Q3K20k50
$$ 13 -44 -83 138 181 -222 69 7 -201 65 65 -82 129 20 -218 -46 -42 123 0 70 39 -124 -41 179 -71
2601g1O3K58k61P8Q5m06J39K17j99J50n6J5kk01K19p6j27K76n8k13K37j18j10
$$ -71 -8 250 -11 67 152 -254 -115 102 -97 53 -3 12 10 -191 28 -48 -175 101 43 -170 67 -51 -161
2624a61K65j61l1L27k08j32J57k62J26R0K5K7P7M3n4j58j98K37o0J24J11k38J89
$$ -161 104 -57 -88 239 31 -101 56 -206 -80 10 35 62 139 182 128 -30 -228 9 -51 73 184 -54 135
2647A35o9j10J4p1l3K19j20Ljr6J08j10Q7J54j50k2J03k43P2K65k23O3K06j52
$$ 135 66 -44 -30 -101 -134 85 -35 -32 -33 -129 -21 -131 -44 110 -40 -62 41 -202 -130 135 -88 -25 181 29
2671B9Ll1o7N9M5KR0k32O3o9p3J50J36k04K47n3j63J63j06j10J69p3K0M7m7O4
$$ 29 32 1 -66 -7 38 40 130 -102 -39 -108 -181 -31 105 -99 148 95 -68 95 -11 -121 48 -25 -5 42 -5 59
2697E9p0j54J73q0M4N3jmJ8k55J29K34k92J98J17k74J85j48K5P8l1J70q6j60R0
$$ 59 -11 -165 8 -72 -28 25 24 20 38 -217 -88 146 -146 52 169 -105 80 -68 -43 35 4 174 88 -72 18
2722A8p8p3K54j26p6L31k09r5J52j37J3Q4j09J04K5l4l6j45K9L14k15Q6K8j34
$$ 18 -60 -133 121 -5 -81 250 41 -54 98 -39 -26 58 -51 53 78 44 8 -137 -108 206 -9 77 105 -29
2746b9l5N4k30K89K4j83K63p3lj1j15l3J74j27R4o3K2%j44J6K06j94K8J64j07
$$ -29 -64 -10 -240 49 73 -110 153 80 77 66 -49 -82 92 -35 59 -4 18 18 -126 -110 96 -98 -70 94 -13
2771a3k2J11j92J19m3J25N6r7j25J24j27J60j56N8J27q6j09R6m4j42K81j75P3
$$ -13 -35 76 -116 3 -40 85 141 44 -81 43 -84 76 -80 -22 105 19 -90 6 -38 -180 101 -74 -1
2794al5P3j2k0j26Q0n4J08J38j25p2J86j81mN9p1J23k6j29J31L1j65J55r0N0J05
$$ -1 -36 37 25 5 -121 -41 -95 13 151 26 -46 140 -41 -45 14 -57 66 40 -89 42 73 -92 63 -27 23 128
2820A28q0j5M1k20J50O5j15N4j03NJ83j53Q2J70k76LJ62j20P7J6o0P4j00O1N5
$$ 128 48 33 74 -146 4 69 -46 8 -95 -90 93 -60 22 192 -84 -81 81 -39 38 54 -6 68 -32 29 84
2845H4j34mJ36j91R5J08k85L32k29j0K31k15L7M7j29J58J22j82j8o6P9J00q5o7
$$ 84 -50 -54 82 -109 -14 94 -191 141 -88 -98 133 -82 -45 2 -127 31 153 -29 -47 -113 -34 66 -19 -86
2869h6K32q5p0O7o5k9M3Q4J0q9j18J09j1j05J85j49N9P5l7Q2j02j87J28J14r4
$$ -86 146 61 -9 58 -7 -36 7 91 101 12 -106 3 -8 -113 72 -77 -18 57 20 102 0 -187 -59 55 -39
2894c9Q0n9r8R1l5J06M3j93J93M8j34K0j26o9J91j19J09J20j61n6J42j98J07O9
$$ -39 41 -18 -116 -25 -60 46 89 -104 89 137 3 23 -103 -172 19 -100 9 129 -32 -88 54 -144 -37 32
2918C2j39J34r0M8j31O7O2J21o2R3j20p8J26J8j17Q4r0L3J71k29N7O6j41P7l1
$$ 32 -107 27 -63 -15 -146 -79 -17 104 42 135 15 -63 63 81 -36 48 -42 -9 162 -67 -10 56 -85 -8 -39
2943c9o8K22k03O4R9j26m6J31qp2K45j88jQ2k32J95o9ON6j65j9J38q1K33j30q0
$$ -39 -107 115 -88 -24 75 -51 -97 34 26 -46 199 11 10 92 -140 55 -14 -8 48 -117 -136 2 -79 154 24 -56
2969e6J34j26j08K44j91J6K07n1K6k35K08j6o1k9K04k56J56Rj99J43o6J5J5P1
$$ -56 78 -48 -156 88 -103 -87 120 69 95 -140 68 52 -9 -38 166 -90 66 75 -124 19 -47 -32 -17 54
2993E4j55K19o6j75K23n4lK5j14M1K3j66Q0r5J44L1m8l1K22k52R3J07l05J89J63
$$ 54 -101 118 52 -123 100 46 43 68 -46 -5 18 -148 -68 -163 -19 12 -36 -67 155 -97 -4 103 -202 -13 150
3018A50j64J00l2j27K84j11j53N9P3j22K27l32K31q7k5L7k2L5M5q2q6J58l0o3
$$ 150 -14 86 54 -73 211 100 -53 6 79 -43 184 -148 83 -4 -29 8 -14 21 66 -16 -102 56 26 -37
3042c7M1j09J61j14L6n3P7Q7N6j75P6M2k20J69p1r4J85n6M5R6j74M0M6m9O5R5
$$ -37 4 -105 56 -58 -22 -75 2 89 145 -30 46 88 -132 37 -34 -128 57 1 46 142 -32 8 54 5 70 165
3068A65j70O4o8p6J30j7j80K87k04J09l7k1M0j11N2K38k65O0J25j39J3l0n6K6
$$ 165 -5 59 -9 -85 45 28 -152 135 -69 40 3 -18 22 -89 -37 201 -64 -4 121 -18 -5 -35 -91 -65
3092f5J51p4Q8j8k16J76n5q4J34j4m8MkO9n6o6J77j76L8J06p6j37K29j58j11L00
$$ -65 86 12 100 82 -134 42 -13 -97 37 23 -25 -21 -23 46 -10 -76 101 -75 -37 69 -7 -144 85 -73 -184 116
3118A16j27P5k1k49J37Qj03J69O2q1Q4j79R4J1q3J92j41j3J78j50Q2l9K2n4k2
$$ 116 -11 64 43 -206 -69 -61 -164 5 67 -14 70 -109 -15 -4 -87 105 -36 -49 129 -21 61 22 44 -10 -32
3143c2O3N5k2j50Q0r5n9J71J1L4O3j14L7M3r2P1M1j46J5o8R4m3K9j07J89j67N0
$$ -32 31 86 64 -86 -6 -101 -160 11 22 56 119 5 42 85 -7 64 105 -41 -26 -94 0 -43 -14 -121 68 -99 -49
3170d9J38k10K19q9j18J77j02r6K06k55K24J8j21K02j08j38J65j09OJ17j75J04
$$ -49 89 -121 98 9 -109 68 -34 -130 76 -179 45 63 -58 144 36 -102 63 -46 -40 77 -98 6
3192FJ00o9M0qj31N9O0l7K7J5l3O2j18q9J59k76L07Kk49K78j94r4J52m2J12l0
$$ 6 106 37 77 69 -62 -3 57 20 47 62 29 91 -27 -116 43 -233 74 76 -173 105 -89 -183 -31 -73 39 9
3218Io6O7o8n8J40j24O2K27j33j11J98j19o8K07k77J47M8p5K4n5q4K13j41k3K08
$$ 9 -57 10 -58 -116 24 -100 -38 189 56 -55 143 24 -44 163 -114 33 81 6 30 -25 -109 104 -37 -60 148
3243A48q6q5P8j96J92L4r0J59j62j15J05p4j7Q9K4M2L6j36K9o7K8J18rj9N1j2
$$ 148 62 -23 55 -141 51 85 -5 154 -8 -123 -18 -92 -109 -20 4 46 82 -54 -25 -92 -64 54 45 26 77 65
3269F5n2O6j49J45o8r5J15j13PJ60o2q5K41j87L3K4k25L01k01Q0Q6j61N5J14p8
$$ 65 13 79 -70 75 7 -88 27 -86 -79 81 19 -66 175 -12 21 45 -180 121 -80 0 86 -75 -20 94 16
3294A6K5N1j47n1J16l3K4j37J04J23j65O4L3q0K09n9j62J95j04q4J89j53l3P2
$$ 16 41 92 -55 -106 10 -23 1 -136 -32 91 -74 -10 23 -57 152 93 -69 126 22 -62 127 -26 -59 13
3318A3o9m1J67j52l3J46m1K5l6n3N6k8j3Q5nK4P5j38O7J1j22R1lj91K67j05j9
$$ 13 -56 -97 70 -82 -115 31 -10 15 -21 -74 -18 -46 -59 26 21 45 120 -18 49 60 -62 29 26 -165 102 -3 -22
3345b2P1j40P2L6o0J37l9j89K01q0M6J08j65M4K04k45N6J05r1m7j4RJ31j47O4
$$ -22 49 -91 -19 17 -43 94 55 -134 67 -13 33 141 -24 20 224 -21 35 140 49 2 -12 -3 128 -19 45
3370D5L3j10K3J06r6j1J0q8R2L4r1R9l3jJ99k43p6P5o7J48l0p8J42j67J6J14o2
$$ 45 78 -32 -9 97 1 -10 0 -88 4 38 -53 46 13 12 211 -32 -108 -33 -100 48 18 -60 82 -85 -69 45 -17
3397a7o0J01m5N8Q5j89J87p6j91K61j37N1O8k13J43j0j21J09j63K0K37j08n4P0
$$ -17 -77 24 -21 37 122 -67 120 44 -147 114 -23 28 96 -117 26 16 -105 4 -159 -139 98 -10 -64 6
3421FM0o9Q9j13J06o5JQ1j78P4P2j20J18K1j58J15L7j54J38J19j43n7R6o0L5p9
$$ 6 46 -23 66 -47 59 -6 -5 76 -102 -28 44 -76 42 63 -95 20 57 -97 41 160 17 -40 56 -4 31 -48
3447d8O8j4p5K17r5j46J57o9j4K9l0j3O4Jp8R7j59J49Jj01P0m3k2O4r8J09K5j68
$$ -48 20 6 -69 148 53 -93 64 -5 -19 10 -20 -33 31 32 -46 51 -108 41 42 -59 11 -32 -54 10 -88 21 46 -122
3475a22K08j9k24J23j4J2k7N7r8J36n2Q0l3k3J70j58qJ40j86RQ1j00k3J90j62
$$ -122 86 67 -157 -34 -48 -36 -63 -6 -104 32 -20 60 27 4 174 16 8 148 -38 -29 52 -48 -71 119 -43
3500d3j9oq5M4J10r3J21j7j12J32L1p4L0j58K62j31L3j3p5P4j5J2o9N1Jj49J82
$$ -43 -62 -68 -153 -109 1 -92 29 12 -100 32 63 -11 19 -139 123 -8 25 12 -63 11 -4 8 -61 -10 -9 -158 24
3527B4r6Q1j35Q3Q8J04o9J7j16RK29k39M9r0k7J27r0m4K07r2k6K7j3l1k0j7Q0
$$ 24 -72 9 -126 -43 45 149 80 97 -19 -10 219 -20 29 -61 -88 39 -51 -95 112 20 -6 21 8 -23 -43 -60 20
3554B0j33J14j7K7j48J20r5P9P9r7P0K7Mkk4j32J35j46K10m1q1P0M7o8L8nj00
$$ 20 -113 1 -16 11 -137 -17 -112 -33 46 -51 19 46 50 48 24 -108 27 -119 91 50 -31 39 86 18 56 51 -49
3581d9P3L2r4J26j11p9J09j28RJ11j48J32n4pJ06j6l7O7o6RO7j33J22j9j9P3j19
$$ -49 24 56 -38 88 -23 -102 7 -121 -112 -1 -149 -17 -71 -78 28 12 -25 42 -24 -15 52 -81 41 22 3 76 -43
3608d3q0P3K8k8J4n3KJ02j48K24l7j35J98k11J0J73j14j33J97qj03P1q3J78j34
$$ -43 -123 -50 -22 -50 -36 -89 -87 15 -133 91 54 -81 117 -94 -84 89 -25 -158 39 31 -72 -1 -84 94 -40
3633d0J0Q4p4n6O6p0J05Oj45J09L7p6R2K8j20P6P8o0r2J00j1k7l1O2o1q9P1n9
$$ -40 -30 54 -20 -76 -10 -80 25 31 -114 -5 32 -44 48 76 -44 32 110 50 -42 58 47 20 -11 51 -10 -99 -28 -87
3661h7J0J07j35J16J37j77L7K0r3J41o8lJ12k01J91p3j05J35q9o8J87j39j29K08
$$ -87 -77 30 -105 11 148 -29 8 28 -65 76 8 5 117 -84 107 34 -71 64 -25 -93 94 -45 -174 34
3685C4j16N4K0n8L3J63j83J01N4p5j1m0L9N5j32Q2N0k04J32R8k04K87r0p0m1K3
$$ 34 -82 -28 -8 -66 -33 130 -53 48 102 27 16 -24 15 70 -62 20 70 -134 -2 96 -108 179 89 19 -22 1
3711Ao9J49j80K36r8p1J39j06n7J35j31k2R7q6M3K0orJ55j31m4pJ08R4k39q8L76
$$ 1 -68 81 -99 137 39 -32 107 1 -56 79 -52 -74 23 -63 -20 0 -6 -15 140 9 -35 -42 66 160 -79 -167 209
3738B09l13JK44j67J30j7j13K20o4k43K32j47o8R3K3Jp9J8J56r2j44J71q8j4O7
$$ 209 -104 -103 141 -26 104 87 -26 194 130 -113 119 -28 -96 -3 20 21 -58 -40 116 24 -120 51 -37 -51 16
3763A6k7P9j32l2J32q8j15J02k3N2R9j39K55j29n6J16p7j7J17j05qm6k2j8K4Q3
$$ 16 -11 68 -64 -96 36 -52 -167 -65 -88 -36 63 -76 179 50 -6 110 33 16 133 28 20 -26 -48 -66 -42 41
3789D1k6R0o8q4P8p4Q6n3o4P3l2n2K03l39K45j2j27J86m4j36J62j38pJ08j5Q2
$$ 41 15 105 37 -47 31 -43 43 -10 -74 -1 -33 -85 118 -221 24 12 -115 71 27 -109 53 -85 -92 16 1 83
3815H3k2j76P8J24k1r6J23j45J02r5O4N6m4j57J35j9O4J1m5J9J9k34L37m9p1k
$$ 83 61 -115 -37 87 66 -30 93 -52 50 -45 19 75 31 -126 9 -10 54 65 20 39 58 -176 161 112 41 39
3841C9j17R5l1lM0n6o8K30q5j07J53j11L9lo8J22q5kM7m1N2Kq7%O6p1J66k4r6
$$ 39 -78 17 -14 -17 23 -33 -101 129 44 -63 90 -21 18 15 -53 69 -16 -18 29 -12 40 42 -45 -45 21 -50 116 92 -4
3870dM1m9K9MO5j05P4o8K5M8p8J17p5o2Q1n8K3Q3j37K2L9J4K3n7m1M7j8K2O4j06
$$ -4 37 -12 17 21 86 -19 55 -13 12 60 -18 99 24 -38 43 -15 8 91 -46 -24 15 29 52 -5 -46 1 -17 5 69 -37
3900c7J28j69N8J12o2p5K07j16k4RL9j79J94k3o0R6j28J8P6Oj3q8N4L9j5Q2N3
$$ -37 91 -78 -20 92 30 -45 162 46 22 31 70 -109 85 62 2 98 -30 -12 64 70 57 -31 23 62 47 129 182
3927A82k78J39j7n1L5kq0K8J54j48O8l7l9O0n6PL9J9J6kj44J11j00L3J29r2J23
$$ 182 -96 43 26 -25 10 8 -72 -44 110 -38 30 -7 -46 14 -42 -35 4 23 39 37 -107 4 -96 -63 66 -26 97
3954I7p9p4N6L4j56J69p3N3L6j02J17M1q3n7J51j42M4M0j59K21j12q4J31rm2l1
$$ 97 18 -56 0 34 -122 47 -26 27 63 -39 78 119 36 -21 130 -12 32 72 -87 134 22 -62 69 60 18 -13
3980a3K6q9J44j8L9r9j2J5k9R9N5j72RP7l5P9L7j4o4p8N2M2k7O1J8j00O8o3j05
$$ -13 13 -76 68 50 89 -10 -22 -7 -36 63 118 -54 -45 32 -3 76 113 99 35 -43 9 51 24 85 103 3 71 8 -97
4009i7R2N4p0qJ35j16N9n2m3P1r6J33rk9l8n2M7Rj13P1J31r2k9lj05P7N3PM0L7
$$ -97 -5 49 -21 -29 106 -10 49 -3 -46 25 -71 62 53 24 -14 -66 -19 -10 -123 -52 79 -13 -42 -45 -150 -73 -20 -13 27 64
4039F4r4J17lk06J82l2L0j03O7Q6K9k00O6L1n2J77j71j6J0o7l5M5P2m6PN4K9j38
$$ 64 -30 87 84 -122 60 28 58 -45 22 108 137 -63 3 34 -18 159 -12 -28 -18 -85 -120 -75 -3 -49 -42 12 41 -97
4067i7J04k6o0P0N6Mn1L8m6k0J3O2J07n2p6K3j12J30k7j37K11o9j42J26l3lJ35
$$ -97 7 -19 -79 -9 47 51 0 38 -8 -28 -15 47 154 102 26 49 -63 67 40 -97 114 45 -97 29 -4 -7 128
4094A28j35mP8r3O4p7J6K24k57P5o3r4Q8l3L2O0O3q6n5J90k51Q6o4nK92j34n6
$$ 128 -7 -11 67 -26 38 -39 -23 201 -56 19 -44 -138 -50 -83 -51 9 72 -14 -69 121 -130 -44 -108 -113 179 45 -11
4121a1M3o6qJ12m8P1j71J64q5l2NN7j93J78pm5k6l0J12l9J47k46J56l5mK5l8j8
$$ -11 32 -34 -42 70 22 93 -78 86 1 -31 -26 31 -162 16 9 -36 -62 -92 20 -19 128 -118 38 3 -1 24 -14 -32
4149c2M9j32J00J12n5M3j64J29J6j71M2P0l6j48J49J05l7j2k8j07J4J01j4l2L4
$$ -32 17 -115 -15 97 42 85 -79 50 66 -105 -63 7 -29 -177 -28 77 40 28 0 -107 -93 8 -6 -38 -4
4174dn1n2J46j41O6N3j15J39p4l0R4j12jR6n8p4J66r1K7K5o9RM1n8QO3o6Q5J01
$$ -4 -55 -107 39 -102 -36 17 -98 41 -33 -63 31 -81 -82 14 -44 -118 48 -43 -16 9 -60 -51 -10 -68 -60 3 -63 22 123
4203A23j03j3o5J06n7l3J39q9j78J04J00n3P8l5p4P4M8j8o0Q4j2l7L0o7l4Q4K0
$$ 123 20 7 -58 48 -9 -42 97 8 -170 -66 34 -19 59 24 -50 24 72 54 -6 78 66 29 59 -8 -42 42 62
4230F2j1o9k3j9J0q8R7L1k4j33R1J38k13K21p6r0J77q0L7j06O7J8n3J87j60j03
$$ 62 51 -18 -41 -60 -50 -138 -41 -10 -34 -167 -76 62 -151 70 -6 -96 81 1 38 -68 -1 17 -36 151 -9 -112
4256a12L5K2J35j19N6L9j16J04j21K1J17j05J75n7p3M5o8lm8J34j07jK0M5J1m1
$$ -112 -77 -55 80 -39 17 56 -60 44 -77 -56 61 -44 131 74 1 46 -22 -25 -73 61 -46 -47 -27 18 29 -12
4282a2J74j83lL7J2R1j90N9P6O3k12K98k00M6K7l6kj06L4PJ31j18L2j8O3r1l7
$$ -12 162 -21 -24 13 25 116 -74 -15 61 124 -88 210 10 56 83 47 45 -61 -27 -20 111 -7 25 7 70 -21 -58
4309e8RJ92j57l3J28m4r7J5L7l4K7rk3RL8M8n4Rl7J18p7o0P9n8J00j30R9m0nJ02
$$ -58 -49 143 -14 -47 81 37 -60 -45 -8 -42 -15 -24 -47 -38 0 48 -6 3 -34 84 7 -53 26 -32 68 -62 37 -3 -8 94
4339I4m5K5r0L1j6K7j23J25lL7L1p6J1k0pN6k4j17J85j58J25k6J2l7Q5n2j31J30
$$ 94 49 74 -16 15 -1 26 -97 28 25 62 93 17 28 8 1 57 33 -84 101 -57 68 42 54 17 102 50 -81 49
4367D9q4q7N2L8O6J0j40J24o3jJ6n3J15k7J7K0r6P2Q7j06n1P6m4nP9m3K0n6J23
$$ 49 -35 -122 -70 -32 34 44 -96 28 -35 -36 -20 -73 42 15 32 52 -44 28 115 9 -42 34 -10 -15 64 21 41 -15 108
4396A08m6j45R5L4p2L9L8r8QO4j5N7j64J16P5p0jn6P2n6L8NpLm0N3n1n7J78j11
$$ 108 62 -83 12 46 -26 13 51 -47 -39 25 10 67 -97 19 94 24 23 -33 39 -17 21 26 19 22 -18 35 -16 -73 105 -6
4426fk5k4N5J15j0p3j36M2J12K6kp2O7j40Q6q7n3J96p5K8oj26J5J73j77O8k2J0
$$ -6 -31 -55 0 115 105 32 -104 -62 50 76 74 2 69 -71 15 -72 -125 71 -4 24 18 -108 -93 80 -97 -29 -51 -41
4454d1p3J35jPL9j04k3l1kJ74j26M1j9j5J44j54K2L0m3N9K9q0J6L4M4l2M4r1j9
$$ -41 -114 21 20 27 66 -38 -61 -92 -94 80 -46 -5 -24 -39 105 -49 -27 3 -40 19 48 -32 -16 18 62 30 74 -17 -36
4483c6n5j14J43LjM2k9M9N7j33L7n4P7oN7j03Q7o4k1M5j13J21oJJ9n5O9K9k4p0
$$ -36 -91 -205 -62 -59 -60 -18 -47 2 59 -74 -37 -91 -14 -20 37 -66 21 -43 -64 -19 -132 -11 -17 -16 3 -52 17 46 22 -48
4513d8J01J7m1j4o8J71n4m8J0q0o9J16P8m4MK6n6L5j15J44o7%l7l1J46k8p4l3
$$ -48 53 70 29 15 -53 118 64 16 26 -54 -123 -7 71 27 31 57 1 36 -79 65 -2 -2 -39 -70 76 48 -26 -59
4541e9k2J10k6MQR7j35r3J32m1L6p9J09j0p7P3j3ll8L2P7k8j3j2k4m0j9R3n1l0
$$ -59 -81 29 3 7 15 112 -23 -116 16 -25 11 -68 41 31 -46 27 14 11 -27 5 82 54 41 29 5 -35 -54 39 -12 -42
4571d2J14j18O8O6l9l4o3j8O9m5J07Lj25O0RK5L7l0j33J2J54q8L3K0J5p5J31r0
$$ -42 72 -46 22 88 49 15 -48 -66 3 -42 65 68 -57 3 12 37 74 44 -89 -77 77 -11 22 42 57 -18 113 23
4599B3Q7m6q7Q1p9p3R7J7m5j2k5J23rj13J35n7n4klJ6jM3rL8r6N3rJ2k1j12J50
$$ 23 110 64 -23 58 -21 -94 3 20 -25 -37 -62 61 52 -61 74 17 -37 -39 -42 -26 -27 16 7 45 -51 2 -7 5 -16 -128 22
4630B2Qn9m0J28p4k5j8K21j27j48j3L9J63p6Np8M3R0k09J89N2N1o2q4M7O1j50
$$ 22 30 -29 -69 59 -15 -40 -58 163 36 -112 -125 -86 77 1 6 -72 -29 61 -148 41 93 144 82 -2 45 106 -44
4657d4K8P2l0m7m0M0P8j0j33J84j43N7O8p7m7J57k13O2lj9P0m0M6qL8J8o4k1O8
$$ -44 -16 56 26 -21 -61 -21 57 47 -86 98 -45 12 80 3 -44 113 -100 -38 -41 -60 10 -30 16 8 46 64 0 -21 47
4686D7M6j03l1O5J3N2n2r2J64j22P9L7l8j1j62J71Nk0j15L8q7P3R6j08Q7L5q5
$$ 47 93 -10 -41 24 37 89 37 -55 109 -13 66 103 65 54 -108 63 68 48 -67 -29 -116 -43 53 -55 32 67 -18
4713a8q4J07m6m1nP6K6j45J32j00J46R4j48L1l8J6jj11L1J0M4N0Q7k07R4q8J14
$$ -18 -102 5 -41 -82 -87 -11 15 -130 2 -98 48 142 -6 25 -13 3 2 -109 -78 -68 -24 26 113 -94 0 -88 26
4740B6j02J01J0NN7j01j5N6j26J16l9k1k3M9j5N2no5J05j8j4l8K2K7p2mNM2m8
$$ 26 -76 25 35 40 97 -4 -19 37 -89 27 -12 -33 -56 -7 -22 30 25 -40 65 47 33 -5 17 44 -28 -32 -27 15 -33
4769c3K8oQ6j00pO2O8j10L3p5k2J61j16J18j05lP5n4k0M4j0k2n7J14l2p4J61j24
$$ -33 -5 -11 75 -25 -32 30 98 -12 21 -54 -76 85 -31 87 -18 -21 54 0 -20 24 14 -8 -65 49 17 -57 104 -20
4797b0L4j54J83m1L3J08j13j53Q1L4kOp4J69j05K1l8Q5o6K3q4mJ19n7l5Q6Lr6
$$ -20 14 -140 43 2 35 143 30 -123 -42 -8 -10 -4 -78 91 -14 7 -31 54 -12 11 -73 -77 42 -15 -50 36 39 -57
4825e7L0m5J94q4p9P4l3O3Lr9O1n9m6O5l1J11m6r7L9N2m1j1O4q5J03p1N7k4K4
$$ -57 -27 -72 122 38 -41 33 0 63 66 -33 28 -31 -77 -12 -43 68 22 -75 -36 16 -25 -36 28 -57 46 -25 32 8 32
4854C2j59J67j10J08M1k15J39j3m2L0k2J39l0p4m3J09m3L6Lj43L6M2pR7l9j34
$$ 32 -127 40 -70 38 79 -136 3 -10 -52 -22 -44 95 65 -9 -52 57 14 50 53 -90 -54 -12 -19 78 39 -95
4880i5P2p1O5p7%K5J14L7j20O5Nj03K3P3J1j5Lq1mL6K2N1j5M4j08N4O8l3k4o0
$$ -95 -23 -94 -29 -106 -106 -81 33 70 -50 15 20 -83 -60 13 24 9 12 -69 -73 -37 -15 36 21 65 -43 11 79 46 22 -38
4910c8N5K6r3J10Nj51P9j0o0J26o3o7J56p9o9%J11j2p2N8k5k6n7P5K7l6R0j77
$$ -38 17 43 -50 60 65 -86 -7 -17 -77 49 -14 -81 75 -4 -73 -73 38 26 -46 12 -13 -39 -96 -21 6 -30 60 -117
4938a17P9N8l7p7P5n8J81n1L6pj08L1J6R4j39j2N1o4k6qJ53q0N0Q2n1r1mO7N5
$$ -117 -38 20 -17 -94 -19 -77 104 53 89 82 -26 5 21 115 -24 -36 15 -49 -75 -83 70 -10 40 122 71 -20 -24 43 98
4967I8n6j95K05n7l2m2J86K2l5j73MJ06o9R8o0r4J07O4j03K0J6q8J95j34J01J1
$$ 98 42 -153 52 -5 -37 -79 107 129 94 -79 -75 31 -38 60 0 -94 13 77 -26 -6 10 -78 117 -17 84 95
4993I5p2l2l0K8j13J23N2k0R5j78J01m6l9K3o8L6L7O5o0K6l3o4qJ86l9m1j01J16
$$ 95 23 -9 -39 -11 -124 -1 51 31 126 -52 49 3 -36 -13 -81 -45 -8 57 -3 23 -10 -74 -82 104 65 24 -77 39
5021C9qm3J3p2P4j23R3J64k00J97j28k6L4P5j08J21r9M0k5J7R6j33o4q7K26j0
$$ 39 31 -12 1 -71 3 -120 -27 137 -63 134 6 -20 14 89 -19 102 3 43 18 35 131 -2 -66 -153 73 63
5047F3J3r4P2J0r8j02K28j69R1j1o3J12o6k2P7r5m4N5O3M6k05M6J25KjMR2j13
$$ 63 76 -18 54 64 -34 -136 92 -77 14 3 -60 52 -14 -36 41 -54 -98 -43 20 66 -139 -93 32 34 33 37 129 16
5075A6k6P5O7j78rJ35k6r8Lj6J04m3J16j02J88k12K0l8M4j7o3Q1jp4L7J2o6Q1
$$ 16 -10 65 132 -46 -55 80 54 -44 -41 -57 47 4 120 18 206 -6 14 -24 20 3 -60 21 20 -54 -17 -5 -71 10
5103A0Q5q1j2L7p4j5K6P0m5J5NQ0r7j4J83j22M1p7o4mn4Q9J07j10j3P3M4m8mq4
$$ 10 95 14 2 39 -35 -50 -24 46 1 16 21 101 4 -10 173 51 92 15 -49 -53 -107 -18 89 -21 -34 39 83 35 31 -53
5133e3J11J0l5p1j07K05m9j8N9m2j18M9j5R7j15M5J05Lj85J90L0q4J7J7n8J93
$$ -53 58 68 33 -38 -145 60 11 -7 52 10 -108 -59 -74 23 -92 -47 58 61 -124 66 96 12 29 46 -12 181
5159A81k03n7J27j00J2J91q3j63J49M3l9O5q5lK5n4N8qo7lq6N6L6Jrn2O4o6N9
$$ 181 -22 -79 48 -52 -40 151 68 -95 54 97 58 123 38 35 60 6 64 56 -11 -14 -100 -44 -8 -7 -16 -68 -4 -70 -11
5188a1J8n8R1j05J34j05r5J21m6J21n3PN2j66J15j5n8O3p3J02l4l6q1J09K3j14
$$ -11 7 -51 40 -65 69 -36 -131 -10 -56 65 12 19 71 -95 20 5 -53 10 -63 39 5 -31 -112 -3 20 -94
5214i4P2J02o0m0o2m0J60j72J38jn7N4r7L3J02N9j80J57j60J22N6k62J74N6p0
$$ -94 -22 80 20 -20 -82 -122 38 -134 4 3 -54 0 -97 -64 38 97 -83 74 -86 36 92 -170 4 60 -10
5239a0PJ04m7m5J6Lj5LOj9N6k1j19J36o8Q6j45M2J13j50L9Q2p1k6k5J09o0l9K
$$ -10 -3 101 54 9 25 28 13 16 22 3 59 38 -81 55 -13 73 -72 -30 83 -67 -28 54 -17 -43 -68 41 -19 -58 -56
5268e6j4R9J77k23lJ23j97R4p5J3J06o8L3lP8j46J41j31J3Q3LP3n2j9mn5k1P2
$$ -56 -70 29 206 -17 -20 103 -94 0 -75 -62 44 -24 9 6 84 -62 79 -52 -39 44 47 120 68 49 45 -10 -31 41
5296D1n5M8Jj01L6Mk3J13k3l4K4j9q5J93o5j25J04l2M3o2l4m5Q9jK4j23P7J65
$$ 41 -14 34 35 -66 -30 -26 -49 64 41 7 31 12 -73 120 55 -70 34 2 45 -17 -51 -96 -7 -8 16 -107 -30 135
5324A35r9j37Q6J4J00j55L1J71j87O7q7P0O1j19O2J29l9q9J92j10j26J43j18Q6
$$ 135 36 -101 -15 -1 99 -56 -25 146 -41 26 -61 9 70 -49 13 142 103 14 206 96 -30 113 -5 81
5348H1q8nK3j1ON4j14l0J02j0k9M9p5o5J08J5J6L3q2J52n7j56J21m7J17r0k6Q3
$$ 81 -7 -12 11 0 6 60 -54 -84 18 8 -21 28 -47 -112 -4 11 27 60 -22 130 73 -83 38 -9 108 18 -8 75
5376G5lo3N1m8n3J8k2N8M9p9n8R4m0R2j10J5mk1P4j7o0K1L6K7n4N5j24P6%j9J15
$$ 75 72 9 60 12 -41 -23 -45 13 62 -17 -75 19 -21 71 -39 -24 -28 -49 25 8 -52 -31 5 32 -22 33 -91 -15 -15 -34 81
5407H1j59J61k5j03J21j23j4Q1p6N7K3j05J21l6o1J16k6k7j6O4q2O0j59J48j08
$$ 81 -78 83 58 -45 76 -47 -61 20 -56 1 24 -81 40 4 -57 59 33 6 -10 54 -28 32 -127 21 -87
5432h7PJ21j21N9Qj9Q3j29J76j50J9J62k10J83k46R9J49j52j9L6O4K3p9P1R8j09
$$ -87 -80 41 -80 -21 -13 -32 51 -78 98 -52 -33 129 -81 102 -144 -45 104 -48 -67 -31 33 56 -23 48 146 37
5458C7K6J41k42M5J14Kj89o6K36o0r8R8N4j70M7N1j07J7M1m0J11J3p3m2ON0n0
$$ 37 63 204 -38 7 121 123 -66 -132 104 44 -54 44 98 -72 -25 26 -81 -64 -23 -63 48 61 -12 -54 -48 2 -48
5485d8mj0L6q2M1M6Jn1Q0rj0k3Q4m0r9M0O3J5j8L3k0n5N8l1n5J4K0m5Q6R1M7j45
$$ -48 -52 -62 -26 -108 -67 -21 -20 -71 9 0 -10 -33 51 11 -88 -48 15 30 12 45 25 -30 28 -3 -58 -44 -24 -69 17 108 155 10
5517A0k1Kj19P5J5l6qJ19knj87K16r0n1J28o0K5N0r0L5n1n3J67j24Q8n5oj4NN3
$$ 10 -11 -9 -128 -53 -38 -74 -82 37 35 30 -157 59 -31 -82 46 -14 11 61 -29 6 -45 -98 69 -55 33 -22 -28 -42 -37 16
5547A6p7P9n4lJ8l9K9K5q2J09j18J4L0K5J43j33j04J28n2P4Jpj16J7J6J42j00
$$ 16 -61 18 -36 -39 -21 -60 -31 -6 -88 21 -97 -83 -53 -28 115 -18 -122 6 -46 28 29 22 -94 -77 -61 81 -19
5574a9o7J8J06m7J40j09K7N0n3L5J2j77Q6j7j09J07Q3J2o2M9j23J78j67J43o8
$$ -19 -86 -68 38 -9 131 22 49 99 46 81 93 -84 2 -15 -124 -17 66 78 16 65 -58 120 -47 96 28
5599B8k0j0%o4J00O5j78J18Kq1oQR1k2r2J20k29K62j03j1K7Nk5n6J12q9J91j84
$$ 28 8 -2 -2 -66 34 99 -79 39 41 -40 -46 -38 53 31 -61 59 -170 92 -11 -22 5 10 -15 -71 41 -48 143 -41
5627d1JP1j17R9R9k52K05j4j7J6K4j47K0qm8M8l7O3Q5%p2m0r3J08J13k02R0LJ11
$$ -41 -40 31 -86 13 112 -140 65 51 34 50 74 -73 -53 -61 -109 -61 -98 -35 50 50 -22 -62 -155 -47 66 -136 -46 -43 68
5656F8j0j0n2m3l2Q0K9M3j01M4J0J6pJ2Mj00K0O8q4J39j13K5Q1o7J05p4k6Jr7
$$ 68 58 48 -4 -47 -79 1 30 73 -28 16 26 42 35 47 51 -49 -29 39 -45 94 -19 6 87 20 125 51 25 26 -71
5685g1P4O6l5j00m9Q2M8r3n2O7L5J4j05J16j35J15J7n7n9J63j7r6J07M9J4j09
$$ -71 3 69 34 -66 -115 -33 15 -78 -130 -63 -28 -14 -119 -3 -138 -23 -6 -63 -122 41 24 -72 35 84 98 -11
5711a1j7N1K7j4M2j10R2n1J2J03j06L9r9Q9l4l7J50j02k0K6L3p3r7O3Q4o6j5l
$$ -11 -28 23 50 36 78 -32 60 9 21 124 18 57 -42 47 13 -24 126 24 4 30 63 -10 -107 -44 40 -26 -41 -44
5739d4rN5q4Q2k0p1J42p1njn0P9q6O3j13K6R3o3M8l8R3M0j00o5R0R3o1R8j01o9
$$ -44 -53 2 -82 0 -20 -91 51 -20 -25 -26 -76 3 -83 -20 -133 -107 -14 -77 -29 -67 26 66 -34 -99 -9 84 23 121 20 -49
5769d9kM2L0M0M4p3q1J72j76L4N7k45K01m9N5O4l5Nk5j21J53p6nN8Q7r5j3p8K0
$$ -49 -51 -9 21 61 105 32 -49 123 -53 -19 38 -207 -6 -55 0 64 29 34 9 -112 41 -35 -40 18 105 10 -3 -81 -61
5798f1M0N1K3K3n0j01J95j44M0k3j4M0r2R0O9j33Q5m0M2r9qj2N4O1r7m0n3J17
$$ -61 -21 30 53 76 26 -75 120 -24 16 -7 -21 19 -73 17 86 -47 38 -2 40 -59 -67 -79 -25 36 -61 -101 -154 -37
5826c7On6P2pN4M4k11J13k0R6j58Q6o3K03r8p1J00m9l7J8j8m8L9O7n5j6opJ44
$$ -37 -31 -87 -15 -22 32 76 -135 -22 -42 54 -104 -18 -81 122 24 -47 53 4 -33 -15 -33 -81 -42 25 -30 -46 -52 -59 85
5855H5k13J36M3r5P6Lk0J3KK8M2j27J15j96PN1K8n2N6m3J60o4r3J48j27L0K4M8
$$ 85 -128 8 51 -44 32 35 15 28 30 58 100 -27 88 -108 -101 -50 -22 -74 -18 -61 99 35 -58 90 -37 -7 17 65
5883F5m2K7n1Q7p9p4LJ14j30J46j51N7K3j1Q8q6p0P8J05j16J5j03J51J9n6n2j2
$$ 65 23 50 -1 86 7 -67 -64 50 -80 66 -85 -28 -5 -16 72 -14 -84 -6 99 -17 -2 -105 46 65 9 -43 -55
5910e5k3J24l5j1m4R8j01m6P5P3m0k7L7L0m9N1j06m7R3o6oJ60j04M2q3P1lo7Q9
$$ -55 -78 46 11 0 -44 54 -47 -93 -18 55 15 -12 25 55 6 57 -49 -96 -3 -69 -75 85 -19 23 -60 11 8 -59 30
$$ [...]
8191b2
##END NTUPLES=NMR FID
##END=
