##TITLE=1H_70-2025
 200.13MHz,CDCl3,
 8 sc
 
 24.6.2025
##JCAMPDX= 6.0         $$ Bruker NMR JCAMP-DX V2.0
##DATA TYPE= NMR FID
##DATA CLASS= NTUPLES
##ORIGIN= UXNMR, Bruker Analytische Messtechnik GmbH
##OWNER= pz
$$ XWIN-NMR		Version 3.5
$$ Tue Jun 24 15:40:41 2025 Russian Standard Time (UT+4h)  she@DPX200
##.OBSERVE FREQUENCY= 200.1313
##.OBSERVE NUCLEUS= ^1H
##.DELAY= (6, 6)
##.ACQUISITION MODE= SIMULTANEOUS
##.ACQUISITION SCHEME= undefined
##.AVERAGES= 8
##.DIGITISER RES= 18
##SPECTROMETER/DATA SYSTEM= spect
##.PULSE SEQUENCE= zg30
##.SOLVENT NAME= CDCl3
##.SHIFT REFERENCE= (INTERNAL, CDCl3, 0, 14.3821)
##AUDIT TRAIL= $$ (NUMBER, WHEN, WHO, WHERE, WHAT)
$$ ##TITLE= Audit trail, XWIN-NMR		Version 3.5
$$ ##JCAMPDX= 5.01
$$ ##ORIGIN= Bruker BioSpin GmbH
$$ ##OWNER= she
$$ F:/spectra/data/she/nmr/H-C/1/audita.txt
$$ ##AUDIT TRAIL=  $$ (NUMBER, WHEN, WHO, WHERE, WHAT)
(   1,<2025-06-24 15:39:19.98 +0400>,<she>,<DPX200>,
      <created by zg, POWCHK disabled, PULCHK disabled
       configuration hash MD5:
       00 E9 B6 7A A2 85 ED C7 34 08 36 98 17 FE 4E 26
       data hash MD5: 16K
       DC 89 14 DA 44 44 E3 AF 6C F4 F8 FA F4 5F FE 16>)
$$ ##END=
$$ 
$$ hash MD5
$$ 24 52 3A FE 00 DE 2C 6C 22 87 21 3F 39 A0 BF BD
##$RELAX= 
##$RELAX= 
##$RELAX= 
##$RELAX= 
##$RELAX= 
##$RELAX= 
$$ Bruker specific parameters
$$ --------------------------
##$DU= <F:/spectra>
##$EXPNO= 1
##$NAME= <H-C>
##$PROCNO= 1
##$TYPE= <nmr>
##$USER= <she>
##$AMP= (0..31)
100 100 100 100 100 100 100 100 100 100 100 100 100 100 100 100 100 100 
100 100 100 100 100 100 100 100 100 100 100 100 100 100 
##$AQSEQ= 0
##$AQ_mod= 1
##$AUNM= <au_zg>
##$AUTOPOS= <>
##$BF1= 200.13
##$BF2= 200.13
##$BF3= 200.13
##$BF4= 200.13
##$BF5= 200.13
##$BF6= 200.13
##$BF7= 200.13
##$BF8= 200.13
##$BYTORDA= 1
##$CFDGTYP= 0
##$CFRGTYP= 5
##$CHEMSTR= <none>
##$CNST= (0..31)
1 1 145 1 1 1 1 1 1 1 1 1 1 1 1 1 1 1 1 1 1 1 1 1 1 1 1 1 1 1 1 1 
##$CPDPRG= <>
##$CPDPRG1= <>
##$CPDPRG2= <>
##$CPDPRG3= <>
##$CPDPRG4= <mlev>
##$CPDPRG5= <mlev>
##$CPDPRG6= <mlev>
##$CPDPRG7= <mlev>
##$CPDPRG8= <mlev>
##$CPDPRGB= <>
##$CPDPRGT= <>
##$D= (0..31)
0 0.7 0 0 0 0 0 0 0 0 0 0.03 0 0 0 0 0 0 0 0 0 0 0 0 0 0 0 0 0 0 0 0 
##$DATE= 1750765159
##$DBL= (0..7)
120 120 120 120 120 120 120 120 
##$DBP= (0..7)
150 150 150 150 150 150 150 150 
##$DBP07= 0
##$DBPNAM0= <>
##$DBPNAM1= <>
##$DBPNAM2= <>
##$DBPNAM3= <>
##$DBPNAM4= <>
##$DBPNAM5= <>
##$DBPNAM6= <>
##$DBPNAM7= <>
##$DBPOAL= (0..7)
0.5 0.5 0.5 0.5 0.5 0.5 0.5 0.5 
##$DBPOFFS= (0..7)
0 0 0 0 0 0 0 0 
##$DE= 6
##$DECBNUC= <off>
##$DECIM= 32
##$DECNUC= <off>
##$DECSTAT= 4
##$DIGMOD= 1
##$DIGTYP= 9
##$DL= (0..7)
0 120 120 120 120 120 120 120 
##$DP= (0..7)
150 150 150 150 150 150 150 150 
##$DP07= 0
##$DPNAME0= <>
##$DPNAME1= <>
##$DPNAME2= <>
##$DPNAME3= <>
##$DPNAME4= <>
##$DPNAME5= <>
##$DPNAME6= <>
##$DPNAME7= <>
##$DPOAL= (0..7)
0.5 0.5 0.5 0.5 0.5 0.5 0.5 0.5 
##$DPOFFS= (0..7)
0 0 0 0 0 0 0 0 
##$DQDMODE= 0
##$DR= 18
##$DS= 0
##$DSLIST= <SSSSSSSSSSSSSSS>
$$ [...]
##$SUBNAM0= <"">
##$SUBNAM1= <"">
##$SUBNAM2= <"">
##$SUBNAM3= <"">
##$SUBNAM4= <"">
##$SUBNAM5= <"">
##$SUBNAM6= <"">
##$SUBNAM7= <"">
##$SUBNAM8= <"">
##$SUBNAM9= <"">
##$SW= 18.0517328524113
##$SWIBOX= (0..15)
0 0 2 0 0 0 0 0 0 0 0 0 0 0 0 0 
##$SW_h= 3612.71676300578
##$TD= 16384
##$TD0= 1
##$TE= 0
##$TE2= 300
##$TE3= 300
##$TEG= 300
##$TL= (0..7)
0 120 120 120 120 120 120 120 
##$TP= (0..7)
150 150 150 150 150 150 150 150 
##$TP07= 0
##$TPNAME0= <>
##$TPNAME1= <>
##$TPNAME2= <>
##$TPNAME3= <>
##$TPNAME4= <>
##$TPNAME5= <>
##$TPNAME6= <>
##$TPNAME7= <>
##$TPOAL= (0..7)
0.5 0.5 0.5 0.5 0.5 0.5 0.5 0.5 
##$TPOFFS= (0..7)
0 0 0 0 0 0 0 0 
##$TUNHIN= 0
##$TUNHOUT= 0
##$TUNXOUT= 0
##$USERA1= <user>
##$USERA2= <user>
##$USERA3= <user>
##$USERA4= <user>
##$USERA5= <user>
##$V9= 5
##$VALIST= <valist>
##$VCLIST= <CCCCCCCCCCCCCCC>
##$VD= 0
##$VDLIST= <DDDDDDDDDDDDDDD>
##$VPLIST= <PPPPPPPPPPPPPPP>
##$VTLIST= <TTTTTTTTTTTTTTT>
##$WBST= 1024
##$WBSW= 4
##$XGAIN= (0..3)
0 0 0 0 
##$XL= 0
##$YL= 0
##$YMAX_a= 845341
##$YMIN_a= -937195
##$ZGOPTNS= <>
##$ZL1= 120
##$ZL2= 120
##$ZL3= 120
##$ZL4= 120
##$ABSF1= 10
##$ABSF2= 0
##$ABSG= 5
##$ABSL= 3
##$ALPHA= 0
##$AQORDER= 0
##$ASSFAC= 0
##$ASSFACI= 0
##$ASSFACX= 0
##$ASSWID= 0
##$AUNMP= <proc_1d>
##$AZFE= 0.1
##$AZFW= 0.1
##$BCFW= 1
##$BC_mod= 2
##$BYTORDP= 1
##$COROFFS= 0
##$CY= -3
##$DATMOD= 1
##$DC= 2
##$DFILT= <>
##$DTYPP= 0
##$F1P= 0
##$F2P= 0
##$FCOR= 0.5
##$FTSIZE= 0
##$FT_mod= 4
##$GAMMA= 1
##$GB= 0.15
##$INTBC= 1
##$INTSCL= 1
##$ISEN= 128
##$LB= 0.25
##$LEV0= 0
##$LPBIN= 0
##$MAXI= 10000
##$MC2= 0
##$MEAN= 0
##$ME_mod= 0
##$MI= 1.114404
##$NCOEF= 0
##$NC_proc= 0
##$NLEV= 6
##$NOISF1= 3.799351
##$NOISF2= 2.8
##$NSP= 1
##$NTH_PI= 0
##$NZP= 0
##$OFFSET= 14.38212
##$PC= 1
##$PHC0= -1201.464
##$PHC1= 12.5922
##$PH_mod= 1
##$PKNL= yes
##$PPARMOD= 0
##$PSCAL= 0
##$PSIGN= 0
##$REVERSE= no
##$SF= 200.129724274929
##$SI= 16384
##$SIGF1= 3
##$SIGF2= 2
##$SINO= 400
##$SIOLD= 16384
##$SREGLST= <1H.CDCl3>
##$SSB= 0
##$STSI= 0
##$STSR= 0
##$SW_p= 3205.1282051282
##$SYMM= 0
##$S_DEV= 0
##$TDeff= 0
##$TDoff= 0
##$TI= <>
##$TILT= no
##$TM1= 0
##$TM2= 0
##$TOPLEV= 0
##$USERP1= <user>
##$USERP2= <user>
##$USERP3= <user>
##$USERP4= <user>
##$USERP5= <user>
##$WDW= 1
##$XDIM= 8192
##$YMAX_p= 0
##$YMIN_p= 0
$$ End of Bruker specific parameters
$$ ---------------------------------
##NTUPLES= NMR FID
##VAR_NAME=  TIME,          FID/REAL,        FID/IMAG
##SYMBOL=    X,             R,               I
##VAR_TYPE=  INDEPENDENT,   DEPENDENT,       DEPENDENT
##VAR_FORM=  AFFN,          ASDF,            ASDF
##VAR_DIM=   8192,          8192,            8192
##UNITS=     SECONDS,       ARBITRARY UNITS, ARBITRARY UNITS
##FACTOR=    0.0002768,     1,               1
##FIRST=     0,             0,               0
##LAST=      2.2672688,     0,               0
##MIN=       0,             -937195,         0
##MAX=       2.2672688,     845341,          0
$$ Real data points
##PAGE= N=1
##DATA TABLE= (X++(R..R)), XYDATA
0@%%%%%%Qj6Q%Qj6K1k9L2m0N6o4P2q8J08j32J52j74K04k42K81l21L68m21M82n46
$$ 0 0 0 0 0 0 0 8 -8 0 0 8 -8 13 -16 16 -24 32 -32 40 -48 60 -72 80 -94 110 -132 149 -172 196 -225 257 -289
32b89O17o99P88q85R91j104J232j373J526j692J870k069K288k527K784l063L375
$$ -289 328 -371 417 -468 523 -581 651 -722 804 -888 982 -1087 1201 -1326 1458 -1605 1770
49A770l720M099m515M974n493O082o745P501q380R415j0651J2152j4018J6411
$$ 1770 -1950 2149 -2366 2608 -2885 3197 -3548 3953 -4427 4988 -5663 6489 -7529 8882
63H882j9601K4066l0730M1653o2421J14377m61102n52319J709051k03505j326643
$$ 8882 -10719 13347 -17383 24270 -38151 76226 -384876 -937195 771856 568351 -758292
74g58292P59422O85594j028175p0052Q72751m43476n99068Q23293K10933q33154
$$ -758292 1130 686724 -341451 -411503 461248 17772 -581296 241997 452930 -380224
84c80224K53630O18946n59255k90229N42506j1941n19835J45756N57954k25696
$$ -380224 -126594 492352 -66903 -357132 185374 173433 -346402 -200646 357308 131612
94A31612n40591M78713M23882o55207j46333N72048k36897l46131M51639K9265
$$ 131612 -408979 69734 493616 -161591 -307924 264124 27227 -318904 132735 162000
104A62000m93871L63344M57617o79075j92053Q48692l11623p72067P26773L22477
$$ 162000 -331871 31473 489090 -189985 -382038 466654 155031 -617036 109737 432214
114D32214q74395K37841P35445n32190l68320N91544L4857n06419J52990K62255
$$ 432214 -442181 -204340 531105 -1085 -369405 222139 256996 -249423 -96433 165822
124A65822l04618K7676L28215k61419j38296L88654n2664l12553R2292J38868
$$ 165822 -138796 -111120 217095 -44324 -182620 206034 153370 -159183 -66891 71977
134G1977n3270j15058L996J71699l4950j15544J59077O410j83371R0595Q8081
$$ 71977 18707 -96351 -92355 79344 44394 -71150 87927 94337 -89034 1561 89642
145H9642j62196k6380J55365n0733j05722K04637J9655l06537J94951K53664m27107
$$ 89642 -72554 -98934 56431 5698 -100024 104613 124268 -182269 12682 266346 -160761
156a60761o6346M32830j82858k42026L05692K6262k24224J55617J09525k43431
$$ -160761 -227107 205723 22865 -219161 86531 112793 -111431 44186 153711 -89720
166h9720m720K36284j51579j73209K62848O505k33169J96415R7048k41982N9506
$$ -89720 -94440 141844 -9735 -182944 79904 86409 -146760 49655 146703 -95279 -35773
177c5773J34202j23323m6531N6323J7937l835j0620L4559j096k9604N1180j2497
$$ -35773 98429 -24894 -71425 -15102 2835 -1000 -11620 22939 21843 -7761 43419 30922
189C0922p7614J6818M8909m340o9123J6067J27872q0068q7812J75133n4181j74330
$$ 30922 -46692 -29874 19035 14695 -54428 -38361 89511 9443 -78369 96764 42583 -131747
201a31747J76872L2470k09835J00688J36833j40949k5280J51487m2331j34071
$$ -131747 45125 77595 -132240 -31552 105281 -35668 -60948 90539 48208 -85863
211h5863J16870O4670k03100M4057J80635j62710m8158J91079p4661q8235J18527
$$ -85863 31007 95677 -107423 -63366 117269 -45441 -93599 97480 22819 -65416 53111
222E3111j4812q8976L2934M2902l7202m1956O2176L5378o7273K9960M6729n9531
$$ 53111 38299 -50677 -17743 25159 -12043 -53999 8177 43555 -23718 6242 52971 -6560
234f560L84J9690k5341j400j9428L0338L4312p0565L9333P1196r9630L998Q0590
$$ -6560 -6176 13514 -11827 -13227 -32655 -2317 31995 -38570 763 71959 -27671 -23673 56917
247E6917q3664k9702P8850j5748m8771M1186N9119n2295l7164R0507l6003r5285
$$ 56917 -26747 -56449 22401 6653 -42118 -932 58187 5892 -31272 59235 23232 -72053
259g2053R5631R53j05191Q5319M1411q2058M1202M3063m8481j5684K2826j94m5186
$$ -72053 23578 24531 -80660 4659 46070 -35988 5214 48277 -204 -15888 6938 6744 -38442
272c8442R759N6227m3600o298P6640l8616k9010M9239l3773k4656J7102j5950
$$ -38442 -28683 27544 -16056 -22354 54286 15670 -13340 35899 2126 -22530 -5428 -21378
284b1378J2746P37k603M1156k0446j3829L8538l8072k4729L1716j8586j1689J7406
$$ -21378 -8632 -7895 -10498 30658 10212 -3617 34921 -3151 -27880 3836 -14750 -26439 -9033
297i033J8308J2544k5875K2062K9826o9836L843M7139o7652J636O0616l7306R37
$$ -9033 9275 21819 -4056 18006 47832 -22004 -18161 28978 -38674 -37038 23578 -13728 -12791
310a2791M6697j4863j9820M683J1245k7348l2959N1245K135n1925O3265K5681
$$ -12791 33906 19043 -777 3906 15151 -12197 -45156 6089 8224 -43701 19564 45245
322D5245n9574L2801J5092n0092N836K935j2584L907L767K6618m426j3037L9792
$$ 45245 -14329 18472 33564 -16528 -10692 -7757 -20341 -16434 -12667 13951 9525 -3512 36280
335C6280k1916l9836L4670j3106l1534K4821Q448Q435L005m850L1471k0143l4119
$$ 36280 14364 -25472 9198 -3908 -35442 -10621 -2173 6262 9267 4417 35888 15745 -18374
348a8374L4815k3564l4211M2910m834j8261L5890O757j3536l200O672r43m1987
$$ -18374 16441 -7123 -41334 1576 -3258 -21519 14371 21128 7592 4392 11064 10121 -31866
361c1866J1776L8784m9946R129O6311l8231j2444M3669k8230k1677J1844q944
$$ -31866 -20090 18694 -31252 -22123 44188 5957 -6487 37182 8952 -12725 -881 -9825
373i825q345k699K3823J0824k6336L0180J7217n0513J3990J6668m1902N888K0034
$$ -9825 -18170 -20869 2954 13778 -12558 17622 34839 -15674 -1684 14984 -26918 -21030 -996
386i96k037M741n119K5917J0028m5776J4085J7234m4505J0186J9565k4181J6009
$$ -996 -3033 1708 -3411 22506 32534 -13242 843 18077 -26428 -16242 3323 -20858 -4849
399d849K3324p018j0413L139J9439k9343k8617M7264j4656m1359O1759J0219n0216
$$ -4849 18475 11457 1044 4183 23622 -5721 -34338 12926 -1730 -43089 18670 28889 -21327
412b1327L2536K2212l2155j1945L084N088j1323j207K3610j6772J612M3500k9636
$$ -21327 11209 33421 1266 -10679 -7595 -2507 -13830 -15037 8573 -8199 -6587 36913 7277
425G277k8456L4593o300k2585n09O687K0716j4902m511M2242k5999k8575M4560
$$ 7277 -21179 13414 7114 -15471 -15980 -9293 11423 -3479 -7990 34252 8253 -20322 24238
438B4238j3347m1133K0124J1599p433J966Q025K146j0932K3745M007n9832K2836
$$ 24238 10891 -30242 -10118 1481 -5952 -3986 4039 6185 -4747 18998 23005 -36827 -13991
451a3991N0664n7986j1248N5184j5805j2091K2985p511j3195o95J1017o063k7920
$$ -13991 36673 -21313 -32561 22623 6818 -5273 17712 10201 -2994 -3689 7328 1265 -26655
464b6655J9569J9377k2234J3713J0024k1819J2636Q821j2702j4169j1465L8378
$$ -26655 -7086 12291 -9943 3770 13794 -8025 4611 13432 730 -13439 -24904 13474
476A3474J0295n9147K5294N3771m2991j4023L0414j8359j3878J9516J819k7827
$$ 13474 23769 -35378 -10084 43687 696 -13327 17087 -1272 -15150 4366 6185 -21642
488b1642L791M5308j8214l4269M4579m767m0648M0941j589m9281K9551K8853k1334
$$ -21642 -17851 27457 9243 -25026 19553 14786 -25862 15079 13490 -35791 -6240 22613 1279
501A279j1561O674K1510l034k3454N351q55l692J5101j3425j0496J7335R799N288
$$ 1279 -10282 -3608 17902 14868 -8586 -3235 -4090 -7782 7319 -6106 -16602 733 10532 15820
515A5820k1240j1682L9103j5413l3571L8568q842l3084M9103R358n1628J3571
$$ 15820 -5420 -17102 22001 6588 -26983 11585 2743 -30341 18762 28120 -23508 -9937
527i937M0429j8186l5971J6328J8848k8955J1994K5865m2633R299N1194l5113
$$ -9937 30492 12306 -23665 -7337 11511 -17444 -5450 20415 -22218 -12919 38275 3162
539C162k3031K8071o509l769K996j2995P596Q441M282M657j9443N69K1201q548
$$ 3162 -19869 8202 1693 -2076 920 -12075 -4479 3962 8244 12901 -6542 -5973 15228 6680
553F680j8419o532J6492J4742k4515N849K2820k7778J4206K8277n2702l388N0250
$$ 6680 -11739 -18271 -1779 12963 -11552 -5703 17117 -10661 3545 31822 -20880 -24268 25982
566B5982k6388k3745L1081J431j5577J6380J3306l2636j2337M6279j2682m9157
$$ 25982 -406 -24151 6930 8361 -7216 9164 22470 -10166 -22503 23776 11094 -38063
578c8063L3414K0253k6357J6910K406j8696K1258R17j8707K14l183R928P551j6190
$$ -38063 -4649 15604 -10753 6157 8563 -10133 11125 12042 -6665 -6451 -9634 294 7845 -8345
592h345N626J3388m019l039j639n44j1391j559K6922k1354k7846N3129O932m7598
$$ -8345 -2719 10669 6650 3611 1972 1428 -9963 -11522 15400 -5954 -33800 19329 26261 -21337
606b1337K5836J5139l3746J4528J1442k9922K947L0519l724k6828J5441K5101
$$ -21337 4499 19638 -14108 420 11862 -18060 -15113 15406 11682 -15146 295 25396
618B5396k9847o177K5620k6538p276K9618j3882o346J4995m572J0226q98k2019
$$ 25396 -4451 -10628 14992 -11546 -18822 10796 -3086 -9432 5563 991 11217 10319 -11700
631a1700J1007P059j3431K831J039o61R089N179n466j3198J3383J2883l5915L79
$$ -11700 -693 6366 -7065 -4234 -3195 -3856 5233 10412 4946 -8252 5131 18014 -17901 -17522
645a7522L4374k8530n521L9438k1178j5171L2192p741k1763R204N794r758k096
$$ -17522 16852 -11678 -17199 22239 1061 -14110 18082 10341 -11422 -2218 3576 -6182 -8278
658h278J4570m427j2053K4262J533k9035J4713P027j9759Q884j251o008J8091
$$ -8278 6292 1865 -10188 14074 15607 -13428 1285 8312 -11447 -2563 -3814 -9822 8269
671H269o829n159J5685j0183n308J0736r879p182P218N527l611m565J5281j494
$$ 8269 1440 -3719 11966 1783 -3525 7211 -2668 -9850 -2632 2895 -716 -5281 10000 8506
685H506j8143J9879j798l1381K3629J0764l1205J5631J8149j8009L908J0630q192
$$ 8506 -9637 10242 8444 -22937 692 11456 -19749 -4118 14031 -3978 -70 10560 2368
698B368o387L476M262j1536p42J6950r572k973J6779j2471k935J2211j5722l63
$$ 2368 -4019 -543 3719 -7817 -8559 8391 -1181 -4154 12625 154 -2781 9430 -6292 -6655
712f655R073j2629Q395P073j1451J0476N480j1632K578K187m215m325J957Q852
$$ -6655 2418 -10211 -1816 5257 -6194 4282 9762 -1870 708 2895 -1320 -5645 -3688 5164
726E164r568m76J9726j4989p020K1049j6296j0288K0151j1600q204J7080k337
$$ 5164 -4404 -4880 14846 -143 -7163 13886 -2410 -12698 7453 -4147 -12351 4729 2392
739B392m797N301K917j845q131M714K470j2323Q962M910j2167J2691K343j2989
$$ 2392 -2405 2896 5813 3968 -4163 551 3021 -9302 -340 4570 -7597 5094 7437 -5552
753e552J2029k903j1768J0447m836n300J0275m151m80Q208l646l48q79j52R79
$$ -5552 6477 3574 -8194 2253 -2583 -7883 2392 -1759 -2239 5969 2323 1975 1096 944 1923
768A923r121O064N658j3167J0150P938j5864J0326M425j6933Q509L318j1929N853
$$ 1923 -7198 -1134 4524 -8643 1507 9445 -6419 3907 8332 -8601 -92 3226 -8703 -2850
782b850M562k581J149J090N158n683m032R668r201m684J3243r408j650J3850r951
$$ -2850 1712 -869 280 1370 6528 845 -3187 6481 -2720 -7404 5839 -3569 -5219 8631 -1320
797a320j99R080r994R99K617o990M403J55j991N903k415K169J979o290N748l206
$$ -1320 -1519 7561 -2433 -1434 1183 -5807 -1404 -1249 -3240 2663 248 2417 4396 -1894 3854 648
813F48o841R949o052m269J4278q124l838J3451r215m771Q004n438k538K670P28
$$ 648 -6193 3756 -2296 -6565 7713 -411 -4249 9202 -13 -4784 3220 -2218 -4756 -2086 -1358
828a358K469m054N468M634j1135N760M626j3615O647M227j0843Q371K120n890
$$ -1358 1111 -2943 2525 7159 -3976 1784 6410 -7205 -558 3669 -7174 1197 3317 -2573
842b573O871l383k193M997o670p1K797l335M247j241l08O550o217J637M897j1848
$$ -2573 4298 915 -1278 3719 -2951 -3022 -225 -3560 687 -554 -862 5688 -529 1108 6005 -5843
858e843N011O338j3644O944P223j0680N576M737o926Q10O5J368k443n644R035
$$ -5843 -832 5506 -8138 -1194 6029 -4651 925 5662 -1264 -454 -389 979 -1464 -7108 1927
873A927l3p184J0320k262n946R774n464n159O323n053J592L587p822P011L614
$$ 1927 1894 -5290 5030 2768 -3178 6596 1132 -4027 2296 -2757 -1165 2422 -5400 1611 5225
888E225q064M658L10n204J877m77J842k345k865J2249m120r645J3500l125r888
$$ 5225 -2839 1819 2129 -3075 -1198 -1675 167 -2178 -5043 7206 3086 -6559 6941 3816 -6072
903f072J1101n045q071J1210l90n566J886K784K513o404n20P027r281K30J0624
$$ -6072 5029 -16 -8087 3123 2733 -2833 -947 1837 4350 -2054 -2574 4453 -4828 -4598 6026
918F026r816o85R410l803J246j007m364P414l872n696P609n383l15J0294p472
$$ 6026 -3790 -4475 4935 1132 2378 1371 -2993 4421 549 -5147 2462 -2921 -3236 7058 -414
933d14m356P457J629m252o021M959N517j1686O090R661j5533N554J3698j4591
$$ -414 -4770 2687 4316 64 -5957 -998 4519 -7167 -1077 8584 -6949 -1395 12303 -2288
947b288k624R825n337j947K174q51o65M42P450m243j0790J2576L458j4277M173
$$ -2288 -4912 4913 -424 -2371 -197 -1048 -1713 -1271 6179 1936 -8854 3722 7180 -7097 -2924
962b924M199l501M094k737O37L944n599N794R56j3084P609O458j0533K114M794
$$ -2924 1275 -2226 1868 -869 -232 3712 -1887 3907 4863 -8221 -612 5846 -4687 -2573 2221
977B221k998P06L142Q51r202p38J6080j0341j4375J9464J894j3923J0743J339
$$ 2221 -777 -71 3071 3922 -5280 -6018 10062 -279 -14654 4810 6704 -7219 3524 4863
991D863r056O872K203p123l269M840N770q849n87J0591p344j355R559q858m078
$$ 4863 -4193 2679 4882 -2241 -5510 -670 5100 -3749 -4336 6255 -1089 -2444 7115 -1743 -5821
1006e821O880n57K52n038O8J3075n993q160J0364l668n034P746m336p102O434
$$ -5821 1059 502 754 -4284 -4216 8859 2866 -5294 5070 1402 -3632 4114 -222 -7324 -890
1021h90O382m127q355R316O653j5617M423J0419j7003L016J5894j2508m961J2456
$$ -890 5492 1365 -6990 2326 8979 -6638 -2215 8204 -8799 -5783 10111 -2397 -7358 5098
1035E098jm987r73K073q71m075N775j775q467J0494M993j0522K151K636p28J218
$$ 5098 5097 110 -863 1210 339 -3736 2039 264 -8203 2291 7284 -3238 -1087 1549 821 2039
1051B039o750K591N236p832N673O139j2351M863R612r289m782M887J840m717n17
$$ 2039 -4711 -2120 3116 -4716 957 7096 -5255 -392 9220 -69 -4851 36 1876 -2841 -3358
1066c358P463n351m375J4880n604j4623J4598K165j3317O375L585n449L916K507
$$ -3358 4105 -1246 -5621 9259 3655 -10968 3630 5795 -7522 -1147 2438 -3011 905 3412
1080C412j531l343R46N774o502m751P428k147j432M254l876K668J949m231M224
$$ 3412 1881 -1462 -516 5258 -1244 -5995 1433 -714 -2146 2108 -1768 900 2849 -1382 2842
1095B842m380n092J1320l508q700J0561J512o854M407J523m469k079M839J282
$$ 2842 -1538 -6630 4690 1182 -7518 3043 4555 -2299 2108 3631 -838 -2917 1922 3204
1109C204j0587M781J0331j1090q4J0735r385r19Q339p797k092N806j154m2r01
$$ 3204 -7383 -2602 7729 -3361 -3445 7290 -2095 -3014 5325 -2472 -4564 1242 88 46 -855
1124h55J511L365m402R85J435m526K040O79k503L199l054J742O058q569L94Q044
$$ -855 656 4021 -381 604 2039 -2487 -447 232 -2271 928 -2126 -384 5674 -2895 -2501 5543
1140E543q631m16P254o797J63O805k559k815J820L780l300n438O935q80p959R038
$$ 5543 -3088 -3504 3750 -3047 -2884 3921 1362 -1453 367 4147 847 -4591 2344 1464 -6495 2543
1156B543M82q484P832R20o404M540j141k803L316j696k89J905j372L040j156j660
$$ 2543 3025 -5459 2373 3293 -3111 1429 288 -2515 801 -895 -1184 721 -651 2389 1233 -427
1172d27K584k995P97P51m731N276R06o982P277P69p727O383Q65p009M344J492
$$ -427 2157 -838 -41 710 -4021 1255 2161 -4821 2456 3225 -4502 1881 2746 -4263 81 1573
1188A573l295J003J645O49k259O77M178o050m67O806o986o54O947n843M45M571
$$ 1573 -1722 -719 926 1575 -684 -7 4171 -1879 -2346 4460 -2526 -3180 3767 -2076 -1631 2940
1204B940m380J259K100l717J864m9j184K035j708J262O38k077L254j999k228N191
$$ 2940 -1440 -181 1919 -1798 66 17 -1167 868 -840 422 1060 -1017 2237 238 -1990 3201
1220C201m413j595O402n531j225P136n101j060N032l471m30J753p75k77j033K463
$$ 3201 -1212 -2807 3595 -1936 -3161 3975 -1126 -2186 2846 -625 -1055 698 -77 -354 -1387 1076
1236A076M42l976M675P2n601N417l66n744N655o52m097M182q35j732K958j731
$$ 1076 1518 -2458 2217 2289 -3312 2105 1739 -4005 1650 998 -3099 1083 248 -1484 1474 -257
1252b57J96Q37j844J763j254k44K377l222J874K303m741K959K022n865L848P59
$$ -257 -61 776 -1068 695 -559 -803 1574 -1648 226 2529 -2212 747 2769 -3096 752 1511
1268A511n257M317L87l369L177M35j619N80j03J066k225n55L931l482l07N125
$$ 1511 -3746 571 958 -2411 766 1201 -418 162 59 1125 -1100 -1655 2276 -1206 -1513 3612
1284C612m722J15M853n250K13L349m254Q75J709j623J757o92j97J795k108P21
$$ 3612 -1110 -995 3858 -1392 -1179 2170 -2084 -1209 500 -1123 634 -58 -255 1540 -568 153
1300A53P35k684K658j070j833M694k615j347M669l910j028M123m299k14L422k551
$$ 153 888 -1796 862 -208 -2041 2653 38 -1309 3360 -550 -1578 2545 -1754 -1968 1454 -1097
1316a097J05J501RM16j756J851L48m322L423J259m989M224J579m242L287J66l217
$$ -1097 -992 509 518 934 -822 1029 1377 -2945 478 1737 -3252 972 2551 -1691 1596 1762 -1455
1333a455K173j247r68J169j304J831P65k029K186m8j308J401k482R40J397l482
$$ -1455 718 -529 -1497 -328 -1632 199 964 -1065 1121 1073 -235 1166 -1316 -376 1021 -2461
1349b461L310J337m459M155Q09m875K925L35l467J618M97n31L29L73K599l054
$$ -2461 849 2186 -2273 1882 2691 -2184 741 1076 -2391 -773 -276 -807 -478 -105 2494 -560
1365e60r15M585l641k481M971k564j493M148j768n33J652j389R01j489j475K669
$$ -560 -1475 3110 -531 -3012 1959 -605 -2098 2050 282 -251 1401 12 913 -576 -2051 618
1381F18j823m72K754j280O5J741j630N85j192n46L387m028o46N732l177j871N072
$$ 618 -1205 -1677 1077 -203 -138 1603 -27 558 -634 -1180 2207 -1821 -2467 3265 88 -1783 3289
1398C289l112j702L009j344j963J22K164L57l272L158K206n043K771K318n767
$$ 3289 177 -1525 1484 140 -1823 -1701 463 820 -2452 706 2912 -2131 640 2958 -2809
1413b809J916K975l284N26R02K71J138k163P77J164l459J801J167l343J432K003
$$ -2809 -893 2082 -1202 -676 226 497 1635 -528 249 1413 -2046 -245 922 -2421 -989 1014
1429A014o17k59j082K484j56m242L659P46m991M416K111n538K281K976k453j585
$$ 1014 397 138 -944 1540 1384 -2858 801 1547 -3444 972 3083 -2455 -174 2802 349 -1236
1445a236J168Q95k231m96M026k928k146O447k149m345M324k16k457J503m16r0
$$ -1236 -68 827 -1404 -1900 2126 -802 -2948 3499 1350 -2995 1329 1113 -1344 159 -257 -347
1461c47L11j20K290k225j933M429j603l188K002M49m92l15P53J322k565P16M030
$$ -347 -36 -156 2134 -91 -2024 2405 802 -2386 -384 65 -427 -742 11 1333 -1232 -516 3514
1478C514m988j471O362l293l132M683n87k345J825J115j988j791L140J056n022
$$ 3514 -1474 -2945 3417 124 -3008 1675 1088 -1257 568 1683 -305 -2096 1044 2100 -2922
1493b922J876L821m343O57L283l663O23K123j411k40q30J541J200l357J078K711
$$ -2922 -1046 2775 -1568 -911 2372 -1291 -668 1455 44 -196 -1026 515 1715 -1642 -564 2147
1509B147k820L87J826k279l55J094Q25j179k289M046P17n150L650J937n076K349
$$ 2147 -673 -286 1540 -739 -1094 0 825 -354 -2643 1403 2120 -3030 620 2557 -2519 -170
1525a70K682m211O30K939r71k235N97K732k086j747L961j991k847M482q57l215
$$ -170 2512 -1699 -1069 1870 899 -1336 -739 1993 -93 -1840 2121 130 -2717 1765 908 -2307
1541b307K414M69m23O5j002J339J9j664K351o67k599K931L08k259M87J361J85
$$ -2307 107 576 153 218 -784 555 574 -1090 1261 594 -2005 926 1234 -1025 -538 823 1008
1558A008j738l35K726k742q51M553k996k514M981p98l362K847L88j508R0Q82j95
$$ 1008 -730 -1065 1661 -1081 -1932 2621 -375 -2889 2092 1294 -2068 779 1167 -341 -251 631 436
1575D36j937J711J499l424J138K982l266K32J722j901N00J10o21J578j171J66
$$ 436 -1501 210 1709 -1715 -577 2405 -861 -629 1093 -808 -308 -198 -819 759 -412 -246
1591b46K055k179l80K024j282n70P75l75J96o93J491J35k758K312J726m682J855
$$ -246 1809 -370 -750 1274 -8 -578 197 -178 18 -675 816 951 -1807 505 2231 -2451 -596
1608e96K310l532J180K313j931j8J023K32j313m54J691o51j773K361n61j531K580
$$ -596 1714 -1818 -638 1675 -256 -274 749 981 -332 -786 905 254 -1519 842 281 -1250 1330
1625A330p27j316J463j043p0Q40j814R59J143j741J247J062j665R39l32k67l53
$$ 1330 603 -713 750 -293 -363 477 -1337 -378 765 -976 271 1333 -332 607 275 8 -345
1642c45l09J456o44j332K712j242j770L065j553k115K860p57j577J663J29L3k28
$$ -345 -654 802 158 -1174 1538 296 -1474 1591 38 -2077 783 26 -1551 112 241 274 46
1659D6J68O49j261j2J174j708N43J335j821J309N60j864J447r6j689J429n60o90
$$ 46 214 863 -398 -410 764 -944 -401 934 -887 422 982 -882 565 469 -1220 209 -351 -1041
1677a041J544m65j75P23l33K82q05K37P51j695L86J674j932M72J817k304P68J301
$$ -1041 503 38 -137 586 253 535 -270 -33 718 -977 -591 1083 -849 -377 1440 -864 -96 1205
1695A205k380O82R59j320N82J74J24N20n16O39j08j068J152r25o60J675r13m44
$$ 1205 -1175 -493 466 -854 -272 -98 26 546 30 669 561 -507 645 -280 -940 735 -178 -622
1713f22J869j568l72K028k046K02R07j196N38O41m57L07k14M92j91r26J228m20
$$ -622 1247 -321 -693 1335 -711 -509 398 -798 -260 381 -76 231 17 509 318 -608 620 200
1731B00j252J764m15j351K017o81r19J405q10o87Q89l86p1M15l19O59m73RP64
$$ 200 -1052 712 297 -1054 963 282 -637 768 -42 -729 160 -226 -297 118 -201 458 -15 -6 758
1750G58j319N60N96j500Q43O32j585J615J6j497J233k53q57J091o15l00N15j62
$$ 758 -561 -1 595 -905 -62 570 -1015 600 616 -881 352 99 -758 333 -282 -582 -67 -229
1768b29M00l00J36J159j775J92J761k362N35J628j876N68R09j305M33N47r29M52
$$ -229 171 -129 7 1166 -609 -417 1344 -1018 -483 1145 -731 -163 746 -559 -126 421 -508 -56
1786e6k80M16K28q04J046j72r05J168l27q26J142q78n9J017j203N8J315j447J43
$$ -56 -336 80 308 -496 550 378 -527 641 314 -512 630 -248 -307 710 -493 -435 880 -567 -424
1805d24R03r13K49M18o52L97j43O76m13q85J638l75j430J951o38j479J764k61
$$ -424 479 -434 -185 233 -419 -22 -165 511 98 -787 851 476 -954 997 359 -1120 644 383
1823C83j095R55m7l95K41j27M65n21l27J152r36l46J274p76k79R33p63M38J79
$$ 383 -712 243 196 -199 42 -85 380 -141 -468 684 -252 -598 676 -100 -379 554 -209 229 408
1842D08p36R67n20q36J396o35r48J294k88m87K87K47J40p70M63Q78j748M59J912
$$ 408 -328 639 119 -717 679 44 -904 390 102 -385 -98 149 289 -481 -18 860 -888 -429 1483
1861A483k160J49J774j658Q0J016q73QJ96K04k22p51Q86P14j633P78R87j562N50
$$ 1483 -677 -528 1246 -412 -332 684 -189 -181 15 219 -3 -754 132 846 -787 -9 978 -584 -34
1880c4M40o26O53n86L69O23j433Q34P09j656N34R12j401L23O25k01m36K4R93o39
$$ -34 406 -220 433 -153 216 839 -594 240 949 -707 -173 739 -662 -339 286 85 -351 -327 666 27
1900B7j249K057l32j927J973J27j746J571K11j148K90N11M2o51k89J194r89m70
$$ 27 -1222 835 503 -1424 549 676 -1070 501 712 -436 -146 365 407 -244 -533 661 -328 -798
1918g98J658o04q28J039k94n21K06j57P60m32o55J643r96q23J910n73j352R73
$$ -798 860 256 -572 467 173 -348 -142 -299 461 29 -626 1017 21 -802 1108 535 -817 156
1936A56M83j206r6O91M60j217M87J384j798J20K010k036n95K043n90q82J016j26
$$ 156 639 -567 -663 28 488 -729 -242 1142 -656 -536 1474 -562 -1157 886 296 -586 430 304
1954C04j54k87M97J52j470R54O44j100J83J038j010K30lJ51M2p27N25R51j919
$$ 304 150 -137 360 512 -958 -4 640 -460 -277 761 -249 -19 -22 129 171 -556 -31 920 -999
1973i99Q79J506k231P42R13r69m21O41M2n69m02J693n04j581K033p4j675J094
$$ -999 -120 1386 -845 -103 810 -159 -580 61 103 -466 -868 825 321 -1260 773 699 -976 118
1991A18L49j084M58N22m85j33L81M49l45q71J382p05r11J093l03k49N35k43K84
$$ 118 467 -617 -159 363 -122 -255 126 575 230 -641 741 36 -875 218 -85 -334 201 -42 242
2010B42l01n84J192n04q64J602n28j197J630k56p51O58J91k90o91K30Q04j291
$$ 242 -59 -643 549 45 -819 783 255 -942 688 432 -319 339 530 240 -451 -221 583 -708
2028g08J92J439j344j56J739j330n50J298o69k07L20Q1Q2m68K52N94j033N25N17
$$ -708 -516 923 -421 -577 1162 -168 -718 580 -89 -296 24 105 187 -281 -29 565 -468 57 574
2047E74r27J00L19r0J05n09K04P82j011J91R17j025j9J112j042j91J039m45k20
$$ 574 -353 -253 66 -24 81 -428 -224 558 -453 -262 655 -370 -389 723 -319 -510 529 84 -136
2066a36K11K44k70p50J195l20j309J204N71j393Q30K05n64K55p1nR3j45L20J08
$$ -136 75 319 49 -701 494 174 -1135 69 640 -753 77 282 -282 -27 -98 -103 -10 -155 165 273
2086B73o58O53k4k61M55p22L75L47p20M22J68r61R41L0j075J108L0j054O68K71
$$ 273 -385 268 244 -17 438 -284 91 438 -282 140 308 -653 288 318 -757 351 381 -673 -5 266
2106B66k29K02k71L75l85j28J001j080l48J481j295l03R42l25j77O96o35K54J0
$$ 266 37 239 -32 343 -42 -170 831 -249 -597 884 -411 -714 228 -97 -274 422 -213 41 51
2125E1k83O30l14k54O06p90K98N87o85J46J26m32Q24p00k48R61q36r7J203r28
$$ 51 -232 398 84 -170 436 -354 -56 531 -154 -8 118 -314 510 -190 -438 523 -313 -410 793 -135
2145a35j30O65p11M67K9r3N4l57K41K43p49N56N42j161O32M24j081R40m98j75
$$ -135 -265 400 -311 156 185 92 146 -211 30 273 -476 80 622 -539 93 517 -564 376 -122 -297
2165b97L79k66K7N42m65K44q1l30O15m67k17K94k09J72L78o80O30J7q05N11J2
$$ -297 82 -184 -157 385 -80 164 83 -247 368 -99 -316 -22 -231 -59 319 -361 269 286 -519 -8 4
2186Do56P70R5n05K41k7J72j74n8L10l73l46R85o58k02J165j021K56L58m85K5
$$ 4 -652 118 213 -292 -51 -78 94 -80 -138 172 -201 -547 438 -220 -422 743 -278 -22 336 -149 -124
2207a24M00p95M96P7l38N58p19K87L52l81J37M48o98M82k61j96Q02p37K2O79n77
$$ -124 276 -519 -23 54 -284 274 -445 -158 194 -187 -50 398 -300 182 -79 -275 527 -210 -188 491 -86
2228h6k09P92p95O4K79j35n8Q2o8N40l90j4N05r27P25O6p54O77r3n66Q03k07n02
$$ -86 -295 497 -298 -234 45 -90 -148 -66 -134 406 16 2 507 -420 305 371 -383 294 201 -365 438 231 -271
2251b71J89j04j18N08n15K11K78l61J14Q0o6M72o50K51R3n73M44L59q93P27L3
$$ -271 -82 -186 -304 204 -311 -100 178 -183 -69 11 -55 417 -233 18 111 -462 -18 341 -552 175 208
2272B08o84N59k5k51K33m2r1Nl16M82m4k15O50l66k69O60l44l47O95m06k49M36
$$ 208 -476 83 58 -193 40 -2 -93 -88 -404 78 34 -181 469 103 -166 494 150 -197 498 92 -157 279
2294B79m61K95M6o23N92k74KK69j85J70m7m54P36k30n15R19o51l03O79j64m50
$$ 279 -182 113 159 -464 128 -146 -144 125 -60 110 63 -391 345 115 -400 519 -132 -435 244 80 -370
2315c70O78m88j26L81j31P4k17L6M55o63K68N37q01L10M55o89K83J53k94L83l20
$$ -370 308 -180 -306 75 -56 18 -199 -163 292 -371 -103 434 -367 -57 398 -291 -8 145 -149 234 -86
2336h6L2J82r5k8L6l31L90J03n18L84l31J42K70m07O71O1q94N60K24r68N06M38
$$ -86 -54 128 33 5 41 -290 100 203 -315 69 -262 -120 150 -257 414 475 -419 141 365 -603 -97 341
2358C41n89M09L9k71J20k85K17J67m54N57j08o99Q88l40j87L42j29O1K40k99J33
$$ 341 -248 161 200 -71 49 -236 -19 148 -306 251 143 -556 332 -8 -195 147 18 79 319 20 153
2379A53j22l69P95k48o99P31k06j47J91n4M7l18J50L67m17j31Q34o76l35P87j86
$$ 153 31 -338 457 209 -490 241 35 -112 79 25 72 -246 -96 271 -146 -277 557 -119 -454 333 147
2400A47n35O93m15j00%M44j4n28L13L61o15j23Q14p10J68N38m63l3L1Q8K17o11
$$ 147 -388 305 -110 -210 -210 234 220 -308 5 366 -249 -372 442 -268 -100 438 -25 -58 -27 61 278 -333
2422c33L37L45p52J50N70l14j66L16L4l24j9K08o2m34O85K99j388Q25L68p84K84
$$ -333 4 349 -403 -253 317 3 -163 153 187 -137 -156 52 -10 -444 241 540 -848 -23 345 -439 -155
2443a55N69o06M0J33P2j40k75O36l14k46O00j4p16M50J71m46M05j42N0j07k72
$$ -155 414 -192 -152 -19 53 -87 -362 274 -40 -286 314 300 -416 34 205 -241 164 22 72 -35 -307
2464c07N34J8m97N31J24p38M05K1j16p2J1N9pl31Q03o91k46P92l15l91Q10k43
$$ -307 227 245 -252 279 403 -335 70 91 -25 -97 -86 -27 -34 -365 438 -253 -499 293 -22 -413 397 154
2486A54k33P6L14l13j72L78J27o28O3O62q11N0Q07m97l09L69nJ55k73K8K70l36
$$ 154 -79 -3 311 -2 -174 204 331 -297 -234 428 -383 -333 474 -23 -332 37 32 187 -86 -58 212 -124
2508a24R8M47p10K01J73l00J48J27j9J03k92K28J20o69K09P84p64J00N47r32M88
$$ -124 -26 421 -289 -88 85 -215 -67 60 41 144 -148 80 200 -469 -260 524 -240 -140 407 -525 -37
2529c7L53m08K64l51K51o2k63N28j59k86J74qj60M29k99j51L77m60J90M9l64N44
$$ -37 316 -92 172 -179 72 10 -253 275 116 -170 4 -4 -164 265 -34 -185 192 -268 -78 -29 -393 151
2551A51m6l30L45J73m19J53j06P7J74k54J53j60j72N87j79n69O38j55j71J35o4
$$ 151 105 -225 120 293 -126 27 -79 -2 172 -82 71 -89 -261 326 147 -422 216 61 -110 25 -39
2572c9k80M06M0J06j77j94L03p3k59L91k80j51M98k40P0P6m51K54J62n07O01k72
$$ -39 -319 87 127 233 56 -138 165 92 -167 224 -56 -207 291 51 121 197 -254 0 162 -345 256 -16
2594a6j52M99l15r2K43k75K60k89LJ77j17J06J54l89P3L37l88j16L87j02j08L8
$$ -16 -168 331 16 -76 167 -108 152 -137 -134 43 -74 32 186 -203 -130 207 -181 -297 90 -12 -120 -82
2616h2N9K81m23J36K69k86J11j35j20M15k26k52L37L6k12K71j35j6K27n22R5L11
$$ -82 -23 258 -165 -29 240 -46 65 -70 -190 225 -1 -253 84 120 -92 179 44 28 255 -267 -172 139
2638A39j91J41k7k17K42J9k0J41m53K84j19j60L31K5m86M69j36k8P9K3o1j7l0
$$ 139 -52 89 62 -155 87 106 86 227 -226 58 -61 -221 110 135 -351 118 -18 -46 33 56 -5 -22 -52
2661e2L28j91k56L74l33K4K50m06M30%l67J93J98n64K79L52n02K75j0r8J42rm5
$$ -52 276 85 -171 203 -130 -106 144 -262 168 168 -199 -6 192 -372 -93 259 -243 32 22 -76 66 57 12
2684A2K6j29K43k41P2L90l60Q2J55n05K08K05k36kJ28j31J26N2j47O9j74q4L54
$$ 12 38 -91 152 -89 -17 373 13 95 250 -255 -47 158 -78 -80 48 -83 43 95 -52 17 -157 -241 113
2707A13k28j8J13j44L15J9l34N04l82j13M25m45J14l4K4K9J87k66K60k51N7m4
$$ 113 -115 -133 -20 -164 151 170 -164 340 -42 -155 270 -175 -61 -95 -71 -42 145 -121 139 -112 -55 -99
2729i9n1L1L74m34K51J9m48M36K45m16K36l11J39J89k83J60j1r5K4N1l05J78q4
$$ -99 -150 -119 255 -179 72 91 -357 79 324 -92 144 -167 -28 161 -122 38 27 -68 -44 7 -298 -120 -204
2752b04K15J47j98J51L76m34lq4j57L27p1k91M70j62j43K03k10j28J78k15K03
$$ -204 11 158 -40 111 487 53 50 -34 -191 136 65 -226 244 82 -61 142 -68 -196 -18 -233 -30
2773c0R5k05K22j38j70L96n09K42L86k80o7R2q8J60j72K9J72m71J46J78j63J25
$$ -30 65 -140 82 -56 -226 170 -339 -97 289 9 -58 34 -54 106 -66 -37 135 -336 -190 -12 -175 -50
2795e0K79l52J62R5k91K31oP1J13k96O1K9n3K6K77k30l16P6K17j37J25M0J87m43
$$ -50 229 -123 39 134 -157 74 68 139 252 -44 17 46 -7 19 296 66 -250 -174 43 -94 31 71 258 -185
2819a85J78L34n22M42Pm22K15J68l67j29J91L5N0k0R4j63L8L4j72K65J37k82%
$$ -185 -7 327 -195 247 254 -168 47 215 -152 -281 -90 -55 -5 -25 69 -94 -56 -22 -194 71 208 -74 -74
2842g4L13l91L96j21o84Q37j80j37J00L9k88K64J70l55r8O3K4m3N1J89j55j05
$$ -74 239 -152 244 123 -561 276 96 -41 59 98 -190 74 244 -111 -209 -146 -122 -165 -114 75 -80 -185
2864a85K92m0l23L63j63k27K99j61L6j1LL36k60q4J76k28rL03r5j6k57K87J60
$$ -185 107 67 -256 107 -56 -283 16 -145 -109 -120 -117 219 -41 -125 51 -177 -186 117 22 6 -251 36 196
2887A96m69M40L5l67m3K56O9j30J38k89K09n3r4J77k34O7J22k14L04j48j40L28
$$ 196 -273 167 202 -165 -208 48 117 -13 125 -164 45 -8 -102 75 -159 -92 30 -184 120 -28 -168 160
2909A60J2l12J89n3J6j91K30r5J03k8k78M52m59K71O7j27p9K70qk53L5J22Kl87
$$ 160 172 -140 49 -4 12 -179 51 -44 59 31 -247 205 -254 17 84 -43 -122 148 140 -113 -78 44 46 -341
2933c41K90J08k29K72j13j37J44O1j48R1p8J10p2n7J89k71J7K66l09Q6M40l72
$$ -341 -51 57 -172 100 -13 -150 -6 55 -93 -2 -80 30 -42 -99 90 -181 -164 102 -207 -121 319 -53
2955e3K03r5J02J94n45K14J75j67j63L25m22J57J66j60L8R4q0L40l73r4L15K7
$$ -53 150 55 157 351 -194 20 195 28 -135 190 -232 -75 91 -69 -31 63 -17 323 -50 -144 171 198
2977A98k99K79k6l30L37j35Pj52L8R8j68K70p3j00K1K95n89K08J57p5J52l1n1
$$ 198 -101 178 152 -178 159 24 31 -121 -83 15 -153 117 44 -56 -35 260 -329 -121 36 -39 113 82 31
3000C1J27j87k3K35l13J59l6n7N6n0q7K96l10J82K5k10K35p3j17rJ02k57K01Q8
$$ 31 158 -29 -52 183 -130 29 -7 -64 -8 -58 -145 151 -159 23 48 -162 73 0 -117 -126 -24 -281 -80 8
3024HK3o1j7J40R9j22J36k39k15M39k29j27L30k10P5J37j52K7k4j90P3K06k57
$$ 8 31 -30 -47 93 192 70 206 -33 -248 191 -38 -165 165 -45 30 167 15 42 18 -172 -99 107 -150
3047a50J10M1j25P2J27l07K70k27J14q7M10j7j54j97Q4N3j12N1K09k56P5j5J06
$$ -150 -40 1 -124 -52 75 -232 38 -189 -75 -162 248 231 77 -120 -36 17 -95 -44 165 -91 -16 -31 75
3070G5k09J46N4j60P6k27Q1q8K24J70j51L2O8Q1l10K3J51j94L4J79oK4j13K04
$$ 75 -134 12 66 -94 -18 -245 -164 -252 -28 142 -9 23 91 172 -138 -115 36 -158 -124 55 49 73 -40 164
3094A64k00L3k24J94j04K45j15m5J63K0j95J38J40l47K74l16K75P2l11J98J17
$$ 164 -36 -3 -227 -33 -137 108 -7 -52 111 131 -64 74 214 -133 141 -175 100 172 -139 59 176
3115A76k50J70j20j17K51l13K72r5L3K6P8k14L75k40J03j18p4Q0M4O2M1l07J14
$$ 176 -74 96 -24 -141 110 -203 69 -26 7 33 111 -103 272 32 135 17 -57 23 67 129 170 -137 -23
3138b3J71n3j13J26j71k6J53p3M0KK2jj55J29J13o4m3J13m1k29L02j16p9J4k9
$$ -23 148 95 -18 108 -63 -89 64 -9 31 33 55 54 -101 28 141 77 34 147 106 -123 179 63 -16 -2 -31
3163c1J57K1k35J6J19Pp6p6N0p3N0L1m2L1P0LK9Q7j01q9J20j69J68mM4qJ8j57
$$ -31 126 147 -88 -72 47 54 -22 -98 -48 -121 -71 -40 -82 -51 19 22 51 138 37 -52 68 -101 67 63 107 99 117 -40
3191d0j32K05rKQ6jlj75J74J2k09L10O0n40K97j55M9J11J7R3l28J68oJ49L9k39
$$ -40 -172 33 24 26 112 111 108 -67 107 119 -90 220 280 -260 37 -118 -69 42 59 152 -176 -8 -14 135 174 -65
3217f5J84j41r8J03p7j29K66o2J43J8j82P4N2j08j73O0J0Q9j13K44j2P9k16l3
$$ -65 119 -22 -120 -17 -94 -223 43 -19 124 142 -40 34 86 -22 -195 -135 -125 -36 -149 95 83 162 -54 -87
3241h7K8K33k23J88j12J87k57Q3o4J08q7P7k4k51MO1%J23k02O7O3K6l0j38J51
$$ -87 -59 174 -49 139 27 214 -43 40 -24 84 -3 74 50 -201 -197 -136 -136 -13 -215 -148 -85 -59 -89 -227 -76
3266g6J12j9l3M3o1J16j0K9k41J95j2j1j39K43l2k88K59j42J31l9n3l4J35M5m3
$$ -76 36 17 -16 27 -34 82 72 101 -140 55 43 32 -107 136 104 -184 75 -67 64 25 -28 -62 73 118 75
3291G5p8M9k8J4N1j61L00k36Q4m9p1R2K4k8r9J14j11q2N3K87j05j82J51K04l98
$$ 75 -3 46 18 32 83 -78 222 -14 70 21 -50 42 66 38 -61 53 -58 -140 -87 200 95 -87 64 268 -130
3316a30M5l6J32P8j8j80Q1m3nP%K99l00L1J49Lj25O0r8J96k20K47j85L2O8N9m3
$$ -130 -85 -121 11 89 71 -109 -28 -71 -76 -69 -69 230 -70 -39 110 113 -12 48 -50 146 -74 173 -12 20 88 147 104
3343A04j54K5Kl1R3j64J25o2K17n7k10r4K81k93J01J74K8k24K80j59K5K17l75
$$ 104 -50 -25 -23 -54 39 -125 0 -62 155 98 -112 -206 75 -218 -117 57 85 -139 141 -18 7 224 -151
3366a51J7Q1J64q1N9j99K29j09r5L7j71Q8K57q2J0j35P5J8r8J00jL7j56J41Rj78
$$ -151 -134 -53 111 30 89 -110 119 10 -85 -48 -219 -131 126 44 54 -81 -6 12 -86 14 13 50 -106 35 44 -134
3392a34J63k04K00K1k61L5J89j23K67N8k52L6l1K3k81J56J18P4P6l8j47J27J33
$$ -134 29 -175 25 46 -215 -180 9 -114 153 211 -41 -5 -36 -13 -294 -138 -20 54 130 92 -55 72 205
3415B05k41L2kj7J3k0k43L80j39j61O1N1J7J80k2j76m0j3J83J4k15N2n8M4P8P4
$$ 205 -36 -4 -6 -23 -10 -30 -273 107 -32 -193 -132 -81 -64 116 94 -82 -122 -135 48 62 -153 -101 -159 -115 -37 37
3441C7J32M8l03MK8o8q7K62L4p7Qk13J50oJ88l4o3J02k12L9R2N0j79K76j84J71
$$ 37 169 217 -86 -82 -54 -122 -209 53 87 10 18 -195 -45 -51 137 103 40 142 -70 -31 61 111 -68 208 24 195
3467A95l3l75L31j18Rm4l0J1q2JJ09J5r9m7M57m25m7J26rM7o7JK31m1j13L2R0
$$ 195 162 -213 118 0 9 -35 -65 -54 -136 -135 -26 -11 -110 -157 300 -125 -172 -46 -55 -8 -75 -74 157 116 3 35 125
3494A25m3k1j07m1k0J07nj35L45K9j88o2K5q0K15q0k05J53R6q9j39J73l22R2K20
$$ 125 82 61 -46 -87 -107 0 -5 -140 205 234 46 -16 9 -71 144 64 -141 12 108 19 -120 53 -269 -177 43
3519D3J44j19l8Q6k1qj08K6k74J89J56L0j42P1j20K28q1R3k28J62L2j8%k03o8
$$ 43 187 68 30 116 95 87 -21 5 -269 -80 76 106 -36 35 -85 143 62 155 -73 89 121 103 103 -100 -168
3544a68K35j2l6ln4o4L3j21K11K2j06N5r0K4J43j86J58LJ30k36P7K2l4m2L7J03
$$ -168 67 55 19 16 -38 -102 -69 -190 21 43 -63 -8 -98 -74 69 -117 41 44 174 -62 15 37 3 -39 -2 101
3570A01M4k25J08n3o1K13m3j5p1l1j57K71j55K52j97j37L58k63j5JkM4J99p6J
$$ 101 145 -80 28 -25 -86 127 84 69 -2 -33 -190 81 -74 178 -19 -156 202 -61 -76 -75 -77 -33 166 90 91
3595I1oM1m6J32j98j64J20l7J1k4j3J01J51j11L0K5j08J94L9l06K8NK60m05J39
$$ 91 85 126 80 212 14 -150 -30 -67 -56 -80 -93 8 159 48 78 103 -5 189 228 -78 -50 -45 215 -190 -51
3620e1j7N1J28k59M8J18K9R6n6o9J0O7q8J04l5Q1j23j82P3Q9m8j69J80p2J41k59
$$ -51 -68 -17 111 -148 -100 18 47 143 87 18 28 95 7 111 76 157 34 -148 -75 14 -34 -203 -23 -95 46 -213
3646b13J20K20j01k67K60j96J19P2j59J00R8J28L9k35R8k0J39k90K33j07q1Q7
$$ -213 -93 127 26 -241 19 -177 -58 14 -145 -45 53 181 220 -15 83 63 202 -88 145 38 -43 44
3668D4j15N2K1LJ21q7k05R8o1JK47L1j71n0n9K35j09J24j29r5K43o1p9J69k76
$$ 44 -71 -19 2 5 126 39 -166 -68 -129 -128 119 150 -21 -71 -130 105 -4 120 -9 -104 139 78 -1 168 -108
3693a08K08P6p0M7j36j9Q1k18M0K45m8q0j08K62j9j06k12J33O1l0J04P6r5o9O7
$$ -108 100 176 106 153 17 -2 79 -139 -99 146 98 18 -90 172 153 47 -165 -32 29 -1 103 179 84 15 82
3718H2m3M03n22l5J13J36k55J25j6Q0p7j4o6N5M9l0J29j75l6J46M3k54K95k64
$$ 82 39 442 -80 -115 -2 134 -121 4 -12 68 -9 -23 -89 -34 15 -15 114 -61 -97 49 92 -162 133 -131
3742a31J35r5L8k3j46L03j01p9l2J3K8J31p8J42N7L6j26n7pO8l85L36L7k42L23
$$ -131 4 -91 -53 -76 -222 81 -20 -99 -131 -118 -90 41 -37 105 162 198 72 15 8 76 -309 27 64 -178 145
3767A45j2j41j04K59o8k01J27p7Q5j06K44k04k8J69j1l78K06K18l29L73j03k25
$$ 145 133 -8 -112 147 79 -122 5 -72 13 -93 151 -53 -81 88 77 -301 -95 123 -206 167 64 -161
3789a61K19k76K75k13lJ21j33M38k05p6j13K67j21O6K1j33R3Pj09N0r1J5K16q4
$$ -161 58 -218 57 -156 -159 -38 -171 267 62 -14 -127 140 19 85 106 -27 66 73 -36 14 -77 -62 154 70
3813G0r0k9j14J75J4P0r9J03k86M70k40J10k16K6j27M4O0NQ2k16K19m5j17J3L6
$$ 70 -20 -49 -163 12 26 96 -3 100 -186 284 44 154 -62 -36 -163 -119 -59 -54 28 -188 31 -14 -131 -118 -82
3838h2K51j03j80Q1n8p1J43O3N9jl8J92l83LQ9J45l11L70J17m13P7K1J8J14j71
$$ -82 169 66 -114 -33 -91 -162 -19 44 103 102 64 256 -127 -124 -35 110 -201 169 286 -127 -50 -29 -11 103 -68
3863f8lJ46j78J25j0r8k6n4K37n0J74j68K8M6j20K85k73L7j07J12OJ1l0j3j4k10
$$ -68 -71 75 -103 22 12 -86 -112 -166 71 21 195 27 55 101 -19 266 -7 30 -77 35 41 52 22 9 -5 -215
3889b15J02PJ80K7k12n3O3L59k63j36J47n1L9j66J01k24M09k29k8O3J20J94l07
$$ -215 -113 -106 74 101 -111 -164 -101 258 -5 -141 6 -45 -6 -172 -71 -295 114 -115 -143 -80 40 234 -73
3912g3l9j08L64n8j37r9K2Q4J81j95o3J36q3K45k93J45j51O5J38j98J20k5l0M6
$$ -73 -112 -220 144 86 -51 -150 -128 -44 137 -58 -121 15 -68 177 -116 29 -122 -57 81 -117 3 -22 -52 -6
3936fR6j20J37j93q8K01J7M5L3l34K41k25K65j05M6r9K7K81j07r0n4j4K30p6k93
$$ -6 90 -30 107 -86 -174 27 44 89 122 -212 29 -196 69 -36 10 -89 -62 219 112 22 -32 -46 184 108 -185
3961a85J35j11K64K2j55J28j06j34M64o20K45o0K67k74J34jjk8j22K48j76J82
$$ -185 -50 -161 103 125 -30 98 -8 -142 322 -298 -53 -113 154 -120 14 13 12 -16 -138 110 -66 116
3983A16l9j26n8o5J12j5K00k63j63L43q2L1j0o8M01k23j61m7J13j7J08mj85J14
$$ 116 77 -49 -107 -172 -60 -75 125 -138 -301 42 -40 -9 -19 -87 314 91 -70 -117 -4 -21 87 83 -102 12
4007A2q5J92j10J39q1r7J29j43K00L0j36l4K5k8r3O4j9N7j0k37J43R7K79k64J74
$$ 12 -73 119 9 148 67 -30 99 -44 156 186 50 16 41 13 -80 -16 -35 22 12 -225 -82 15 294 30 204
4032B04j84nl8j7j46P6K33k40R7k9m7K13K8k18L4j50K80k8P9j92J91j85k8J79
$$ 204 20 15 -23 -40 -186 -110 123 -117 -20 -49 -96 117 145 -73 -39 -189 91 63 142 -50 141 -44 -72 107
4056A07n1o6K2j97O6K47j40j05Q5K97k89j09k42M27j6m7p6j29J96K11j24k39J34
$$ 107 56 -10 12 -185 -119 128 -12 -117 -32 265 -24 -133 -375 52 36 -11 -87 -216 -20 191 67 -172 -38
4079c8J20k45J69r8J88j53K6O0j95L09j26L8j13L4p2K04k11J55j07J94k57R5J51
$$ -38 82 -163 6 -92 96 -57 -31 29 -166 143 17 55 -58 -24 -96 108 -103 52 -55 139 -118 -23 128
4102A28q1Lj39k4l8K87K8l43J61j5J8N8m4rj21J74P7N7k29j78N7J92k5Nj01K48
$$ 128 47 50 -89 -113 -151 136 164 -179 -18 -33 -15 43 -1 -10 -131 43 120 177 -52 -230 -173 19 -6 -1 -102 146
4128A46J5j74j34J64P2j7l7j54K62kK8k15j58J80P5q0J2J50j71oP9l4M0J5j37
$$ 146 161 -13 -147 17 89 72 35 -119 143 141 169 -46 -204 -24 51 -29 -17 133 -38 -44 35 1 41 56 -81
4153h1Q3N4J58m18J12J4L04q5l00p6L86j32k2n0K1oKL9J7j21nr6J89l1m7P8j13
$$ -81 2 56 214 -204 -92 -78 226 141 -159 -235 151 19 -3 -53 -32 -38 -36 3 20 -101 -106 -202 -13 -44 -91 -13 -126
4180a26J73q4Q4O2k27L14k3k11K82k53j1p4o1J06K90l18J64n2k81R0L16k54j4
$$ -126 47 -37 47 109 -118 196 173 -38 244 -9 -20 -94 -155 -49 241 -77 87 35 -246 -156 160 -94 -108
4203a08P9Poj0O5J9K9K4k7L7j63j5R3l0r0J49q2R1Nj21P5N0k0j89K59l23K00M8
$$ -108 -29 -22 -28 -38 27 46 75 99 72 109 -54 -69 24 -6 -96 53 -29 62 67 -54 21 71 51 -138 121 -202 -2 46
4231D6j45J78p1R0j26K27j84L4j24M1M4Lj69P9o7K63k53j26K72R8k12R2l1J28
$$ 46 -99 79 8 98 -28 199 15 49 -75 -34 10 13 -156 -77 -144 119 -134 -260 12 110 -102 -10 -41 87
4255H7RJ27j00o6J11k14L9j53J02K1O0pj16K00K23m90J25Jn0J65k3k18J27l5O3
$$ 87 96 223 123 57 168 -46 -7 -160 -58 -37 23 16 -100 100 323 -167 -42 -41 -91 74 51 -167 -40 -75 -12
4280a2j34L51j39j11j23L42n1k00N6J04j78q3J32J73N6j24J47j08k58P3J87k35
$$ -12 -146 205 66 -45 -168 174 123 -77 -21 83 -95 -178 -46 127 183 59 206 98 -160 -87 100 -135
4302a35J75Kk5J22j47j58R4j14J99k6j02J63k05K04j15L27k30J07k12N5L6q5k7
$$ -135 40 42 17 139 -8 -166 -72 -186 13 -13 -115 48 -157 47 -68 259 29 136 -76 -21 15 -70 -97
4325i7P4L7n6P9O1p2J13k03n2K46R4k88K34k47J10n9J26k28J8J62k16J96j52J99
$$ -97 -23 14 -42 37 98 26 139 -64 -116 130 224 -64 170 -77 33 -26 100 -128 -110 52 -164 32 -120 79
4349G9r7K8M2L0m1j36J37q4k5R2J5Rq0j71J97j6p5J33LM6k43KJ4J79j01j16L54
$$ 79 -18 10 52 82 41 -95 42 -42 -67 25 40 49 -31 -202 -5 -21 -96 37 40 86 -157 -155 -141 38 -63 -179 175
4376A75Pr4M3k19K34k2j35N5r6K38k2j08j37J19jP9j74N4j85Q2K74j50J38j53
$$ 175 182 88 131 -88 146 124 -11 44 -52 186 164 56 -81 38 37 116 -58 -4 -189 -107 167 17 155 2
4400Bm0j66K21P9pj17P0n4Q5j6J1p4mpJ19k5L4RPk59M5J03j6%J14j40J37j32j
$$ 2 -38 -204 17 96 89 -28 42 -12 73 57 68 -6 -10 -17 102 77 111 120 127 -132 -87 16 0 0 114 -26 111 -21 -22
4429b2j59R0J62j90K42m7K8j75kOK4p5L03j92k43N39k43r2Q4j47N0J97r3J55j45
$$ -22 -181 -91 71 -119 123 76 104 -71 -73 -67 -43 -118 185 -7 -250 289 46 -46 38 -109 -59 138 45 200 55
4454E5j17K20r5j64N0j22J99j05J23K7l15L28j1l6l9J00j40nK50k02P5M3N2n8
$$ 55 -62 158 63 -101 -51 -173 26 -79 44 71 -244 84 73 37 -2 98 -42 -47 203 1 76 119 171 113
4478A13j22o9K37j41J73j98n7J34%j30kJ89k13N2K74l26O7J21k62J66L7j11N8
$$ 113 -9 -78 159 18 191 -7 -64 70 70 -60 -62 127 -86 -34 240 -86 -19 102 -160 6 43 -68 -10
4501a0n8J79R3m7k12J12J22k25J27mo3P7o2q6J36j14j04R8M1l2M3J35j27j50K38
$$ -10 -68 111 204 157 -55 57 179 -46 81 77 14 91 29 -57 79 -35 -139 -41 0 -32 11 146 19 -131 107
4526A07q4q7r5J40J30m5J9j53J23J9m8j03l9n2Q3J1R3j82J71M1l1j03j18N00k86
$$ 107 23 -64 -159 -19 111 66 85 -68 55 74 26 -77 -116 -168 -85 -74 19 -163 8 49 18 -85 -203 297 11
4551A1j40J40r7J00j15K12k46k0J06J93q6L2p1j61K23jr4k64J98O4J40l5k28K20
$$ 11 -129 11 -86 14 -101 111 -135 -155 -49 144 58 90 19 -142 81 80 -14 -278 -80 -16 124 89 -139 81
4575H1k6Pj26l6lQ1j8l5K10k7P7r1j99J67j13N1j42K92jj51R2n7k6n5l4N2K48
$$ 81 55 62 -64 -100 -103 -22 -40 -75 135 108 185 94 -105 62 -51 0 -142 150 149 -2 90 33 7 -48 -82 -30 218
4602B18o2k24Q5P5j29k7l0j9l3J80k02L28j86kr1l7J92M7k00K47j97n4J72j08
$$ 218 156 -68 17 92 -37 -64 -94 -113 -146 34 -168 160 -26 -28 -119 -156 36 83 -117 130 -67 -121 51 -57
4626e7j09Q6N3m6J40r9q8J09p3PK73j90J52j23Rr7P4N6O2j94l7J47L1o7l1N3j58
$$ -57 -166 -80 -27 -73 67 -32 -120 -11 -84 -77 196 6 158 35 44 -53 21 77 139 -55 -92 55 86 19 -12 41 -117
4653a17r7J31J62j25L8J19Pq6l18L20J06j02q0m8R7L3l7q9K40k34qR3j37J66r8
$$ -117 -214 -83 79 -46 -8 111 118 32 -286 34 140 38 -42 -90 7 40 3 -86 154 -80 -88 5 -132 34 -64
4678f4M8K3Q1k34J38K01l00J88J7j39K3j7L8k0j48J07J6K04j06q3J1M8p0m1j08
$$ -64 -16 7 88 -146 -8 193 -107 81 98 -41 -18 -35 3 -17 -165 -58 -42 162 56 -27 -16 32 -38 -79 -187
4703a87K23k55K10l2J33r7M8O9l12L3MoK24r0K3K10k80L6r1K08l1k41K89j83J87
$$ -187 36 -219 -9 -41 92 -5 43 112 -200 -167 -163 -169 55 -35 -12 198 -82 -46 -137 71 40 -201 88 -95 92
4728I2l3k16J64k70L40j34K3l2K5K63n78L16K3mJ07j60L27j64m25M79r0J1J2j2
$$ 92 59 -157 7 -263 77 -57 -34 -66 -41 222 -356 -40 -17 -21 86 -74 253 89 -336 143 53 64 76 64
4752F4j05k7O8J5mJ48j76l7L83l58J30o2r5J72j47M8m4Q3k45L03j24L6n0l29K90
$$ 64 -41 -68 0 15 11 159 -17 -54 329 -29 101 39 -56 116 -31 17 -27 56 -189 114 -10 26 -24 -353 -63
4777f3J50j17J36j59pJ86M3j89Rj8P3J17k44j32J40K04k93K02j34L61l89p3L23
$$ -63 87 -30 106 -53 -60 126 169 -20 -11 -29 44 161 -83 -215 -75 129 -164 38 -96 265 -124 -197 126
4800A26M0p7j89O4L9J01o0k72M74j10j58j11J90Rk87L23j73J39j6J59M7p5k06
$$ 126 166 89 -100 -36 3 104 44 -228 246 136 -22 -133 57 66 -221 102 -71 68 52 211 258 183 -23
4823b3j29Q9L2O8p0j28K54r5J1j45K15j64OK72j11o2k11J80l4p7l6j11L45k20
$$ -23 -152 -63 -31 37 -33 -161 93 -2 9 -136 79 -85 -79 193 82 20 -191 -11 -45 -122 -158 -269 76 -144
4847a44O4R1R2k69J96K47k17n2j54J03J58J3j09k18O5J84o2l41N35j85J17j07
$$ -144 -80 11 103 -166 30 277 60 8 -146 -43 115 128 19 -199 -134 50 -12 -353 182 -3 114 7
4869Gj03K28r0l09L35m1k1N8j39O2J14j86K2K02J26k12l9j42oL38l24K44p8j45
$$ 7 -96 132 42 -267 68 27 6 64 -75 -13 101 -85 -63 139 265 53 14 -128 -134 204 -120 124 46 -99
4893i9L49k65O3q1P6p9R4k8Kj01K45J01k99r2l7K43k54J55j7rj30J66J02k75n3
$$ -99 250 -15 48 -33 43 -36 58 30 32 -69 176 277 -22 -114 -151 92 -162 -7 -24 -33 -163 3 105 -170 -223
4918b23L47j70K11j99n6J16o6J74p5j8jJ12k08j3j26L17l68M68l06n1Q7M0K38
$$ -223 124 -46 165 -34 -90 26 -40 134 59 41 40 152 -56 -69 -195 122 -246 222 -84 -135 -48 -8 230
4941B30j80oj49j51L25r4J80q3J00m36L28k01J80K8j70M61m77j20J65K24k41j0
$$ 230 50 44 -105 -256 69 -25 155 72 172 -264 64 -137 43 71 -99 362 -115 -235 -70 154 -87 -97
4963i7J08qp1J42j75K5J28k77j96L26q6K70k3j32J93j5j27j43J03O4J0j02jL76
$$ -97 11 3 -68 74 -101 -76 52 -225 -421 -95 -181 89 66 -66 127 112 -15 -158 -55 9 19 -83 -84 292
4987B92k09ll07J51K43l87N15l18N7k2Lj29R3j51L37j66K03j11L8J0k71P7k7J83
$$ 292 83 80 -227 -76 167 -220 295 -23 34 12 15 -114 -21 -172 165 -1 202 91 129 139 -132 -55 -82 101
5011A01L7k97J50N9O8j12Q8j70nJ09J2r4m5P3Q7n6m3j94L63k38J26J40j90j6R7
$$ 101 138 -159 -9 50 118 6 94 -76 -81 28 40 -54 -99 -26 61 5 -38 -232 131 -107 19 159 -31 -47 50
5036E0l8N3k50J57J95j06j17K02J27k47q2J27R2O8l97K67j50j11N7J42p1Q6M8
$$ 50 12 65 -185 -28 167 61 -56 146 273 26 -56 71 163 231 -166 101 -49 -160 -103 39 -32 54 102
5059A02M7k7k04p7J35mJ6K9r5O9j45J26J21j54R5O3n0p1j66Q6n6J77j05M00m01
$$ 102 149 122 -82 -159 -24 -28 -12 17 -78 -9 -154 -28 93 -61 34 97 47 -24 -190 -104 -160 17 -88 312 -89
5084h9J79k49r2J34J90k07N1j2k9J16j9j3Q8j10PJ23J28p2o7j20K5k7M0j0n3K9
$$ -89 90 -159 -251 -117 73 -134 -83 -95 -124 -8 -27 -40 48 -62 -55 68 196 124 57 -63 -38 -65 -25 -35 -88 -59
5110e9J00N1r6M9J37j4j31j87L19k8j85r2R9K30m23k8K44K14k05rj58K36k6r4
$$ -59 41 92 -4 45 182 168 37 -150 169 141 -44 -136 -37 193 -230 -258 -14 200 -5 -14 -172 64 38 -56
5134e6P1J79k23mj10k8K69m4mj38PL4K8O1o6r0Q9J08J74l81Q2J82j51o5J47K6
$$ -56 15 194 -29 -33 -143 -171 98 54 50 -88 -81 -47 -19 42 -24 -114 -25 83 257 -124 -42 140 -11 -76 71 97
5160I7R7k99L72j98k13J34L7J43j17q8j59K39nn7P8k08M9j1k9J99k07K44j15P
$$ 97 194 -105 267 69 -144 -10 27 170 53 -35 -194 45 40 -17 61 -147 -98 -109 -138 61 -146 98 -17 -10
5184a0m7K6J46j56MJ96j47J9P6j88o0J62j0k4K6N8k36J29j41P9K5K5J51P4k35
$$ -10 -57 -31 115 -41 -37 159 12 31 107 -81 -141 21 11 -13 13 71 -165 -36 -177 -98 -73 -48 103 177 -58
5209e8J25j40j31M23j92l2M0L1j20j39J21J12p3k50M19j18r4J98k26L9j56J19
$$ -58 67 -73 -204 219 27 -5 35 66 -54 -193 -72 40 -33 -283 136 18 -76 122 -104 -65 -221 -102
5231a02M4k89K29N9M1J53j68M4j38J87K04j58K6J56l78N2J91l78P0Q5j6J9j80
$$ -102 -58 -347 -118 -59 -18 135 -33 11 -127 60 264 106 132 288 -90 -38 153 -225 -155 -70 -86 -67 -247
5254b47L93j73J44q1j87K12r3k6N4J02j92J49j46N6N9o3j5nj20lK58M9j45K34
$$ -247 146 -27 117 36 -151 61 -32 -58 -4 98 -94 55 -91 -35 24 -39 -54 -59 -179 -182 76 125 -20 214
5278B14j79m5J31J51k80o8K09j91K18j68mM3P6j65R1k4j51L22k15M4q9L50k25
$$ 214 35 -10 121 272 -8 -76 133 -58 160 -8 -12 31 107 -58 33 9 -142 180 -35 9 -80 270 45
5301D5pl1j3N7j36J67j51pJ74j58j56J94k57M18k1k09K72j9M8k94n0J72K8r3l4
$$ 45 38 7 -6 51 -85 82 -69 -76 98 -60 -216 -22 -279 139 118 -91 181 162 210 -84 -134 38 66 -27 -61
5326f1K01k65m3L60l67J13J20j98l2O6Q4K5j09K35l2m0j1j41J59K1j17J88j00
$$ -61 140 -125 -168 192 -175 -62 58 -140 -172 -106 -22 3 -106 129 97 57 46 -95 64 85 -32 156 56
5349E6j16Q6q6J03j7N2j08n9J23J17p2j86k01M13k33J49o3J41j61J57l54M16o1
$$ 56 -60 26 -60 43 26 78 -30 -89 34 151 79 -107 -308 105 -128 21 -42 99 -62 95 -259 157 96
5372I6j38l9J09q4K35k56j24J60Lj7q7K23p6J38l8Qp1k0n3k63M24O5J24j20k80
$$ 96 -42 -81 28 -56 179 -77 -201 -41 -38 -55 -142 81 5 143 105 113 42 22 -31 -294 130 195 319 199 -81
5397h1J26L3k86J92L2o5Q1j56J85N7J43k14j12q1J53K49k59K82l90q0J43R4M9
$$ -81 45 78 -208 -16 16 -49 32 -124 61 118 261 47 -65 -146 7 256 -3 279 -111 -191 -48 46 95
5420I5M2k6m17K06J46j1J0M6k3J79l49K87l69J18K6q5J38P1%k32M06j99K7j0j25
$$ 95 137 111 -306 -100 46 35 45 91 68 247 -102 185 -184 -66 -40 -125 13 84 84 -148 258 59 86 76 -49
5445d9J73Oj35K68k48L1J35j94j26J75j00K9j19q4L31o6K5l9k1p7K62q6k23R1
$$ -49 124 130 -5 263 15 46 181 -13 -139 36 -64 -35 -154 -238 93 27 52 13 -8 -85 177 91 -132 -41
5469d1O6O5l9q7O1J17j35N4Q6k47J27n2j18K68j17M3j68J92m9o2J26k00J92m6
$$ -41 25 90 51 -36 25 142 7 61 147 -100 27 -25 -143 125 8 51 -117 75 26 -36 90 -110 82 36
5493C6R1j74J9n1L12j40K6m5r0lJ60m2k50K82k76n8L3K06q4m0J0J10K1Qrj23K28
$$ 36 127 -47 -28 -79 233 93 119 74 -16 -19 141 99 -151 131 -145 -203 -170 36 -48 -88 -78 32 53 61 52 -71 157
5520A57j54k9J36N9j76K07r2k00O4p3N8k4k3J48k28K36P1j61j22L70k51j9L2j51
$$ 157 3 -26 110 169 -7 200 108 -92 -28 -101 -43 -67 -90 58 -170 66 137 -24 -146 224 -27 -46 -14 -165
5544a65J3j7%K04r2o5J34j38P1O6J63j57L9Ok89K84k01K18j91j9M1j16K10k11
$$ -165 -152 -169 -169 35 -57 -122 12 -126 -55 11 174 17 56 62 -227 57 -144 74 -117 -136 -95 -211 -1 -212
5568b12J09n3J66J24j27j27K9N3r3m8o7K43Q9p8J9l2O7k54M5J34r1O1Q6l1M6k1
$$ -212 -103 -156 10 134 7 -120 -91 -38 -131 -179 -246 -3 86 8 27 -5 62 -192 -147 -13 -104 -43 43 12 58 37
5594C7j73j0j87J96K38k02K0J75j29N7j6k06L07j3l40M58k21m2K0J08j48K94l06
$$ 37 -136 -146 -333 -137 101 -101 -81 94 -35 22 6 -200 107 94 -246 212 -9 -51 -31 77 -71 223 -83
5617h3m4J74P4K0n2j57N4N8l35J78J22j73m9k7K09j1j9P0m2lO3O3kj05j22J60
$$ -83 -127 47 121 141 89 -68 -14 44 -291 -113 9 -164 -213 -240 -31 -42 -61 9 -33 -36 27 90 88 -17 -139 21
5643B1n9p0m4J94n9K4N5j29RJ12k16K11l4J28j1j14K7rm5j19j4J83Om4q6J42n7
$$ 21 -38 -108 -152 42 -17 7 62 -67 -58 54 -162 49 15 143 132 18 45 36 -9 -128 -142 41 47 3 -83 59 2
5670Bm1nN3lKj00P7p9J18p6P8j71k2K72M2l36J06O7K6p4k38K18J35K8l5k4r1J44
$$ 2 -39 -44 9 6 8 -92 -15 -94 24 -52 26 -145 -167 105 147 -189 -83 -16 10 -64 -302 -84 51 79 44 20 -71 73
5698G3L9q9j09J49j89J12j18K22pj11J24r8j7k3JK5K69p5j19l8K0k16p6J74K54
$$ 73 112 23 -86 63 -126 -14 -132 90 83 -28 96 -2 -19 -42 -41 -16 253 178 59 21 41 -175 -251 -77 177
5723A77j66p7K39j31j70n4L34q8j87J30Nj12j23K11j70M4J97j2Q3j39o8K99k7
$$ 177 11 -66 173 42 -128 -182 152 64 -123 7 12 -100 -223 -12 -182 -138 59 47 130 -9 -77 222 195
5746A95k23K54r3q9J08r8M7Nq3R3o9m1n8P1p5l0J14n2J02j4K0o7N7M4k07n2j3
$$ 195 -28 226 133 44 152 54 101 106 23 116 47 6 -52 19 -56 -86 28 -24 78 64 84 17 74 118 -89 -141 -154
5773a54Q8N2n4K02j65O3p1P4r5p4L98k35j09q2L87k76j50L70k19k9M0m7J02J1
$$ -154 -66 -14 -68 134 -31 32 -39 35 -60 -134 264 29 -80 -162 225 -51 -201 169 -50 -79 -39 -86 16 27
5797B7k11K15j06O0J35k43J18j45J22J22r6J72k35j65K23J22l85J63N0j23K11
$$ 27 -184 31 -75 -15 120 -123 -5 -150 -28 94 -2 170 -65 -230 -7 115 -270 -107 -57 -180 31
5818C1J04l2r9l2k07L93p1j67k3qK24o4l9J0j22K03k37J10m0r5N2J67Nn5J00j12
$$ 31 135 103 4 -28 -235 158 87 -80 -103 -111 113 49 10 20 -102 101 -136 -26 -66 -161 -109 58 63 8 108 -4
5844dJ43j20j8M9p4J12j59j5J16l4Q8j52K1Nn2q4J83m8M9j69J34K26j91R4j46
$$ -4 139 19 1 50 -24 88 -71 -86 30 -4 84 -68 -47 -42 -94 -178 5 -43 6 -163 -29 197 6 100 -46
5869d6J16k19N1L31k07L5r5J80q9O1j36j45K84j37n0j47K14N7r8k59K79o7QK42
$$ -46 70 -149 -98 233 26 61 -34 146 57 118 -18 -163 121 -16 -66 -213 1 58 -40 -299 -20 -87 -79 163
5893A63m23K41J76k9k77L04l67J77J99j57j35J37j51L3OQ9Q6j27N8Q5p0O8j88
$$ 163 -260 -19 157 128 -149 155 -212 -35 164 7 -128 9 -142 -109 -103 -14 72 -55 3 88 18 86 -102
5916a02R3j4N3L8j63J11N9r5N8O6M2j69j14J63k48J66J13o5J25k19N9J14Lr2K41
$$ -102 -9 -23 30 68 -95 16 75 -20 38 104 146 -23 -137 26 -222 -56 57 -8 117 -102 -43 71 74 -18 223
5941B23k56K36l20L8l1K69k46J8j9N6J75l43K00j96K01K3R9J67k81m7J59J48j31
$$ 223 -33 203 -117 -79 -110 159 -87 -69 -88 -32 143 -200 0 -196 5 28 127 294 13 -34 125 273 142
5964A42j58n9l06O55k72p9J16j27J44j19j0j97L11Mm2L9r9P1k59J58J86k29J28
$$ 142 -16 -75 -381 274 2 -77 39 -88 56 -63 -73 -270 41 45 3 42 -57 14 -245 -87 99 -130 -2
5987bN7j60N4J52q6R5j27K3m9J41J6Mk34P5j05N9k28M08j40o1L6j9J58q2J14k05
$$ -2 55 -105 -51 101 15 110 -17 6 -43 98 114 118 -116 -41 -146 -87 -315 93 -47 -108 -72 -91 67 -15 99 -106
6013a06PJ65j32M5J56l23L85r3q8k39K74J10j31nLJ8p2MJ86k72m8K53K3L1j24
$$ -106 -99 66 -66 -21 135 -188 197 104 16 -223 51 161 30 25 28 46 -26 -22 164 -108 -156 97 120 151 27
6038B7r4N4m3M4Q7L1j6j83k3J47J96k79K55j82Q0l2o5j26pJ51j24M8N1L8QjK25
$$ 27 -67 -13 -56 -12 75 106 90 -93 -116 31 227 -52 203 21 101 69 4 -122 -129 22 -102 -54 -3 35 43 42 267
6065B67p7k97kJ45n0M9J36j33m2k3K02l60K19R1j95J75j10K9j04O5K71j33j63
$$ 267 190 -107 -109 36 -14 35 171 38 -4 -27 175 -185 34 125 -70 105 -5 24 -80 -15 256 123 -40
6088d0J6j8n8J35R3j1k11o5K73o0J05j86J32q2j64K18j37J6n5J20p6N9O0n8j9
$$ -40 -24 -42 -100 35 128 117 -94 -159 114 54 159 -27 105 23 -141 77 -60 -44 -99 21 -55 4 64 6 -13
6113a3q7p7J38K01k29J09j7J34k76J56r1N4J08J8k64K52o2lj7K5m5J6j7r4PP6
$$ -13 -100 -177 -39 162 -67 42 25 159 -117 39 -52 2 110 128 -136 116 54 51 34 59 14 30 13 -81 -74 2
6139Bk0J5J6m5r2J6k88K81J06j00J80p3J29k49K45j26O5n4k14J33J48k85J93j19
$$ 2 -18 -3 13 -32 -124 -108 -396 -115 -9 -109 71 -2 127 -122 123 -3 62 8 -206 -73 75 -210 -17 -136
6163a36J70k2o4R6L63n07R2L9j52L15l03J71k5l8N8j10j46O7L6j5J29k8k02J62
$$ -136 34 12 -52 44 407 -100 -8 31 -121 194 -109 62 37 -1 57 -53 -199 -132 -96 -111 18 -10 -212 -50
6187e0r0P3R0j98K32q6J33j37P4Ok13Q6J56p1p1P2k08K71J7j63J31J38j10L1J10
$$ -50 -140 -67 23 -175 57 -29 104 -33 41 47 -166 -80 76 5 -66 6 -202 69 86 -77 54 192 82 113 223
6212B23k47J3m8M4J4P4Jo5p7N3o7J99rl16J37PK19j25P3j42l19M18N8p5J40j10
$$ 223 -24 -11 -59 -15 -1 73 74 9 -68 -15 -82 117 108 -208 -71 -64 155 30 103 -39 -358 60 118 43 183 73
6238G3q3Q5j1J05k93K11O2j35J40j8m3k45K9Q9Qj9J74k7l37J38R0m4kJ32o3l3
$$ 73 -10 75 64 169 -124 87 149 14 154 136 93 -152 -123 -34 -26 -45 129 102 -235 -97 -7 -51 -53 79 16 -17
6264a7J51j28j81J25L4p0J72k37Q1L44n00K32o7k7J43q4J09n4l0o9M9j88L86j09
$$ -17 134 6 -175 -50 -16 -86 86 -151 -70 274 -226 6 -61 -88 55 -29 80 26 -4 -73 -24 -212 174 65
6288F5j58k1J12N2J60k78J9l8j3n3J4J00J45o1J20k56j23K99j55n2J75Jj6m3J9
$$ 65 -93 -114 -2 50 210 -68 -49 -87 -100 -153 -139 -39 106 45 165 -91 -214 85 -70 -122 53 54 38 -5 14
6313A4N7nj21r2J05L19j80j65J79M0k14j63L14j97L9j09J96K05r0l00J81J14q4
$$ 14 71 66 -55 -147 -42 277 97 -68 111 151 -63 -226 88 -109 -70 -179 17 222 132 -168 13 127 43
6336D3k83L06R2o4M9j07j75q0J64J76l66R1L9J42L5r9m8P1o2KL7k8J15%j05L4
$$ 43 -240 66 158 94 143 36 -139 -219 -55 121 -245 -154 -115 27 62 -37 -85 -14 -76 -74 -37 -65 50 50 -55 -21
6362b1r0L54l46r0O8L80k29o6j3J06J03q5M1p1j0K0J38k89K89j73K4k38K53j87
$$ -21 -111 243 -103 -193 -125 255 26 -40 -53 53 156 71 112 41 31 51 189 -100 189 16 40 -198 55 -132
6386a32J54ro0J75k27J37j18J42j52J75j26J54Q5m91J31k3J15J86pj70K74j51
$$ -132 22 13 -47 128 -99 38 -80 62 -90 85 -41 113 198 -293 -162 -185 -70 116 109 -61 213 62
6408F2j61P8J3O5kp0K52m24M10k02Rm4j8n2K25p2q4K17j27j64K02l00K09L2k44
$$ 62 -99 -21 -8 57 55 -15 237 -187 223 21 30 -14 -32 -84 141 69 -15 202 75 -89 113 -187 22 54 -190
6433a90J4L75m98J98p2J42l0L10k06L1j62O6K40m34L07j88L20ll11J83k84n2L23
$$ -190 -176 199 -299 -101 -173 -31 -61 249 43 74 -88 -22 218 -216 91 -97 223 220 -91 92 -192 -244 79
6456G9J13k02j52K82k93K38p3p7J09Jj27L2J62j28l2J55jj02J59n3k8j23J71j14
$$ 79 192 -10 -162 120 -173 65 -8 -85 24 25 -102 -70 92 -36 -68 87 86 -16 143 90 62 -61 110 -4
6480dl6J27m9l16K36Kk9q9M1J07n2R8o4J59k88L81o3k0k06K47k44J00Q1j12m0
$$ -4 -40 87 38 -278 -42 -40 -69 -158 -117 -10 -62 36 -28 131 -157 224 161 141 -65 182 -62 38 119 7 -33
6505c3L6%N3R2j04o1j57J57J23k03k33J17J0M9J41M8p9J05j77J19l01R3L77l46
$$ -33 3 3 56 148 44 -17 -174 -17 106 -97 -330 -213 -203 -154 -13 35 -44 61 -116 3 -298 -205 172 -174
6529a74K26j22J75q4m7N8O3k34K02L5j94M8qmK4J53j77J10j3m8j4J02rP8lm12
$$ -174 52 -70 105 21 -26 32 95 -139 63 98 -96 -48 -56 -60 -36 117 -60 50 37 -11 -25 77 68 146 143 -269
6555b69K91o6O4K7q9J34j38K7J74q9j84J45J31k66J4L9L16l11K27k14J7j44J60
$$ -269 22 -44 20 47 -42 92 -46 -19 155 66 -118 27 158 -108 -94 -55 261 -50 177 -37 -20 -164 -4
6578do8N0J36q2J18KJj90j29K6J47J32j11qo4M3j34N6J38j18J08N3r4L9j25J52
$$ -4 -72 -22 114 32 150 152 153 -37 -166 -140 7 139 28 20 -44 -1 -135 -79 59 -59 49 102 8 47 -78 74
6604G4k24L12j34j3n4Q3j87jJ97J01j61p4J51p8r8K44o8O4o1k27J02Q6j73J27
$$ 74 -150 162 28 15 -39 44 -143 -144 53 154 -7 -81 70 -8 -106 138 70 134 73 -154 -52 34 -139 -12
6628a2J19l86M16k39J70Q2j94J25k57J11J29k3j54J17k39J66N0J6n8J19j74Q4
$$ -12 107 -279 137 -102 68 150 -44 81 -176 -65 64 41 -113 4 -235 -69 -19 -3 -61 58 -116 -32
6650c2k9J6RJ05j75O0K7l3K0J21rp4M4q3j28J08p4L39K9k41L6j95J51j05L9J58
$$ -32 -61 -45 -36 69 -106 -46 -19 -52 -32 89 80 6 50 -33 -161 -53 -127 212 241 0 36 -159 -8 -113 -74 84
6676H4k9j9m2k15L40j54l9K91q4J38k35Q9l1M6j36L1p2N8J11j52J57o2m3k16L39
$$ 84 55 36 -6 -221 119 -35 -74 217 133 271 36 125 94 140 4 35 -37 21 132 -20 137 75 32 -184 155
6701A55m5j18J03k8K9K26m25J37j72J86K09l54K43j99J79j29PJ6J21j3k32J28
$$ 155 110 -8 95 67 96 322 -103 34 -138 48 257 -97 146 -53 126 -3 4 20 141 128 -104 24
6723B4j81J34K8M0N1o1P4k08j6R6M1q5J20j22J89j47R0n4O0k31J48r3K50n6o2
$$ 24 -157 -23 5 45 96 35 109 -99 -115 -19 22 -63 57 -65 124 -23 67 13 73 -158 -10 -103 147 91 29
6748B9n9M9Q5Jl9l04M18k92J3J12j68LK94j77L4k0J82k70J55K7j20K13k13J47
$$ 29 -30 19 104 105 66 -238 180 -112 -99 13 -155 -152 142 -35 -1 -21 161 -109 46 73 -47 166 -47 100
6772A00KJ10l43J51k5Jj08R5j95K5K62j65Q2P3m5PR0Pj82l1K79m62K61Lj3j18
$$ 100 102 212 -131 20 -5 -4 -112 -17 -212 -187 75 -90 -8 65 20 27 117 124 -58 -89 190 -272 -11 -8 -21 -139
6798a39L01j81O3l10K02r4n2J78n4k29K81K9j08J82mn4m9j07J17l3J63j12K3j85
$$ -139 162 -19 44 -266 -64 -158 -210 -32 -86 -315 -34 -5 -113 69 65 11 -38 -145 -28 -61 102 -10 13 -172
6822a72K63r5l1K9J03k03Q2P4k85L43r2l3N2J4J53l35J89p5q6J60Q0k46K39j09
$$ -172 91 -4 -35 -6 97 -106 -24 50 -235 108 16 -17 35 49 202 -133 56 -19 -105 55 135 -111 128 19
6846A9j3k13L10k4j6r8O7p1np2j8J59o7J28j66N1K5l9P2j31L0L0p9K96k62R5M4
$$ 19 6 -207 103 79 63 -35 32 -39 -44 -116 -134 25 -42 86 -80 -29 -4 -43 29 -102 -72 -42 -121 175 -87 8 52
6873E2J1J53l00K8j3P0q6L28k81l6J60j88J73k01J82lKj5J9O5j27J23n9p0K3M1
$$ 52 63 216 -84 -56 -69 1 -85 243 -38 -74 86 -102 71 -130 52 49 51 36 55 120 -7 116 57 -13 10 51
6899E1J79k14M0J12j1j91J4l7L0J7M3j14J74j12J94l30L6N0K95l05J67O7m41L18
$$ 51 230 16 56 168 157 -34 -20 -57 -27 -10 33 -81 93 -19 175 -155 -119 -69 226 -79 88 155 -286 32
6923C2k9j00Q3J06j32j50J09PJ0jn4J15j25K68j58N2K3j72K87j31j49j40L04P2
$$ 32 3 -97 -14 92 -40 -190 -81 -74 -64 -65 -119 -4 -129 139 -19 33 56 -116 171 40 -109 -249 55 127
6947A27j47J49o3p8Q2j83q8K45L1j6M9o3q7k9ll8R0o0J23n0k71J98Q9j08J43k7
$$ 127 -20 129 66 -12 70 -113 -201 44 75 59 108 45 -42 -71 -74 -112 -22 -82 41 -9 -280 -82 7 -101 42 15
6973A5J39J21l42J62j69j4K37k14q8k4J59O2J94l25N2P8l2n8KL7l1J3L7J21k14
$$ 15 154 275 -67 95 -74 -88 149 -65 -153 -177 -18 44 238 -87 -35 43 11 -47 -45 -8 -39 -26 11 132 -82
6998h2J17R5j81O6qL5m0O1jj30m2N8L05k26l6p8J54q4j31L17j27L2m1J1J76j77
$$ -82 35 130 -51 15 7 42 2 63 62 -68 -110 -52 253 27 -9 -87 67 -17 -148 169 42 74 33 44 220 43
7024D3o0J9q9n6K02N8j9j33j2L1j13K92k66j32J53M9J5J61l14R2J72l9q4J4J68
$$ 43 -17 2 -87 -143 59 117 98 -35 -47 -16 -129 163 -103 -235 -82 -33 -18 143 -171 -79 93 54 -30 -16 152
7049A52k28o1Q3j7K40k57K30j04P9J48j17j66j24N3J42n3N6j32l1J27j04K7Q2
$$ 152 -76 -137 -54 -71 169 -88 142 38 117 265 148 -18 -142 -89 53 0 56 -76 -107 20 -84 -57 25
7072B5J62k57Qj26L57j94RJ7l3r3P9R1L3j99k6j2J29L3J48j41j5kq9O1j91K64
$$ 25 187 -70 -62 -188 169 -25 -16 1 -32 -125 -46 45 78 -121 -147 -159 -30 3 151 10 -5 -7 -96 -35 -226 38
7098C8o5J03ol3k6j84L72O4j43j95Q9Lj01M%K1qJ00l3j26K36k8R6j59J6j78K23
$$ 38 -27 76 70 37 11 -173 199 263 120 -75 14 17 -84 -80 -80 -59 -67 33 0 -126 110 82 178 19 35 -143 80
7125H0j80Q9j1N6K17k33J62j59q4k2K14l65J26K91k32J74l07LM44m54r8L44k67
$$ 80 -100 -11 -22 34 251 18 180 21 -63 -85 129 -236 -110 181 -51 123 -184 -181 263 -191 -289 55 -212
7148b12K84M2l28M2L15j64P9j32L55k82J89K8k28j56J27J13j54K03j00r1J17l2
$$ -212 72 114 -214 -172 143 -21 58 -74 281 -1 188 216 -12 -168 -41 72 -82 121 21 -70 47 15
7170A5O2Kj54oJ02o2J52j05mO5k69J12o4K49J42k44R3J40j67q9r7j52K07K23j09
$$ 15 77 79 -75 -81 21 -41 111 6 2 67 -202 -90 -154 95 237 -7 86 226 59 -30 -127 -279 -72 151 42
7195D2K03k83o7l9l6M03r6k31J68p4k02J92P9j43R5k33O0L51m9k41O0P0L0r8j56
$$ 42 245 -38 -105 -144 -180 223 127 -104 64 -10 -212 -20 59 -84 11 -222 -162 189 140 -101 -41 29 59 -39 -195
7220a95K48j1j24J4O9k1J13K3j58r9N20l80j30K24q9j05J27Lk18K83j41J62k77
$$ -195 53 42 -82 -68 1 -20 93 116 -42 -141 379 -1 -131 93 4 -101 26 29 -189 94 -47 115 -162
7243a62L00o7M9l8j23K17j16o8J04k16j23K50N3j83L3n9J63m4R7N3k10N1k34K75
$$ -162 138 71 120 82 -41 176 60 -8 96 -120 -243 7 60 -123 -90 -149 14 -30 67 120 -90 -39 -273 2
7267Bj33m4L49j30q5J46J2Q8l47K67k69K7N7J72j59M6L6j90Q7J31k35K77k19K46
$$ 2 -131 -175 174 44 -41 105 117 205 -142 125 -144 -117 -60 112 -47 -1 35 -155 -68 63 -172 105 -114 132
7291A32j77K89k67j09J49N8k2j51L48m1k10k17J86p1P1K72j53jq2l1J32o9N4j05
$$ 132 -45 244 -23 -132 17 75 53 -98 250 209 -1 -218 -32 -103 -32 240 87 86 4 -27 105 36 90 -15
7315a5K9m1k12K99l2j5k1Q8J51k11r7R6k00L31j07Pj25J25lp8J21k25N0J13lj9
$$ -15 14 -27 -239 60 28 13 -8 80 231 20 -77 19 -181 150 43 50 -75 50 47 -31 90 -135 -85 28 25 6
7341FO1q0k07J33P0q0k1n1K40rj46o3J4N1J51q6k1k1R9p4L2J18R0m00K31l27L44
$$ 6 67 -13 -220 -87 -17 -97 -118 -169 71 62 -84 -147 -133 -82 69 -17 -38 -59 40 -34 -2 116 206 -194 37 -290 54
7368E4M0k31N0L0N5P7J35k15l3J8j66K96k40R1J52k50J70J24m19O8L57k14k0Q8
$$ 54 94 -137 -87 -57 -2 75 210 -5 -38 -20 -186 110 -130 -39 113 -137 33 157 -262 -194 163 -51 -71 17
7392A7J20j22m4m9J09Q1j38r4O4j17K36J6M7j07K45k60m0J49j63J86o5k06J41
$$ 17 137 15 -29 -78 31 112 -26 -120 -56 -173 63 79 126 19 264 4 -36 113 -50 136 71 -135 6
7415FJ0j77K59j96m7J17k6q8J94j64K09o3m4M5j79K16K0J4j93QK17L7p0Rk12M4
$$ 6 16 -161 98 -98 -145 -28 -54 -142 52 -112 97 34 -10 35 -144 72 92 106 -87 -79 138 175 105 114 -98 -54
7441e4o6J97j50M5k9J73k5l7k13q2K43Rj09J04J39nj19k16J15l8J93L2k07l4J31
$$ -54 -120 77 -73 -28 -57 116 91 54 -159 -241 2 11 -98 6 145 140 21 -195 -80 -118 75 107 -100 -134 -3
7466cj37L71l41K37j91R9k0j74J78k2N8l8Q8r1J0O9n9j44J92m4r5Q4j34J53L9
$$ -3 -140 231 -110 127 -64 35 15 -159 19 -3 55 17 105 14 24 93 34 -110 82 38 -57 27 -107 46 85
7491H5k43J27J14p9M1j41K40j46j22J74m6P0q9N5j78K94m8k08K01j78o6J49j73
$$ 85 -158 -31 83 4 45 -96 144 -2 -124 50 4 74 -15 40 -138 156 108 -100 101 -77 -143 6 -167
7514a67K00K1r8P3R1J6l29K82k16J77r0q5R9o6R7N7j61l4P9J41r1Nr7L74l92J94
$$ -167 33 54 -44 29 120 136 -193 89 -127 50 -40 -125 -26 -92 5 62 -99 -133 -54 87 -4 1 -96 278 -114 80
7540H0k53K40k8k03K00m7j20K93n7P6k2j88j34J09m6j2J69Q2l99K94Q5rj01p3
$$ 80 -173 67 39 -164 36 -11 -131 162 105 181 159 -29 -163 -54 -100 -112 57 139 -260 34 119 110 9 -64
7564f4J13O7P7j57O7n7l41K16J16M2j93J16O5l06L96j05j1K3N8k92J02j40J63
$$ -64 49 116 193 36 103 46 -295 -79 37 79 -114 2 67 -239 157 52 41 64 122 -170 -68 -208 -45
7587d5M6%j1j39J65J82k07J44q4L7j83p1J9L14j84L7O5j61M0j1K55k74J31j19
$$ -45 1 1 -10 -149 16 198 -9 135 51 88 -95 -166 -147 167 -17 20 85 -76 -36 -47 208 -66 65 -54
7611e4L8J04k16K59k9j85j6K27nk42J46Q2j26k4m1J35J6j4LK8j72L8n9L78m15
$$ -54 -16 88 -128 131 102 -83 -99 128 123 -119 27 109 -17 -41 -82 53 69 55 58 86 -86 -48 -107 271 -144
7636a44Q4J26j86o3J55j05J51J80jj91J54m87K45J84j05M1o4m2PJ51j53j69R8
$$ -144 -60 66 -120 -183 -28 -133 18 198 197 6 160 -327 -82 102 -3 38 -26 -68 -61 90 -63 -232 -134
7659a34q5J49K65m9j63j54K57j06LJ23k20j73Q7J66p2J09L9k08J95K3j03J68j22
$$ -134 -219 -70 195 146 -17 -171 86 -20 -17 106 -114 -287 -200 -34 -106 3 42 -166 29 52 -51 117 -5
7682ek8R1j87L9K21j20J44m1q1O7q1J44k23J84l1j47j16M4J69Q2k87k42K31J22
$$ -5 -33 58 -129 -90 131 11 155 114 33 100 19 163 -60 124 93 -54 -170 -126 43 125 -162 -404 -173 -51
7706e1P0k0j02j9p5J95J3N6n8j89P4K46j01j31J12l14K91J10p7o2Q8j83M8J67
$$ -51 19 -1 -103 -122 -197 -2 11 67 9 -180 -106 140 39 -92 20 -294 -3 107 30 -32 56 -127 -79 88
7730H8j00M0j88M04j35j30J57k85K35j66O0K83l04K10j97k5j40J22J79k54J47
$$ 88 -12 28 -160 244 109 -21 136 -149 86 -80 -20 263 -41 169 -28 -53 -193 -71 108 -146 1
7751Aj9j01N1NJ02J00l9j1J51k29k03L48j8l7j17k2M7N5P1k77J29q5K26j50k71
$$ 1 -18 -119 -68 -63 39 139 100 89 240 11 -192 156 138 101 -16 -38 9 64 135 -142 -13 -98 128 -22 -293
7776b93N12k19L1L2Mr9J52l13J24K26j65j06J73K6j04j99K82k1k1j15r3J69kp7
$$ -293 219 0 31 63 67 -32 120 -193 -69 157 -8 -114 59 85 -19 -218 64 43 22 -93 -186 -17 -19 -96
7800i6M0J09P0k28J81K3K4r1N8k1j38O0J04k08J92j58J03R4m4j83%J08J9o3K20
$$ -96 -56 53 123 -105 76 99 123 32 90 69 -69 -9 95 -113 79 -79 24 118 74 -109 -109 -1 18 -45 175
7825A75m1j94N6K05k52Q6l6M0k11J97L9M0lj81O8O8j83J09J07k2j23J12R7k79
$$ 175 134 -60 -4 201 -51 35 -1 39 -172 25 64 104 101 -80 -12 56 -127 -18 89 67 -56 56 153 -126
7849a26J08l5P5m7J43J1j6q6n9Q8j58K33M1k50p4J04K47l6m8k02m7Q9J04j31J19
$$ -126 -18 -53 22 -25 118 129 113 27 -32 56 -102 131 172 -78 -152 -48 199 163 115 -87 -134 -45 59 -72 47
7874D7Q1k19LO2L16k55n4j1J33j83K96l99K23N5j26j81L81o2J18k26m8m5J07O3
$$ 47 128 -91 -88 -26 290 35 -19 -30 103 -80 216 -183 40 95 -31 -212 169 107 225 -1 -49 -94 13 76
7898G6j55K36J1q2k9q6m5J02J9J19j08j80m3m2K72K2j29K5J61j93j70k2K34J80
$$ 76 -79 157 168 86 57 -29 -74 28 47 166 58 -122 -165 -207 65 87 -42 -17 144 -49 -219 -241 -7 173
7922A73j8j74k9K07j41L0O4j10P3j85P0M7L1P7J8l7m8l3K7j12K29r7o0j43J07
$$ 173 155 -19 -48 159 18 48 112 2 75 -110 -40 7 38 115 133 96 48 15 42 -70 159 62 2 -141 -34
7947c4K10k09J28m1j70r7K77L4k85J33Q5J13j80k24J87K70k32J4J8j11Q7J38j95
$$ -34 176 -33 95 54 -116 -213 64 98 -187 -54 31 144 -36 -260 -73 197 -35 -21 -3 -114 -27 111 -84
7970h4Q0j3M3N6l7j71J72l00O6K71j2M1j20K2J58J2m4r1K8j24k7J43j37K28k33
$$ -84 -4 -17 26 82 45 -126 46 -254 -188 83 71 112 -8 14 172 184 140 49 77 -47 -74 69 -68 160 -73
7995g3J72j63j31J10K32j51j95J26J41j79J06J02q2l26N15j95n2j4J84j0j60m8
$$ -73 99 -64 -195 -85 147 -4 -199 -73 68 -111 -5 97 15 -311 204 9 -43 -57 127 117 -43 -91
8017i1j7J08j27K00Lj8p4%J05k66K56n3r4K3J4l7O1o0KP3Jq6R2j46O0J52o2j30
$$ -91 -108 0 -127 73 76 58 -16 -16 89 -177 79 26 -68 -45 -31 -68 -7 -67 -65 8 9 -77 15 -131 -71 81 19 -111
8045a11Q9o9j13K83j64j86J96P6Q5k29K66j56n4J40j15O3M3m2qk2j22PQ8J82j62
$$ -111 -22 -91 -204 79 -85 -271 -75 1 86 -143 123 -33 -87 53 -62 1 44 2 -6 -28 -150 -143 -55 127 -35
8070c5k5J02o7q8K14k20J04o7q5L14j28o5j12J26J77k06K8Q1j16Q7k80K67P9p3
$$ -35 -60 42 -25 -113 101 -119 -15 -82 -167 147 19 -46 -158 -32 145 -61 -33 48 -68 19 -261 6 85 12
8094A2J65k15J39r4P3l09J52o0MP5Q2j11j29K77j39qJ69m1j95N7J08O6K1O7l6
$$ 12 177 -38 101 7 80 -229 -77 -137 -133 -58 24 -87 -216 61 -78 -86 83 42 -153 -96 12 78 99 166 130
8119A30k9k4P8k37J93j07r7J7M3J4l9J1Q2P4q5q7M8K3k21J14RJ20J17m1M3K0k23
$$ 130 101 77 155 -82 111 4 -93 -76 -33 -19 -58 -47 35 109 24 -63 -15 8 -213 -99 -90 30 147 106 149 169 -54
8146e4J66j01J3n0J88j51o0Q5j27R8k5K18k79n6K4P9o6K36k62K1P6M1j63K60j15
$$ -54 112 11 24 -26 162 11 -49 36 -91 7 -18 200 -79 -135 -111 -32 -98 138 -124 -103 -27 14 -149 111 -4
8171dK6m6k5J34j28j3K76j15l7K00k14j18J57j61K68k32M9j68j15K58
$$ -4 22 -24 -49 85 -43 -56 220 105 68 268 54 -64 93 -68 200 -32 17 -151 -266 -8
8191h
$$ Imaginary data points
##PAGE= N=2
##DATA TABLE= (X++(I..I)), XYDATA
0@%%%%%%%qJ6j6K4l2M0n6P2q8J12j44J77k17K64l13L73m44N20o09P12q27R55j096
$$ 0 0 0 0 0 0 0 0 -8 8 -8 16 -16 24 -32 40 -48 64 -80 97 -120 144 -169 204 -240 280 -329 383 -444 511 -585
30e85J256j438J637j854K098k369K667k992L348l739M167m638N151n709O317o986
$$ -585 671 -767 870 -984 1114 -1255 1412 -1580 1768 -1971 2196 -2442 2709 -3000 3317 -3669
46c669P718q513R382j0336J1389j2547J3824j5242J6824j8604K0615k2907K5551
$$ -3669 4049 -4464 4918 -5418 5971 -6576 7248 -7994 8830 -9774 10841 -12066 13485
59A3485k8639L2302l6730M2206m9180N8420p1305R0631j23171J91487n67789P94012
$$ 13485 -15154 17148 -19582 22624 -26556 31864 -39441 51190 -71981 119506 -448283 345729
71C45729M99612j724850O09122J039196q00453m72629R51216k27417p35702N38864
$$ 345729 845341 -879509 -270387 768809 -31644 -504273 446943 219526 -516176 22688
81B2688M10940q16430R7248P24130l82922l91428N83543L1966n43430Q1077M81889
$$ 22688 433628 -382802 -285554 438576 55654 -335774 247769 279735 -263695 -182618 299271
92B99271k41053n19360M00528N26503n79182k35652O69997r5854n28196L61309
$$ 299271 58218 -461142 -60614 465889 -113293 -348945 321052 225198 -302998 58311
102E8311J63762n39328J62177N52868m96051l44904Q25554n273q77724M89153
$$ 58311 222073 -317255 -155078 397790 -98261 -443165 382389 377116 -500608 -11455
112a1455N52546q60169p1342Q19380l87387n12829O08656K10795n29622P4197
$$ -11455 541091 -319078 -390420 428960 41573 -471256 137400 348195 -181427 -107230
122a07230L55491k75864j36363L15106j80920k36738L92373O1089l56813J16719
$$ -107230 248261 -27603 -163966 151140 -29780 -266518 125855 186944 -169869 -53150
132e3150K32489j06044j48991m106J27332k7317j59313J31316J00446j68418O6162
$$ -53150 179339 73295 -75696 -79802 47530 20213 -139100 -7784 92662 -75756 -9594
143i594J58624j42921q6691J36318k1445j50949J14591R4147k36493R6777L16571
$$ -9594 149030 6109 -80582 55736 34291 -116658 -2067 92080 -144413 -47636 268935
154B68935l12083j76511M36284r5843l72673K55746J20604k72892J01986J91853
$$ 268935 -43148 -219659 216625 120782 -251891 3855 124459 -148433 -46447 145406
164A45406j94325m5932K54213q3235k41267J98829Q9238k76391J04215J92124
$$ 145406 -48919 -94851 159362 76127 -165140 33689 122927 -153464 -49249 142875
174A42875k19931L512K08068j03320q8811P7133L151l5046k4512J1376J9290j9298
$$ 142875 -77056 -73544 134524 31204 -57607 19526 22677 -12369 -36881 -25505 -6215 -25513
186b5513M4305K2373o2947K2006N2542l0276o5268n922R5200l7442j10734J49160
$$ -25513 18792 41165 -21782 224 52766 22490 -42778 -48700 46500 9058 -101676 47484
198D7484L6716j84904J28317J06440k24400K6970J70957j38952q0563J57049L914
$$ 47484 84200 -100704 27613 134053 -90347 -63377 107580 -31372 -111935 45114 49028
209D9028j31288Q7900J14146j65263k4802J94916j21784j32446J88249j8890j38979
$$ 49028 -82260 5640 119786 -45477 -70279 124637 2853 -129593 58656 39766 -99213
220i9213J22119M0027j00923L5145N6389m5609n2190L6082L7252p0428K033P5841
$$ -99213 22906 62933 -37990 -2845 53544 7935 -44255 -8173 29079 -41349 -39316 36525
232C6525l9653j1304N2353k0757j2717o247l334K5792n8695k428R0609o3984k7649
$$ 36525 -3128 -14432 37921 17164 4447 -1800 -5134 20658 -38037 -40465 50144 -13840 -41489
245d1489J08506m8404o2152P7750j0903p4102K2812N1223l5273m0823Q6298J7882
$$ -41489 67017 18613 -43539 34211 23308 -50794 -27982 23241 -12032 -52855 33443 51325
257E1325r6312O9349M6901j25140L5612O8814r8967R583P4630l8781j3262M2213
$$ 51325 -44987 24362 71263 -53877 -18265 50549 -48418 -38835 35795 -2986 -16248 25965
269B5965O696l7423j1537M0265l6822m3663O9391q657m4669O6676M603l5916K9213
$$ 25965 32661 -4762 -16299 23966 -12856 -56519 12872 4215 -40454 26222 30825 -5091 24122
282B4122j1564j6658r5k2805K2078p40k1374M9698j995l0299L9038r906l7381
$$ 24122 12558 -4100 -4195 -27000 -4922 -5662 -27036 22662 20667 -9632 29406 19500 -17881
295a7881Q465Lk872j5237J1779M9362l4382r394O7513m8092l9135N7415l7329
$$ -17881 -9416 -9413 -12285 -27522 -15743 33619 -763 -10157 57356 9264 -29871 27544 -9785
308i785l6362M9929l361j7796K4967K1346j0192l0622K6006P879p0306K5550M5530
$$ -9785 -46147 3782 421 -17375 7592 28938 18746 -11876 14130 22009 -48297 -22747 22783
321B2783o0418K1650N6266l7246M631K3636k4506r793q579J143j383j8070L6461
$$ 22783 -37635 -15985 40281 3035 7666 31302 6796 -2997 -11576 -10433 -11816 -29886 6575
334F575J2386l4168L8536J1384m7635J0298M215k0252j32m679K6850J0968k5675
$$ 6575 18961 -15207 23329 34713 -12922 -2624 1591 -18661 -18793 -23472 3378 14346 -11329
347a1329L8749P102m8393K5735O75m6160K0929J3347j7208J1470J8732J0911k2065
$$ -11329 27420 34522 -13871 11864 12539 -33621 -12692 655 -16553 -5083 13649 24560 2495
360B495m416L4000m5574k9890N9197k4909l3547O0418J200k3967K7997j948j8833
$$ 2495 -1921 32079 -13495 -43385 15812 -9097 -42644 17774 18974 -4993 23004 21056 2223
373B223q437J174L162k7465J4164L7559l2775P960M2013l5955j2254K1635k0115
$$ 2223 -6214 -5040 -1878 -29343 -15179 22380 -10395 -2435 39578 3623 -8631 13004 -7111
386g111j1337k716J2510K2568k6748J0893M2193l4644j0129K5276l2809q365K2454
$$ -7111 -18448 -21164 -8654 13914 -12834 -1941 40252 5608 -4521 20755 -12054 -20419 2035
399B035j2018o490J4181K3725p027k8258L4636J458o0360L3280K4693n9567K2289
$$ 2035 -9983 -16473 -2292 21433 14406 -13852 20784 22242 -38118 -4838 19855 -39712 -17423
412a7423M7235k6988o581J8865L388j2226j5841J0445j1428j5223L8524q394l1120
$$ -17423 29812 2824 -3757 15108 18496 6270 -9571 874 -10554 -25777 12747 4353 -26767
425b6767M3665J2057l2681M18L164L386j2735j7775L5108k070l1418M6776J1288
$$ -26767 16898 28955 -3726 -3308 -144 3242 -9493 -27268 7840 5770 -25648 21128 32416
438C2416m7021J6119J7402k2335q455L094K795l995J4512J7717l9656P381N7610
$$ 32416 -14605 1514 18916 -3419 -11874 -8780 -5985 -9980 4532 22249 -17407 -10026 47584
451D7584m9636l9860N6654q131l3666K7586M961j0457J0356J1431k103k5404N484
$$ 47584 -2052 -41912 14742 6611 -27055 531 5492 -4965 5391 16822 14719 -10685 -5201
464e201K1558k8039m092K1262j6763Q766K1230j4203q671k894J8657J0034n5467
$$ -5201 16357 -11682 -15774 5488 -11275 -2509 18721 4518 -4153 -7047 11610 21644 -33823
477c3823M751O3098l3734k9779M5646j665k0697J8568J622k7331m288L3828r210
$$ -33823 -29072 34026 292 -29487 16159 14494 -6203 12365 13987 -13344 -17632 16196 6986
490F986m1925L7157K2148m4323K7852K0859n3324J5441L6283l2674j8202J5081
$$ 6986 -34939 2218 24366 -19957 7895 28754 -24570 -9129 27154 -5520 -23722 -8641
502h641J8563K161k0521P336J3544q894O646r774j9125J6053Q278m940r549q241
$$ -8641 9922 12083 -8438 -1102 12442 3548 10194 420 -18705 -2652 5626 686 -8863 -17104
516a7104L4950K784m1897K6694J1312m4077K9528K1676n2737P962N0766j3293
$$ -17104 17846 20630 -21267 5427 16739 -27338 2190 23866 -28871 -20909 29857 16564
528A6564l5150J6303K7321k6427j0159K6919l1576j0391N4151k2049l5471L9598
$$ 16564 -18586 -2283 25038 -1389 -11548 15371 -16205 -26596 27555 5506 -29965 9633
540I633O730j6840N351j2051m19J0246m687J357q375Q97K6771m225j9789K08J1396
$$ 9633 16363 -477 4874 -7177 -7596 2650 -2037 -680 -9055 -8158 18613 14388 -5401 -5193 6203
555F203Q272k4664r322K7861j5635k684L6481l3257j7012N5183j7040m2766K8076
$$ 6203 14475 -10189 -19511 8350 -7285 -9969 26512 -6745 -23757 31426 14386 -28380 -304
568c04Q688k2714J0632J7304j9289j0189M1863O43n4749K0346L2942l7605o62
$$ -304 8384 -14330 -3698 13606 -5683 -15872 25991 26634 -28115 -7769 25173 -12432 -13094
581a3094J7305j8723J6942J4484k0667K337N133k6L443j8262k594J7669k955l012
$$ -13094 4211 -14512 2430 16914 -3753 -1416 3717 3691 7134 -11128 -13722 3947 992 -2020
595b020N002L219j875m370J5200j2200l5306L6084K0390n3023J5680L8299l0593
$$ -2020 2982 6201 4326 -44 15156 2956 -32350 3734 24124 -28899 -13219 25080 -5513
608e513L680K2612k8063o772K6877o534k8861J0874L1411j8257j4126L2644j1994
$$ -5513 -1833 20779 -7284 -14056 12821 6287 -22574 -11700 19711 1454 -12672 19972 7978
621G978k1632K7785j0193k3243J6995p62N66Q695j4676R242J6453j6622m279L530
$$ 7978 -13654 14131 3938 -19305 -2310 -3072 -2506 6189 -8487 755 17208 586 -3693 -163
635a63o064M080K640m138m198J1632J8136k4087j0959L5095j9735k6573L5405
$$ -163 -6227 -2147 493 -3645 -7843 3789 21925 -2162 -13121 21974 2239 -24334 11071
648A1071r812k7315L4322O209k5171J1862J2050j2047p250P462j965j4952J6496
$$ 11071 1259 -26056 8266 14475 -10696 1166 13216 1169 -6081 1381 -584 -15536 960
661I60J2006k5164J0997K1409k0811Q7O342j4525R139j352j3441J6865N79q396
$$ 960 12966 -12198 -1201 20208 -603 -516 5826 -8699 440 -912 -14353 2512 3091 -5305
675e305J4964l421j0595O641J508p160o945R327O220j5205J4045J3018k7898J1800
$$ -5305 9659 6238 -4357 2284 3792 -3368 -10313 -986 5234 -9971 4074 17092 -10806 994
689I94K0529l4479J2K4621j9583m228J8299m311m268O599M355q525p107J2555
$$ 994 21523 -12956 -12944 11677 -7906 -12134 6165 1854 -2414 4185 8540 15 -7092 5463
703E463o165j2064J6695k512q559J8374o650p821J2812j1073m025R060j2903K973
$$ 5463 -702 -12766 3929 1417 -7142 11232 4582 -3239 9573 -1500 -5525 3535 -9368 -6395
717f395J1865r970K807Q768l600l182n52M242o941p648J6649n129j3140K3207
$$ -6395 5470 -4500 -1693 7075 3475 293 -259 3983 -2958 -10606 6043 914 -12226 10981
731A0981k797j7579K0198l614j8972J3838j29j1759O596M938n80k668L091O778
$$ 10981 8184 -9395 10803 7189 -11783 2055 1926 -9833 -3237 1701 1121 -1547 1544 8322
745H322j0857M24Q303j4137L821R656j3028Q210Q588j3203Q228K606j2112O840
$$ 8322 -2535 -2111 6192 -7945 -4124 5532 -7496 714 9302 -3901 4327 6933 -5179 1661
759A661j992p796Q153j295j700M476L67L036n491j25P370j2702K43J2805j3880
$$ 1661 -331 -8127 26 -1269 -2969 1507 1874 4910 -581 -706 6664 -6038 -5795 7010 -6870
774f870L110J4380j4380L548J0883j4006N58O262p555p61J819L693lm229R714
$$ -6870 -3760 10620 -3760 -212 10671 -3335 -2777 3485 -4070 -4831 -3012 681 678 -3551 6163
789F163j925r739J1569m595j0663J3732n261o874J3534m363l395Q428o366m47
$$ 6163 4238 -5501 6068 1473 -9190 4542 -719 -7593 5941 1578 -1817 6611 245 -202
803b02K289o635L208j023j548N221l423L826L408q010O696n28j0882J0827j938
$$ -202 2087 -4548 -1340 -2363 -3911 1310 -2113 1713 5121 -2889 3807 3279 -7603 3224 1286
818A286j0558J4228j438q858J1243j330o529L117j340j147l022O64O983p568J990
$$ 1286 -9272 4956 3518 -5340 5903 4573 -1956 1161 -179 -1326 -4348 -3684 3299 -4269 -2279
833b279J1022j1175J033R425j2374J561O557q898M537K601m415P123k342l609
$$ -2279 8743 -2432 -1399 8026 -4348 -2787 3770 -5128 -591 2010 -2405 4718 2376 -1233
847a233N047m425j093P98l956N571j890k007R122p090l54J0545j2232j032J0651
$$ -1233 3814 -611 -1704 -906 -4862 709 -1181 -3188 5934 -1156 -1510 9035 -3197 -4229 6422
862F422j1209K45R477o588K42M584k88o60n745M151K267j0339O129L616q588R223
$$ 6422 -4787 -4542 4935 -1653 -1411 3173 2885 2225 -3520 631 2898 -7441 -1312 2304 -6284 2939
878B939J601q317P497j446l830M762p181J257P138p804K177N933n529J992J246
$$ 2939 4540 -3777 3720 2274 -1556 3206 -3975 -2718 4420 -3384 -1207 4726 -803 1189 2435
893B435k388r36m347O933L75j1783J1228N420j2661R265K258j2305Q898K411j0038
$$ 2435 47 -889 -5236 1697 2072 -9711 1517 6937 -5724 3541 5799 -6506 2392 4803 -5235
908e235K279L777J461k812k046Q369m797n290J0252o963p201J0941k652l481L963
$$ -5235 -2956 821 2282 -530 -2576 5793 996 -4294 5958 -1005 -8206 2735 83 -3398 565
923E65l079N934J308q426O164j167n814Q769m221p543R642L091m720l361L409
$$ 565 -2514 3420 4728 -3698 2466 1299 -4515 4254 33 -7510 2132 5223 503 -2858 551
938E51N908r926j882J1725j1853k329J7518j0494p470J4812k343o235L615j807
$$ 551 6459 -3467 -5349 6376 -5477 -7806 9712 -782 -8252 6560 4217 -2018 1597 -210
952b10j746M85L884j033r166R515Q718j4733N73Q715o284L35n16k816N485k787
$$ -210 -1956 -1471 2413 1380 -7786 1729 10447 -4286 -3713 5002 -1282 -947 -1463 -4279 1206 -1581
968a581J774N501j0010L440J0331j1349k778P422l731j363L280J195m467j419
$$ -1581 193 5694 -4316 -876 9455 -1894 -4672 2750 -981 -2344 936 2131 -2336 -3755
982c755J3209m541j8198J5055P473j8849O109Q535j0142N521O326p474j980M481
$$ -3755 9454 4913 -13285 1770 9243 -9606 -3497 5038 -5104 417 6743 -731 -2711 1770
996A770L893p678m649J0341l010n901J0575l608p158R102M6m699k237k241R700
$$ 1770 5663 -2015 -6664 3677 667 -5234 5341 1733 -5425 3677 3723 -976 -3213 -5454 4246
1011D246k162j0888J0681L118p811O802m41q805N266M827n542p091O852R681j2005
$$ 4246 2084 -8804 1877 4995 -2816 3986 3545 -5260 6 4833 -709 -7800 -948 8733 -3272
1026c272j296J4540j1854n576J7061j0177j1415J4194K023p169J150L652J562
$$ -3272 -4568 9972 -1882 -7458 9603 -574 -11989 2205 4228 -2941 -1791 1861 3423
1039C423l423J911R83r175N350P631j1440O4Q121j753R23l449j264O389p076p34
$$ 3423 0 1911 2894 -6281 -931 6700 -4740 -4676 3445 1692 2615 -834 -2098 4291 -2785 -3519
1055c519P849r681K82J3328p038o124P739K261n438k712M883k114o668J1056J222
$$ -3519 4330 -5351 -5069 8259 1221 -4903 2836 5097 -341 -3053 1830 -284 -6952 4104 5326
1070E326j5268J1809R087j6190J858P907p869O13M009k582r92J948N615k736o688
$$ 5326 -9942 1867 10954 -5236 -3378 4529 -3340 -2727 1282 -1300 -2292 -344 5271 2535 -4153
1085d153P349M6o547L285j854p67N136l489J877J619o342P835J01j2340P357M919
$$ -4153 3196 3242 -3305 -20 -1874 -2641 2495 -994 883 2502 -3840 3995 4096 -8244 -887 4032
1101D032q881L366M701l476o34M134J501q470k57J0889q701n945J2976m590n399
$$ 4032 -4849 -1483 3218 -258 -892 3242 4743 -3727 -3984 6905 -1796 -7741 5235 645 -4754
1116d754J0695m516n745P012j492l489n2K44L650k242l21M418l268K86K471m494
$$ -4754 5941 1425 -4320 2692 1200 -2289 -2341 -2097 1553 -689 -1010 3408 140 426 2897 -1597
1132a597J219k39k191O004m503k818R991m861m921Q648n046m634P127j764m337
$$ -1597 -378 -617 -2808 3196 -1307 -4125 5866 1005 -3916 4732 -314 -4948 2179 415 -3922
1147c922K922M032j156m941N222K694r101M069M696j0238M579N474p914L685K893
$$ -3922 -1000 3032 1876 -3065 2157 4851 -4250 -181 4515 -5723 -1144 4330 -3584 101 2994
1162B994m473K650o84k408J939j710J161J051k323L238k30q93K166m019J768L227
$$ 2994 -1479 1171 487 -1921 18 -1692 -531 520 -1803 1435 1205 312 2478 -1541 227 3454
1178C454p610L374M895q387M196M719p638K575L925n219J55J715j49j259k78M447
$$ 3454 -4156 -782 4113 -4274 -78 4641 -2997 -422 3503 -1716 -1561 154 5 -1254 -1532 2915
1194B915k963k493P176l669m778P530l439l876O253l257j358M388l008J19J952
$$ 2915 -48 -2541 4635 966 -3812 3718 279 -3597 2656 -601 -1959 2429 -579 -460 1492
1209A492k764J490m57r14J740j950J826N02k869M346q80m421O121k549m694P036
$$ 1492 -1272 218 -239 -1153 587 -1363 463 965 -1904 2442 1562 -2859 3262 713 -3981 3055
1225C055k748l979O294j917k803L338o18j019l55N70J289l461K003L258n886L464
$$ 3055 307 -3672 2622 705 -2098 1240 622 -397 -752 -182 1107 -2354 -351 2907 -2979 485
1241D85L505o590L106K959o290L142J320l917K506q8j305K152j493P29L87j796
$$ 485 3990 -2600 506 3465 -2825 317 1637 -2280 226 138 -1167 985 -508 221 608 -1188
1257a188K385k098o52L604l547N33M329m927J246L941n859K133K477m974J966
$$ -1188 1197 -901 -1553 2051 -1496 -963 3366 -1561 -315 3626 -2233 -100 2377 -2597 -631
1272f31J653k660J421N67M71n78j575K942j526l072N092k532k672O354k725k579
$$ -631 1022 -1638 -217 350 821 243 -1332 1610 84 -2988 2104 -428 -3100 3254 529 -2050
1288b050N314k642j896K827k271K05N60j477J963p04n00K457k398Q78Q56l371
$$ -2050 3264 622 -1274 1553 -718 -513 47 -1430 533 -171 -671 1786 -612 266 1122 -2249
1304b249K858k0l677M825q27l013M910j989k420L876k229k053K241p02M7l35O79
$$ -2249 609 589 -3088 1737 910 -2103 2807 818 -1602 2274 45 -2008 233 -469 -422 -757 -78
1321g8K323l585J247L012n380J256L498n044K257K816l719K380P57j969J205j181
$$ -78 2245 -1340 -93 2919 -2461 -1205 2293 -2751 -494 2322 -1397 983 1740 -229 976 -205
1337b05m60R80k469J577J474k012K167o10o05K120l452J82L020m433K056L561
$$ -205 -665 315 -2154 -577 897 -1115 1052 442 -163 1957 -1495 -1313 1707 -2726 -670 2891
1353B891m886K272L123l982N92J257k060j37k1J392q71j637M613j089m172N023
$$ 2891 -1995 277 3400 -582 10 1267 -793 -930 -951 441 -430 -2067 2546 1457 -2715 2308
1369B308p64m411L541n59k508L082l98K79Q31j742K124q75k816K306q09j515K398
$$ 2308 1544 -2867 674 115 -2393 689 291 570 1401 -341 1783 908 -1908 398 -411 -1926 472
1386D72r16L49L30p24K569k176k952N203j831l860N199p54k741L749j04k566N31
$$ 472 -444 -95 235 -489 2080 -96 -3048 2155 324 -3536 1663 909 -1832 1917 1813 -753 -222
1403b22J070j49l137J116L402l983P47M730m749l65M596l649j173J761l72J008
$$ -222 848 699 -2438 -1322 2080 -1903 -1156 3574 -1175 -1540 3056 -593 -1766 -5 -377 631
1419F31j308%K924k530K80K166l386k6K496j655p30k9J456J674l568J644K825
$$ 631 -677 -677 2247 -283 -3 2163 -1223 -1249 1247 -408 -1138 -1167 289 1963 -1605 39 2864
1436B864n622K128L841o081N89N216k521j420J939R33j805j435L098j548l924
$$ 2864 -2758 -630 3211 -2870 -2281 2935 414 -1006 933 1866 61 -1374 1724 176 -3748
1451c748N298K99n291L874K063l767J453L46j188M82m19J234p68k017L910M41
$$ -3748 1550 1849 -3442 432 2495 -1272 181 527 -661 -179 -598 636 -132 -2149 1761 2202
1467B202l915K005J180j812j8r4P79j051o55L944k689l218O388j338n384M304
$$ 2202 -1713 292 1472 -340 -358 -452 327 -724 -1379 2565 -124 -3342 3046 1708 -3676 628
1483F28R15l571J841J812j910j104K268J894m393r6M925l868j836M512k502j188
$$ 628 1543 -2028 -187 1625 -285 -1389 879 2773 -1620 -1716 3209 -659 -2495 2017 -485 -1673
1499a673L202j149j174N73L06J400k768j69L331k044j117L075j556j047J839k8
$$ -1673 1529 380 -794 -221 85 1485 -1283 -1452 1879 -165 -1282 1793 237 -810 1029 1001
1515A001q30k091K224J970n023J400M286m637L05M066l417j303L884r67k363O36
$$ 1001 171 -1920 304 2274 -2749 -1349 2937 -1700 -1395 2671 -746 -2049 1835 868 -1495 -859
1531h59K324n95k888L197J74l593L197J222m384J804J622j888K90j65P49P01k053
$$ -859 1465 870 -2018 1179 1353 -2240 957 2179 -2205 -401 1221 -667 -377 -542 207 908 -1145
1548a145J523P69k749K207J167l011M81J554j46r56o00K260r24k596M199j201
$$ -1145 378 1147 -1602 605 1772 -1239 -758 796 650 -306 -906 1354 430 -2166 2033 832
1564H32m284M639M22m206K290J921k249J68J143Lj497P33J946k879j75L400k131
$$ 832 -3452 1187 1609 -2597 -307 1614 -635 -467 676 679 -818 -85 1861 -1018 -1193 2207 76
1581G6j352K831j559o81J484j279L70p1j129K244j115j284K793o46j411J119m09
$$ 76 -1276 1555 -4 -685 799 -480 -110 -181 -1310 934 -181 -1465 1328 682 -729 390 -19
1598a9k1m71M65Q41k069J114K539l669K08L567l257r86L055j891r86J873J93n80
$$ -19 -40 -511 -46 795 -1274 -160 2379 -1290 -1082 2485 -772 -1758 1297 -594 -1580 293 486 -94
1616i4l56J277L4j945J421O21k578K083J94k044K060K81j425J300j213k00J481
$$ -94 -450 827 861 -1084 337 958 -1620 463 657 -1387 673 954 -471 829 -384 -584 897
1633H97j974Q8J642j065R1J055l36j45m64O75k18j619J991L3k437K814L67l202
$$ 897 -1077 -989 653 -412 -321 734 398 253 -211 464 246 -1373 618 651 -1786 1028 1395 -1807
1651a807K604N50k716J122M79r46L15J73R03m93o31J651j179n84J497j629m7J752
$$ -1807 797 1347 -1369 -247 232 -714 -399 -226 677 184 -447 1204 25 -559 938 -691 -738 1014
1669A014j576P05J109j783J078J27j699J257j35j385J229k3j99N92k29N94p66
$$ 1014 -562 143 1252 -531 547 674 -1025 232 97 -1288 -59 -82 -281 311 82 676 -90
1686i0m32J493j592n93K386j605m08K423j720m30J625j361k71N20k45M5l12L76
$$ -90 -522 971 -621 -1214 1172 -433 -841 1582 -138 -568 1057 -304 -575 -55 -300 -255 -567 -191
1704a91P85j050Q98J55j406J500n77j236J748n22r40J934j003l92J293j141k33
$$ -191 594 -456 442 597 -809 691 114 -1122 626 104 -836 1098 95 -297 996 -145 -378
1721c78P80j151K87K59m9Q07j093Q94N45j788J075M94k112J701N75k090J840m8
$$ -378 402 -749 -462 -203 -252 555 -538 356 901 -887 188 682 -1430 271 846 -1244 596 548
1739E48r81J102l80p94N49n97N14m30j24J284r02l6J273j336j20J301j820R11
$$ 548 -433 669 289 -505 44 -553 -39 -469 -593 691 -211 -247 1026 -310 -430 871 -949 -38
1757c8R39j789J013R50j721Q52J04o52N99k66l8k54m25J055m16m28J627j262p28
$$ -38 901 -888 125 1075 -646 206 310 -342 257 -9 -47 -301 -726 329 -87 -515 1112 -150 -878
1776h78K198j741k60J665j070l94J142p02L00j33l84N13o87M04M12r63N10P08
$$ -878 1320 -421 -681 984 -86 -480 662 -40 260 127 -257 256 -431 -27 385 -578 -68 640
1794F40j413J321k56j031J450o83p29J716j230l11J285q96j18O99m97j45R8N2
$$ 640 -773 548 292 -739 711 28 -701 1015 -215 -526 759 -137 -255 444 -53 -198 -100 -48
1812d8J19r54J021L62j765J703O36k095J304J094k308R16O14j021M99K7K73k16
$$ -48 71 -883 138 500 -1265 438 1074 -1021 283 1377 -931 -15 599 -422 77 104 377 161
1830A61o95J036m30r38J439o39l82P70m79j4P46r35O49K85j434J353j3j335J343
$$ 161 -534 502 72 -866 573 -66 -448 322 -157 -171 575 -360 289 574 -860 493 480 -855 488
1849D88o0j190P52K11k38k33M5J129j625J1J797j293j031K429r59r13J240m03
$$ 488 428 -762 -10 201 -37 -270 -225 904 -721 -710 1087 -206 -1237 1192 233 -680 560 157
1867A57o60O30O8O2o43J92Q91j401J54J313j178J22Q76j111O40k40j52Q16j017
$$ 157 -503 127 195 257 -386 -194 697 -704 -550 763 -415 -293 583 -528 112 -128 -280 536 -481
1886d81J94J481j547o2J508j304q0Q01m90l36NQ28k12j291J383M49k061J196Q22
$$ -481 -287 1194 -353 -415 1093 -211 -291 510 20 -316 -311 517 305 -986 397 846 -1215 -19 803
1905H03k012R60J377j755L01P01q6l93l09J039l45j240J215M8j298J303J75r91
$$ 803 -1209 -249 1128 -627 -326 375 289 -104 -413 626 281 -959 256 304 -994 309 484 -507
1923e07N03m8L64j53j081J347p8j221J487K49j715J316J80j124LO57J74p38k18
$$ -507 -4 -52 312 159 -922 425 347 -874 613 862 -853 463 643 -481 -478 179 353 -385 -603
1942f03J716j340o59K047j123j313K055l32j284Q03K38k91M5K49P49j306J32J259
$$ -603 1113 -227 -886 1161 38 -1275 780 448 -836 -33 205 -86 -41 208 957 -349 -217 1042
1960A042j498l13J471p13m25P26l17L32l60o9Q50j199j70J504j240m82J462m85
$$ 1042 -456 -769 702 -11 -436 290 -27 305 -55 -124 726 -473 -643 861 -379 -861 601 116
1978A16n96Q20K5m48l86R36j41j430J121J095j921P70J193j863M67P53q06k45
$$ 116 -480 340 365 -83 -469 467 326 -1104 17 1112 -809 -39 1154 -709 -242 511 -295 -540
1996e40L55O15k98p03J008K92j214O73L41r49M18J52l47K99m04O91P1j218J232
$$ -540 -185 430 132 -571 437 729 -485 188 529 -420 -2 150 -197 102 -302 389 460 -758 474
2015D74L8j602J179N68j283L67P79l90k90J18Q54q06n90J393q80p84J641p55q95
$$ 474 512 -1090 89 657 -626 -259 520 130 -160 -42 812 6 -584 809 -71 -855 786 31 -864
2034h64J403k76p53M54J16k42Q5m34J065n71j97J064q21l29P25l18r6J83n55P24
$$ -864 539 263 -490 -36 80 -162 -77 -511 554 -17 -214 850 29 -300 425 107 11 194 -361 363
2054C63m66m58J390j094l35J365q01o40J018l18m57M88K44J1o38M49P87j489M11
$$ 363 -103 -561 829 -265 -600 765 -36 -676 342 24 -433 55 299 310 -328 121 908 -581 -170
2073a70J017j315K30Q41j066O11J19m67L64k98p6L94n24M93K52r82N95J16l51
$$ -170 847 -468 -238 603 -463 148 267 -200 164 -134 -210 184 -340 153 405 -577 18 134 -217
2092b17O17k50J8M59j197N59O84j430Q36O55j305O88K38l95J02j93K33l3n73R50
$$ -217 400 150 168 627 -570 -11 673 -757 79 734 -571 117 355 -40 62 -131 102 69 -504 446
2112D46k67q49J161j76r79J044l05o26R40l88j51L40j81K40j61n68O31j09l60
$$ 446 179 -670 491 315 -664 380 75 -551 389 1 -150 190 9 249 88 -480 151 42 -318
2131c18O00k82Q5J79k99M38m08l47J017n63n35R02n25k74P04l89m03N14l84K47
$$ -318 282 0 85 264 -35 403 -5 -352 665 102 -433 469 -56 -330 374 -15 -418 96 -288 -41
2151d1Q8k50N99p58K05N67p79K23Q17j084O06L34q17L44M5m48N21J1m09L58m31
$$ -41 47 -203 396 -362 -157 410 -369 -146 671 -413 193 527 -290 54 99 -349 172 183 -226 132 -299
2172b99L69K18n19L29j52j17L71n90J4J104j032M54M60j112M08L98o32M30R7m25
$$ -299 70 288 -231 98 -54 -171 200 -390 -376 728 -304 150 610 -502 -94 304 -328 102 199 -226
2192b26L74k10P2M1k44L13J5p17J089n02n17J017o02k12R07m37k11M21p19O11
$$ -226 148 -62 10 51 -193 120 135 -582 507 5 -512 505 -97 -309 598 161 -50 371 -348 263
2212B63l22j83K39N7k12M31m59Q4M99q20N54O8q53R12j2p07Q61k51l84N60k69
$$ 263 -59 -242 -3 54 -158 273 -186 -102 397 -423 131 199 -654 258 246 -461 400 149 -235 325 56
2233E6m6M6j11J42l40J42M90n02j09P70j042N59M34j109P23K13n55K36K05j23
$$ 56 10 56 -55 87 -253 -111 379 -123 -232 538 -504 55 489 -620 103 316 -239 -3 202 79
2253G9J33l9m66N48o25K92L87m98M09l72O9N13o05J3P27p72J48N14q18K14M54
$$ 79 212 173 -293 255 -370 -78 309 -189 220 -152 -83 430 -175 -162 565 -207 -59 455 -363 -149 305
2274C05l77K51j88j84K64j96J94J7o42P17l3p31Q50j06m30N91k24l27M56l35m6
$$ 305 -72 179 -9 -193 71 -125 69 86 -556 161 128 -603 247 141 -289 302 78 -249 207 -128 -174
2295a74N95m76L74j25m38J83J50m52M57k93J48J19m53O92j66o61O72m2o68O57
$$ -174 421 -55 319 194 -244 -61 89 -363 94 -199 -51 68 -385 307 141 -520 152 110 -558 99
2315I9nl42M76N8m37J18P6K40l57j61P00o44k42J052p26k36O59n76K98K01m79
$$ 99 94 -248 228 286 -151 -33 43 283 -74 -235 465 -179 -421 631 -95 -331 328 -248 50 251 -228
2336b28M86j29l63M75m22J13K05l17J13L94m18P5k22L11L54r71L01Q26p99O5P56
$$ -228 258 129 -234 241 -181 -68 137 -180 -67 327 -91 -16 -238 73 427 -544 -243 583 -216 -151 605
2357F05o86j73N20j88k19J42K65Pl87K74k5n83M66K28o71N14Lp5O6k30N2J69j88
$$ 605 -81 -254 266 78 -141 1 266 273 -114 160 135 -448 18 246 -425 89 92 17 83 -147 -95 74 -114
2380a14P2K19l82J58K31l54K06l9m4R0l67N71m48l20Q60j70p59R10j09p50R18
$$ -114 -42 177 -205 -47 184 -170 36 -3 -47 43 -324 247 -201 -521 339 169 -590 320 211 -539 379
2401C79j16m53J36J86L2j37l5N90o84p8N85m37l57O93l34k85N54j68O6j53j53
$$ 379 263 -190 -54 132 164 27 -8 582 -102 -180 405 -32 -389 304 -30 -315 239 71 137 -16 -169
2422a69M36m40j85N28k74j67N68k75n4K9j0J66n80M72M12r18K97P60p89k50R87
$$ -169 267 -173 -358 170 -104 -271 297 22 -32 -3 -13 153 -427 45 457 -461 -164 596 -193 -443 544
2443E44m42l01M99k29k18R6K13P8p22O05J30o21M84K70p70Q9L60r6p3j12J33L20
$$ 544 102 -199 300 71 -147 -51 162 240 -482 123 253 -368 116 386 -384 -295 65 -31 -104 -216 -83 237
2465B37m32L27L72p91L53K65n91K75K9O1j53j67N83l49n20P32j34o62Q77N4p57
$$ 237 -195 132 504 -287 66 331 -260 15 44 105 -48 -215 368 19 -501 231 97 -565 312 366 -391
2486c91K55L70j47p7L8N3j63j17M05k95k69O65k32k53L03k23r3K56j61M9K1l85
$$ -391 -136 234 87 10 48 101 -62 -179 226 -69 -338 327 95 -158 145 -78 -171 85 -76 -27 -6 -391
2508c91P82l55l19O82k93j49L39n65M53k98L7L57m94QQ36o43k13P23p43n2M34
$$ -391 391 36 -283 399 106 -43 296 -269 184 -114 -77 280 -214 -206 630 -13 -226 497 -246 -298 136
2529A36o1r7K1J24O5m19K50J48l38J82K07o03M11m5K7p6R4L5J62j91k62N40o02
$$ 136 75 -22 -1 123 188 -231 19 167 -171 11 218 -385 26 -19 8 -68 26 61 223 32 -230 310 -292
2552b92J76L07m12J88J43k09J50J18j64P1l77P05r1m84K70p4k13K29J16l78K36
$$ -292 -116 191 -221 -33 110 -99 51 169 5 76 -301 404 313 -171 99 25 -188 41 157 -221 15
2573A5K65l14j59LL42o1m12P19k99j50J77j66k43N59m39N3K43k12J79L8l97K35
$$ 15 280 -34 -193 -190 152 91 -321 398 99 -51 126 -40 -283 276 -163 -110 133 -79 100 138 -259 -24
2595b4p3K1K57o08M03N2k70L67j32l26O63m14j65O49l70j48L41l69n7J86j72J68
$$ -24 -97 -76 181 -427 -24 28 -242 125 -7 -333 330 -84 -249 400 30 -118 223 -146 -203 -17 -189 -21
2617b1N1j85L40m92M4L33l67L56M1j94L02o6l06K63k37O2K72k08j25L88k57n8
$$ -21 30 -155 185 -307 -263 70 -297 59 100 -94 208 142 -164 99 -138 -76 196 -12 -137 251 -6 -64
2639f4R4k72K34o5J35K49o27N13J37o67K91M38m69J83r0j56K8J5J0R6j89P5J13
$$ -64 30 -242 -8 -73 62 311 -316 197 334 -333 -42 396 -73 110 20 -136 -108 -93 -83 13 -176 -101 12
2662A2P8n5j35k04L72p8q7K01l16J23K98j98j29L96l38K19k35k44L87K2o0P0j66
$$ 12 90 35 -100 -304 68 -10 -97 104 -212 -89 209 11 -118 278 -60 159 -76 -320 67 89 29 99 -67
2685f7oJ7q5K92m28KN28j06k29L40o03L50K75m55K78m7k84L64k60M6K70l58K73
$$ -67 -73 -56 -141 151 -277 -275 253 147 -82 258 -345 5 280 -175 103 56 -228 136 -124 -78 192 -166 107
2708A07n0k39m8L50n7l5j71L8L66j80k46L18p2j80K87k97Q6L2j93J50n2J19j3
$$ 107 57 -182 -230 120 63 28 -143 -105 261 81 -165 153 81 -99 188 -109 -23 9 -184 -34 -86 33 20
2731B0k95L43N5l97J40J94j45K18q8o9J37o5J0N4Kj24J24k78K39m4j13K14j26
$$ 20 -275 68 123 -274 -134 60 -85 133 45 -24 113 48 58 112 114 -10 114 -164 75 31 -82 132 6
2754Fj5L6k58J49L25l93K01J28n43M67m2k16Q7p7j49M77l88K29J02j45J9j3k04
$$ 6 -9 27 -231 -82 243 -150 51 179 -364 103 61 -155 -68 -145 -294 183 -205 24 126 -19 0 -13 -217
2777b17L41j98k3M27l88L0J39j97J67m4j73K53l7n0J24o1k78N25l56jQ2n9J12
$$ -217 124 -74 -97 330 -58 -28 111 -86 81 37 -136 117 80 30 154 93 -185 340 -16 -17 65 6 118
2800A18n1j79L82l69r3M35k63j53J67K6O8J09k46J01k34K16K2l11J45M28n28J57
$$ 118 67 -112 270 -99 -192 243 -20 -173 -6 20 88 197 -49 52 -182 34 56 -255 -110 318 -210 -53
2822e3K49m51K02J88l10L27p8j72M3K2O4Q4k67J94r2O0n2R5J1j43R1k67M2J22
$$ -53 196 -255 -53 135 -175 152 74 -98 -55 -33 31 115 -152 42 -50 10 -42 53 64 -79 12 -255 -213 -91
2846i1P8K96m05mL89m24J42p2L8M2r8K66j96R2p3J36k49K80k71N2J76N7l76M30
$$ -91 -13 283 -122 -126 263 -161 -19 -91 -53 -11 -109 157 -39 53 -20 116 -133 147 -124 -72 104 161 -215 215
2870B15k97J51r3m6J30q6k05L63m2k40J95j28J46j03N7K06k98J3O7j41J20J31
$$ 215 -82 69 -24 -70 60 -26 -231 132 90 -150 45 -83 63 -40 17 223 -75 -62 5 -136 -16 115
2892A15m1l67M98M8l79n0J00J81k6N4%l23J35L96m37J42J18j09l1J63j45kPj80
$$ 115 74 -293 205 253 -126 -176 -76 105 79 133 133 -190 -55 341 -96 46 164 55 24 187 42 40 47 -133
2916a33K24m03L94O1j55L6R2k1j20J63k23J97m8O7n6l37K45J69l50J15K83l11
$$ -133 91 -312 82 143 -12 24 116 95 -25 138 -85 112 64 131 75 -262 -17 152 -198 -83 200 -111
2938a11L3j39K84R5k94K94l9k49L10o4l95L03J1r0Q1Q1j76L5J01r2J2k9K34j16
$$ -111 -78 -217 67 162 -132 162 123 -126 184 120 -275 28 39 -51 30 111 -65 -30 71 -21 -9 -38 196 80
2962H0m63L65j48J19J48p6j21K2l2J15p6l4K86j72j19L66l44K7K07j12J2j18J63
$$ 80 -383 -18 -166 -47 101 25 -96 -74 -106 9 -67 -101 185 13 -106 260 -84 -57 150 38 50 -68 95
$$ [...]
8191C2
##END NTUPLES=NMR FID
##END=
