##TITLE=1H_70-2024
 CDCl3
 8 sc, 
 6.9.2024
##JCAMPDX= 6.0         $$ Bruker NMR JCAMP-DX V2.0
##DATA TYPE= NMR FID
##DATA CLASS= NTUPLES
##ORIGIN= UXNMR, Bruker Analytische Messtechnik GmbH
##OWNER= root
$$ XWIN-NMR		Version 3.5
$$ Fri Sep  6 14:06:57 2024 Russian Standard Time (UT+4h)  she@DPX200
##.OBSERVE FREQUENCY= 200.1318
##.OBSERVE NUCLEUS= ^1H
##.DELAY= (6, 6)
##.ACQUISITION MODE= SIMULTANEOUS
##.ACQUISITION SCHEME= undefined
##.AVERAGES= 8
##.DIGITISER RES= 18
##SPECTROMETER/DATA SYSTEM= spect
##.PULSE SEQUENCE= zg30
##.SOLVENT NAME= CDCl3
##.SHIFT REFERENCE= (INTERNAL, CDCl3, 0, 15.7039)
##AUDIT TRAIL= $$ (NUMBER, WHEN, WHO, WHERE, WHAT)
$$ ##TITLE= Audit trail, XWIN-NMR		Version 3.5
$$ ##JCAMPDX= 5.01
$$ ##ORIGIN= Bruker BioSpin GmbH
$$ ##OWNER= she
$$ F:/spectra/data/she/nmr/H-F/1/audita.txt
$$ ##AUDIT TRAIL=  $$ (NUMBER, WHEN, WHO, WHERE, WHAT)
(   1,<2024-09-06 14:05:59.68 +0400>,<she>,<DPX200>,
      <created by zg, POWCHK disabled, PULCHK disabled
       configuration hash MD5:
       00 E9 B6 7A A2 85 ED C7 34 08 36 98 17 FE 4E 26
       data hash MD5: 16K
       57 20 DC 24 91 17 D3 FA 1E B1 29 3A 5D 10 98 3D>)
$$ ##END=
$$ 
$$ hash MD5
$$ 81 F8 9A 17 EE C7 B3 F6 E4 4C D1 FB 63 0B D2 8F
##$RELAX= 
##$RELAX= 
##$RELAX= 
##$RELAX= 
##$RELAX= 
##$RELAX= 
$$ Bruker specific parameters
$$ --------------------------
##$DU= <F:/spectra>
##$EXPNO= 1
##$NAME= <H-F>
##$PROCNO= 1
##$TYPE= <nmr>
##$USER= <she>
##$AMP= (0..31)
100 100 100 100 100 100 100 100 100 100 100 100 100 100 100 100 100 100 
100 100 100 100 100 100 100 100 100 100 100 100 100 100 
##$AQSEQ= 0
##$AQ_mod= 1
##$AUNM= <au_zg>
##$AUTOPOS= <>
##$BF1= 200.13
##$BF2= 200.13
##$BF3= 200.13
##$BF4= 200.13
##$BF5= 200.13
##$BF6= 200.13
##$BF7= 200.13
##$BF8= 200.13
##$BYTORDA= 1
##$CFDGTYP= 0
##$CFRGTYP= 5
##$CHEMSTR= <none>
##$CNST= (0..31)
1 1 145 1 1 1 1 1 1 1 1 1 1 1 1 1 1 1 1 1 1 1 1 1 1 1 1 1 1 1 1 1 
##$CPDPRG= <>
##$CPDPRG1= <>
##$CPDPRG2= <>
##$CPDPRG3= <>
##$CPDPRG4= <mlev>
##$CPDPRG5= <mlev>
##$CPDPRG6= <mlev>
##$CPDPRG7= <mlev>
##$CPDPRG8= <mlev>
##$CPDPRGB= <>
##$CPDPRGT= <>
##$D= (0..31)
0 1.2 0 0 0 0 0 0 0 0.06 0 0.03 0 0 0 0 0.0002 0 0 0 0 0 0 0 0 0 0 0 0 
0 0 0 
##$DATE= 1725617159
##$DBL= (0..7)
120 120 120 120 120 120 120 120 
##$DBP= (0..7)
150 150 150 150 150 150 150 150 
##$DBP07= 0
##$DBPNAM0= <>
##$DBPNAM1= <>
##$DBPNAM2= <>
##$DBPNAM3= <>
##$DBPNAM4= <>
##$DBPNAM5= <>
##$DBPNAM6= <>
##$DBPNAM7= <>
##$DBPOAL= (0..7)
0.5 0.5 0.5 0.5 0.5 0.5 0.5 0.5 
##$DBPOFFS= (0..7)
0 0 0 0 0 0 0 0 
##$DE= 6
##$DECBNUC= <off>
##$DECIM= 24
##$DECNUC= <off>
##$DECSTAT= 4
##$DIGMOD= 1
##$DIGTYP= 9
##$DL= (0..7)
0 120 120 120 120 120 120 120 
##$DP= (0..7)
150 150 150 150 150 150 150 150 
##$DP07= 0
##$DPNAME0= <>
##$DPNAME1= <>
##$DPNAME2= <>
##$DPNAME3= <>
##$DPNAME4= <>
##$DPNAME5= <>
##$DPNAME6= <>
##$DPNAME7= <>
##$DPOAL= (0..7)
0.5 0.5 0.5 0.5 0.5 0.5 0.5 0.5 
##$DPOFFS= (0..7)
0 0 0 0 0 0 0 0 
##$DQDMODE= 0
##$DR= 18
##$DS= 0
##$DSLIST= <SSSSSSSSSSSSSSS>
$$ [...]
##$SUBNAM2= <"">
##$SUBNAM3= <"">
##$SUBNAM4= <"">
##$SUBNAM5= <"">
##$SUBNAM6= <"">
##$SUBNAM7= <"">
##$SUBNAM8= <"">
##$SUBNAM9= <"">
##$SW= 24.0689170037331
##$SWIBOX= (0..15)
0 0 2 0 0 0 0 0 0 0 0 0 0 0 0 0 
##$SW_h= 4816.95568400771
##$TD= 16384
##$TD0= 1
##$TE= 0
##$TE2= 300
##$TE3= 300
##$TEG= 300
##$TL= (0..7)
0 120 120 120 120 120 120 120 
##$TP= (0..7)
150 150 150 150 150 150 150 150 
##$TP07= 0
##$TPNAME0= <>
##$TPNAME1= <>
##$TPNAME2= <>
##$TPNAME3= <>
##$TPNAME4= <>
##$TPNAME5= <>
##$TPNAME6= <>
##$TPNAME7= <>
##$TPOAL= (0..7)
0.5 0.5 0.5 0.5 0.5 0.5 0.5 0.5 
##$TPOFFS= (0..7)
0 0 0 0 0 0 0 0 
##$TUNHIN= 0
##$TUNHOUT= 0
##$TUNXOUT= 0
##$USERA1= <user>
##$USERA2= <user>
##$USERA3= <user>
##$USERA4= <user>
##$USERA5= <user>
##$V9= 5
##$VALIST= <valist>
##$VCLIST= <CCCCCCCCCCCCCCC>
##$VD= 0
##$VDLIST= <DDDDDDDDDDDDDDD>
##$VPLIST= <PPPPPPPPPPPPPPP>
##$VTLIST= <TTTTTTTTTTTTTTT>
##$WBST= 1024
##$WBSW= 4
##$XGAIN= (0..3)
0 0 0 0 
##$XL= 0
##$YL= 0
##$YMAX_a= 431629
##$YMIN_a= -232746
##$ZGOPTNS= <>
##$ZL1= 120
##$ZL2= 120
##$ZL3= 120
##$ZL4= 120
##$ABSF1= 10
##$ABSF2= 0
##$ABSG= 5
##$ABSL= 3
##$ALPHA= 0
##$AQORDER= 0
##$ASSFAC= 0
##$ASSFACI= 0
##$ASSFACX= 0
##$ASSWID= 0
##$AUNMP= <proc_1d>
##$AZFE= 0.1
##$AZFW= 0.1
##$BCFW= 1
##$BC_mod= 2
##$BYTORDP= 1
##$COROFFS= 0
##$CY= 11.3945322036743
##$DATMOD= 1
##$DC= 2
##$DFILT= <>
##$DTYPP= 0
##$F1P= 15.6554695791079
##$F2P= 12.8336369535428
##$FCOR= 0.5
##$FTSIZE= 0
##$FT_mod= 4
##$GAMMA= 1
##$GB= 0.15
##$INTBC= 1
##$INTSCL= 1
##$ISEN= 128
##$LB= 0.24
##$LEV0= 0
##$LPBIN= 0
##$MAXI= 10000
##$MC2= 0
##$MEAN= 0
##$ME_mod= 0
##$MI= 1.114404
##$NCOEF= 0
##$NC_proc= 0
##$NLEV= 6
##$NOISF1= 3.799351
##$NOISF2= 2.8
##$NSP= 1
##$NTH_PI= 0
##$NZP= 0
##$OFFSET= 15.70392
##$PC= 1
##$PHC0= -25996.6
##$PHC1= 15.18748
##$PH_mod= 1
##$PKNL= yes
##$PPARMOD= 0
##$PSCAL= 0
##$PSIGN= 0
##$REVERSE= no
##$SF= 200.130013532006
##$SI= 16384
##$SIGF1= 3
##$SIGF2= 2
##$SINO= 400
##$SIOLD= 16384
##$SREGLST= <1H.CDCl3>
##$SSB= 0
##$STSI= 0
##$STSR= 0
##$SW_p= 3612.71676300578
##$SYMM= 0
##$S_DEV= 0
##$TDeff= 0
##$TDoff= 0
##$TI= <>
##$TILT= no
##$TM1= 0
##$TM2= 0
##$TOPLEV= 0
##$USERP1= <user>
##$USERP2= <user>
##$USERP3= <user>
##$USERP4= <user>
##$USERP5= <user>
##$WDW= 1
##$XDIM= 8192
##$YMAX_p= 0
##$YMIN_p= 0
$$ End of Bruker specific parameters
$$ ---------------------------------
##NTUPLES= NMR FID
##VAR_NAME=  TIME,          FID/REAL,        FID/IMAG
##SYMBOL=    X,             R,               I
##VAR_TYPE=  INDEPENDENT,   DEPENDENT,       DEPENDENT
##VAR_FORM=  AFFN,          ASDF,            ASDF
##VAR_DIM=   8192,          8192,            8192
##UNITS=     SECONDS,       ARBITRARY UNITS, ARBITRARY UNITS
##FACTOR=    0.0002076,     1,               1
##FIRST=     0,             0,               0
##LAST=      1.7004516,     0,               0
##MIN=       0,             -232746,         0
##MAX=       1.7004516,     431629,          0
$$ Real data points
##PAGE= N=1
##DATA TABLE= (X++(R..R)), XYDATA
0 0 0 0 0 0 0 0 0 4 -8 8 -8 12 -16 16 -23 24 -32 36 -44 50 -62 70 -82 95 -108 126 -142 164 -185 210 -235
31 -235 266 -298 332 -372 414 -463 514 -571 633 -701 776 -858 952 -1055 1169 -1297 1444
48 1444 -1610 1802 -2029 2297 -2624 3030 -3551 4255 -5250 6793 -9531 15954 -67273 20540
62 20540 131594 153895 245066 307048 342532 181424 68025 22171 -68475 -140866 -210632 -209130
74 -209130 -112765 -102686 -56279 13971 65205 130615 108357 86768 106697 50349 10597 -42309
86 -42309 -86780 -74975 -110751 -113244 -70111 -52260 4942 31531 55002 104940 94288 91140 77253
99 77253 32064 22175 -18564 -51346 -48719 -63999 -47155 -34560 -29572 7434 9859 13795 23632
112 23632 6876 10260 -3122 -18183 -7336 -17963 -10577 2370 -434 17653 19207 16931 23620
125 23620 9892 8431 3828 -10224 -5611 -10777 -11291 -3482 -6377 2240 4871 791 7035 1166 -2218
140 -2218 -1583 -9251 -7531 -7846 -10331 -3843 -4356 -1559 4572 3059 7187 8097 6235 9048 6154 4952
156 4952 6018 1221 1331 301 -3513 -2287 -4414 -5787 -3672 -6077 -4273 -2284 -4088 -169 -610 -392
172 -392 2914 1105 2703 3396 1325 3175 1014 -714 1407 -2560 -1726 -250 -2494 998 -198 823
188 823 4405 1602 4033 4444 583 2400 -1173 -3325 -2210 -6849 -4279 -4507 -5564 -159 -1329 865
204 865 4761 2122 5198 3739 533 3493 -1478 -993 -812 -4063 -101 -1039 -1049 3286 181 2634 3156
221 3156 -439 2149 -950 -2077 -272 -4255 -1311 -1517 -3254 1347 -818 396 2864 167 2795
236 2795 1413 -462 2056 -1784 -1112 -236 -2551 189 -287 -344 2488 594 2454 2646 548 2114 -481
253 -481 -1133 -576 -3247 -2268 -2129 -2489 397 -592 747 2403 1241 2984 2007 289 1257 -978 -1119 -1084
271 -1084 -2204 -696 -420 -664 1289 730 1665 2200 892 1145 81 -1009 -742 -2021 -2050 -1166 -1822 -419
289 -419 266 642 1573 1185 1390 1562 109 398 -469 -1238 -445 -1181 -859 393 -510 1100 1156 555 1918
308 1918 468 379 548 -1381 -425 -1234 -1701 -393 -1231 -224 973 646 1914 1228 795 1700 -509 -386
326 -386 -180 -1587 -558 -1263 -991 366 -965 462 1093 235 1200 -47 65 528 -1502 -508 -849 -1343
344 -1343 173 -910 642 1255 326 1605 688 223 979 -1026 -242 -805 -1636 -407 -1083 -903 385 -546
362 -546 711 712 426 904 -323 -74 66 -1053 62 -603 -469 484 149 1036 1241 1052 1319 593 -257 11
382 11 -951 -762 -1167 -1556 -796 -536 -227 345 512 1201 888 692 282 -4 -299 -356 -847 -426 -602 -218 394
403 394 603 944 785 798 419 371 62 -597 -940 -984 -991 -710 -718 -479 77 299 857 720 1065 785 -279 161
425 161 -228 -577 6 -1083 -81 303 -429 907 468 579 991 -107 367 -191 -1003 -36 -1461 -776 -168
444 -168 -1013 797 79 509 1137 -78 814 629 -816 614 -686 -657 110 -1201 294 202 -317 1447
462 1447 15 586 955 -609 695 -650 -1379 -327 -1519 -196 143 -608 1389 169 725 1371 -575
479 -575 928 -74 -1098 142 -1348 -865 284 -870 833 177 49 1470 -85 446 877 -704 958
496 958 -939 -839 -44 -1522 76 328 -514 797 -89 350 1068 -544 862 -296 -856 60 -1279 -500
514 -500 -21 -903 961 -94 248 1128 -69 476 439 -558 96 -812 -936 301 -838 181 194 -141 1099
533 1099 324 439 699 -640 108 -472 -1036 39 -761 -448 118 -388 960 531 327 964 104 67 10 -773
553 -773 -291 -798 -870 -148 -525 122 584 151 1218 583 69 468 -552 16 -235 -980 -179 -723 -577 269
573 269 -72 530 577 -10 903 -136 -307 374 -705 -499 -248 -471 340 -400 28 824 173 771 70 -278
593 -278 61 -682 -335 -196 -1032 -172 -221 -207 517 88 454 719 -186 411 -75 -153 121 -945 -301 -275 -640
614 -640 710 -125 419 815 132 639 330 -106 256 -282 -484 -280 -936 -494 -103 -185 362 119 437 893
634 893 143 654 151 -287 -175 -834 -184 -22 -519 117 -136 -65 665 2 560 207 -175 271 -345 -195 -74
655 -74 -260 74 -260 -161 492 -47 273 221 171 292 96 2 -96 -251 -70 -21 44 533 55 149 333 91 -42
678 -42 431 -26 -153 -63 -576 153 -61 -195 -31 -36 255 199 48 115 104 -94 -93 -296 -218 242 -249 140 246 262
702 262 226 295 315 198 -549 -1 -209 -327 24 -418 34 0 -90 301 255 245 450 30 -63 -216 -683 -146 -518
725 -518 -312 25 -319 390 477 662 529 512 276 428 -491 -380 -384 -698 -205 -985 -305 -98 78 360 277 495
747 495 742 -4 141 -101 -698 106 -634 -348 3 -367 -24 41 -34 208 107 421 405 -218 146 60 -707 -110
769 -110 -46 -165 -235 -344 169 83 -68 278 -127 176 -32 -288 74 -266 10 406 -188 245 233 -27 401 -75
791 -75 -63 -466 -628 -333 -240 -566 272 224 10 201 238 208 274 4 344 -52 -434 107 -558 -111 -220 -206 379
814 379 -79 -84 158 21 265 232 -377 125 -463 -116 -13 -333 -30 17 -217 564 -14 393 410 26 61 -122
836 -122 -336 -295 -460 129 -75 -342 227 15 -42 212 -351 24 -13 -606 183 -435 6 111 -664 -258 102
857 102 -256 415 32 85 448 -147 242 -150 -489 225 -573 -211 -76 -217 363 -258 -224 331 -214 437 44
878 44 -253 315 -83 -350 12 -330 281 332 -121 537 -187 27 529 -286 175 -5 -239 -8 -182 -123 187
899 187 53 142 -69 44 268 -503 96 -3 -338 100 -364 -9 219 -86 209 116 345 286 -109 -242 97 -451
921 -451 6 37 -91 -88 -292 -188 171 -210 191 250 -413 157 -119 -58 30 -264 -176 221 115 382 99 -96 342
944 342 64 -63 127 -408 379 60 -281 138 -33 -319 302 -294 130 267 -120 342 -202 -47 296 -90
964 -90 1 -108 -274 -52 -115 56 183 -71 550 -205 59 259 -402 -36 -295 -193 -106 -512 -221 43 -331 345
986 345 249 64 447 -237 212 95 -211 166 -398 -152 154 -273 239 63 -14 521 -67 -290 340 -550 197
1007 197 -132 -138 289 -393 87 67 -132 414 228 -93 523 -333 50 -130 -233 131 -173 38 239 -391 213
1028 213 143 49 158 -182 210 180 -521 47 -428 -459 332 -743 68 97 -99 752 -201 53 88 -46 69 102
1050 102 -475 22 -194 142 26 -129 230 -205 426 216 -293 140 -328 -229 508 -176 115 47 -422 151 12
1071 12 263 361 -62 -164 246 -197 28 -10 83 403 -234 183 -173 -202 196 274 449 310 -35 120 -93 -47
1093 -47 112 -341 -112 -163 169 115 -28 218 167 53 211 64 148 -34 -211 -45 -213 109 257 167 16 211
1115 211 -186 140 -18 -104 -112 17 -323 -326 10 -39 34 -44 118 -39 322 246 -58 -265 -149 3 97 65 -113 -301
1139 -301 354 304 22 165 303 168 -161 -118 -49 -159 64 -69 -285 -22 87 -89 19 61 331 -61 -66 -94
1161 -94 -206 -202 -175 -270 -263 72 88 237 223 97 366 -54 -2 120 -260 -14 -281 -59 -379 85 112 458 13 234
1185 234 -105 -240 75 -188 -32 102 -119 276 -54 -37 109 -218 70 386 -6 106 247 35 67 -262 229
1206 229 -337 -10 65 -190 82 -22 -193 -65 -86 7 196 -204 -106 283 -107 60 -74 143 583 75 301
1227 301 -36 -434 213 210 -142 361 58 87 56 94 250 263 337 108 -54 397 -190 26 117 -249 -71 157 -345
1250 -345 -140 -345 11 -2 -35 -10 35 62 182 -261 -57 140 -367 469 29 -300 82 -108 93 236 -235 261
1272 261 -31 -147 346 -290 281 -219 -589 124 -106 -174 57 -91 350 220 -141 415 -234 70 311 -51
1292 -51 69 -371 -336 109 131 8 139 -309 57 -19 292 229 -176 180 95 -147 179 -306 47 -154 23 201
1314 201 -163 -142 69 119 167 -71 175 428 -381 -3 -24 -24 110 151 11 238 -73 -43 -238 -186 -108 -49 -194 119
1338 119 -96 -38 -95 -24 71 188 41 0 -142 -99 64 -92 378 -160 -35 214 101 61 -33 176 -54 149 -159
1361 -159 -111 -57 153 88 96 -125 200 -41 91 88 -200 32 -147 -48 191 -260 -178 48 -149 221 -99 193 201 29
1385 29 190 11 143 67 -294 180 1 -290 132 -195 -354 265 -91 -12 32 -64 62 39 59 159 -239 -203 24
1408 24 -2 120 119 96 228 -268 -56 -105 -248 135 15 6 -271 -206 212 -160 -156 192 35 -121 99 139 233 -122
1432 -122 -184 148 -166 -108 22 -302 326 -285 154 -125 -17 284 126 -101 -99 -646 -221 10 -141 -42 -18 36
1454 36 10 -52 55 -12 -185 58 -62 -51 -86 -101 5 -154 -28 207 77 -183 253 -359 -97 -188 -16 -302 -252
1477 -252 -11 -4 -37 135 -76 -141 400 93 -79 138 -56 254 71 5 -19 -64 406 221 23 19 -7 -109 108
1500 108 -216 189 54 57 -165 -100 -121 -93 -365 158 202 -21 16 -13 198 129 -77 -63 -109 -118 -21 -23 11 236 -307 -130
1526 -130 -284 -312 351 -175 -137 62 23 34 -91 -77 127 77 233 227 -102 399 52 -135 -90 -285 -100 -107 120 95
1550 95 237 -166 156 -237 -37 -208 -51 247 -28 -110 -87 -279 200 -105 123 -96 -215 113 -88 -10 -79 -13
1572 -13 -33 -58 204 189 -68 -245 84 69 -95 285 -31 140 265 -6 60 383 106 91 -108 -158 3 -32 -48
1595 -48 358 -132 -91 3 -56 30 -130 161 -14 157 180 -296 -272 -87 -49 66 63 178 16 -40 269 -12 -199 -275
1619 -275 13 -96 95 173 256 203 87 34 -265 -81 -40 -27 -135 -80 -50 47 -34 53 -145 154 261 338 48 173
1643 173 72 -16 266 -147 22 31 -456 -210 -218 -255 114 -151 86 9 26 131 -197 -72 209 -561 46 224 -168
1666 -168 224 -54 7 249 -101 -145 122 -38 244 26 -47 113 321 76 -65 92 26 -48 124 196 141 264
1688 264 -232 52 119 -178 -47 237 -166 -197 118 -409 139 -142 366 -119 121 -122 -206 -159 127 -382 -47
1709 -47 29 -11 27 -20 -257 50 262 -98 31 93 485 -245 452 107 62 38 -170 392 -46 -133 -128 84 -476 134
1733 134 -98 -126 -13 -94 181 77 28 -29 286 260 234 -77 -7 22 89 271 1 152 -108 -26 75 -124 8
1756 8 -8 -70 -171 125 24 45 -16 -176 35 -93 -2 -4 257 -105 -18 184 -231 114 24 156 172 -110 59 16
1780 16 64 -12 247 -127 -49 179 -309 140 -57 -66 -3 -112 46 10 -88 86 31 -190 59 -260 -3 -4 155 -26
1804 -26 -455 -170 109 -126 196 -384 62 201 199 -284 -91 92 252 -6 -19 69 -79 44 89 -129 -51 -57 -182
1827 -182 5 81 -40 -151 -15 -108 -357 209 41 -233 90 192 48 46 -29 -224 106 -245 -72 -14 -67 105
1849 105 -16 156 312 -151 190 -207 -152 283 -42 109 -142 67 218 -169 -9 -240 -440 190 -55 178
1869 178 10 226 110 6 -236 -206 -17 259 -156 13 -132 -21 303 -35 -109 208 71 47 19 -264 68
1890 68 117 -198 2 20 -119 -136 235 21 236 -71 -25 -176 139 227 205 -224 -192 -37 1 180 180 63 -4 20
1914 20 -79 32 128 245 64 -35 -137 30 -258 50 -26 -3 -123 -271 65 -162 -96 60 -49 174 183 -71 170
1937 170 -93 -10 109 -90 74 -109 161 -3 38 -15 68 -43 -98 66 55 177 75 -22 -5 -104 26 -47 31 -142
1961 -142 -15 285 -531 -295 -286 67 158 -124 495 -126 -123 -79 -141 186 -31 314 260 -18 40 -34 77 31 177 -241
1985 -241 296 -48 -21 -106 -128 24 0 -178 -307 -4 -33 -3 -44 -63 -78 -342 85 -120 -12 188 -30 73 109
2008 109 88 10 193 228 70 -150 -62 -132 58 107 32 43 -20 9 -208 111 -16 -269 -51 211 1 71 0 130
2032 130 183 139 -309 -49 150 -119 -40 59 -167 -125 -99 40 -36 42 -125 125 -371 150 8 260 -47 -62 185
2055 185 1 -43 -11 0 110 -116 -126 158 107 454 136 -182 122 -13 -65 -94 -6 -236 -90 -59 126 42 -70
2078 -70 295 45 -53 95 -82 -169 -126 -168 217 401 -85 -138 63 -340 181 -3 -174 129 179 218 144 77 95 -43
2102 -43 -261 75 -60 -53 117 -155 44 -34 -122 207 94 -76 281 -284 -20 -115 -85 27 275 -232 -14 -125
2124 -125 348 152 -24 218 -76 -82 -162 -190 -135 49 -142 163 -55 -242 -138 154 383 -152 -60 -43 -6 144 -51
2147 -51 -78 354 230 14 275 -240 417 169 78 53 -230 -206 -64 108 -97 -28 87 -209 45 92 131 -140 283
2170 283 -268 -307 28 -289 -82 -173 16 -26 -116 -60 -108 -292 -24 237 37 -86 -217 22 -115 -183 190 220 13
2193 13 225 107 141 -71 -29 207 17 -28 -109 -55 581 -111 -437 144 -92 128 135 220 172 -132 429 296 -128
2216 -128 -110 -170 200 194 -177 -108 -31 -181 -133 182 29 -284 -395 48 57 -348 149 -68 -43 99 -8 -17 5 -130
2240 -130 42 19 -50 -271 55 45 295 16 -8 185 157 120 -64 24 239 -101 48 -104 -200 -63 -68 -132 -41 135
2264 135 123 -197 -120 86 67 79 92 59 172 -38 225 -19 -2 -28 -114 158 -292 -346 -120 -188 197 -118 -156 -135
2288 -135 -73 -336 -180 -316 -6 -29 -41 23 159 279 -312 -203 -262 150 -90 63 -152 217 -165 -63 -19 -224
2310 -224 -213 -135 -76 8 -376 -53 309 84 -16 109 -157 -9 325 -77 -80 -473 133 -197 -89 -138 -313 71
2332 71 -11 -263 -26 -252 -20 248 -196 -125 236 -117 -9 -162 72 192 -450 -60 74 -244 44 250 147
2353 147 -16 168 85 -415 66 34 -80 22 231 -5 23 -153 51 151 -194 122 73 -358 25 -193 -243 101
2375 101 -85 -75 149 113 -205 120 -23 31 7 27 4 -398 21 16 29 -48 -485 179 -228 -53 112 93 208 148
2399 148 -169 51 146 85 135 168 -10 -246 -379 318 -152 -183 0 13 46 -176 -113 -26 187 -235 373 -64 252
2422 252 304 13 -26 -46 -318 -209 -57 192 -125 -1 -128 -111 39 -215 191 -108 97 -66 44 -133 24
2443 24 -51 43 -114 -153 -36 80 39 -160 -155 -59 -88 -61 179 -256 2 -222 -245 350 3 98 -549 -53 15 -198
2467 -198 -67 -150 69 -32 -194 -53 -120 -14 128 -225 279 -395 259 270 50 -44 -239 32 -141 139 -317
2488 -317 60 -17 -155 171 -124 81 10 65 -145 -96 164 93 312 16 -474 -236 -135 68 341 -157 82 122
2510 122 109 159 20 12 -358 313 93 9 31 111 322 -57 300 91 35 72 140 -16 121 -175 -4 93 -3 158
2534 158 -165 10 -83 211 362 -11 8 -222 -224 126 11 -247 -82 75 39 115 -25 128 -47 -308 -90 -217
2556 -217 -30 2 77 -58 41 -28 56 289 -199 78 -26 -137 173 2 4 -37 91 -65 -96 -103 -79 -53 -35 70 -263
2581 -263 112 221 204 -431 -81 -339 47 205 157 -48 198 147 -147 -72 225 -167 -63 -13 38 6 -75 265 208
2604 208 110 332 7 -84 -62 -58 33 187 183 -113 69 -261 50 348 107 15 359 -128 207 -297 -102 -30 6 -79
2628 -79 194 -241 -44 29 -552 40 74 325 36 161 58 127 201 -110 60 -71 -13 -52 74 189 438 44
2650 44 61 178 -189 -44 114 -22 -28 -306 -108 -6 118 -127 -161 -278 85 -185 -97 -74 -46 -29 38 -495 -219
2673 -219 47 9 -37 108 -250 91 10 94 -46 -25 169 -182 99 62 140 -280 -122 -40 -24 -29 -2 -159 -79 -12 88
2698 88 -148 120 42 -46 -202 246 -261 207 59 -123 -164 11 158 -87 -41 -149 -183 -6 109 230 66 -9
2720 -9 -42 98 -161 180 318 -125 91 220 -35 -274 25 -79 -186 -95 15 49 137 -164 -16 9 98 -95 205
2743 205 -70 162 -60 -367 64 -42 -329 -94 -64 16 126 41 138 -334 57 -381 24 172 14 71 -156 168
2765 168 -55 -42 287 51 -208 106 186 9 79 -131 217 237 -60 -102 78 -183 -248 -64 74 -280 -66 -4
2787 -4 106 113 193 -93 -34 341 68 133 120 183 136 18 60 -239 -33 253 204 215 76 -212 238 -32 194 81
2811 81 -194 21 90 -32 -257 -33 170 15 -281 73 43 69 227 20 204 321 -483 148 9 238 -52
2832 -52 -48 274 302 17 -143 -35 50 -116 187 -117 13 5 -171 -287 -82 48 -77 71 -44 42 193 -20 -135
2855 -135 17 -76 -68 -4 -124 -279 63 127 -156 102 -135 -1 9 -113 34 -413 99 -12 -229 -73 60 280
2877 280 -49 -39 -288 -70 288 79 -109 110 -64 -18 -25 147 130 19 68 -61 -33 315 31 -7 304 376 -133
2900 -133 0 34 18 103 -178 6 -157 257 -54 -106 246 243 -134 216 -195 280 151 -99 -52 -52 -339 -20 150
2923 150 -212 -175 66 20 -294 -1 18 -56 250 88 -31 2 -72 132 33 -196 -5 -202 116 40 60 23 -69 412
2947 412 74 -34 -265 -125 212 10 -199 22 -17 -148 159 129 163 -221 -112 -55 51 -157 -196 106 -89 -146
2969 -146 5 229 8 -106 4 196 129 149 33 -18 -61 -319 124 163 -96 133 83 -438 -273 -344 35 -38 -58
2992 -58 -220 -29 -119 207 -31 252 66 -116 -157 -127 -197 -153 -132 63 40 4 -76 -151 37 16 130 70 -297 31
3016 31 -40 -94 100 -123 -6 -10 46 -89 76 122 -5 47 -108 -133 -76 133 42 -160 36 40 -262 -156 -137 65 -50
3041 -50 -180 -37 -22 68 -167 -58 135 245 216 -67 -202 -114 -8 42 181 338 16 -90 -14 151 -211 93
3063 93 239 -138 25 -25 -13 26 -142 -87 36 14 14 -383 82 -121 98 -221 -173 -76 137 253 -246 -388 2
3086 2 -158 -31 -2 69 -90 -105 199 63 -108 -39 71 -218 46 -158 295 -279 287 16 8 17 89 30 69 238
3110 238 116 -160 51 14 -78 -260 -88 -25 62 -70 -8 -81 -248 46 4 248 135 -26 160 -151 16 -247
3132 -247 127 213 11 224 89 -90 -278 512 234 37 -39 -41 289 -188 21 -164 84 73 35 -53 -177 -185 33
3155 33 -35 -225 -39 -34 -289 89 -253 36 85 -98 233 -115 -127 -281 347 21 -211 -154 123 341 -154 -42
3177 -42 0 306 61 265 -89 -61 -113 -136 -356 -106 119 -290 -83 134 -159 126 185 -45 -247 -114 -107 -185 -11
3200 -11 94 -116 5 -148 -2 42 -16 78 -30 -104 -72 143 205 123 -144 -122 105 107 269 -97 60 -104 47 39
3224 39 22 -72 -265 63 -157 -74 39 75 170 234 -158 -177 138 -243 -450 8 -139 259 -173 -68 -55 -197 -219
3247 -219 -34 44 -169 -296 -61 127 218 125 -46 -220 72 126 -12 42 -427 -54 27 -201 -270 201 11 153
3269 153 -312 28 -36 -15 -17 -67 51 24 -133 242 17 -300 4 195 -79 -12 -44 -194 45 -269 -309 18 139
3292 139 -64 299 -125 -10 -15 68 156 165 42 -203 105 -246 -74 -263 -317 -7 -155 97 258 -17 -11 -7 71 234
3316 234 112 -117 26 -53 51 -203 -149 -4 39 -27 145 -62 223 224 20 3 58 -103 -116 39 28 101 101 21 -66
3341 -66 209 22 124 -181 -189 277 -9 424 272 216 100 82 -180 215 -203 -26 297 -229 -184 222 -272 -277 62
3364 62 -3 162 -218 -107 -3 160 -37 247 136 -21 244 -369 187 -112 -80 -34 -135 -39 54 258 97 -55
3386 -55 194 -19 -5 -146 75 -73 -272 -58 54 45 -336 78 -206 -314 -67 -129 367 -111 66 235 -123 17
3408 17 144 272 -49 -22 208 125 290 187 263 -10 -300 58 139 80 -80 93 100 -46 38 -198 17 70 121 158
3432 158 -284 136 296 -8 -116 57 120 51 -94 -9 -157 -15 -59 -40 -9 50 156 83 121 111 -137 70 -136
3455 -136 0 -26 -393 85 19 60 -184 -105 -21 -66 -189 -112 38 51 138 89 -67 -64 37 -60 106 156 24 -167 112
3480 112 -262 67 97 59 268 -75 -53 6 -362 -71 -24 2 -28 5 -14 165 -50 183 -60 56 -47 73 126
3503 126 -354 -158 218 -358 -28 244 -197 31 -72 -11 -64 -118 88 151 -47 171 -185 -244 -148 -173 128 108 -36
3526 -36 86 -293 -17 18 -9 -75 256 218 189 -24 182 81 567 49 151 -75 76 25 -1 131 63 182 72
3549 72 185 -32 92 -410 289 36 87 177 260 -15 184 -204 36 77 -99 96 50 -239 -330 -70 -70 -334 -70
3572 -70 -248 13 0 -83 -391 -480 142 -60 56 14 55 65 214 61 -194 -181 -152 120 116 -234 -99 -229 -191 -152
3596 -152 29 80 5 26 -10 88 267 284 -25 1 -225 70 -160 -23 -35 312 -59 24 -262 358 -83 198 112
3619 112 -160 -245 -59 -126 -118 -140 9 -136 11 -324 24 93 -97 133 -316 -185 78 110 -69 135 146 -132 -193
3642 -193 -26 -533 144 -344 16 55 25 264 -93 70 -37 -24 77 -123 246 -96 84 -55 34 13 -41 364
3664 364 79 152 171 -68 -15 66 94 33 -258 -227 279 41 145 -172 40 -165 249 -172 10 -212 -45 -75 -22
3687 -22 80 -18 -100 238 -52 -126 96 290 55 -51 74 213 -21 25 -99 -193 239 32 23 143 51 -9 -88 143
3711 143 -86 -2 -103 -78 123 101 127 -33 62 -182 79 82 128 -67 297 -77 -24 -158 -97 -64 145 11 -51 213
3735 213 -131 259 -258 6 210 -4 -93 -238 197 53 78 -73 -117 -286 5 -202 162 -170 126 406 0
3756 0 30 109 -4 30 -95 224 318 -137 18 -71 2 -50 26 97 10 -264 -158 46 -78 -31 4 -309 164 99 81
3781 81 -285 -158 188 142 279 47 -66 5 -61 -154 -462 -28 -146 -75 -153 46 117 134 161 401 -109 -125 196 -185
3805 -185 -190 217 -94 -13 56 -239 -137 0 -84 -154 169 204 -179 -19 -243 -68 -206 273 209 299 -226 -171 -151 75
3829 75 189 198 -74 -226 238 -228 14 -29 103 -10 170 -23 -25 94 57 242 -215 41 284 175 -166 23
3851 23 -293 37 17 120 -235 -176 177 -141 37 -59 63 -186 -48 -126 17 20 -167 -24 14 -217 -169 -14 324
3874 324 -79 -128 -211 -96 -158 122 205 57 -95 -43 -64 228 -27 19 -253 -123 -195 115 -88 -87 -26 -20 -196 -231 10
3899 10 -6 260 63 120 166 -281 156 84 177 -122 48 213 -48 5 57 227 -77 117 95 -20 -79 -53 -80 -133
3923 -133 100 -288 -274 -267 -32 -157 63 98 -76 -231 53 214 -227 345 32 -200 -234 -275 -144 36 -27 45 -90
3946 -90 -46 122 -17 -38 -169 -163 31 -150 18 -142 -186 -366 1 -96 140 417 20 17 30 -44 149 -179 -73 -8
3970 -8 85 -117 -223 123 97 -99 60 62 -210 -40 -78 113 26 96 -86 -82 -77 -137 308 55 -6 -178 -351 -4 -220
3995 -220 -182 141 50 90 -151 -162 96 36 -237 197 -277 -99 175 81 -169 -55 236 31 206 70 -56 -124
4017 -124 -258 -163 296 -41 87 -238 -28 230 -382 -7 380 125 -9 200 71 -340 -208 -248 -5 -139 -78
4038 -78 -135 128 23 325 -2 69 121 -89 -24 170 -57 40 39 143 214 -118 -99 3 195 -212 25 139 114 -138
4062 -138 -20 0 154 36 135 235 132 -60 -204 -424 329 341 275 109 46 145 39 261 -95 -120 -35 -275 -61
4085 -61 23 336 7 38 -129 -35 -39 -67 -106 169 57 -284 -52 -206 242 -194 346 80 -131 219 125 -183 142
4108 142 328 100 -79 -71 -105 -120 -30 -81 103 206 149 4 -3 -84 -52 94 116 -112 264 -284 -162 168 -97 148
4132 148 -162 59 42 -114 92 -16 -94 -224 -99 -95 -200 91 90 -25 -437 5 82 229 54 86 205 259 120
4155 120 -30 -262 333 -222 89 -159 -45 88 -35 -294 -16 -206 222 33 176 -96 -275 65 -269 100
4175 100 22 152 -5 21 -147 8 77 317 -17 -218 -180 -145 -185 -39 61 85 -57 26 -475 -72 -24 -102 -37 -46
4199 -46 82 -86 202 -285 -254 371 93 389 -259 32 -168 67 116 -285 53 227 69 342 77 -66 -268
4220 -268 -72 97 205 147 -116 222 -152 -17 147 48 -79 138 147 -79 -5 30 122 39 -176 91 64 -42 148
4243 148 -72 -234 -36 95 -198 -267 -17 17 66 136 -225 -61 -122 -157 46 -34 143 380 313 31 -227 -190 7
4266 7 -174 127 52 57 11 220 47 -155 211 -203 337 -110 -218 291 -64 161 15 -375 237 119 -8 -41
4288 -41 -405 276 39 130 -288 94 -149 -377 91 48 49 -15 295 123 -293 117 245 52 235 -63 -72 25 -43
4311 -43 -133 -128 -277 153 -149 -52 -140 -166 29 207 200 -93 147 322 42 -273 -213 156 100 77 -75 -34 259 -192
4335 -192 -61 147 -93 -312 -1 17 -47 108 -29 -134 -316 15 146 210 -214 -101 -199 -306 143 -116 -143 -236
4357 -236 171 -82 -97 161 -266 10 5 -202 227 110 -378 64 61 -40 73 -51 44 -67 127 108 19 -29 100
4380 100 -49 -27 -19 -298 -298 73 -276 -45 419 -245 169 -270 -206 -11 47 -34 152 -302 -142 31 244 -54 -5
4403 -5 107 153 -234 -433 2 -30 120 -12 93 130 -242 34 -294 111 35 138 -135 217 0 111 -107 -69
4425 -69 233 -153 11 -150 153 -101 -48 -263 -237 -52 -455 -99 -17 123 59 69 98 -106 -66 -256 -82 230 -126
4448 -126 232 -47 112 163 112 4 88 106 185 242 -88 -75 117 -148 130 66 97 250 -96 76 -19 96 -126
4471 -126 -88 -366 -126 -181 -92 259 35 125 110 -117 -241 370 -131 7 49 134 -60 51 10 -101 96 -119 -44
4494 -44 -156 -304 -104 -153 -14 155 -131 94 -9 50 81 340 74 -136 -134 -115 -110 42 -43 72 -152 166 256 -258
4518 -258 -25 120 51 31 56 38 -62 30 219 -25 -161 136 123 -7 120 169 15 -114 70 -135 40 420
4540 420 120 81 -248 169 -550 -79 -212 -257 -9 -78 211 72 111 -168 39 -18 -82 -65 77 408 -140 -96 -18
4563 -18 123 -54 112 -209 -152 -55 -355 -53 35 227 165 176 194 -185 -95 131 17 -412 -22 -156 -50 6 -98
4586 -98 49 83 289 -63 50 91 202 -147 -136 -242 -7 69 179 -187 235 222 -128 29 -182 -33 117 -379
4608 -379 351 207 -284 35 -110 269 -230 13 -169 105 174 29 -49 44 -365 -39 347 50 -8 -20 179 -212
4630 -212 -264 -50 85 219 54 64 -65 338 -54 -251 -234 -223 -143 -231 86 125 17 -87 -75 206 272 -38 68
4653 68 -34 175 133 96 171 84 -108 8 28 -213 -30 136 -298 231 -338 -132 -68 -121 2 -245 45 -52 201
4676 201 -100 322 -68 330 156 23 312 -192 -333 60 56 -97 158 -146 206 -89 94 36 0 -166 -144 174
4698 174 -189 351 121 -44 -24 -96 70 442 -124 205 -233 -35 -131 126 116 145 66 246 -74 -39 184 147 -138
4721 -138 -396 55 -127 -113 -14 -16 55 24 -162 89 -5 82 -123 124 46 -237 82 37 -28 -138 91 -87 -35 241
4745 241 55 1 9 -130 -379 118 191 -74 -11 -79 -44 112 106 -90 73 379 105 148 56 -223 181 -193 -106 -19
4769 -19 160 -148 -48 -274 190 86 106 221 -182 -131 -192 -250 -155 56 85 -167 78 126 194 127 341 -168 -139 46
4793 46 -22 81 -264 361 -97 246 -1 -113 -104 124 -150 -97 107 -88 -22 -184 -38 201 29 -169 356 -261
4815 -261 -172 11 43 83 186 -278 -101 29 41 -24 -158 147 -33 -56 250 136 65 5 210 261 183 84 -186 109
4839 109 92 -65 -65 10 -242 -5 -64 129 148 193 148 334 -129 53 141 -169 154 281 -37 229 105 232 120
4862 120 -14 -176 95 -12 43 332 -51 -29 -160 569 -68 96 -178 -211 261 87 258 208 82 51 -133 139
4884 139 -105 -188 -29 -69 121 -9 31 2 -43 40 -153 148 -249 -80 -72 -27 -39 -215 -131 -55 130 54 -130 87
4908 87 194 104 160 -146 -21 251 -217 -119 18 33 146 112 -21 17 214 143 -222 -66 97 -164 -209 -179 26
4931 26 75 -97 71 88 141 68 123 -84 157 64 -101 -1 247 -177 13 -128 -52 -64 151 91 -169 14 -229
4954 -229 169 -90 236 52 -103 114 233 137 -226 -291 -11 -42 236 151 284 62 204 104 -221 -62 -193
4975 -193 -233 -28 263 155 176 69 -86 -66 49 252 -197 289 -108 -27 -45 -318 143 31 -90 -62 -195 148
4997 148 -83 -174 -215 40 26 60 -128 120 -133 254 107 168 -91 -234 -340 134 266 -54 -2 -111 -38 -126 249
5020 249 -160 -168 -33 -70 -79 55 -128 103 137 40 -8 -173 97 187 -67 135 -193 139 32 -49 71 140 -114 -199
5044 -199 114 3 4 -88 302 -9 -182 0 -236 121 249 203 283 -24 111 97 -331 -144 -74 -268 -115 -57 -43
5067 -43 249 -196 119 -222 -46 -9 56 216 -227 -48 -66 7 -295 -93 169 111 -30 30 -172 -384 1 239
5089 239 -82 145 -84 177 -166 60 187 16 51 63 -155 -201 50 -65 0 -275 -18 -148 86 126 40 11
5111 11 302 -223 147 -346 -25 -25 129 265 182 -75 -90 249 12 33 -46 -61 162 -34 123 -2 -160 -24 -152
5134 -152 30 -7 -23 -121 -103 -156 -70 -171 14 43 6 -230 -83 66 93 50 47 134 -194 -189 -181 215 178 -119 100 145
5160 145 27 -113 105 93 17 102 130 13 -123 245 223 -153 -94 -4 -403 30 -16 139 57 98 -104 -25 -145 328
5184 328 65 -84 -192 29 -24 75 145 120 97 -51 -77 -292 231 25 59 -13 19 86 112 4 -26 -82 35 131 -21
5209 -21 -118 -142 -74 2 246 201 -273 -87 -259 -36 -270 246 -50 -242 13 188 -199 -103 127 -317 28 -131
5231 -131 -181 146 120 -55 -71 11 -107 133 34 -356 -430 79 54 -219 -345 200 367 107 144 -340 5 -37 -55
5254 -55 152 -125 -40 288 23 -162 -30 -63 -173 66 334 -21 -78 -19 107 227 94 289 207 -167 -166 -205 352
5277 352 -180 32 35 83 -254 91 126 -194 -82 196 -88 -213 183 13 23 -304 83 -64 -233 -24 -134 53
5299 53 124 -77 -56 -38 -83 264 95 351 -18 -116 45 181 -38 -205 -72 -220 98 -10 -23 144 -122 -84 21
5322 21 102 42 14 89 4 -130 -140 -288 -250 208 -48 148 -89 -47 -181 -91 98 -4 -207 28 47 81 -18 -164
5346 -164 217 -249 226 148 16 -131 238 -4 -307 10 -100 -32 -54 69 162 144 -8 25 -63 119 100 -258 -199
5369 -199 237 95 -358 273 -79 -42 -100 19 -127 16 -202 -100 -117 207 -237 -17 105 168 -196 47 -188
5390 -188 -258 245 -119 43 226 227 218 8 -353 -3 91 75 62 110 86 167 42 -87 -162 -91 -144 155 -140 39 -122
5415 -122 125 166 -71 63 -132 176 20 -58 -77 -103 -118 90 28 -197 -105 -110 201 -162 103 284 8 21 48 47
5439 47 418 -7 -202 188 81 -81 188 -52 102 -163 -60 -29 -48 71 154 -468 16 295 -73 170 -169
5460 -169 128 179 -54 -39 -84 182 -114 186 86 255 35 -271 242 5 136 38 -258 49 -269 180 -1
5481 -1 -24 47 -316 118 -33 -67 210 262 -121 166 388 -117 119 89 -287 -31 -159 170 -297 60 240 -54
5503 -54 -152 65 22 178 -30 -215 -75 18 -190 162 -281 -152 102 145 207 -394 301 -115 4 211 -21 175
5525 175 -156 45 -63 -50 -201 210 -2 -49 72 162 283 -161 69 -439 -303 10 80 -70 -120 -177 227 -81
5547 -81 -41 -78 195 -184 48 -78 -14 -1 -132 170 -87 -31 -77 -208 -107 -124 179 -285 -108 33 -126 62 47
5570 47 218 229 -61 165 -528 -71 82 46 -78 -145 69 7 33 80 6 72 162 135 -27 231 -94 -64 -39 -230
5594 -230 42 -271 -48 106 207 30 -30 -250 -124 -95 30 73 -102 129 32 43 161 170 -74 -291 -327 -54 123
5617 123 -41 -7 -278 -186 48 -41 -40 52 -79 267 104 269 -130 -141 -70 -85 25 204 156 57 -158 -137 62 -416
5641 -416 -188 112 50 134 322 -28 88 -7 -149 31 -5 -8 213 15 29 181 -79 -21 253 71 -64 -163 143
5664 143 -91 -133 68 -100 122 242 -38 -46 21 -32 136 170 4 24 -134 35 -26 -274 -127 210 -54 202 -283
5687 -283 -31 200 -108 -148 -150 -60 157 -91 5 207 -59 -176 -249 105 -257 -28 -234 98 -146 236 -9 60
5709 60 213 -355 -34 99 48 -98 17 134 -200 38 191 -111 310 -253 340 -75 228 -88 215 27 153
5730 153 170 -288 33 12 241 168 90 -79 -151 -58 135 137 8 -196 165 -182 77 -104 -27 79 -239 174 -153
5753 -153 -380 -107 95 -158 96 124 -346 -181 -208 -192 10 82 31 -77 -39 -195 47 -52 -61 243 -30 82 -3
5776 -3 -139 277 -68 -409 -63 -127 15 -103 154 213 -29 -54 -110 -110 161 -195 -44 -70 163 -158 257 44 159
5799 159 -137 -170 82 86 -48 -8 -236 -22 -41 59 225 69 376 75 -169 41 -40 180 138 -60 81 -155
5821 -155 60 156 76 47 240 200 134 -90 -112 -5 -16 -170 -120 189 -230 -63 31 77 84 206 23 52 -3 -74 -75 363
5847 363 129 -39 7 -139 142 76 190 2 -148 21 148 291 186 -49 -199 -183 420 38 -43 -24 113 -293
5869 -293 2 -78 15 -353 -58 -104 75 415 -207 -95 107 167 83 -126 227 73 -16 13 111 -18 -3 240 251
5892 251 -204 2 56 85 185 -80 -101 75 -149 52 -104 52 -14 -237 -49 -39 1 292 -239 134 255 -3
5914 -3 -35 -98 -159 -7 376 40 213 -132 -258 -12 221 -68 -206 115 -60 127 -121 -116 -344 55 202 -164
5936 -164 422 95 47 46 77 511 -275 19 242 -16 245 -392 198 -2 -36 -75 -30 337 158 206 -103 28 -169
5959 -169 194 203 55 -200 412 -36 -147 57 -48 103 15 98 68 -15 -7 182 117 -67 332 -19 122 -65 55
5982 55 -10 151 25 -236 -188 -144 122 137 151 3 -171 -154 -30 -42 -95 41 218 -70 -67 169 135 322 152 -23
6006 -23 388 -92 -3 -33 -12 13 413 -40 51 283 -127 -15 -40 -111 -97 162 5 131 -88 -201 242 -75 37
6029 37 28 -80 -282 163 -44 -137 341 -89 -38 109 -237 49 -67 198 -35 186 43 -166 30 -80 -113 -147
6051 -147 169 -152 73 -210 6 -65 -25 17 -98 31 83 -191 31 -343 215 -184 158 -176 -615 380 -124
6072 -124 32 -66 82 167 2 198 -182 182 -41 95 -92 167 229 311 -95 -171 -192 -67 -64 125 377 -62 -97
6095 -97 253 -8 471 8 -306 186 199 -137 140 -146 176 95 5 -63 -326 82 -265 -92 -86 11 122 415 -379
6118 -379 20 -186 169 93 -55 68 98 -23 145 116 -359 -94 -16 322 -62 90 11 118 230 32 -5 -40
6140 -40 197 116 45 63 -391 -95 140 -13 -64 260 -148 26 -122 -164 -199 -42 107 -4 -146 -278 154 89 -36
6163 -36 -15 272 77 143 98 -169 -6 36 -138 113 -3 243 52 41 -62 200 -53 -225 -43 211 -114 114
6185 114 -351 138 -35 18 -185 177 165 -342 -276 -179 145 124 -135 90 -10 -22 -102 -208 -82 -56 -69 60 95
6208 95 -47 30 -61 108 -166 119 38 -294 155 96 70 -2 -147 170 239 -408 -71 -205 221 249 -42 -14 105
6231 105 203 190 72 -148 -184 46 6 -147 -67 6 7 -230 -346 265 -12 151 34 -42 -98 55 -105 54 -59
6254 -59 -132 179 2 18 -99 48 -69 295 -57 -66 -74 -97 6 59 4 71 143 -75 166 -149 -47 98 -148 106
6278 106 -289 50 -8 -368 -185 -3 -62 -156 -229 216 111 164 -6 -176 126 -113 -289 -121 -102 -57 -260 341
6300 341 -175 -63 -21 -146 142 -162 30 179 -153 -15 -185 135 -29 164 96 -214 200 -13 -358 -11 32
6321 32 116 279 138 -325 -160 -90 -89 -146 73 241 -55 5 5 66 -70 45 -213 -118 214 -56 -60 -162 276 82
6345 82 133 48 -81 209 -119 -319 -60 -146 -73 -45 -8 -55 -25 -285 -219 -128 -37 287 142 90 -204 106 52 -252 112
6370 112 96 -381 169 -196 50 34 -58 437 185 -31 -285 -104 85 -57 -78 -346 225 13 46 -155 -300 -279
6392 -279 -13 35 204 -85 197 -156 63 121 -151 77 -116 7 131 126 -122 16 -277 -56 100 -300 -39
6413 -39 52 1 76 41 28 298 65 59 23 -142 -193 -95 316 -22 124 -43 -173 -216 102 142 -180 -12 -102 -207 -105
6438 -105 101 -119 -55 102 162 -367 -9 72 -329 57 15 69 271 14 -348 67 -98 197 47 152 355 -162
6460 -162 162 26 119 -253 -86 7 -54 343 -39 -168 148 -95 129 -69 177 112 -20 50 -4 -16 269 133
6482 133 75 -359 -146 263 229 -15 -20 225 -129 -218 237 86 -105 -232 -79 145 -62 43 272 -125 138 114
6504 114 223 -425 -9 98 6 -20 115 211 -26 87 177 53 -9 52 -137 125 138 324 104 -72 -60 -6 -219
6527 -219 -170 7 -198 -294 -102 -149 -204 -256 3 -133 115 155 77 -206 -92 234 -151 129 -2 138 -28 193
6549 193 384 -134 107 173 -86 76 25 313 -408 86 25 150 -8 -18 118 -245 -144 5 -114 -41 -220 -66
6571 -66 430 125 -74 -67 -173 174 288 -83 162 -486 -177 -19 86 32 36 -171 60 289 93 14 -47 90 -329
6594 -329 185 35 59 58 -311 -50 -154 -138 -215 -265 -34 13 -225 -194 5 -26 288 -188 -327 -143 -233 116 -131
6617 -131 36 -162 -193 24 -191 230 -12 -92 -29 -192 -204 318 -303 -316 -184 62 246 -157 -248 196 148 -72
6639 -72 31 56 103 -213 21 -103 -33 -148 -83 244 265 -329 -145 -341 270 16 -167 74 110 -212 176 259 -26
6662 -26 -60 -46 -104 392 68 145 -136 -179 136 202 -75 -243 -206 -412 -334 23 -35 157 -86 97 22 119 -117 -20
6686 -20 22 -267 34 -101 86 126 -268 110 6 -129 -14 -198 -98 -40 14 -165 298 133 238 84 1 285
6708 285 204 -185 258 117 -140 30 -210 36 -59 -228 -169 206 -206 -322 221 -88 33 -73 28 9 256
6729 256 -111 99 -39 162 53 90 201 97 77 89 83 -188 203 33 -144 -79 65 -54 -230 210 118 202 203
6752 203 203 -236 132 -95 -225 381 -132 1 -12 164 -131 15 -106 -102 -72 -72 -32 -125 -2 -65 -81 -205 -124 2
6776 2 117 68 89 58 242 342 -65 -57 95 -25 79 -113 -117 -133 -82 -47 -28 -3 100 310 59 167 242 210 -107
6801 -107 231 184 -182 -110 192 -165 -161 -234 45 120 -22 73 -103 47 36 -239 236 110 114 -195 99 -452 -86
6824 -86 -14 141 -150 197 101 476 45 -26 -134 7 -52 -175 -232 -176 -170 -69 197 -255 -47 0 -95 319 -459 171
6848 171 18 145 15 -318 117 -205 -49 -45 103 202 12 -19 297 140 -646 10 -29 -173 -167 190 109 -70 -198
6871 -198 -256 1 176 52 346 46 40 158 -147 11 258 315 211 -401 -89 32 -144 -160 133 -184 118 -12
6893 -12 -93 -83 221 -14 -73 -19 49 273 -217 -379 -216 -91 -170 5 -156 153 -5 -165 -459 78 150 -69 -158
6916 -158 18 -136 31 -67 31 -171 -78 -22 -144 109 18 -27 -70 -48 -190 45 -151 17 63 196 -272 134 41
6939 41 134 320 18 -266 -113 249 -217 63 122 -145 -129 168 64 -107 107 152 55 26 8 -217 138 57 269
6962 269 152 -57 -12 76 -97 -75 26 58 34 44 188 -273 -78 52 -229 -280 23 -108 -8 -87 -294 -191 2
6985 2 -231 140 241 -42 23 -199 -233 -297 118 49 -121 56 -6 -16 80 20 -110 -15 154 -176 -322 -117 178 145
7009 145 136 311 -101 -107 111 -437 -161 93 286 -37 -72 125 -76 356 75 131 265 169 -202 286 -306 113
7031 113 -42 53 133 261 142 -80 49 -78 263 74 -67 108 -7 76 23 -228 -173 -307 -303 6 -179 -227 -52
7054 -52 15 -238 -67 -121 -218 201 -47 114 249 23 47 184 -7 -115 269 130 212 -206 40 -47 39 -127 86
7077 86 271 185 69 341 116 118 126 78 170 -74 187 -129 124 292 31 -241 128 -177 -128 216 39 -102 -254
7100 -254 -311 -32 -94 -108 -26 193 88 126 349 -48 -24 -105 200 179 -24 -19 231 -53 71 -227 -269 -6 86 80 223
7125 223 33 -59 286 29 -34 -140 118 -104 -136 -115 -96 -11 136 -152 169 23 -61 -236 -136 120 -86 -34 48
7148 48 -165 -237 385 -139 -73 -159 -390 157 -479 -206 -293 -180 341 154 69 -12 -146 63 34 88 236 89 -417
7171 -417 -47 102 30 -256 157 7 -108 -269 48 -204 110 -58 85 -35 129 -57 -95 -64 130 109 -157
7192 -157 -209 50 -63 -10 -86 -27 -211 -216 177 161 -217 327 34 248 -115 162 -153 -278 -12 92 94 -257 311
7215 311 130 16 136 73 70 -212 83 231 -178 -129 -83 44 110 -450 -139 -48 3 183 -123 198 -18 114 -71
7238 -71 -13 77 -37 -68 -146 -298 15 34 274 219 -90 -313 55 281 212 48 66 118 159 150 98 35 -260 44 -4
7263 -4 107 164 23 40 -255 4 50 -67 62 66 -194 74 56 80 -71 -78 -35 253 -186 81 108 151 -210 -5 -108
7288 -108 248 156 68 38 -131 198 81 209 -38 -285 174 -32 -338 -51 -20 208 102 -201 172 70 -99
7309 -99 -153 -52 -143 -189 90 -48 -5 193 61 167 83 108 -229 -23 -50 -304 -11 11 168 39 80 89 90 123 103
7334 103 -292 64 -450 -458 -193 5 439 -217 383 -345 -74 -150 326 131 -108 328 -25 94 31 225 -184
7355 -184 -91 130 57 108 313 -90 -121 206 -140 -154 124 7 116 -146 113 -91 -182 -264 -258 130 -52 -315 58
7378 58 -184 13 -345 -194 -111 198 -222 -205 232 105 -134 55 -69 -192 -69 -188 11 -112 -73 68 -83
7399 -83 36 -291 100 -99 -268 44 184 -54 189 -59 122 175 48 222 331 23 148 76 -228 -224 -151 206
7421 206 5 -249 25 -304 -361 306 31 154 73 35 -96 -184 -55 -54 116 91 -180 110 -60 37 44 141 194 65
7445 65 186 -68 -171 -161 -55 7 87 -15 122 -33 96 -162 272 188 -30 197 51 164 266 -60 210 184
7467 184 207 -205 252 -276 47 10 -327 -10 91 52 136 -86 -195 -139 107 257 326 -44 -7 145 -156 135
7489 135 -175 48 152 72 -145 29 127 -131 203 141 -351 31 91 -236 -28 -27 182 67 -361 266 -333 -96
7511 -96 -105 -142 -282 65 82 133 17 48 -148 -16 -229 271 33 20 199 -11 229 -274 -8 125 -34 76 273
7534 273 293 -2 -190 3 -287 12 -150 274 -192 89 77 310 38 201 65 114 -204 56 138 -95 104
7555 104 29 -9 100 -51 -165 356 169 -64 382 182 -82 -8 -273 -172 -8 57 -141 -5 -114 12 121
7576 121 126 337 -283 -16 9 65 305 147 -14 96 210 310 -50 171 164 159 147 87 -330 -157 -48 75 205
7599 205 167 -85 -129 221 5 142 84 -112 -40 153 -141 142 -34 86 32 -64 62 -243 -51 80 314 85
7621 85 93 -30 -184 -324 245 55 120 126 -330 67 -6 158 255 -22 138 -20 -172 142 -148 -55 96 -65 34
7644 34 -84 -92 -179 166 0 -43 -94 54 -88 46 178 -26 -26 196 210 262 -151 26 -27 149 14 -82 -7 -15 116
7669 116 -37 33 262 100 -41 -16 -172 50 -285 -306 23 41 348 -65 161 11 14 17 -2 165 24 -251 -156
7692 -156 -23 -72 93 46 -176 -33 7 29 -61 125 -187 -86 -133 -66 20 189 31 44 -169 -384 -15 -215 -56
7715 -56 -65 88 115 349 -198 98 162 16 -33 -64 -4 148 -283 116 82 110 -183 -133 -463 -42 113 -204 19 -49
7739 -49 -62 -62 -189 -52 71 133 61 -27 -4 6 166 -231 242 296 186 368 -25 186 167 -109 49 14 -68 273
7763 273 -48 241 -46 -234 366 242 -36 -59 -185 -227 -205 343 -17 -55 -73 27 373 -81 171 -188 -222 8
7785 8 -121 259 -206 -84 6 -67 185 -63 -88 4 -53 -289 -36 -4 168 372 -3 11 47 -62 -54 215 -68 -175
7809 -175 -22 -70 -154 80 -97 -208 -115 -144 -289 -103 12 -198 -292 -135 -32 -21 130 45 239 158 35 -31 -156
7832 -156 194 -71 70 -131 192 202 54 -88 157 161 -128 98 16 -307 199 53 -421 -109 -228 108 -325
7853 -325 146 41 -87 -320 -122 54 216 218 -54 187 -97 -79 -85 291 174 -51 -208 93 137 -98 249 -14
7875 -14 43 47 201 161 -66 -73 265 158 99 204 -190 114 -371 68 182 8 85 27 -205 -36 -5 -237 -137 -76
7899 -76 35 135 -47 -323 -120 -418 -281 -216 -153 -79 -114 181 -117 26 274 -86 28 42 78 -137 -52 -49 -117 248
7923 248 -56 106 -59 -274 126 -213 38 38 -69 -169 -101 -9 -33 -42 77 -146 -86 96 -180 -182 -165 168 -76 39
7947 39 -55 184 70 -12 41 68 -104 -6 123 49 -158 -476 -79 110 195 27 69 200 190 182 43 112 -131 -25
7971 -25 393 51 2 197 282 -437 -276 -72 -56 -177 -273 -14 -137 281 156 -77 -102 -14 -111 -138 -71 -61 39 232
7995 232 -319 -109 -86 -1 1 -5 -12 13 136 -186 -162 -117 -172 157 30 70 185 177 -72 90 -159 98 0 -77 -180 87
8021 87 69 -14 166 -81 77 205 95 136 25 -370 85 -45 -70 226 150 -160 74 74 0 -111 -88 -238 102
8044 102 257 -16 386 214 38 299 -232 -19 64 75 -62 -93 216 37 -139 75 -115 -467 -110 321 83
8065 83 -227 16 112 63 -43 3 237 24 216 38 108 -241 80 139 137 122 256 92 91 -228 -62 -90 72 -2
8089 -2 -17 269 -22 21 -46 386 -199 65 24 -118 -5 -78 -186 -101 411 -218 -59 77 -1 286 78 -218 -102
8112 -102 -111 -15 145 -163 -119 -42 -180 54 -92 110 -17 -117 121 342 -37 49 106 369 -2 115 -11 71 -89
8135 -89 -164 76 -104 -83 -133 83 45 170 -14 -94 65 -177 -92 206 -68 -119 247 3 106 -64 149 -31 -32
8158 -32 49 -302 30 -13 437 -88 -253 200 575 331 -96 -87 3 284 48 -218 75 -119 -44 261 -67 27 80
8181 80 -160 234 -44 225 -115 -149 -227 -37 -192 -273
8191b73
$$ Imaginary data points
##PAGE= N=2
##DATA TABLE= (X++(I..I)), XYDATA
0 0 0 0 0 0 8 -1 8 -8 16 -16 23 -24 32 -40 48 -56 66 -80 96 -113 135 -154 178 -207 237 -273 309 -353 399
29 399 -450 507 -571 638 -715 799 -888 988 -1097 1217 -1349 1495 -1655 1832 -2027 2245
45 2245 -2494 2771 -3086 3449 -3874 4372 -4971 5711 -6642 7866 -9543 12007 -15988 23516
59 23516 -42907 201096 431629 224945 216959 129206 69101 -119893 -232746 -208126 -205199 -216559
71 -216559 -164079 -103271 43455 81935 91977 144250 142950 127428 71891 -13134 -10296 -61024
83 -61024 -106984 -107848 -113390 -62783 -36719 -25262 48453 73197 97916 111580 84591 89087 51421
96 51421 -718 -18527 -65473 -72800 -74251 -88282 -51155 -32847 -11826 19889 18495 40129 39457
109 39457 16910 19886 140 -7432 -6304 -20294 -2982 1954 2715 21471 15330 19464 20352 3295
123 3295 4626 -7354 -15342 -11029 -20654 -13358 -6258 -8441 3135 2616 4202 8760 -426 927 -1148
138 -1148 -8043 -3812 -7291 -5373 872 -660 5698 8059 6499 11383 7996 6691 6917 1793 1688 -381
154 -381 -4444 -2730 -6014 -6960 -4492 -7248 -5154 -4168 -5079 -1322 -1118 -490 2925 1582 3510 4756 2598
171 2598 4780 2987 1105 2834 -665 -531 84 -3155 -489 -1601 -2500 1344 -956 1175 2699 769
187 769 3806 884 -516 1034 -4153 -3426 -3805 -6770 -3000 -4252 -2447 2090 82 4847 5425 3636
203 3636 6403 2636 1772 1706 -3103 -1130 -3020 -4560 120 -2549 183 2046 -374 3705 1217 -429
219 -429 1773 -2809 -1417 -1575 -4206 -489 -2442 -1214 1708 -674 2615 2893 512 3298 393 462
235 462 1037 -2208 -42 -1274 -2367 667 -1138 1091 1723 247 2866 1035 29 1375 -1830 -1136
251 -1136 -1739 -3259 -1306 -2499 -1167 655 -316 2286 2656 1803 3309 873 455 664 -1829 -994 -1462
268 -1462 -2067 -471 -833 421 1501 868 2178 1394 459 1293 -585 -1241 -1234 -2625 -1424 -1334 -1286 626 263
287 263 1562 1919 1089 1667 1186 -272 409 -1168 -1279 -774 -1580 9 95 -227 1211 496 1057 1474 -310
306 -310 904 -385 -1368 -669 -1956 -1101 -364 -1032 841 935 601 2080 696 1120 1224 -666 -2 -1105
324 -1105 -1694 -410 -1860 -459 157 -429 1239 306 833 1392 -216 349 -278 -1065 -163 -1139 -484 54
342 54 -291 1142 914 705 1828 -135 334 452 -1386 -278 -1361 -1186 -365 -1124 63 341 -311 1788
360 1788 370 689 1022 -423 297 -322 -916 -14 -736 -188 562 105 1059 773 489 1311 -73 -153 -409
379 -409 -1646 -1144 -1557 -1196 -219 -620 507 326 624 1311 1063 740 400 -118 -110 -596 -515 -392 -374 -130 519
400 519 417 772 619 739 240 -120 -431 -931 -916 -1264 -623 -896 -588 195 505 846 1114 871 1040 534 -358
421 -358 398 -696 -460 -280 -953 399 -300 44 882 15 1019 551 -458 411 -861 -794 -335 -1312 -100
440 -100 -11 -747 908 -16 1062 1080 -180 991 -65 -105 252 -1350 -452 -589 -958 645 -194 554 1253
459 1253 63 1538 234 -607 829 -1423 -436 -57 -1620 334 -196 114 1634 100 1085 1063 -450
476 -450 1075 -918 -989 153 -1562 54 103 -784 1439 -340 778 1167 -631 1341 -164 -509 417
493 417 -1369 -133 -180 -1390 731 -413 -105 1055 -502 806 541 -377 726 -583 -342 367 -1032
510 -1032 196 -276 -591 1167 -329 494 1076 -158 877 -67 -626 505 -1215 -45 -89 -894 817
527 817 -373 346 1095 179 762 656 -903 475 -942 -665 -164 -892 359 286 145 1080 233 674 819
546 819 -745 398 -407 -956 -29 -1021 -466 250 -648 583 388 502 813 259 574 202 -709 -4 -630
565 -630 -587 -208 -581 -203 326 -241 920 421 286 569 -163 343 -59 -860 -245 -472 -327 211 -482 382
585 382 607 -3 700 -74 -75 364 -725 77 -106 -380 89 -215 438 740 22 687 440 16 675 -488
605 -488 72 -229 -945 -133 -510 -200 753 -303 703 609 91 674 31 -277 234 -657 -678 -634 -708 133 -415
626 -415 69 677 141 674 532 134 448 -210 31 -234 -643 -138 -759 -452 92 -210 510 788 263 657
646 657 116 89 409 -742 -75 -505 -408 142 55 -24 136 -51 94 401 71 45 -212 -88 -18 -325 -135 64
668 64 -203 101 128 104 513 86 -33 158 -54 -209 -96 -258 -30 22 201 -96 -90 265 71 -188 38 24 126
691 126 -153 -470 158 27 -73 347 205 484 345 -52 376 173 -339 -253 -256 -382 -224 -7 328 238 51 825
713 825 342 173 153 -198 -4 -374 -529 -272 -369 -69 39 29 509 218 387 629 266 353 -64 -620 -102 -781
735 -781 -610 -415 -462 156 182 66 908 407 552 525 -95 286 -33 -348 165 -866 -107 -51 -278 396 -11
756 -11 135 711 73 503 -18 -399 132 -319 -87 -69 -520 94 134 4 591 138 57 341 -282 304 -367 -150
778 -150 392 -121 -25 337 -243 86 170 40 45 -301 113 -61 -396 -59 -403 170 462 -149 438 294 188 390
800 390 62 49 172 -188 131 6 -320 51 -310 240 394 317 330 356 -98 510 -138 -25 195 -185 96 -230
822 -230 16 344 -85 231 514 146 603 442 -262 222 -279 -16 -122 -742 149 3 -86 359 -276 276 544
843 544 -62 474 -96 -255 76 -337 -184 -271 -222 211 -68 386 224 -148 242 -10 -319 293 -602 -282 -145
864 -145 -599 106 0 -69 193 42 193 218 33 588 -157 -54 -93 -377 -88 -26 -66 418 -15 26 270 -5
886 -5 171 222 -3 -19 -169 -250 -7 -163 101 37 -143 339 255 -10 145 -101 175 -194 -116 -246 -367 -107 141
909 141 -164 203 87 -72 425 133 -60 -80 19 95 -394 -191 -90 -43 15 36 3 378 11 92 99 -168 -217 29
933 29 -276 -101 68 -329 125 -13 8 105 34 346 18 10 -4 -51 -274 54 -225 304 6 -175 456 113 249
956 249 290 232 348 -97 -117 85 -390 -170 -146 -227 219 -122 67 553 -298 85 -24 -23 146 -638 -365 139 -438
979 -438 302 195 -113 519 82 415 531 -292 128 -559 -407 -26 -205 -154 65 -57 709 156 88 530 -497
1000 -497 412 37 -247 328 -553 -279 -92 -228 305 -103 78 466 -193 77 249 -162 433 -291 -578 199
1020 199 -3 214 338 -109 174 -59 135 397 -484 -61 78 -261 19 -400 -58 -169 -98 147 -18 -8 295
1041 295 -72 231 28 -182 -17 -310 -333 292 -493 -55 45 -44 106 -41 54 382 10 60 -354 -526 -36
1062 -36 -171 116 -49 -248 248 -179 225 564 -194 43 34 -332 51 -200 -187 -125 91 384 -109 -121 144 -345
1084 -345 139 -51 -141 -84 -108 -272 46 -279 -123 -26 108 358 -17 236 307 58 -127 -95 -313 -331 111 -54
1106 -54 -60 -56 -40 170 25 83 113 10 68 -45 -18 116 -208 -150 5 -43 -246 181 178 225 34 -179 210 89 34
1131 34 -38 -122 174 21 105 239 151 402 113 45 322 65 213 -43 -120 72 127 -57 117 71 43 -104 -117 102
1155 102 18 259 105 -93 -258 -216 -154 -21 -251 -153 120 -129 46 107 -10 133 -23 -199 -194 -118 -29 60 179
1178 179 -65 -117 -60 -135 -45 -37 -244 -43 -165 -186 -136 -285 -499 89 26 8 291 248 133 318 -95 300 -14 -354
1202 -354 165 116 282 17 -205 336 -14 45 112 -86 222 63 -75 -63 135 -282 89 -206 59 99 77 222
1224 222 73 -110 -45 -176 213 205 -310 -2 -184 -213 20 -83 130 -10 0 197 -2 -29 120 -102 291 -128
1246 -128 -6 466 -119 145 9 -233 374 -172 -146 122 -501 221 -121 -164 251 -190 89 154 -71 75 -149
1267 -149 289 -25 -39 84 228 -129 -4 -80 -143 91 167 227 25 -17 188 25 -24 15 71 337 -255 -341 81
1290 81 -29 9 223 68 437 9 159 101 -150 150 28 -135 -269 223 47 -244 34 -17 35 76 -98 139
1312 139 -65 126 -37 98 1 -385 15 -153 -249 121 -42 -94 -161 -266 -33 19 -45 91 -13 66 394 85
1334 85 -139 -66 23 -84 344 -152 344 151 154 -138 -212 236 -97 -293 284 -79 -294 -57 -239 44 -110 8
1356 8 7 215 235 -132 162 136 122 75 -42 328 223 121 315 222 54 190 189 -135 25 -404 -91 196 7 66
1380 66 131 -130 259 54 -230 26 -61 -100 40 -163 123 -6 24 28 -91 217 -48 -208 314 -209 -176 -108 -211
1403 -211 226 48 -244 501 -178 195 -124 15 -69 -290 121 -87 -286 127 67 -11 148 -402 322 42 -222
1424 -222 174 110 -206 174 -329 -170 -557 -252 16 -34 108 98 33 -296 120 -85 -39 37 -81 76 -376 78
1446 78 37 -190 10 93 -80 196 -115 -183 -154 -77 -90 -299 170 1 -4 64 54 -115 105 20 128 -124 -3 129
1470 129 45 -72 -166 -278 53 -22 -192 5 -122 17 171 105 -104 -99 -11 236 16 -264 -155 -183 -118 80 -35
1493 -35 290 -178 165 -136 -68 -302 122 -137 -34 26 7 -54 -129 100 232 5 238 -88 -82 84 -272 58 3
1516 3 -308 69 -355 -45 274 33 21 -292 -205 143 -264 -4 -159 -88 101 -328 -63 24 -235 -47 -105 -54 187
1539 187 111 138 -109 -3 150 -51 63 35 -112 121 -48 35 258 289 -341 30 -30 113 -194 -174 4 15 -89
1562 -89 48 -157 -36 134 114 257 -286 -120 -235 -313 179 -151 29 182 -378 -98 34 47 282 133 142 112
1584 112 -119 -233 139 192 -24 -105 70 -120 191 211 232 202 99 -80 29 42 -4 84 -115 -158 -28 -23 47 -83
1608 -83 -16 -54 89 156 -67 -262 -67 -74 -2 63 -212 -206 -95 -90 125 -190 -388 -214 -186 -207 35 -26 -96 -312 -77
1633 -77 29 -46 -61 73 -63 -131 35 132 -163 110 -190 239 -143 -232 -197 -36 255 253 -161 126 45 35 86 73
1657 73 49 42 125 115 124 -1 273 -57 -81 -11 -322 76 -318 -8 26 0 -108 -22 -137 289 -24 98 105 92 38 -350
1683 -350 -315 -6 -229 107 30 -140 -252 -71 140 -48 134 158 39 -134 436 -121 -55 -274 -142 -111 7 -206
1705 -206 130 -468 -10 12 -68 236 125 -17 -384 -71 212 90 -304 -129 -14 -76 -157 -89 -65 71 143 -38
1727 -38 -116 -16 -145 32 50 94 170 -3 -61 162 -141 -78 127 -464 279 -49 -84 -220 56 211 96 277 51
1750 51 82 -19 128 -296 236 109 8 -446 -136 -109 312 -194 -100 -107 -136 213 208 108 112 -161 -55 -70 -373 1
1774 1 12 147 -121 281 48 104 -132 -216 141 117 268 -283 20 -249 -479 423 107 176 244 6 74 -287 -54
1797 -54 21 25 27 -229 -284 -370 -240 -20 -26 -120 -21 152 49 30 -174 -5 191 -147 244 -266 9 77 -393 20 485
1822 485 303 349 211 -13 -93 58 7 135 -221 40 -57 -6 -33 270 229 102 126 170 -95 15 -6 -209 85
1845 85 -232 139 111 -56 107 -248 90 253 -109 -86 -95 157 -44 26 -3 -73 50 56 -35 44 31 83 235 -144 -126
1870 -126 222 -113 124 -119 -112 -71 -194 170 7 19 -16 -200 -66 100 -211 196 -123 -43 171 -193 -153 67
1892 67 305 60 181 -117 94 -60 120 -4 99 342 -209 -577 152 3 -63 159 -155 -6 74 49 177
1913 177 24 -108 250 -150 239 -31 -112 108 -5 118 87 -281 -29 233 71 86 -25 200 35 -122 176
1934 176 147 -133 -61 43 98 -75 -175 -165 -341 -87 -191 -253 292 46 -215 28 -38 -60 77 -215 288 -199
1956 -199 -80 98 -27 77 125 28 189 107 237 -110 58 193 -23 -104 -43 -261 23 122 -22 257 93 63
1978 63 87 -30 149 93 303 -251 -83 268 -49 66 -145 22 23 -96 -30 113 -73 -168 -217 0 -45 -117 85
2001 85 101 -88 -131 103 -20 -148 4 -159 92 4 -60 -29 58 187 167 -22 272 -311 65 74 65 -157 -5 -10 -229
2026 -229 30 86 -155 -271 -137 404 -101 -99 106 143 -150 -79 31 74 115 161 -174 -187 -45 -1 152 -151 -97 -244
2050 -244 90 158 216 129 -93 -34 180 138 119 -56 -122 210 109 -151 -208 194 -202 -270 125 -103 -87 247 195 -223
2074 -223 -256 147 124 169 -114 -114 299 -198 -261 72 -43 44 81 52 253 -134 -421 167 7 145 139 -70 -81 25
2098 25 -50 -124 -27 -4 -55 -120 -48 256 -161 -3 65 -250 38 -41 -76 335 36 -27 40 -216 415 402 -67 93 9
2123 9 -177 -222 55 205 129 -259 29 -12 -285 94 -27 283 -246 19 -41 -96 -91 56 -187 193 185 -7 -101 115
2147 115 303 40 212 -5 -30 -103 333 -181 349 45 -346 54 2 -65 8 22 39 103 -13 -113 24 104 317
2170 317 146 27 25 -77 113 127 325 14 25 -19 -60 -54 45 -277 17 219 -123 102 114 229 -196 253 406
2193 406 -21 -108 -274 -92 35 -98 -292 -257 143 273 64 -159 -240 -114 147 263 229 29 -280 -206 -18 -52
2215 -52 -126 -189 203 62 7 112 15 -64 130 -60 -66 224 60 -107 -55 -73 95 169 72 118 -199 21 -138 -222 -76
2240 -76 12 -174 -216 -15 -36 191 148 1 112 -80 -134 154 109 79 -289 162 -145 -22 -313 -142 -20 -197 -376
2263 -376 -136 160 -102 142 72 37 -103 -239 -246 -108 -39 125 -15 279 -67 187 -2 -162 -178 108 -55 33
2285 33 103 187 89 73 140 257 163 -48 -23 -74 16 -210 19 -220 168 -86 107 52 -317 173 -29 147 43 116
2309 116 83 -225 29 -11 166 115 -63 -247 162 168 -163 -37 124 -4 49 -70 -200 50 44 17 234 -172 -14
2332 -14 262 111 -85 -340 -142 -169 63 9 4 -37 154 37 115 -266 -67 -201 -232 169 92 -53 212 60 26
2355 26 -212 -97 -412 81 -82 480 14 96 -200 82 263 -43 -420 -146 129 -81 -105 137 -44 15 -129
2376 -129 -133 33 -113 -20 174 279 -13 -3 94 204 -164 352 -180 122 -62 109 -163 -14 53 208 -124 286
2398 286 -82 126 -195 78 -39 -33 65 -174 225 -208 41 -188 -28 -310 -191 -158 -56 71 152 154 153 -146 200
2421 200 -80 212 -121 193 -45 -1 -101 165 16 -26 157 40 -166 -61 -126 321 -325 -84 -207 -13 -31
2442 -31 -251 73 -96 54 176 -118 229 378 -307 237 97 73 -58 88 -53 268 -91 -61 -208 103 108 268
2464 268 -89 186 412 -205 78 161 -262 -135 27 35 -53 54 128 53 13 60 -168 -96 20 7 34 -160 216 102
2488 102 -117 186 35 -84 156 -65 -352 -43 289 -142 91 -196 -189 -207 -187 123 -149 11 -342 -62 105
2509 105 154 -220 80 -64 -331 81 -37 87 -52 29 -238 -214 110 -24 118 107 17 -130 56 123 194 79
2531 79 -26 -63 -219 199 162 -2 -186 -186 21 163 -178 60 14 -188 341 -291 -470 220 177 104 -361 -264 -22
2554 -22 -140 52 98 234 106 -276 -6 -348 -80 111 31 59 -162 433 -30 226 144 1 150 115 56 -134
2576 -134 -133 161 110 -338 34 185 54 -110 172 -333 -297 49 59 -70 -209 83 -64 135 39 168 24 -29
2598 -29 -210 -91 -189 -52 45 -18 106 183 12 -93 173 25 -284 76 -28 13 73 -85 -136 129 -2 -80 -261
2621 -261 -144 215 -66 -127 -144 6 307 53 187 -154 239 220 -244 -287 -47 -120 150 -85 -190 -4 -86 -184
2643 -184 78 89 138 102 176 -346 -50 -150 -122 83 13 75 -86 -200 -111 83 -214 -19 -250 -157 -64 33 186 -103
2667 -103 62 -17 69 10 -133 251 -12 211 122 -59 4 13 114 -3 28 -29 -52 42 -36 211 63 377 -112 219
2691 219 72 77 63 -99 182 -36 -156 111 -126 -68 54 82 -142 92 10 115 9 81 -241 -675 290 -98
2713 -98 -66 -35 -150 -35 -36 -43 107 54 -65 -181 -20 273 -148 -182 -92 -167 -78 -216 -13 -166 -241 88 -314 -87
2737 -87 -304 -110 2 -92 -132 -13 -19 21 -70 95 467 12 0 -90 -306 -54 1 -35 -100 -12 -146 94 -41 256
2761 256 -27 125 -337 -16 -162 -113 -248 -14 -138 51 37 -281 -150 -1 107 -199 -39 -89 -113 -88 -79 475
2783 475 -95 -158 -214 109 229 32 129 153 -83 -95 -181 -44 -101 -178 73 24 -3 -201 149 -74 56 -132 41
2806 41 -342 -156 42 -224 -114 204 -174 54 175 61 -43 -81 3 -293 169 -369 256 -74 77 21 73 70
2828 70 230 123 -185 41 -89 253 198 -203 154 83 -210 -278 56 78 148 -118 -38 -56 -37 132 185 28 264
2851 264 -206 174 114 -304 -64 16 51 25 -105 73 28 -162 -83 145 230 -20 -296 163 4 214 57 -297
2873 -297 165 -96 36 -153 126 -83 -28 -299 -370 50 -319 357 97 -163 398 -45 -49 -159 -338 -159 -46
2894 -46 -165 -49 25 -372 254 114 -185 -52 -14 132 -66 73 -474 -113 -3 -340 -18 75 199 -122 -255
2915 -255 -268 79 -241 239 68 133 85 118 204 -151 203 -275 357 82 122 -91 160 -132 -163 -190 168 -21 98
2938 98 -98 34 34 -249 290 -126 59 -132 -101 -100 64 3 -130 17 25 -48 -133 -68 118 53 232 -85 -91 -207 61
2963 61 -252 -95 -176 -176 -300 -209 64 -355 -36 -40 306 119 -162 329 -134 -10 -173 -120 -222 17 -143 -116 107
2986 107 -53 17 -321 -30 32 16 -293 -47 -41 -52 129 58 -188 -11 0 25 6 159 88 136 24 -245 -46 42
3010 42 99 -53 79 134 -181 -46 77 -125 189 261 1 -85 -264 204 54 72 79 -219 -221 -125 377 -117 42 -244
3034 -244 28 12 53 139 61 99 91 321 -12 -74 -36 -246 -55 -44 -29 -122 -86 118 -84 -20 -237 -305 121 -149 -113
3059 -113 -53 -265 -229 119 -36 34 -45 1 114 -202 -144 140 -16 -54 -158 -67 139 217 -99 -192 100 291 -83
3082 -83 40 -71 -104 -43 -12 -53 307 -173 123 131 146 127 122 -74 95 28 241 155 -98 34 -99 6 -99 -133 -271
3107 -271 -61 -205 -276 -17 63 -268 121 -157 -2 -89 346 -35 -115 243 -56 63 32 174 -213 6 158 -24
3129 -24 100 26 58 12 -187 -24 -165 63 149 109 62 -10 -75 173 269 192 -76 -32 140 -159 48 23 -34 59 376
3154 376 -128 123 -204 -171 -23 85 24 -112 -172 -106 -186 39 -73 -257 274 -383 81 -44 95 234 126 -31
3176 -31 4 65 -241 117 -44 229 -285 240 187 208 -18 19 162 19 -14 -52 -46 93 137 204 256 -118 -144 -300 244
3201 244 -97 -11 181 -249 -294 -56 145 -186 -393 145 -60 -140 51 -74 208 -51 -20 -26 -29 -80 -267 114 303
3224 303 -61 126 131 192 75 -127 -103 -50 -8 -112 -186 24 -115 76 -118 -259 260 76 -207 -470 281 120
3246 120 78 -53 10 264 -55 -2 50 2 52 313 186 -111 -158 135 -119 51 -87 11 22 -405 -150 188 159
3269 159 -300 106 250 -58 107 -223 -75 6 -50 166 296 -87 212 -129 -152 136 -19 134 -192 110 100
3290 100 -116 -74 -108 40 -3 -144 -69 223 98 175 14 -61 -299 -76 -57 124 -271 255 126 74 -35 -79 119
3313 119 -174 179 83 98 -234 -142 -80 -40 -23 -196 -15 -4 -311 78 56 65 109 50 -157 101 -234 44 -28 193
3337 193 -74 -94 244 -118 -41 -81 302 73 45 77 98 54 -138 -7 54 211 51 -52 -87 -43 -195 161 68 141
3361 141 80 -266 -204 330 -215 -106 -84 64 -123 83 -101 -126 8 184 -12 226 -87 -55 359 118 0 -246
3383 -246 -98 -20 198 -239 -93 229 333 -134 -103 -153 -69 188 59 362 36 197 9 228 -326 191 -28
3404 -28 -298 -257 34 -226 193 122 157 -33 169 -62 -320 -38 -89 -74 61 127 291 -221 -208 36 272 49 12
3427 12 -284 6 218 -236 -250 160 -101 -14 64 -282 4 -376 -57 -98 153 -65 119 239 -55 -78 -173 50
3449 50 184 -149 -11 52 -169 270 -137 40 -91 98 254 228 61 146 -37 186 -13 161 9 -100 110
3470 110 143 -241 -34 10 65 -14 -177 -21 -11 -31 -90 7 64 -83 49 337 -70 -41 -155 44 -34 -35 -99 76 37
3495 37 16 -104 120 55 4 99 56 -141 68 -94 194 -59 -158 12 37 157 -89 30 -204 287 -79 83 220
3518 220 173 184 48 -48 -259 212 76 -125 -368 -49 -38 -122 -66 -300 -139 -12 111 -54 -87 103 169 -137 -11
3541 -11 258 238 -100 162 65 -75 98 -159 -334 -19 -132 6 -62 238 195 28 140 155 -128 1 -95 -154 54
3564 54 51 198 -201 33 -14 109 271 -143 -3 -69 -6 -97 205 -260 -78 75 295 -93 -32 361 94 -61 137
3587 137 203 108 -15 -150 9 -25 106 39 274 -252 -32 108 -101 -158 299 19 364 169 25 99 -107 36
3609 36 212 131 -180 80 -25 -97 36 253 -209 55 -27 18 -21 -84 -112 -366 -232 47 -144 -239 -268 -41 74
3632 74 -183 122 -111 -213 233 -131 145 -98 -31 -393 -215 204 -85 -36 -205 -32 -50 25 -189 -74 5 -121
3654 -121 -10 165 -200 50 -167 -65 294 -329 -106 109 -25 -37 228 197 242 16 47 -143 -230 74 -38 -131
3676 -131 -37 -232 -147 116 -90 335 149 50 -35 28 -35 -95 -41 -211 -35 -107 269 167 68 198 -6 -30 29 -289
3700 -289 185 -134 -177 22 -31 60 205 165 -245 163 -67 -27 52 -184 158 -78 275 99 -202 6 107 -98
3722 -98 -8 -105 -184 162 -278 -157 -7 40 123 417 75 353 -213 172 -237 335 127 19 -153 -115 91 -70
3744 -70 76 -33 -162 51 -230 -12 -49 29 91 -175 -49 -297 107 -364 -229 -197 249 4 41 -347 59 3
3766 3 -32 79 -74 -73 -300 137 92 -28 -119 -60 -95 -312 -45 -291 304 170 27 -61 307 75 1 50 -239 -242 149
3791 149 -5 2 -146 144 153 -126 -94 -52 68 30 103 -234 126 203 -29 177 -92 -159 23 -12 202 -27 88 414
3815 414 7 -147 215 69 -124 76 108 82 -247 176 -38 -64 165 -223 261 80 15 216 -72 45 -164
3836 -164 -77 -166 184 411 -112 -124 -172 39 200 32 -276 -32 -147 -116 74 -267 -32 15 -152 -96 -23 61 -49
3859 -49 176 -96 57 239 134 12 -41 30 -214 54 167 277 -142 -119 -158 72 112 119 116 -153 204 72 -16 39
3883 39 -42 20 -153 14 37 79 127 241 -144 7 133 -100 225 7 -229 -91 -78 -133 116 -204 54 -26 315
3906 315 56 76 401 47 200 38 96 92 -37 -23 126 34 119 164 -139 -82 56 31 -87 38 23 51 -11 45 109
3931 109 12 -249 174 111 122 299 -229 -116 390 -198 -75 -10 -35 42 -165 8 -53 52 186 -59 15 -80 76
3954 76 -198 469 240 -16 138 -248 -179 21 -372 -131 12 106 130 -56 23 -18 220 -84 113 173 -64 40
3976 40 -98 4 389 -298 177 -91 -88 59 -238 -31 -128 -33 293 189 21 217 -38 41 -233 41 122 147 -25
3999 -25 173 -196 -26 247 -1 16 -82 -55 1 -223 166 103 -295 -290 -38 -63 55 -128 220 -4 -115 -389 98
4022 98 10 -26 81 -146 96 144 105 183 105 -16 292 -10 92 242 -50 32 96 -51 42 142 -151 209 65
4045 65 -54 103 133 245 110 -33 -28 10 -57 -190 48 -33 109 157 12 -88 -209 187 -136 28 -135 -62 -160
4068 -160 -280 57 154 -205 3 -83 55 208 59 37 -57 -265 -170 -63 -15 48 51 -28 -273 89 -187 -53 -275
4091 -275 -176 -228 39 -28 -4 77 -219 -317 40 130 -281 -13 -216 171 -33 71 -376 -28 -98 138 -179 19 -14
4114 -14 8 83 192 80 80 18 97 127 207 153 189 -297 -273 169 -404 259 -6 -164 -216 175 76 37 28 -36 2 -45 -5
4141 -5 -167 4 -159 -320 -322 -216 -56 251 -44 65 14 254 9 37 -108 40 -54 -54 139 -292 205 216 -82
4164 -82 84 -89 132 -4 130 -122 39 123 156 -119 -100 -170 243 -158 -358 -438 -205 -137 -113 -191 65 199 -21
4187 -21 201 -22 137 265 311 -154 130 54 -169 -134 167 250 397 -74 195 -178 -184 -51 -187 287 35 103 -13
4210 -13 -149 -51 -194 162 -111 85 348 -225 1 -123 60 64 156 -300 226 72 -25 91 4 -59 80 49 -11
4233 -11 -223 -300 -230 146 -8 -98 257 30 191 -29 217 42 211 200 0 -39 64 68 -126 373 185 381 -15
4256 -15 -232 97 41 -268 -78 -217 -333 395 -194 -33 -144 30 -43 -27 -41 -14 33 78 -176 -158 -147 -86 348 -23
4280 -23 34 -50 -15 19 13 -173 49 3 -152 -134 75 -220 -130 -134 -183 50 90 -21 201 116 -276 -340 49 -155 117
4305 117 55 78 -119 14 -340 226 10 -176 252 -17 -15 1 256 -68 -43 68 -130 -88 -63 309 185 -195 -21
4328 -21 -104 91 91 -173 200 -233 -57 -49 -228 27 453 107 -75 -89 -123 415 -120 213 322 52 18 -125 -87
4351 -87 24 -181 13 -16 -151 -7 0 159 113 -38 -222 92 107 -161 100 -7 -54 150 94 100 -108 -208 158
4374 158 -67 -78 -72 -132 108 -24 163 22 33 334 -157 -37 -41 -36 163 -221 157 -111 -88 -185 -130 56 25 -127
4398 -127 -141 -59 111 -41 7 80 69 188 -166 -278 -175 -29 275 -92 -156 -60 -68 -380 -67 29 -85 49 -23 -62
4422 -62 39 -146 164 -80 -47 28 -14 -50 310 -104 -196 264 -80 54 20 -86 -152 90 65 27 96 263 -268 196
4446 196 201 177 58 246 89 -344 -449 -1 1 125 286 -290 63 -310 -289 -86 117 330 -244 -173 33 -119
4468 -119 -56 107 169 -92 76 239 -342 206 150 166 19 -79 -180 -97 465 -23 44 -93 -136 -42 -26 72 -35 -124
4492 -124 34 -275 54 -371 -318 -174 141 16 133 39 -153 -21 60 36 232 -98 21 273 198 106 -69 156
4514 156 -222 -40 57 522 288 93 105 -37 94 -118 -26 -75 -21 -131 -40 -33 63 95 -258 180 42 197 -11
4537 -11 -149 130 50 -6 127 111 34 272 -26 56 65 172 -91 94 -220 -203 253 -129 -313 116 -225 148 199
4560 199 -55 -92 -31 12 81 -276 422 -42 -348 372 -138 -180 -218 -24 324 221 -159 175 -188 127 -43 33
4582 33 -101 -117 6 -324 -198 185 -231 68 202 -175 -49 -50 40 -233 -75 -164 -218 205 80 207 -239 -252 7
4605 7 -225 -25 511 -51 -322 -176 6 17 -53 92 38 -101 317 -104 100 389 -39 84 155 169 -123 -149 78
4628 78 -15 -165 339 16 -39 56 -188 166 -86 161 20 -22 66 -109 29 37 -72 -53 -166 -133 -114 30 72 -147
4652 -147 4 -255 6 -207 8 293 -110 -252 -118 254 38 88 -63 -106 -31 -197 -95 -293 44 161 8
4673 8 -231 225 -9 103 -130 292 178 35 -255 171 319 182 -178 73 -36 -13 -154 33 -98 -44 -198
4694 -198 2 44 64 53 95 -111 29 178 -258 -202 -183 313 -185 97 16 175 -38 -6 155 -12 23 253 -234
4717 -234 62 17 -59 181 98 331 3 228 -23 163 -229 15 133 -104 -57 -239 14 144 -127 -4 -6 -46
4739 -46 147 -30 133 -209 -93 275 66 -108 -397 -57 39 199 312 41 -116 -96 39 108 -197 86 71 42
4761 42 271 56 120 151 -104 64 85 16 59 112 -83 5 -89 -72 -1 59 38 -97 -114 -60 54 -81 -73 -42 22 162
4787 162 206 -93 -202 -191 -247 21 74 16 263 -344 253 67 -8 -2 -178 25 199 -274 -200 -61 338 46 15
4810 15 198 212 -98 -74 154 383 9 -56 51 -98 -137 -2 169 -157 53 -58 -186 -144 -66 -244 14 -27 72
4833 72 55 85 6 -124 191 -188 121 -135 196 195 16 -8 -109 181 -8 298 -19 10 113 -166 295 -21 351
4856 351 155 18 -253 37 289 86 149 79 316 -53 -103 100 -136 -66 38 -117 58 200 102 7 33 155
4878 155 66 55 27 184 -59 -291 28 81 -13 331 95 -26 -7 29 -193 107 53 -70 271 -237 -35 -200 -1
4901 -1 -163 -47 -122 -81 -289 42 -177 47 -142 186 -147 -31 268 -164 -169 15 167 169 112 153 327 -178 -208 -41
4925 -41 98 204 283 -233 154 255 0 -79 -179 185 113 112 -82 -101 97 22 -106 -143 -315 179 -274 136 126
4948 126 -301 76 23 135 -135 -46 -301 109 -292 -70 -38 -142 -163 30 -34 0 -74 -286 -163 -231 126 -66 -168
4971 -168 -45 58 -9 -354 364 26 -72 7 20 -24 -166 377 -208 138 -3 169 -40 -399 -174 32 42 96
4993 96 -82 101 22 30 -162 95 22 -13 89 -90 -207 -245 -353 75 -34 51 35 -220 -161 -58 32 -99 253 199
5017 199 -64 38 -129 -198 -131 -49 -7 -59 -156 224 -72 -55 125 165 69 -95 167 287 -339 -138 -93 30 360
5040 360 -397 -389 -148 -91 -98 -62 175 71 -18 -136 102 -168 99 54 202 -31 108 -87 -217 -129 -242 -39 116
5063 116 68 -94 202 44 28 -110 359 109 -265 81 92 4 146 -250 228 -89 -54 -254 -258 -82 -112 -52 323
5086 323 53 -171 158 62 179 59 67 -112 63 54 -243 -362 -79 68 -292 365 -76 26 28 196 33 27 126
5109 126 -42 -21 39 144 -186 18 213 -14 -164 -292 -77 -69 207 -284 -78 -52 -256 -12 93 -28 -32 586
5131 586 -37 -145 -159 -135 -209 -116 195 70 45 357 129 -153 -104 -236 -25 -97 -207 -76 189 3 228 121
5153 121 -405 7 -18 21 -243 53 -170 -87 117 -39 19 70 70 -178 -62 38 130 -219 99 -119 -76 -99 -12 192
5177 192 278 3 124 70 101 -5 146 26 -60 -454 -49 283 -125 67 12 70 182 91 -140 22 -57 62 154
5200 154 155 -66 -5 297 -148 -62 -163 -110 -132 278 -5 -29 -141 81 -297 19 -94 -289 -68 188 66 25 -41
5223 -41 -92 79 -257 109 49 217 46 87 -90 49 -62 -40 -188 58 -19 99 -41 120 64 -127 -104 75 309
5246 309 -94 -15 -106 -13 -156 154 141 -122 -106 -5 158 42 210 85 -164 201 109 14 147 27 112 -48 152
5269 152 -172 41 -2 95 -145 16 -219 239 239 136 12 -4 99 -142 380 103 -35 190 2 341 12 -55
5291 -55 -55 145 14 58 163 9 201 -171 218 314 -124 74 186 -351 -59 25 81 64 93 -52 -86 82 227
5314 227 84 -136 -146 -28 81 -28 -276 22 -69 -269 -231 70 -26 -41 57 238 311 -55 -43 -242 -125 413 -97
5337 -97 -207 35 193 60 158 -99 65 100 198 -56 147 -170 80 -145 -140 91 -132 312 -199 101 53 337
5359 337 320 236 -279 -106 -163 114 -20 -372 34 -198 17 -174 67 -11 193 375 -67 140 -230 -88 50
5380 50 -201 -21 130 161 -112 -147 111 62 212 83 49 70 102 184 -104 74 -82 108 -96 139 -49 112 -20
5403 -20 -170 125 9 -222 -109 80 279 -223 -28 105 -140 41 -5 -84 38 290 -223 189 34 135 -256
5424 -256 -272 -65 23 38 -22 13 136 -146 -80 -111 351 79 -262 14 76 -254 294 -63 -58 139 68 -195 -49 209
5448 209 -2 16 101 168 -202 9 -171 61 18 -91 170 146 192 -75 65 -168 160 109 -163 237 219 -120 -53
5471 -53 -167 31 48 -302 103 154 63 -261 27 -22 -224 -51 -55 -155 -199 131 -282 101 -189 -103 19 163 -92
5494 -92 151 -177 55 -42 13 -214 151 61 -87 -14 -132 12 123 -323 -272 132 332 -10 47 -134 -9 75 160
5517 160 -11 -195 -66 67 -108 219 -69 86 73 -109 -76 -139 -45 -393 63 15 -109 -46 -84 114 133 393 -2
5540 -2 167 -30 105 128 172 356 36 177 -159 121 -55 -140 -51 1 3 -66 182 107 76 -53 111 -7 -71 48
5564 48 -73 -103 -26 -250 -172 200 44 106 -145 -151 6 -205 274 -114 255 374 172 198 -166 86 87 189 -112
5587 -112 -72 79 96 -5 10 105 -215 149 -174 -87 -9 152 146 -19 -136 106 0 72 256 -76 27 -198 -124
5610 -124 49 -47 -93 15 116 -255 -152 -117 -382 329 -64 -98 -185 -186 -125 -101 58 355 95 -203 -43 8 163
5633 163 -229 -358 3 159 184 131 245 -35 15 -116 39 154 -122 -143 293 43 153 302 -237 -7 -78 -150
5655 -150 9 -43 -145 -74 256 -238 -47 -336 146 200 83 61 208 244 95 263 189 60 91 -288 -341 -73 -177
5678 -177 -242 5 -252 -163 -165 -114 -43 -72 -233 143 123 -57 78 33 -369 376 -233 -126 68 195 93 -61 -44
5701 -44 -43 -31 -221 -117 -48 -1 -167 -287 -332 139 27 -120 -81 59 28 -136 59 257 -66 106 104 -118 -177 78
5725 78 -170 56 -112 -108 2 321 98 -160 73 -347 172 28 8 348 145 -117 122 10 277 120 192 -266
5747 -266 -196 15 -59 -288 -206 2 33 171 60 -433 -254 -98 182 81 -251 47 -173 180 -133 92 -53
5768 -53 53 156 -369 272 -81 36 221 -45 118 26 -126 -250 125 69 67 -97 167 -167 -43 117 6 -97
5790 -97 -240 261 206 -115 207 359 361 238 -145 -8 -18 -117 -83 90 -150 54 -35 -79 -119 -52 47 -280 215 -56
5814 -56 84 -107 -184 -56 -35 244 -43 111 92 35 -74 10 55 183 -51 263 -160 -44 -97 -334 236 120 84
5837 84 71 113 232 -29 -266 -188 260 15 141 0 100 -16 -3 -66 205 29 7 -71 198 -55 11 -105 -149
5860 -149 -109 -171 -135 -236 -27 -53 63 68 7 -149 -25 82 -108 -9 110 0 281 26 -158 55 42 -559 180
5883 180 139 -9 58 -190 -132 368 -79 159 -255 82 -69 -89 -31 70 330 173 -36 -72 -9 -83 55 -3 38
5906 38 -66 99 -101 61 194 71 379 -345 -99 -69 168 192 -100 -145 -161 -145 -84 -88 -154 -218 -219 115 -134 -214 205
5931 205 -101 -27 319 109 143 171 -158 261 -82 -12 108 141 129 40 252 41 50 -352 19 61 -317 13 156
5954 156 -322 178 -93 7 -102 218 127 14 -373 3 -200 124 -224 -35 -250 83 -242 -55 5 24 67
5975 67 -75 116 -19 115 14 32 -47 275 -58 -149 -117 -42 27 -100 19 -137 410 164 281 -143 -202 134 -171
5998 -171 -58 -96 -185 281 95 -79 -7 -32 43 -292 -10 12 123 341 118 -105 53 174 37 -20 -8 -55 18
6021 18 98 -6 -70 38 -116 74 -308 0 263 -92 -10 -304 186 104 -38 63 -137 -324 109 33 209 197
6043 197 131 -210 -236 -175 -185 -27 -118 -134 63 278 68 7 -209 245 -330 -29 327 -5 -249 133 -71 -68 -119
6066 -119 -138 -10 -150 -57 -116 -65 212 -81 65 -288 -162 46 -181 -62 -156 -52 14 -12 16 279 -285 -11 -376
6089 -376 206 -130 -148 -82 100 -44 58 -82 33 -54 -52 -214 -115 -158 18 -51 256 -31 -127 -49 -311 263 302 644
6113 644 -152 -79 -85 269 -23 451 -54 116 -33 148 -68 33 -163 -312 73 -94 -80 -474 11 60 -13 105
6135 105 44 69 -75 79 -78 -198 -41 225 -14 124 -53 -7 -64 305 -30 -69 -172 -41 -135 -58 -125 10 306
6158 306 265 58 172 107 -267 137 -19 -296 -242 206 60 -141 77 -99 4 -162 -88 112 -244 135 95 -12
6180 -12 443 -172 214 -19 -183 111 -317 105 79 -46 -360 69 -37 224 162 -198 -356 -31 -2 -100 140 -46
6202 -46 89 298 -66 74 -3 -236 54 -45 -139 162 -81 144 185 81 -8 359 125 107 75 68 118 163 123 223
6226 223 111 370 -109 182 140 15 -135 5 -290 233 167 403 -196 20 187 137 24 107 -24 -114 120 245
6248 245 -40 -359 245 -138 114 105 138 -38 84 126 -135 -189 36 -87 -122 386 90 -134 190 159 120 126 -142
6271 -142 -19 -104 -64 44 -7 34 -85 70 -23 121 63 -221 -199 -123 68 -88 283 45 226 -188 -197 45 314
6294 314 192 47 58 79 116 264 -109 79 -133 -304 140 171 31 0 -3 12 -83 -108 -46 175 75 -84 82 -13
6318 -13 88 248 -74 161 186 169 15 112 72 -1 158 -37 344 -116 86 71 -154 168 -66 -85 -214 -301 123
6341 123 178 -142 -145 -8 -107 -258 -45 205 -108 -142 62 90 109 57 -143 320 -71 286 -58 314 256 151 224
6364 224 180 -353 52 288 -15 127 -17 -130 36 -28 -98 141 -75 -274 -205 -63 -71 14 94 64 -190 64 127
6387 127 153 221 -55 67 -57 76 104 50 -144 209 208 -141 163 -347 96 64 -181 -132 -125 -267 -59 202 47
6410 47 23 183 -31 44 -334 -9 150 -253 116 -246 -373 77 284 -78 -240 -47 60 163 -52 115 221
6431 221 159 69 -95 -122 69 -213 -89 29 154 -40 253 326 140 -106 250 -97 145 132 -289 116 -193 -167
6453 -167 139 175 -92 77 166 76 172 103 -322 -16 48 20 62 -85 151 95 113 33 -338 6 -42 -130 25 308
6477 308 73 -48 -194 214 -200 -163 240 -5 8 -165 -40 -22 5 -92 -199 418 -268 508 29 32 62 -5 -147
6500 -147 43 281 339 -128 39 77 85 -42 -76 138 3 2 -25 38 140 -87 342 344 -358 221 96 -217 319 151
6524 151 -70 252 -223 186 131 -279 102 -87 129 67 21 -261 -36 7 43 -52 342 -80 -217 170 113 52 11
6547 11 -27 4 183 -102 165 22 231 47 342 40 35 481 -67 -177 202 -303 -152 46 -48 -12 -47 -75 -64
6570 -64 -182 300 80 -192 -32 32 -9 27 182 -70 27 16 -36 105 101 -343 -46 201 88 -310 11 -94 55
6593 55 -131 -150 -105 -112 -117 -9 -29 -167 6 101 44 -131 229 -50 -240 323 -81 -71 -138 -170 56 17 -113 -101 210
6618 210 157 314 -48 -154 16 -14 -12 -256 -162 -145 -64 -15 -123 -346 -173 -165 208 -119 -99 115 34 -56 -113 147 -168
6643 -168 129 154 -6 111 -162 109 117 -84 35 108 -88 -138 -155 -119 -72 51 -60 -414 102 178 83 233 -62
6666 -62 -2 -199 328 -75 170 -3 -120 -138 -3 257 308 68 264 21 -304 -129 448 -110 102 -234 -173 -54
6688 -54 37 -53 135 182 111 -102 66 140 -101 -2 -73 211 -163 165 -66 290 -184 -153 59 121 -152 177 94 -164
6712 -164 197 222 5 -43 -188 -368 -22 -116 -146 -164 165 135 173 -149 -202 35 72 144 -104 163 -30 180 293
6735 293 -81 -24 -150 -54 -337 156 -245 -63 98 -105 -42 226 59 -176 -135 -19 -45 50 56 43 -54 -162 -63 52
6759 52 -221 105 179 -249 -120 136 185 -264 -166 -182 -161 197 -95 -54 -49 -33 -29 -211 134 14 109 -206 403 27
6783 27 -116 -40 -18 21 34 111 15 -22 159 93 -213 82 33 -124 49 -25 -116 154 -220 -21 415 -137 110 58
6807 58 35 -4 33 263 -123 -135 -106 -33 -119 114 -138 43 -27 130 10 216 72 -137 -220 -24 124 -7 132
6830 132 151 204 -30 -82 -139 -91 93 -132 -115 35 33 149 -5 -309 -23 -57 -45 40 185 233 35 -15 -165 41
6854 41 -148 -10 61 -67 26 349 203 -49 -219 -235 60 -73 34 103 83 -189 187 -92 25 -99 114 -397
6876 -397 -70 246 91 182 -37 137 -68 243 76 280 -78 335 -39 -33 213 201 68 -230 -5 -95 3 133
6898 133 -55 247 102 59 -139 -118 -223 -293 -126 76 -174 171 -34 -28 227 248 -11 33 -172 -80 201 -78 23
6921 23 -14 38 -41 -25 80 75 105 -237 383 159 -5 236 -225 -158 -23 156 -50 -112 -320 -178 80 -59 12 59
6945 59 296 -110 -136 50 85 200 177 -182 53 -80 38 299 -211 103 -171 -103 52 -119 -230 74 121 123 -166
6968 -166 -128 83 -270 -93 104 -80 365 190 -49 -96 -7 183 -260 63 -19 -277 145 52 146 -193 -98 -5 -104
6991 -104 23 -182 150 148 -20 -183 106 -43 -146 274 34 -400 -101 99 7 44 331 93 201 -18 -21 209
7013 209 273 -139 125 -82 -44 28 -25 -85 85 142 -17 367 170 -125 64 186 -292 -34 159 18 -321 72
7035 72 -115 362 -84 2 -191 139 154 -86 -3 57 71 51 338 6 102 47 -7 167 -1 -117 -117 117 17 -152
7059 -152 22 -78 -280 35 17 -189 -33 -69 58 142 -200 111 -344 76 59 -64 -126 -376 23 -13 188 222
7081 222 107 -335 521 -39 36 -68 177 176 354 -244 58 -26 -104 -158 -154 230 115 -134 216 -167 -64 -34 -38 -49
7105 -49 143 -26 -51 -186 -201 -108 -199 8 -130 -209 -6 55 -1 -90 124 -77 -88 227 -133 -259 80 -566 64
7128 64 -57 31 -22 102 -138 46 -103 -10 -216 116 61 364 165 25 -167 -22 114 9 -227 -204 -505 -101
7150 -101 -392 -402 22 61 -98 21 -123 -91 -67 -291 245 -18 -200 -51 12 -86 -101 -165 54 -6 -90 67 276
7173 276 47 214 80 -183 -70 86 46 98 -213 -350 254 -152 152 -251 -51 211 -40 29 -42 -19 301 -29
7195 -29 -47 -146 34 -249 -97 149 6 97 36 -113 107 147 -131 -18 -141 -21 160 -27 -101 12 87 190 118
7218 118 -102 286 -105 82 -321 -231 156 9 -214 -49 99 -28 -38 -13 -199 -123 206 278 23 -136 91 204
7240 204 -46 137 -92 99 -263 -102 -77 254 9 203 -306 51 -144 209 369 -181 84 -86 49 -235
7260 -235 -212 26 282 178 -282 12 284 -57 -369 -49 -52 69 219 -139 384 55 -140 -20 -70 -15 29 4
7282 4 -259 52 72 -215 -213 213 81 57 2 -54 242 262 155 -229 40 -18 -24 136 -69 40 -136 -309 -47 18
7306 18 87 67 -128 162 -154 12 86 147 -63 95 -41 188 91 194 143 -97 -212 -84 -151 -88 -1 -4 -278 211
7330 211 -190 71 -51 142 -89 -22 -5 377 -285 -357 157 207 72 -196 -393 294 159 158 -192 -24 -455 121
7352 121 -326 -88 -47 634 144 -5 5 -442 154 -123 13 130 -233 227 -123 120 -108 91 254 126 231
7373 231 11 163 224 -271 -236 12 174 -36 12 301 326 55 -178 -183 -46 114 237 -192 -206 -5 -132 -364
7395 -364 -270 226 199 66 -71 -53 -142 93 3 128 33 -4 -71 -214 106 -89 -79 199 -121 52 -374 -81 -144
7418 -144 100 53 32 -138 -132 95 -333 -9 -186 -59 117 38 104 29 -365 84 46 64 -181 145 83 -53 52
7441 52 -71 -263 -3 -100 -170 -26 -274 121 11 105 83 -227 -49 85 18 186 -108 -193 296 -145 -90 91 -136
7464 -136 102 107 -90 -192 -170 -250 -269 38 -12 -7 -109 -162 -68 225 -382 33 -111 152 193 204 -113 11 85 19 14
7489 14 -78 184 -240 141 211 -91 -160 111 193 -74 -27 22 -84 -225 -12 -132 226 252 -255 8 -79 183 -125
7512 -125 2 116 -53 -71 59 -136 352 -119 -33 -224 110 156 -72 -98 -95 -395 -118 -40 -43 -74 10 -100 146 -94
7536 -94 245 -114 -45 284 -107 248 -187 279 138 -138 141 78 12 -38 250 -65 -243 11 -96 -78 -150 -103 -31
7559 -31 99 173 101 24 106 632 6 58 4 -101 140 17 8 47 85 306 -153 68 -67 -66 248 51 51 -108 192
7584 192 -85 83 128 -154 256 93 30 -119 69 -274 162 -56 104 -275 144 144 57 -87 168 -74 7 -90
7606 -90 99 -15 -166 114 80 126 -127 33 184 -33 170 185 71 -336 90 -100 -176 -151 14 127 324 174
7628 174 -91 245 -286 -228 -258 17 -39 -207 -18 71 -61 46 313 -57 120 226 -95 -19 62 -263 51 -47
7650 -47 -2 -266 -108 107 -116 69 213 -166 -64 87 68 -119 -81 -75 -42 -78 -162 76 77 -3 -310 73 -55 -196
7674 -196 173 48 125 10 -23 58 20 -27 275 149 86 -62 152 22 -55 1 -38 -317 -37 230 -114 -21 -368
7697 -368 -73 -329 75 39 -210 -63 -153 45 -260 38 85 -29 81 -85 -81 -59 -189 88 -380 -148 -106 -63 -87
7720 -87 -54 305 -6 -340 234 142 -11 286 75 -12 -167 74 -218 121 -197 153 -37 -177 -57 -219 148
7741 148 66 -15 148 -90 -17 69 -10 -84 -197 144 -40 6 216 177 -241 64 172 448 72 -14 244 -22 108
7764 108 -55 -58 -51 247 17 -100 123 -160 3 -27 66 -31 -26 -31 -303 119 77 -62 36 -116 49 -91 -237 51
7788 51 -46 -160 -86 -13 -126 34 -180 268 255 -33 24 139 -13 -256 118 -23 146 120 -157 26 164 31
7810 31 16 -58 -455 -329 -285 83 -290 8 -122 18 -105 16 27 -93 182 -33 -103 168 -51 -100 -255 -349 -68
7833 -68 130 81 -124 226 76 -47 205 50 125 -99 -10 -94 26 -103 -456 200 85 -114 -53 103 248 1
7855 1 -75 200 81 6 18 -186 -22 212 -133 -24 174 221 -2 16 -515 355 -30 153 158 -115 146 82 -7 150
7879 150 288 -84 3 70 110 -119 45 143 371 413 39 132 -19 -20 -186 -38 -86 71 -165 -83 37 52 98 257
7903 257 -179 -71 35 -68 -1 19 -17 115 140 -11 81 -7 -172 -39 -1 -67 -100 -274 28 -17 112 -80 82
7926 82 -53 -116 -31 118 50 -305 52 92 39 171 -10 164 -123 -106 144 71 175 73 -112 114 233 -242 76
7949 76 76 16 -201 -49 2 159 35 -89 -134 177 97 338 290 68 264 -152 32 -4 73 -103 -92 -216 -105 210
7973 210 151 -30 -31 81 -63 155 117 201 -153 -149 101 -153 97 290 286 39 100 -319 159 203 -182 -144 147 48
7997 48 66 114 42 -241 -88 209 -122 -235 -64 101 -157 33 -96 -312 -61 -76 122 29 -142 68 -76 -91
8019 -91 -122 -165 31 0 38 253 209 -102 -96 -345 242 15 152 80 8 39 3 204 190 129 -182 -167 46 84 -66
8044 -66 11 -194 177 -21 -42 165 -57 -240 -35 279 245 -45 -12 168 -123 201 84 -52 188 -226 -15 -499
8066 -499 -110 -485 187 -81 -94 25 -17 -55 2 -230 71 23 40 162 16 -54 42 164 -145 -43 -137 287 -131
8089 -131 -142 -85 134 134 88 -278 -123 91 -179 44 204 -299 -175 -218 -267 -395 -421 13 -181 -65 -232 298 436
8112 436 68 147 95 -106 -133 33 391 -150 -118 -9 -125 12 163 48 124 -81 182 -166 -194 74 -313 -469
8134 -469 236 -142 -124 -49 223 -149 252 40 54 -31 130 -527 54 20 12 275 -37 -286 228 -47 -114 -103 103
8157 103 2 226 104 -15 -103 -131 -174 -147 169 -231 109 -135 308 -228 -55 54 -11 -40 -83 -38 -75 -133 59
8180 59 129 -120 140 -200 121 296 107 -153 298 -76 -67
8191f7
##END NTUPLES=NMR FID
##END=
