##TITLE=1H_70-2023
 CDCl3
 8 sc, 
 8.9.2023
##JCAMPDX= 6.0         $$ Bruker NMR JCAMP-DX V2.0
##DATA TYPE= NMR FID
##DATA CLASS= NTUPLES
##ORIGIN= UXNMR, Bruker Analytische Messtechnik GmbH
##OWNER= root
$$ XWIN-NMR		Version 3.5
$$ Fri Sep  8 14:05:09 2023 Russian Standard Time (UT+4h)  she@DPX200
##.OBSERVE FREQUENCY= 200.13135
##.OBSERVE NUCLEUS= ^1H
##.DELAY= (6, 6)
##.ACQUISITION MODE= SIMULTANEOUS
##.ACQUISITION SCHEME= undefined
##.AVERAGES= 8
##.DIGITISER RES= 18
##SPECTROMETER/DATA SYSTEM= spect
##.PULSE SEQUENCE= zg30
##.SOLVENT NAME= CDCl3
##.SHIFT REFERENCE= (INTERNAL, CDCl3, 0, 15.7039)
##AUDIT TRAIL= $$ (NUMBER, WHEN, WHO, WHERE, WHAT)
$$ ##TITLE= Audit trail, XWIN-NMR		Version 3.5
$$ ##JCAMPDX= 5.01
$$ ##ORIGIN= Bruker BioSpin GmbH
$$ ##OWNER= she
$$ F:/spectra/data/she/nmr/H-F/1/audita.txt
$$ ##AUDIT TRAIL=  $$ (NUMBER, WHEN, WHO, WHERE, WHAT)
(   1,<2023-09-08 14:04:04.93 +0400>,<she>,<DPX200>,
      <created by zg, POWCHK disabled, PULCHK disabled
       configuration hash MD5:
       00 E9 B6 7A A2 85 ED C7 34 08 36 98 17 FE 4E 26
       data hash MD5: 16K
       28 B9 25 D2 C9 41 CB EB CC 85 1F 9A 82 32 3F ED>)
$$ ##END=
$$ 
$$ hash MD5
$$ 86 94 F5 E6 9D 74 6C 50 8B 24 52 FD EE 7B 15 BD
##$RELAX= 
##$RELAX= 
##$RELAX= 
##$RELAX= 
##$RELAX= 
##$RELAX= 
$$ Bruker specific parameters
$$ --------------------------
##$DU= <F:/spectra>
##$EXPNO= 1
##$NAME= <H-F>
##$PROCNO= 1
##$TYPE= <nmr>
##$USER= <she>
##$AMP= (0..31)
100 100 100 100 100 100 100 100 100 100 100 100 100 100 100 100 100 100 
100 100 100 100 100 100 100 100 100 100 100 100 100 100 
##$AQSEQ= 0
##$AQ_mod= 1
##$AUNM= <au_zg>
##$AUTOPOS= <>
##$BF1= 200.13
##$BF2= 200.13
##$BF3= 200.13
##$BF4= 200.13
##$BF5= 200.13
##$BF6= 200.13
##$BF7= 200.13
##$BF8= 200.13
##$BYTORDA= 1
##$CFDGTYP= 0
##$CFRGTYP= 5
##$CHEMSTR= <none>
##$CNST= (0..31)
1 1 145 1 1 1 1 1 1 1 1 1 1 1 1 1 1 1 1 1 1 1 1 1 1 1 1 1 1 1 1 1 
##$CPDPRG= <>
##$CPDPRG1= <>
##$CPDPRG2= <>
##$CPDPRG3= <>
##$CPDPRG4= <mlev>
##$CPDPRG5= <mlev>
##$CPDPRG6= <mlev>
##$CPDPRG7= <mlev>
##$CPDPRG8= <mlev>
##$CPDPRGB= <>
##$CPDPRGT= <>
##$D= (0..31)
0 1.2 0 0 0 0 0 0 0 0.06 0 0.03 0 0 0 0 0.0002 0 0 0 0 0 0 0 0 0 0 0 0 
0 0 0 
##$DATE= 1694167444
##$DBL= (0..7)
120 120 120 120 120 120 120 120 
##$DBP= (0..7)
150 150 150 150 150 150 150 150 
##$DBP07= 0
##$DBPNAM0= <>
##$DBPNAM1= <>
##$DBPNAM2= <>
##$DBPNAM3= <>
##$DBPNAM4= <>
##$DBPNAM5= <>
##$DBPNAM6= <>
##$DBPNAM7= <>
##$DBPOAL= (0..7)
0.5 0.5 0.5 0.5 0.5 0.5 0.5 0.5 
##$DBPOFFS= (0..7)
0 0 0 0 0 0 0 0 
##$DE= 6
##$DECBNUC= <off>
##$DECIM= 32
##$DECNUC= <off>
##$DECSTAT= 4
##$DIGMOD= 1
##$DIGTYP= 9
##$DL= (0..7)
0 120 120 120 120 120 120 120 
##$DP= (0..7)
150 150 150 150 150 150 150 150 
##$DP07= 0
##$DPNAME0= <>
##$DPNAME1= <>
##$DPNAME2= <>
##$DPNAME3= <>
##$DPNAME4= <>
##$DPNAME5= <>
##$DPNAME6= <>
##$DPNAME7= <>
##$DPOAL= (0..7)
0.5 0.5 0.5 0.5 0.5 0.5 0.5 0.5 
##$DPOFFS= (0..7)
0 0 0 0 0 0 0 0 
##$DQDMODE= 0
##$DR= 18
##$DS= 0
##$DSLIST= <SSSSSSSSSSSSSSS>
$$ [...]
##$SUBNAM2= <"">
##$SUBNAM3= <"">
##$SUBNAM4= <"">
##$SUBNAM5= <"">
##$SUBNAM6= <"">
##$SUBNAM7= <"">
##$SUBNAM8= <"">
##$SUBNAM9= <"">
##$SW= 18.05172834244
##$SWIBOX= (0..15)
0 0 2 0 0 0 0 0 0 0 0 0 0 0 0 0 
##$SW_h= 3612.71676300578
##$TD= 16384
##$TD0= 1
##$TE= 0
##$TE2= 300
##$TE3= 300
##$TEG= 300
##$TL= (0..7)
0 120 120 120 120 120 120 120 
##$TP= (0..7)
150 150 150 150 150 150 150 150 
##$TP07= 0
##$TPNAME0= <>
##$TPNAME1= <>
##$TPNAME2= <>
##$TPNAME3= <>
##$TPNAME4= <>
##$TPNAME5= <>
##$TPNAME6= <>
##$TPNAME7= <>
##$TPOAL= (0..7)
0.5 0.5 0.5 0.5 0.5 0.5 0.5 0.5 
##$TPOFFS= (0..7)
0 0 0 0 0 0 0 0 
##$TUNHIN= 0
##$TUNHOUT= 0
##$TUNXOUT= 0
##$USERA1= <user>
##$USERA2= <user>
##$USERA3= <user>
##$USERA4= <user>
##$USERA5= <user>
##$V9= 5
##$VALIST= <valist>
##$VCLIST= <CCCCCCCCCCCCCCC>
##$VD= 0
##$VDLIST= <DDDDDDDDDDDDDDD>
##$VPLIST= <PPPPPPPPPPPPPPP>
##$VTLIST= <TTTTTTTTTTTTTTT>
##$WBST= 1024
##$WBSW= 4
##$XGAIN= (0..3)
0 0 0 0 
##$XL= 0
##$YL= 0
##$YMAX_a= 516186
##$YMIN_a= -459174
##$ZGOPTNS= <>
##$ZL1= 120
##$ZL2= 120
##$ZL3= 120
##$ZL4= 120
##$ABSF1= 10
##$ABSF2= 0
##$ABSG= 5
##$ABSL= 3
##$ALPHA= 0
##$AQORDER= 0
##$ASSFAC= 0
##$ASSFACI= 0
##$ASSFACX= 0
##$ASSWID= 0
##$AUNMP= <proc_1d>
##$AZFE= 0.1
##$AZFW= 0.1
##$BCFW= 1
##$BC_mod= 2
##$BYTORDP= 1
##$COROFFS= 0
##$CY= 11.3945322036743
##$DATMOD= 1
##$DC= 2
##$DFILT= <>
##$DTYPP= 0
##$F1P= 15.7292609196834
##$F2P= 12.9074282941183
##$FCOR= 0.5
##$FTSIZE= 0
##$FT_mod= 4
##$GAMMA= 1
##$GB= 0.15
##$INTBC= 1
##$INTSCL= 1
##$ISEN= 128
##$LB= 0.24
##$LEV0= 0
##$LPBIN= 0
##$MAXI= 10000
##$MC2= 0
##$MEAN= 0
##$ME_mod= 0
##$MI= 1.114404
##$NCOEF= 0
##$NC_proc= 0
##$NLEV= 6
##$NOISF1= 3.799351
##$NOISF2= 2.8
##$NSP= 1
##$NTH_PI= 0
##$NZP= 0
##$OFFSET= 15.70392
##$PC= 1
##$PHC0= -21399.95
##$PHC1= 12.65271
##$PH_mod= 1
##$PKNL= yes
##$PPARMOD= 0
##$PSCAL= 0
##$PSIGN= 0
##$REVERSE= no
##$SF= 200.130013532006
##$SI= 16384
##$SIGF1= 3
##$SIGF2= 2
##$SINO= 400
##$SIOLD= 16384
##$SREGLST= <1H.CDCl3>
##$SSB= 0
##$STSI= 0
##$STSR= 0
##$SW_p= 3612.71676300578
##$SYMM= 0
##$S_DEV= 0
##$TDeff= 0
##$TDoff= 0
##$TI= <>
##$TILT= no
##$TM1= 0
##$TM2= 0
##$TOPLEV= 0
##$USERP1= <user>
##$USERP2= <user>
##$USERP3= <user>
##$USERP4= <user>
##$USERP5= <user>
##$WDW= 1
##$XDIM= 8192
##$YMAX_p= 0
##$YMIN_p= 0
$$ End of Bruker specific parameters
$$ ---------------------------------
##NTUPLES= NMR FID
##VAR_NAME=  TIME,          FID/REAL,        FID/IMAG
##SYMBOL=    X,             R,               I
##VAR_TYPE=  INDEPENDENT,   DEPENDENT,       DEPENDENT
##VAR_FORM=  AFFN,          ASDF,            ASDF
##VAR_DIM=   8192,          8192,            8192
##UNITS=     SECONDS,       ARBITRARY UNITS, ARBITRARY UNITS
##FACTOR=    0.0002768,     1,               1
##FIRST=     0,             0,               0
##LAST=      2.2672688,     0,               0
##MIN=       0,             -459174,         0
##MAX=       2.2672688,     516186,          0
$$ Real data points
##PAGE= N=1
##DATA TABLE= (X++(R..R)), XYDATA
0@%%%%%%%qJ6j6J6j6K4l2M0m8N6p2Q8j04J28j55J81k18K56k96L44m00M64n29O02
$$ 0 0 0 0 0 0 0 0 -8 8 -8 8 -8 16 -16 24 -24 32 -40 48 -56 72 -83 98 -120 136 -160 184 -216 248 -281 321
31C21o89P85q89J002j128J270j424J593j777J977k196K437k700K986l298L639
$$ 321 -368 417 -472 530 -598 672 -752 841 -936 1041 -1155 1282 -1418 1568 -1730 1909
47A909m014M425m874N367n913O519p191P942q789R750j0853J2133j3637J5434
$$ 1909 -2105 2320 -2554 2813 -3100 3419 -3772 4170 -4619 5131 -5722 6411 -7226 8208
61H208j7628K0376k3931K8730l5584M6211o4979J07390l59739N1719P55413o84549
$$ 8208 -9420 10956 -12975 15755 -19829 26382 -38597 68793 -290946 -239227 516186 -168363
73a68363r9936N81588l33946l37508O29053l7896n29643L21826K78182n05048
$$ -168363 -268299 313289 -20657 -358165 270888 232992 -296651 25175 303357 -201691
83b01691R7124L93774l16970j25326L17341j42734j45024J97087O111j62756Q2823
$$ -201691 -104567 289207 -27763 -153089 164252 21518 -123506 73581 79692 -83064 -241
94b41J21996j53507r5294K11485n154j64612J08045L0711j60917Q8157J27532
$$ -241 121755 -31752 -127046 84439 79285 -85327 22718 53429 -107488 -19331 108201
105A08201j62457n5732K25482p9829k34998K40933J06241k87573J41424J42474
$$ 108201 -54256 -109988 115494 35665 -199333 41600 147841 -139732 1692 144166
115A44166k98429J03432K56445k59722p8461K62293j02155j73270K07120J9008
$$ 144166 -154263 -50831 205614 -54108 -132569 129724 27569 -145701 61419 80427
125H0427k19520J43758R5767k19662R3308J26671j91205N1066J41446j25178j9982
$$ 80427 -139093 4665 100432 -119230 -25922 100749 -90456 -39390 102056 -23122 -43104
136d3104P4450l4318J5394M2196n1157m1188N6644K5652m5316R897p277k0987
$$ -43104 31346 -2972 12422 54618 3461 -37727 18917 44569 -747 9150 1873 -19114
148a9114N3684l1220l5631O4641l7600j8230N7961n4627J753N3498n9138M867
$$ -19114 34570 3350 -32281 32360 -5240 -23470 34491 -20136 -18383 35115 -24023 -19156
160a9156M7689m3581j1552L3983j3211j7286L4608j1855m9027O8984J3417r3529
$$ -19156 28533 -15048 -26600 7383 -5828 -23114 11494 -361 -49388 19596 33013 -60516
172f0516P5998L5913j06394P3755L7244j09360O8337N5637j08964J4648Q1323
$$ -60516 15482 51395 -54999 18756 56000 -53360 14977 70614 -38350 -23702 57621
183E7621n6689l9688P3003k5409o9662R2054L784j08682Q0324L3796r7753N8629
$$ 57621 932 -38756 34247 8838 -60824 31230 35014 -73668 6656 40452 -57301 1328
195A328L7274p6584K4115M1854l3229j3277L1278J841m2404K9632L3505n9258
$$ 1328 38602 -37982 -13867 27987 -5242 -18519 12759 14600 -27804 1828 35333 -23925
207b3925P757M4712l1552n834J9458l468j4386l36M0526k7464m2261P0458j3277
$$ -23925 -16168 28544 -3008 -8842 10616 7148 -7238 -7574 32952 5488 -36773 33685 20408
220B0408o4049O8431K744o9232M4300K9543n7168O33N6645l2223m6411P3152n249
$$ 20408 -43641 24790 27534 -41698 2602 32145 -25023 -24390 32255 32 -46379 26773 21524
233B1524p8030P6384J8652q8702N7151L2613p2218K7065L9649m3071j2271M2301
$$ 21524 -56506 19878 38530 -50172 6979 39592 -32626 -5561 34088 -8983 -21254 21047
245B1047p460m5824L9098K0919o0714L0518L1098n6636J9565K9960l2667K190
$$ 21047 13587 -32237 6861 27780 -32934 -2416 28682 -27954 -8389 21571 -11096 -8906
257h906J3886r65j1878n24K7120k3519j3868M0563k2528j6875L3834j2659j3064
$$ -8906 4980 4015 -7863 -8387 18733 -4786 -18654 21909 -619 -17494 16340 3681 -9383
270i383J3827M464q397j1457K5399j939l4609L6835J723m1785L8074L767l6964
$$ -9383 4444 8908 511 -10946 14453 12514 -22095 14740 16463 -25322 12752 16519 -20445
283b0445K5062P669k2195K325J4743l315k1994K0735J0662l8986K5659J7384m2324
$$ -20445 4617 12286 -9909 -7584 7159 3844 -18150 2585 13247 -25739 -80 17304 -25020
296b5020K4504J5790l2836J5046J1403j1584j404N139Q867j6548L525K2630k8145
$$ -25020 -516 15274 -17562 -2516 8887 -2697 -4101 1038 9905 -6643 -3118 19512 -8633
309h633L860K5311k8679M629J6812j7779L909J959P6k11j1037J7946o588j7301
$$ -8633 -4773 20538 -8141 -3512 13300 -4479 -570 1389 1465 1254 -9783 8163 1575 -15726
323a5726K8590j1442j6719K6498r998r261J2418k833j423n370R008L915k2347
$$ -15726 12864 1422 -15297 11201 1203 -8058 4360 1527 104 -5266 3742 7657 -14690
336a4690K0497N898l0697K5579M964k7457K1208L019j5639P334M205n19j0600
$$ -14690 5807 11705 -18992 6587 11551 -15906 5302 8321 -7318 16 4221 3702 -6898
349f898P115J1749k5661J1242J7214l1740J3478J4978k5179J0525P493r912L230
$$ -6898 217 11966 -13695 -2453 14761 -16979 -3501 11477 -13702 -3177 4316 -5596 -2366
362b366M67P814q004m350K1616j6829m312K3255j9645q64J6489j4713J355K712
$$ -2366 -1899 5915 -2089 -6439 15177 -1652 -5964 17291 -2354 -3218 13271 -1442 -87 2625
376B625j792K379j0860J1102j10j7722K1931m676j7763K2151o142r463J3058n852
$$ 2625 833 3212 -7648 3454 3344 -14378 7553 2877 -14886 7265 1123 -8340 4718 -1134
390a134k46j71O44O708j5067P959R780k0883J4620M995j9993J6791J237r794R399
$$ -1134 -1380 -1551 -907 5801 -9266 -1307 8473 -12410 2210 7205 -12788 4003 5240 -4554 4845
405D845m749K832J042n037J0404j1189j068J4564j7354L953Q218j6214J0077R08
$$ 4845 96 2928 3970 -1067 9337 -1852 -2920 11644 -5710 -1757 6461 -9753 324 1232
419A232r244Q741o478L591M932j0026J1108l498n650J5666j1775p21J1618j3241
$$ 1232 -8012 729 -5749 -2158 2774 -7252 3856 358 -5292 10374 -1401 -2122 9496 -3745
433c745O722K305j1170R295m785q93N592j1587Q936M41q882J3911r207l556J5554
$$ -3745 2977 5282 -5888 3407 -1378 -2271 3321 -8266 670 1111 -7771 6140 -3067 -6623 8931
448H931j1947K639O228j0952R232j580m416O398j0032P414L757j2923J2141l564
$$ 8931 -3016 -377 5851 -5101 4131 2551 -1865 4533 -5499 1915 5672 -7251 4890 1326
462A326p817J5553p826l064P709o628O445k476m628Q408j1962M798Q230j8837
$$ 1326 -6491 9062 1236 -1828 5881 -747 5698 3222 -1406 7002 -4960 -162 8068 -10769
476a0769Q045N174j3734J0089k089o225O491l022O490l627n589J5320r397r19
$$ -10769 -2724 2450 -11284 -1195 -3284 -9509 -3018 -6040 450 -3177 -8766 6554 -2843 -3762
490c762J4603j5467L147J1026j1198M752q79l292O939p939N695R13j1979J5020
$$ -3762 10841 -4626 -1479 9547 -1651 3101 2222 -1070 5869 -2070 3625 4538 -7441 7579
504G579j821j0896J2767n997j948Q174p395K580l258q30R475j4211L033Q816j6722
$$ 7579 5758 -5138 7629 1632 -316 7858 463 3043 -215 -1045 8430 -5781 -2748 6068 -10654
519a0654J0420N332j6215R821K073n028M731l194L631k654j057J0965j3054l41
$$ -10654 -234 5098 -11117 -1296 777 -4251 480 -2714 917 -1737 -2794 8171 -4883 -5224
533e224J3945j4998L462Q071j4601P116L373o054M100n507N656K900q302J0990
$$ -5224 8721 -6277 -2815 5256 -9345 -2229 1144 -4910 -810 -6317 -661 2239 -6063 4927
547D927m203o111J5174p762l031P719o957N515j254m218O808r746M759P817j5810
$$ 4927 724 -5387 9787 2025 -1006 6713 -244 5271 4017 -201 6607 -3139 1620 9437 -6373
562f373Q120M292j1700J0950j719o937O389l162L348k227n466Q850q351O0R755
$$ -6373 1747 6039 -5661 5289 3570 -3367 3022 -140 3208 981 -4485 4365 -3986 -3926 5829
577E829j4984M461P495j1617P905q68n910Q848m564K061L388p800R367j402n685
$$ 5829 -9155 -4694 2801 -8816 -911 -1779 -7689 1159 -3405 -1344 2044 -5756 3611 2209 -3476
592c476R648p460M64O970q778M989j088m758R383q050L12P149j0679P886K237
$$ -3476 6172 -1288 -824 6146 -2632 2357 1269 -3489 5894 -2156 -1844 5305 -5374 2512 4749
607D749j0470R573k472l560P502p247K127J626m559P118o795j100Q318j0228N637
$$ 4749 -5721 3852 1380 -2180 5322 -1925 202 1828 -2731 4387 -2408 -3508 4810 -5418 219
622B19L791j1590R840K58o230Q529o346J109M943o738O386l424m528R816p953
$$ 219 4010 -7580 2260 2518 -3712 4817 -1529 -420 4523 -2215 4171 747 -3781 6035 -1918
637a918J7N954r417N528J295o240O824n493J187N671r077P128L48q123J1053m300
$$ -1918 -1901 4053 -5364 164 1459 -4781 2043 -3450 -2263 3408 -5669 1459 1807 -6316 4737 437
653D37m942R224p160J780L808n940M665k792k21N469q696N956K383r370J0170
$$ 437 -4505 4719 -2441 -661 3147 -2793 1872 -920 -1141 4328 -4368 1588 3971 -5399 4771
668D771l223o370J0853o853r62N805p175M758m89m490O622o204J643M947q524
$$ 4771 1548 -4822 6031 -822 -1784 4021 -3154 1604 1115 -3375 3247 -2957 -1314 3633 -4891
683d891O125l9n659Q722n398j25N794q262O214J139p691R159m814k888Q610q113
$$ -4891 1234 1195 -4464 4258 -1140 -1265 4529 -3733 2481 3620 -4071 5088 274 -2614 5996 -2117
699b117J114M388o927N197j835k524M148n431M570j04p000J0003n148m379J1456
$$ -2117 -1003 3385 -3542 1655 -180 -2704 1444 -3987 583 479 -6521 3482 -1666 -6045 5411
714E411r012k27Q870r466L980L149n230M562k467J591J670n590P458l207m704
$$ 5411 -3601 -3828 5042 -4424 -444 2705 -2525 2037 -430 1161 2831 -2759 4699 1492 -3212
729c212J0551q086j132Q773r798L560L425p553O137k837k472N755o780L516J999
$$ -3212 7339 -747 -1879 6894 -2904 656 4081 -3472 2665 -172 -2644 3111 -3669 -153 1846
744A846o938O531k170l318O035n310K763J659n454Q054m652k819J0426r653J249
$$ 1846 -5092 1439 -731 -4049 1986 -3324 -561 1098 -4356 3698 -954 -3773 6653 -3000 -1751
759a751Q712j0363L739M424o881L669q87O1K5l840O990n255l617J0870r386j002
$$ -1751 6961 -3402 337 4761 -2120 1549 662 723 748 -3092 3898 -1357 -4974 5896 -3490 -4492
775d492J0407j0411K443N963p781M506j61j732L814n173M389L25o126Q228l690
$$ -4492 5915 -4496 -2053 3910 -3871 635 474 -1258 2556 -2617 1772 2097 -4029 4199 509
790E09l550P919o598J681L239o157O263l049l005Q383q483J118O739r343M082
$$ 509 -3041 4878 -1720 -39 3200 -2957 3306 257 -2748 5635 -2848 -1730 5009 -4334 -252
805b52K493o307M289j633J43J130m121O965m081l770J0939q579j059J0795r887
$$ -252 2241 -4066 223 -1410 -1267 -137 -4258 2707 -1374 -5144 5795 -2784 -3843 6952 -2935
820b935K210O389p400L430P69k171K270l879L904r46n438Q335n556l121Q971p859
$$ -2935 -725 5664 -1736 1694 2463 292 2562 -1317 2587 1641 -3797 4538 -1018 -4139 4832 -3027
836c027R95N281p344N049m64l934O401n540J070M663p188M793O07m636N487l627
$$ -3027 -2032 3249 -4095 954 490 -3444 2957 -2583 -1513 3150 -4038 755 1362 -3274 2213 -1414
852a414M62L335n500O020j726m686R289o496j323Q253q602J958M904p171L777
$$ -1414 -952 2383 -3117 2903 1177 -3509 5780 -716 -2039 6214 -2388 -430 4474 -2697 1080
867A080l05k472K731m143L841j122m488Q145n440k246Q974p992J724O556q538
$$ 1080 775 -1697 1034 -3109 732 -390 -4878 3267 -2173 -4419 4555 -3437 -1713 4843 -3695
882c695M708J609n031N316k855k53K635m716M630j904k959O024n881J318M620
$$ -3695 1013 2622 -2409 2907 52 -201 2434 -2282 2348 444 -2515 3509 -2372 -1054 3566
897C566q047N647Q50o325P795m156k972P151n888J385L155n233L781j195r82K934
$$ 3566 -4481 1166 2016 -4309 3486 -670 -3642 3509 -2379 -994 2161 -3072 709 -486 -1468 1466
913A466m473M579k50n094Q397m741k555R337q058O23O835q521L600K230n281L422
$$ 1466 -3007 1572 1322 -3772 4625 -116 -2671 6666 -1392 -769 6066 -2455 1145 3375 -1906 1516
929A516j946J07Q75l653M562l101j969P177p809J792O364q960N258K670p892P106
$$ 1516 -430 -323 552 -3101 1461 -1640 -3609 3568 -4241 -2449 3915 -5045 213 2883 -5009 2097
945B097j058m040N735l751M62K178k853L050k562L13L474n680M851N4o369Q758
$$ 2097 1039 -3001 2734 -1017 -555 1623 -1230 1820 -742 -429 3045 -2635 2216 2270 -4099 4659
961D659l954m316Q985p192n43P112p621J889K726m369K691q72M13Mk283N740m526
$$ 4659 705 -3611 5374 -1818 -2361 4751 -2870 -981 1745 -2624 67 -805 -392 -388 -2671 3069 -1457
978a457j096P907q525K251P515j0887N364M092r119O374M17n490M276j537l82
$$ -1457 -2553 5354 -3171 -920 6595 -4292 1072 5164 -3955 2419 2836 -2654 1622 85 -297
993b97j36r41K977m601K011L662q170O304J479q298Q910k617n658R576n165k137
$$ -297 -433 -1374 1603 -2998 -987 2675 -5495 809 2288 -6010 2900 283 -5375 4201 -964 -3101
1009c101O673n601J315K542l000K059j320J709m87k387N719m768j034Q053q759
$$ -3101 3572 -2029 -714 1828 -1172 887 -433 1276 789 -1598 4121 -647 -1681 6372 -2387
1024b387J067P766j0660M203M947r444M842K044n497L161j02n18j033P30L333
$$ -2387 -1320 6446 -4214 -11 4936 -4508 334 2378 -3119 42 -60 -578 -1611 -881 2452
1039B452o296L549M435r259O796K424r862R120o29p432Q773l444l391N881l665
$$ 2452 -3844 -295 4140 -5119 1677 4101 -5761 3359 2730 -4702 4071 627 -2764 3117 -548
1054e48j39J371j155J038k589L055r00m073P523m838l186R356q133k01Q747r683
$$ -548 -687 684 -471 567 -2022 1033 133 -3940 3583 -1255 -4441 4915 -3218 -3419 5328 -4355
1070d355K517O000p787L212K809m018J338J107P80k252N73M553p100L311N198
$$ -4355 -1838 4162 -3625 -413 2396 -1622 -284 823 1603 -649 -76 4477 -2623 688 5886
1085E886j0254N805L807j0227P386Q21p886P306j517m067M216j780m10J43M46
$$ 5886 -4368 1437 5244 -4983 2403 3224 -4662 2644 1127 -2940 1276 -504 -914 -771 -325
1100c25Q09l950M649j11n837P908l204m769R968o421k235Q819p517P16N532o002
$$ -325 484 -3466 1183 1072 -4765 3143 -61 -4830 5138 -1283 -3518 5301 -2216 -1500 4032 -1970
1116a970J593K122k110L37m67K237k808n35N675p121J465O426r580M315M846r728
$$ -1970 -377 1745 -365 -28 -495 1742 -1066 -1601 4074 -3047 -1582 4844 -4736 -421 4425 -5303
1132e303O066K125p289N768l69l052K915l97R8j453J482J831n048M816P98p113
$$ -5303 763 2888 -4401 1367 998 -2054 861 464 562 -891 591 2422 -2626 2190 2988 -4125
1148d125P913j492o650Q922m258l775P532n254q05M266l588P02L65j82K05k165
$$ -4125 3788 2296 -4354 4568 310 -3465 4067 -1187 -1992 2274 -1314 -612 -247 -429 -224 -2389
1164b389L846k416k458O831n416q54P303p905K528N215q021M359K331n399M179
$$ -2389 1457 -959 -3417 3414 -2002 -2856 4447 -3458 -930 4285 -3736 623 2954 -2445 1734
1179A734o42j527J601j239J738k219M91K935n630L549K373p690O474q8o522P362
$$ 1734 1092 -435 1166 -73 1665 -554 -63 2872 -2758 791 3164 -4526 1948 1860 -4662 2700
1195B700k616l830O044l285p07K630k030J382j296J090J291l686M259j126l773
$$ 2700 84 -3746 2298 -987 -1694 936 -1094 288 -1008 82 1373 -2313 1946 820 -2953
1210b953O799l962k060O610o107O48M790n948K697J234l861L176j460j31Q39k132
$$ -2953 3846 -116 -2176 4434 -1673 -1025 3765 -2183 514 1748 -2113 1063 -397 -528 311 -1821
1226a821K912k416o08M475n799K674L598p088N091J018n555N544j225k764M285
$$ -1821 1091 -1325 -1933 2542 -3257 -583 3015 -4073 1018 2036 -3519 2025 800 -1964 2321
1241B321k505K85J058j525K110k371J067K097m812L853Q2m894N774k421l059N612
$$ 2321 -184 101 1159 -366 1744 -627 440 2537 -2275 1578 1660 -3234 2540 119 -2940 2672
1257B672m298J38L453m338K505J34k252K529j857Q51J374l058L808j799j832N213
$$ 2672 -1626 -1488 1965 -2373 132 266 -1986 543 -1314 -463 911 -2147 1661 -138 -1970 3243
1273C243m425O76M010n506L272J428m729M198j368k072L132k665J099J63j793
$$ 3243 -1182 -506 3504 -2002 1270 2698 -2031 2167 799 -1273 1859 -806 293 456 -1337
1288a337L042l192L22L200m909L106J201m823M815j220k769M561l087R6K793l468
$$ -1337 1705 -1487 -1165 2035 -2874 232 1433 -3390 1425 205 -2564 1997 -1090 -994 1799 -1669
1304a669K613m23j522L203l197J287J642l840L843r23k750M411l464k45L461m478
$$ -1669 944 521 -1001 2202 -995 292 1934 -1906 1937 1014 -1736 2675 -789 -1034 2427 -2051
1320b051K181R44l368L434j600j150K917l069J887L35k416L740k721k21L655m400
$$ -2051 130 1074 -2294 1140 -460 -1610 1307 -1762 125 460 -1956 1784 -937 -1158 2497 -1903
1336a903K309J729m357M015q07k619L911k740K11J807l013K680j020j490L135
$$ -1903 406 2135 -2222 1793 986 -1633 2278 -462 -251 1556 -1457 1223 203 -1287 1848
1351A848l411J247J681m118L653o01l011M408k696l54K889l331J960N56k610L417
$$ 1848 -1563 -316 1365 -2753 900 299 -2712 1696 -1000 -1354 1535 -1796 164 720 -1890 1527
1367A527j794n13K956l512K135P48k864L659k170r46L326l647J381J507l750L398
$$ 1527 -267 -780 2176 -1336 799 1547 -1317 2342 172 -774 2552 -1095 286 1793 -1957 1441
1383A441j128k020L361k852N28J702l112K622q31j438L305l357J285K261l942
$$ 1441 313 -1707 1654 -1198 -670 1032 -2080 542 -289 -1727 1578 -1779 -494 1767 -2175
1398b175K996P3k871L767k122l05K505l289K148L66k452L294k035n88K752l704
$$ -2175 821 894 -1977 1790 -332 -637 1868 -1421 727 1093 -1359 1935 -100 -688 2064 -1640
1414a640K185Q66l126L204j656j264K896k954J083J389l188K986j078j399L340
$$ -1640 545 1411 -1715 1489 -167 -1431 1465 -1489 -406 983 -2205 781 -297 -1696 1644
1429A644k906P52K029l182K687n11j699L188k601L87K245l421K736l26k513L240
$$ 1644 -1262 -510 1519 -1663 1024 513 -1186 2002 -599 -212 2033 -1388 1348 1022 -1491 1749
1445A749k179j62K240l056J862Q8k552L401k114n61K786k928J502R50l066L258
$$ 1749 -430 -592 1648 -1408 454 542 -2010 1391 -723 -1284 1502 -1426 76 1026 -2040 1218
1461A218j182j298K928k723J232J067k587K804j019j472L123k912Q35J751l265
$$ 1218 36 -1262 1666 -1057 175 1242 -1345 1459 440 -1032 2091 -821 14 1765 -1500
1476a500K652m77k285L303k591K19J969k994K267l52k124L202k276n2K424l206
$$ -1500 1152 675 -1610 1693 -898 -679 1290 -1704 563 211 -1913 1289 -987 -1039 1385 -1821
1492a821J957N70k674L371j735q10K923k647J178J096k521K646j081j161K769
$$ -1821 136 706 -1968 1403 -332 -1142 1781 -866 312 1408 -1113 1533 452 -709 2060
1507B060k726J342P71k928K987j182j671K995k729N94J630l060K242k72j755K592
$$ 2060 -666 676 1447 -1481 1506 324 -1347 1648 -1081 -487 1143 -1917 325 53 -1702 890
1523H90j701J69J488k436K243m51j862L475k466R2K240l118K399K76k631L025
$$ 890 -811 -642 846 -1590 653 202 -1660 1815 -651 -559 1681 -1437 962 1238 -1393 1632
1539A632j509r50K547k717J246P56k532K670j394p39K268k621J297R06k782K738
$$ 1632 123 -827 1720 -997 249 1005 -1527 1143 -251 -990 1278 -1343 -46 860 -1922 816
1555H16p87j720L105k381N90J943k864K287l97j878K860j737N3J722k678J998
$$ 816 29 -1691 1414 -967 -377 1566 -1298 989 592 -1286 1574 -163 -110 1612 -1066 932
1571I32l08j839K884k246o4K164l147J810N07k685K980j340r23K310k244R11J045
$$ 932 624 -1215 1669 -577 -641 1523 -1624 186 693 -1992 988 -352 -1275 1035 -1209 -298 747
1588G47k340K381p30j034K464k491J354Q64k322K511r29j385K764k354N98J614
$$ 747 -1593 788 58 -976 1488 -1003 351 1215 -1107 1404 475 -910 1854 -500 98 1712
1604A712k978K465n99j794K610j988n8J658k468J327J34j520K472j874j26K090
$$ 1712 -1266 1199 600 -1194 1416 -572 -630 1028 -1440 -113 21 -1499 973 -901 -1027 1063
1620A063k864J786O97k407K985j253j001K568k283J158O40k005K253j046q76K314
$$ 1063 -1801 -15 682 -1725 1260 7 -994 1574 -709 449 1089 -916 1337 291 -585 1729
1636A729k366Q97R67k654K254o21j456K571k528O90J546k843J992Qj869K550j562
$$ 1729 -637 260 1227 -1427 827 206 -1250 1321 -1207 -517 1029 -1814 178 186 -1683 867 -695
1653f95m5J815k223J414R3j299K232j628J87J798k852K013J73k325L050j496j169
$$ -695 -740 1075 -1148 266 359 -940 1292 -336 -149 1649 -1203 810 983 -1342 1708 212 -957
1670i57K554k507R68Q28k333K040q48p00J737k155J011O83k054K605j197j097
$$ -957 1597 -910 58 886 -1447 593 -255 -955 782 -1373 -362 321 -1733 872 -325 -1422
1686a422K855k289O23J519k603K248j38j756K258j240m85J716j860Q67K15j208
$$ -1422 1433 -856 -233 1286 -1317 931 793 -963 1295 55 -430 1286 -574 293 508 -700
1702g00K037k125O90J298k718K104Mk524K786j087j303K731k475M79J524k007
$$ -700 1337 -788 -98 1200 -1518 586 590 -1934 852 -235 -1538 1193 -1282 -803 721 -1286
1718a286J736n48m96J532j895J448M91k095K668j450r94K880k618M24K150l170
$$ -1286 450 -98 -594 938 -957 491 982 -1113 1555 105 -889 1991 -627 -203 1947 -1223
1734a223J654L25j942J992q97n61J108j497J152k64j102K312k102K96K038l114
$$ -1223 431 756 -1186 806 -91 -652 456 -1041 111 -153 -1255 1057 -1045 -749 1289 -1825
1750a825K501J14k532K917r02j264K436j858M36R95j622J366n42m75J371j918
$$ -1825 676 790 -1742 1175 273 -991 1445 -413 23 1018 -604 762 220 -255 1116 -802
1766h02J278J78j987K628j355j366K817k229J9K057k654J269O22j951K065j186
$$ -802 476 654 -1333 1295 -60 -1426 1391 -838 -819 1238 -1416 -147 475 -1476 589 -597
1782e97RJ074j359J494m30j033K244j947J82J978k730J799N94k378K248o13j470
$$ -597 -588 486 -873 621 191 -842 1402 -545 -363 1615 -1115 684 1278 -1100 1148 535 -935
1799i35K219j548l5Q25j209J008o89l59J296j914J595J69k374K897j075j411L037
$$ -935 1284 -264 -299 526 -683 325 -364 -723 573 -1341 254 423 -1951 946 -129 -1540 1497
1816A497k188k76K171k324J290N97j447J518q36J33N83j308J805j111r61K619
$$ 1497 -691 -967 1204 -1120 170 767 -680 838 2 135 718 -590 1215 104 -857 1762
1832A762k237j38K126k981J534R78k884K379m35j284J477r27L42M17j147J770
$$ 1762 -475 -613 1513 -1468 66 1044 -1840 539 104 -1180 297 -630 -288 129 -1018 752
1848G52j250N2J644k379J685Q09k728K604n06j959L012j901l63K252k469Q84L75
$$ 752 -498 -446 1198 -1181 504 1313 -1415 1189 683 -1276 1736 -165 -528 1724 -745 139 514
1865E14j162J255r14L74N05j857K041p08j804L199k118n17K664k799Q82J466k165
$$ 514 -648 607 -307 67 572 -1285 756 48 -1756 1443 -675 -1192 1472 -1327 -445 1021 -1144
1882a144J539r8q05J130r11Q89j88q52J702j344k91K033k705J174J060k654K232
$$ -1144 395 297 -508 622 -289 600 412 -440 1262 -82 -373 1660 -1045 129 1189 -1465 767
1899G67k18j932K345j225o29J473j595O97K93q54J515j438Q74O60k244K301n92
$$ 767 549 -1383 962 -263 -892 581 -1014 -317 -24 -878 637 -801 73 733 -1511 790 198
1916A98j663K912j619p26K507k072M38J403j886J101j66p24J018j288J026r7j401
$$ 198 -1465 1447 -172 -898 1609 -463 -25 1378 -508 593 427 -297 721 -567 459 362 -1039
1933a039K208j652m61K347k658O00J711k841J972L64k013K262j099k23J037j135
$$ -1039 1169 -483 -944 1403 -1255 -655 1056 -1785 187 551 -1462 800 -299 -522 515 -620
1949f20J013j17n27J344j554O40R92k394K250j25k371K759j102j226K427j807
$$ -620 393 276 -251 1093 -461 179 1171 -1223 1027 902 -1469 1290 188 -1038 1389 -418
1965d18k3J399j945J078l01k80R69j610J488k11j572K488j380p84K700k558P17
$$ -418 -441 958 -987 91 -210 -490 479 -1131 357 146 -1426 1062 -318 -1102 1598 -960 -243
1982b43J769k636J297Q14j635J513p78j69R04j345J255o56n81J776k102N28J620
$$ -243 1526 -1110 187 1001 -634 879 101 -68 836 -509 746 90 -491 1285 -817 -289 1331
1999A331k768J759J93k107K055o13r83J943j363J02P23r66J210o02J23O03j514
$$ 1331 -1437 322 515 -1592 463 -150 -1133 810 -553 -451 272 -694 516 -86 37 640 -874
2016h74J448R1j752K467j394r48K677k335L61J659k372J040O22j347R50n49j91
$$ -874 574 665 -1087 1380 -14 -962 1715 -620 -259 1400 -972 68 690 -657 293 -256 -447
2033d47L73r50J580r48n83K035k070M15J936k980K095M91k236K040l91r80J518
$$ -447 -74 -1024 556 -392 -975 1060 -1010 -595 1341 -1639 456 947 -1289 751 360 -620 898
2050H98j111K48O53r02R34j142K50J285k059J425J28j884K102o75j510K550j816
$$ 898 -213 35 688 -214 720 -422 -172 1113 -946 479 607 -1277 825 150 -1360 1190 -626
2067f26j72J625j744P79M26r88J214r19L40N83j344J770r37j068K655k033Q4J983
$$ -626 -798 827 -917 -138 288 -700 514 -405 -65 518 -826 944 7 -1061 1594 -439 -355 1628
2085A628k589J178J014k476J868k39j231J657j036K97J34q99J298j251K10J478
$$ 1628 -961 217 1231 -1245 623 384 -847 810 -226 71 205 -694 604 -647 -437 1041
2101A041k482J562N30k234K432o20j305K288j637rJ578j689R28J63q13J125j016
$$ 1041 -1441 121 651 -1583 849 229 -1076 1212 -425 -434 1144 -545 383 546 -267 858 -158
2118a58M39N30j726J916q75j033K201j854k58J971k248R09J091k039J333j34p86
$$ -158 281 811 -915 1001 126 -907 1294 -560 -818 1153 -1095 -186 905 -1134 199 65 -721
2135g21J066q76O20L3j005J783j456k6J722k185J244R37k381K140l83j636K251
$$ -721 345 -531 89 122 -883 900 -556 -582 1140 -1045 199 1136 -1245 895 512 -1124 1127
2152A127j222k85J405j459P52J09q14R35j159N05Q22k097J986m77j431K402j625
$$ 1127 -95 -380 1025 -434 318 427 -387 548 -611 -106 716 -1381 605 128 -1303 1099 -526
2169e26l53J922j975P54J030j717J241k07p44J371j226O71J31j045J778j217l67
$$ -526 -879 1043 -932 -178 852 -865 376 169 -575 796 -430 241 372 -673 1105 -112 -479
2186d79J647j869N40J180j981J659m30j336J776j236J02Q40j065Q46l26o52J718
$$ -479 1168 -701 -161 1019 -962 697 267 -1069 707 -529 -427 413 -652 194 -132 -784 934
2203I34j575N07Q08j907J841k24j407K084j025o75J736j687N97P48j500J445n42
$$ 934 -641 -134 674 -1233 608 384 -1023 1061 36 -639 1097 -590 7 755 -745 700 158
2220A58m65R94j312R69J97j460J602j098l08J879k240P91J394k273J458j10j286
$$ 158 -307 687 -625 344 541 -919 683 -415 -723 1156 -1084 -293 1101 -1172 286 176 -1110
2237a110J789r87Q4O79j279J307l26n96J609j478N6J404j955J491k88j384J918
$$ -1110 679 -308 -224 455 -824 483 157 -439 1170 -308 -252 1152 -803 688 400 -984 934
2254I34j044m66J549j610O24N05j495J551q66j93J037j180O08M02j327J636o41
$$ 934 -110 -576 973 -637 -13 492 -1003 548 -318 -511 526 -654 -46 356 -971 665 24
2271B4q67J767j798O97J242j839J336k36r33J555j162L69P73j567J073k64p41
$$ 24 -843 924 -874 -177 1065 -774 562 326 -607 948 -214 155 928 -639 434 170 -571
2288e71J612j408M9J221j933J026J76j314J606n85l74J148j295O11K39r75J339
$$ -571 1041 -367 -318 903 -1030 -4 172 -1142 464 -121 -495 653 -642 -31 208 -767 572
2305E72p19j04J032j477Q92M89j446J571n65o88J217j298L09J122j734J150j41
$$ 572 -147 -251 781 -696 196 685 -761 810 245 -443 774 -524 -215 907 -827 323 182
2322A82j044J539j296M0J023j548J462k67j030J822j401J22J288j829J295K16
$$ 182 -862 677 -619 -579 444 -1104 358 91 -939 883 -518 -396 892 -937 358 574
2338E74j301J618r08j27R99j202O48L73j257J378q70k03J044j484P88N07j376
$$ 574 -727 891 -17 -144 855 -347 301 674 -583 795 -75 -278 766 -718 70 577 -799
2355g99J354o35o69J565j490L88P42j428J186p7q10J455j230J09J117j560J189
$$ -799 555 -80 -749 816 -674 -286 456 -972 214 137 -673 782 -448 -339 778 -782 407
2372D07j07r15J477j181J40J252j387P02lj252J633j008k11J378j536N59K74j151
$$ 407 300 -615 862 -319 -179 1073 -314 388 385 -867 766 -242 -453 925 -611 -52 222 -929
2390i29J356o53k72J265j532N31N78j314J541m12p30J623j489L69Q00j263R72
$$ -929 427 -226 -498 767 -765 -234 344 -970 571 159 -571 1052 -437 -68 732 -531 441
2407D41O1r98J384j157L15P83j381J004k10r89J141p56j79J185j360Q40L75j610
$$ 441 502 -496 888 -269 46 829 -552 452 242 -747 394 -362 -541 644 -716 124 499 -1111
2425a111J683r08k35J329j278O51K09j000J200o27l84J396j529Q55N26j305J297
$$ -1111 572 -336 -571 758 -520 131 340 -660 540 -87 -471 925 -604 251 777 -528 769
2442G69o05m94J271j181L35N43j319R47k06r28J459j057J85P48j163Q01J04j026
$$ 769 164 -330 941 -240 95 638 -681 266 60 -868 591 -466 -281 467 -696 105 209 -817
2460h17J390j125K77R00j460J122J61j061J243p06j46J216j176N02L65j263R62
$$ -817 573 -552 -275 625 -835 287 448 -613 630 -76 -222 994 -182 320 685 -578 384
2477C84k33m04J125j378N59M57j268J088l88p47J578j321K00P57j272J001m7q00
$$ 384 151 -253 872 -506 53 510 -758 330 -58 -805 773 -548 -348 409 -863 138 91 -709
2495g09J262p32m3R65j306R66j2r73J451o82m67J061j429J092J38j175J499r09
$$ -709 553 -179 -222 743 -563 403 391 -582 869 187 -280 781 -648 444 582 -593 906 -3
2513cn50J328j372O02L30j172J116n87j82J009j057M21K57j018J294l72o12J412
$$ -3 -553 775 -597 5 335 -837 279 -308 -490 519 -538 -117 140 -878 416 44 -568 844
2531H44j106J97R06j406J018k22p04J093o50M0O75j394R12J96r19J263r16j7Q43
$$ 844 -262 -65 841 -565 453 231 -473 620 -30 10 685 -709 203 399 -520 743 -173 -190 653
2550F53j596Q88R0j000J429p16k92R59r42M31M27j158J215l91l08J181j088M17
$$ 653 -943 -55 35 -965 464 -252 -544 415 -527 -96 331 -827 388 -3 -311 870 -218 199
2568A99N19j165R51k71m44J141j083k1P66j111R40j97p25J042r96J38P29j058
$$ 199 718 -447 504 233 -211 930 -153 -174 592 -519 421 224 -501 541 -455 -317 412 -646
2586f46O34Kn97J250q55j21R36j082O78J89r63J196o57l15J124r68K08Q44j470
$$ -646 -12 -10 -607 643 -212 -333 603 -479 199 388 -575 621 -36 -351 773 -195 13 857 -613
2605f13J095m02n63J232j054J98N57j019Q56l51l37Q20p72K09O52j200Q56q9p00
$$ -613 482 80 -483 749 -305 -107 450 -569 287 -64 -401 419 -353 -144 508 -692 164 75 -625
2624f25J093p50J51O11r88P29O7p84J091p75J26P52j131O75K08j030J316p07m99
$$ -625 468 -282 -131 480 -508 221 288 -496 595 -180 -54 698 -433 242 450 -580 736 29 -470
2643d70J130j083L45M46j050R24l23m65R05r43L19N33q86P59j58m41J224j245
$$ -470 660 -423 -78 368 -682 242 -81 -546 359 -584 -265 268 -618 141 -17 -458 766 -479
2661d79M54P09j286Q16J74q22J106q74J6Q18j102O99L88j088J131p50k17J022
$$ -479 -25 684 -602 214 388 -434 672 -202 -186 632 -470 229 617 -471 660 -90 -307 715
2679G15j307P42p5j000J594r03k81Q91r92O37M79j163J021j16n21R67q93K90L34
$$ 715 -592 150 75 -925 669 -234 -515 376 -616 21 500 -663 358 242 -279 688 -205 85 419
2698D19o39Q87o47j36R78r62NP47j135P50Kr50J051m61k27O25p17M95Jo49Q02
$$ 419 -220 667 20 -116 862 -100 -95 652 -483 267 269 -681 370 -91 -318 307 -410 85 86 -563 239
2719B39o43L50N90j072P85J24j116J401o64k26R72j133M93M36p73O21q9p39Q48
$$ 239 -404 -54 536 -536 249 373 -743 658 -6 -232 740 -393 100 536 -237 384 295 -444 404
2738D04p21L83K95q17P93m67n23J026o51k7Q00j277P59J56q90J042o43J29P89
$$ 404 -317 66 361 -456 337 -130 -653 373 -278 -305 495 -782 -23 133 -757 285 -358 -229 560
2757E60j049O67L18r00R05m47j86R17j123O37J35j040J305o20n60J211j039K27
$$ 560 -489 178 496 -404 501 54 -132 785 -338 299 434 -606 699 79 -481 730 -309 -82
2775h2M97j064O15n5k41P41q04K35L29p50J184o96n49J386j120K44R47j223O05
$$ -82 415 -649 -34 -89 -330 411 -393 -158 171 -579 605 -91 -640 746 -374 -130 817 -406 199
2794A99R8q69J159o05j22Q01r30O25j96m67O42p46O6Q53j166O50J34r15J164l00
$$ 199 297 -572 587 -18 -140 661 -269 356 160 -307 335 -411 -345 508 -658 -8 126 -789 375 75
2814G5o49J210j158L94L41o15O06k45l81P75n39K06O02j145R55l58o62J412r82
$$ 75 -574 636 -522 -128 213 -402 204 -41 -422 353 -186 20 622 -523 432 74 -588 824 -158
2833a58M5Q69j402N54M53q18Q10m03k40N84p51N28j74m59Q47o72J59P78j075P12
$$ -158 -113 756 -646 -92 361 -457 353 -50 -290 294 -457 71 -103 -562 285 -387 -228 550 -525 187
2853A87J30r98J359o04n27J133o89JL76n53N67l00k34N98q62M43L56j157J234
$$ 187 317 -681 678 74 -453 680 -9 -8 368 -185 382 82 -152 446 -416 27 383 -774 460
2872D60n54n53J311j072J6Q70q70K37N92r92O10k14m4O93q50N15q4m47R10o59
$$ 460 -94 -647 664 -408 -392 478 -392 -155 437 -555 55 -159 -203 490 -360 155 71 -376 534 -125
2892a25j91J011j309O50O15j069Q19k59o32R29n14q2K74n48P86o13j56P59r13
$$ -125 -316 695 -614 36 651 -418 401 142 -490 439 -75 -157 117 -431 355 -258 -414 345 -568
2911e68N05L70j141J231m47p87J426q68J30Q27q67L21J51m62O37m85L8M33q05
$$ -568 -63 307 -834 397 -50 -837 589 -279 -149 678 -189 132 283 -179 458 -27 11 444 -361
2930c61R27l49p53J057q25j62J161j352K42O86q37M53P7n87P80l51K42K11n61
$$ -361 566 217 -536 521 -304 -466 695 -657 -415 271 -566 -113 -36 -623 157 -194 48 259 -302
2949c02N42k82l34R33j014N67N86j188Q63Qr76J239p38N9L76o84M20K28o85O41
$$ -302 240 -42 -376 557 -457 110 696 -492 371 379 -597 642 -96 -37 339 -345 75 303 -382 259
2969B59o99K15O18j062R12j84q02J272p16n59J324j034M88O21q04M96l57k86O75
$$ 259 -440 -225 393 -669 243 59 -743 529 -187 -746 578 -456 32 653 -151 345 -12 -298 377
2988C77o47N42K7m83P88l57n56Q16r73L45O68j178Q64n6n80O27l71k21O24n67
$$ 377 -270 272 299 -184 604 247 -309 507 -466 -121 547 -631 233 177 -403 224 -147 -368 256 -311
3008c11L01k7m33O29m49K82N03j201J046J58r26Q70k44o32J104r33K31P48r58
$$ -311 -10 -37 -470 159 -290 -8 495 -706 340 498 -428 442 198 -434 670 -263 -32 716 -242
3027b42N69j90k72M47p06O13K81j177J197o92l73J141j096K21P53j296J088m6
$$ -242 327 137 -135 312 -394 219 500 -677 520 -172 -545 596 -500 -279 474 -822 266 220
3045B20q19J073m05k18M20o31O32Jm32P44p61R6P98j036O83l7q65J003m19l72
$$ 220 -599 474 69 -149 271 -360 272 273 -159 585 -176 -80 718 -318 365 328 -537 466 47 -325
3065c25Q21p63M7M95q56N59j2l72P10q09N78L80j085J032m58m41J055r34K51P70
$$ -325 496 -267 -220 275 -581 -22 -34 -406 304 -505 73 453 -632 400 -58 -499 556 -378 -127 643
3085F43j078O86R5o24O62m20J78K47p99P33k30l77Q12o84j26P91j004L99M48j022
$$ 643 -435 251 346 -278 384 -36 142 389 -410 323 93 -284 528 -156 -282 509 -495 -96 352 -670
3105f70R23l62m66Q57p44M77L10m61L83j04l96R66r19L91J71q77Q68j17o40R87
$$ -670 253 -109 -575 282 -462 15 325 -136 247 143 -253 713 -206 185 356 -521 347 230 -410 577
3125E77r40M7P89r66N58Q0n17O48o16J33N67r16O15J0o43Q76m93l07J163j299
$$ 577 -363 -316 473 -493 65 145 -372 276 -340 -207 360 -556 59 69 -574 302 -191 -498 665 -634
3145f34O69M87r60Q85k98l59Q19p05L27Q9o47O37l57j34P38r21M17J77p65P74
$$ -634 35 522 -438 447 149 -210 609 -96 231 320 -327 310 -47 -181 557 -364 53 230 -535 239
3165B39k38n43Q45o38m0N35o49M20K22n23M96l61J4M95n91O39j02o61J060p19
$$ 239 1 -542 303 -335 -375 160 -489 -69 153 -370 126 -235 -221 274 -317 322 220 -441 619 -100
3185a00j12Q88j061M76L21j008P16O2m35N91q53N25K64o50M05j62j65Q02j010
$$ -100 -212 676 -385 91 412 -596 120 182 -253 338 -515 10 274 -376 29 -133 -298 504 -506
3204e06K16P67j163R45j17m85Q02n90J18M58q04N28P9n22P73o77Q2O42r46M99
$$ -506 -290 477 -686 259 142 -343 459 -131 -13 445 -359 169 248 -274 499 -178 -96 546 -400 99
3224I9Jn75R97o89j72O54o28M26J70r25P26q3m95Q61p53L47L27p35P23p8k97Q08
$$ 99 100 -475 522 -167 -339 315 -313 113 283 -642 84 1 -494 367 -386 -39 288 -447 276 198 -99 709
3246G09r69L42K75q27P63j84n05Q52n83n3O20q51M91k1l70O67n45L4N47r49O92
$$ 709 -260 82 357 -470 293 109 -396 456 -127 -180 440 -411 80 59 -311 356 -189 -155 392 -557 135
3267A35O1o75Q66l92j84O68q78O89L0p26P79k58j91M51l51K99K9o81P89m28m31
$$ 135 196 -479 387 -5 -189 479 -399 290 320 -406 373 115 -76 375 24 323 352 -329 460 32 -399
3288c99R89q43q8O58q76O87j18n36Q37p28L19L74q09P78l05k61R26p79J51M65
$$ -399 590 -253 -341 317 -559 128 10 -526 311 -417 -98 276 -533 245 -60 -321 605 -174 -23 442
3308D42q22M95J35n69P44m68j36N75n70K98K72o81P50n72j94Q53r00K49K48n95
$$ 442 -380 115 250 -319 425 -43 -179 396 -174 124 396 -285 465 -107 -301 552 -348 -99 149 -446
3328d46O56l20m83Q11o11L42K88p24P37j65l82R39p79p9N09o76Q30j42o97R46
$$ -446 210 -110 -593 218 -393 -51 237 -487 250 85 -297 642 -137 -216 293 -383 447 305 -392 554
3348E54o65p4O04q51N47Q4n36O20n33K51M36q46L30L27n64O02m77j21P28p10K78
$$ 554 -111 -185 419 -432 115 199 -337 283 -250 1 437 -409 -79 248 -316 286 -191 -312 416 -294 -16
3369a6M31o79N55p8n13O57n84L52R3n68O50L9n87Q06m70l35P15p85M25J3m26N25
$$ -16 415 -264 291 213 -300 357 -227 125 218 -350 300 339 -248 558 88 -247 468 -317 108 121 -305 220
3391B20l96j00N77o00J46K36p35Q65j82k10O53q89M49J76n57N93j48m03Q86p61
$$ 220 -176 -276 301 -299 -153 83 -652 213 31 -179 474 -415 34 210 -347 246 98 -305 581 -180
3411a80L61K9o39P37l18l17O08n02J45M27p59N44j32k70N90l67o1M00p72P53k6
$$ -180 181 210 -429 308 -10 -327 281 -221 -76 351 -408 136 4 -266 324 -43 -104 296 -476 277 251
3432B51o25Q87n83m9Q97q98J04K83n14Q50n94k19Q17r14M12J03n22M43k14k85
$$ 251 -374 513 -70 -119 778 -120 -16 267 -247 603 9 -210 607 -307 105 208 -314 129 -85 -370
3452c70O83n05m5L13m32P23m46l47N67n65L25K81p71Q10l5n63P94l75j70N82p00
$$ -370 313 -192 -237 76 -356 367 -79 -426 141 -424 -99 182 -589 221 186 -377 417 42 -128 454 -246
3473b46L27K97p49O84j38k29L41n79M54J11n95N50l85j90O80o96M30M2n18N63
$$ -246 81 378 -371 313 175 -54 287 -292 162 273 -322 228 -157 -347 333 -363 67 109 -409 154
3493A54r0m54Q69p86L07O67j023Q04l61l12P11o66K86K53n09M28M5n66O82n81
$$ 154 64 -390 479 -307 0 667 -356 448 87 -225 486 -180 106 359 -150 278 323 -243 439 -142
3513a42l01Q15p98P92j99o97O30k32o9M03n47K55K04m12N82l79j77O06n10L17
$$ -142 -443 372 -426 366 167 -530 100 -132 -201 202 -345 -90 114 -298 284 -95 -272 334 -176 141
3533A41K07o62N41j89j52M96m77m2O56r03O78k24j66K73k60k09M51n16K68J77
$$ 141 348 -314 227 38 -114 382 -95 -137 519 -384 294 70 -96 177 -83 -292 159 -357 -89 88
3553H8m96P06p57K60N12m75Q2J83l62M99j89l09P57p06L35K33o56O53m23j84P84
$$ 88 -408 298 -459 -199 313 -162 -80 103 -259 240 51 -258 499 -207 128 361 -295 358 -65 -249 535
3574E35p59J03M91p47P92m22l61Q30n43j05M70o66M40M9m97P59m74J34L33q65
$$ 535 -224 -121 370 -377 415 -7 -368 462 -81 -186 284 -382 58 107 -390 369 -105 29 362 -503
3594e03O22j11k72P25n67R2M36o94K88K52m77N53k22k42M85p47M72M00q22O44
$$ -503 119 8 -264 461 -106 -14 422 -272 16 268 -209 344 122 -120 365 -382 90 490 -332 312
3614C12k66k39O46q44M54J93o75O93k41l72O38l71l2L64m49M44j77l44N85n10
$$ 312 46 -193 453 -391 63 256 -419 274 33 -339 299 -72 -104 260 -189 255 78 -266 319 -191
3634a91J43L86o53O20r8l96L66l00q5Q26q85K80J86m82M29j26k92M93o55M76M4
$$ -191 -48 338 -315 305 207 -189 177 -123 -208 618 -267 13 199 -283 146 20 -272 221 -434 42 86
3655H6p30P29j53r2M96n40J91L58o82P39k58k08N11n45LO21o21L64j19l70M54
$$ 86 -644 85 -68 -160 336 -204 -13 345 -337 402 144 -64 447 -98 -95 526 -95 269 150 -220 234
3676B34m39O0L73n67O20k62m07O83m82o2N40o22J50K15l72N22k09k61P11m80R7
$$ 234 -205 -145 228 -339 281 19 -388 295 -187 -249 291 -331 -181 34 -338 184 -25 -286 425 -55 42
3697D2J02m65O23j85j94N57n43K4K45n78O16j27l52N35m82n8M83m95L47m53q1
$$ 42 144 -321 302 117 -77 480 -63 -39 206 -372 244 117 -235 300 -182 -240 243 -252 95 -358 -439
3718d39O76m05j41O46p41M78K20m54N16l77k78P15o95L89j4m27N83k83M8J87n62
$$ -439 237 -168 -309 337 -404 74 294 -160 356 -21 -299 416 -279 110 96 -331 252 -31 17 204 -358
3739c58O05k39n04R60o21p0M55n19J74M22n78M58j03l17N13m34O5L00m35K91q4
$$ -358 247 8 -496 464 -157 -227 228 -291 -117 305 -273 185 82 -235 278 -156 -91 209 -226 65 -19
3760a9k24N34l76N1L93n65M40p4m27L67J3l82P95o93K28nm40N53l11j10N24l90
$$ -19 -243 291 -85 -34 359 -206 234 160 -267 100 113 -269 526 -167 61 56 -384 169 -142 -252 272 -118
3782a18o9M95p30N18j61k80P79o88J47K97n68M35O5k48M49k14j80M36n90L65J13
$$ -118 -187 308 -422 96 -65 -345 434 -254 -107 190 -378 57 122 -126 323 109 -71 365 -225 140 253
3803B53m22M70m25R9K69o29M44J03m86N54l16N3L22q42N55M3k74M03j63k22P05
$$ 253 -169 301 -124 -25 244 -385 59 162 -324 230 -86 -33 289 -553 2 45 -229 174 11 -211 494
3824D94p98L64J28m40N42j61l61N43j18j18L83p63L76k3l22O05n06J06J29n47
$$ 494 -304 60 188 -252 290 129 -232 311 193 75 458 -305 71 48 -274 331 -175 -69 60 -487
3844d87O07j99m74R62p19J05M69o04L10J75n34N89j72j41K85l94L8N73o31N54
$$ -487 120 -79 -553 409 -310 -205 264 -340 -30 145 -389 200 28 -113 172 -222 -184 389 -242 312
3864C12j51j51L03n26K50K36p51O57p6l23M74o38J94M16o51N10j91j48N13o08
$$ 312 161 10 313 -213 37 273 -478 179 103 -220 254 -384 -190 226 -425 85 -106 -254 259 -349
3884c49K05N25o88L83M0l03N97n04P8L98n87K58K05m14L36j50q4K16l27J80O0
$$ -349 -144 381 -307 76 116 -187 410 -94 -16 382 -205 53 258 -156 180 30 -54 162 -165 15 75
3905G5l32N51l76j72M37n57J05M52l96N23k75j47L83m17K02K88o27N02j81j87
$$ 75 -257 294 -82 -254 183 -374 -269 183 -213 310 35 -112 271 -146 56 344 -283 219 38 -149
3925a49N80o78J70N78n70L95k52k98N60n54M2P07n50mL1l89N53l51j20L83o38
$$ -149 431 -247 -77 501 -69 326 74 -224 336 -218 -176 531 -19 -23 8 -381 172 -179 -299 84 -554
3946e54N60rk66N26j09l98M65m55J14M13m86L60j45k64N71n00J19L36n49L45j6
$$ -554 6 -3 -269 257 148 -250 215 -240 -126 287 -199 161 16 -248 323 -177 -58 278 -271 74 58
3967E8k9J52l33J09J95p49O99o1m54P66m69M5J76m04K28J27k93M98m04k12O03
$$ 58 29 181 -152 -43 152 -597 102 41 -413 353 -116 -71 105 -299 -71 56 -237 261 -143 -355 248
3988B48o10N76J63n68N27l08k36N46l45l8L59o18M97j19j78K49k50m5K57m95O52
$$ 248 -362 214 377 -191 336 28 -208 338 -7 -45 314 -304 193 74 -104 145 -105 -150 107 -388 264
4009B64k27l71O78m59K5J66l62N34k3n09P63m89j51N79n78J61J40l93M65l27J33
$$ 264 37 -334 344 -115 -90 76 -286 248 225 -284 479 -10 -161 418 -160 1 141 -252 213 -114 19
4030A9K05n21M04P6o86P88l83k42P12n98Q9K87m84K94J19l01N22m95L52j1m26
$$ 19 224 -297 107 183 -503 285 -98 -340 372 -226 -137 150 -334 -40 79 -222 300 -195 157 146 -280
4051b80M64j00m13O18l85mM44o94O36Oo39N51J2l52M92o97M17l9k86L86l63r3
$$ -280 184 84 -329 289 -96 -100 344 -350 286 292 -347 204 216 -136 356 -341 76 37 -249 137 -226 -319
4073c19L21k60M00O6n10N34j64l21N48l73N6L94n53L70j8k71J73j95K88pk54L36
$$ -319 2 -258 142 208 -302 232 68 -253 295 -78 -22 372 -181 189 171 -100 73 -122 166 159 -95 241
4095B41l30k97P28o71lN75p04N85R2m56L44k56N4J73k20K62j0l30N07k72j62N09
$$ 241 -89 -386 342 -329 -332 243 -461 124 216 -240 104 -152 -98 75 -145 117 107 -223 284 12 -150 359
4117C59n62K72N7k32L34m2l34N04n58R2M49o06N42k74o8K52n39K43L06m16K93
$$ 359 -203 69 126 -106 228 186 -148 356 -202 -110 339 -267 275 1 -67 185 -354 -111 195 -221 72
4138G2J33n61N02k84j30N69o59K93K23m38N26j69j74J99l46L71J19m91M39j99
$$ 72 205 -356 146 -138 -268 301 -358 -65 158 -280 246 77 -97 102 -244 127 246 -245 194 -5
4158ej54M64n90L11L44o32L62k17p1K69k77K0K71l78L53j87k32N51m73J23N15
$$ -5 -159 305 -285 26 370 -262 100 -117 -188 81 -196 -176 95 -283 70 -117 -349 202 -271 -148 367
4179C67o79N74j84l66P74o19O5L51n16J59K98l55L87k39j99N97n36L24Kn26M62
$$ 367 -312 262 78 -288 486 -133 -68 283 -233 -74 224 -131 256 17 -182 415 -121 203 205 -321 141
4200A41k06k17M58k84J40Jj68K04j69q6L13l56K34J44k93M16l18PM56o22K52N43
$$ 141 -65 -282 176 -108 32 33 -135 69 -100 -186 127 -229 5 149 -144 272 -46 -39 417 -205 47 590
4222E90o39P7J49l74M75l46j17M89o00K73J38m59N70l63j63N79o67M05K57n62
$$ 590 -49 28 177 -197 278 -68 -185 304 -296 -23 115 -344 226 -137 -300 279 -388 17 274 -288
4242b88N94j44l74M54k99J4L34n59N23j00m12M15n41L24L36o09O73l28l04O32
$$ -288 306 162 -212 242 -57 -43 291 -268 255 155 -257 158 -383 -59 277 -332 341 13 -291 341
4262C41n53J25K13m49M15j3n49P95l99j3K78n26K25K76l12K98k70K3M28l70m4
$$ 341 -212 -87 126 -323 92 79 -470 325 -74 -87 191 -335 -110 166 -146 152 -118 -95 333 -37 -81
4283h1J77k68M17j98k00M26l87K40J9l67M21k82j13M40m58P9L42o59M74J50m46
$$ -81 96 -172 245 47 -153 273 -114 126 145 -222 199 -83 -196 244 -214 -135 207 -452 22 172 -274
4304b74N65l32r2L62l56K82M6n15O36m80R0K63k71N45k13n08N40k76j45L85m82
$$ -274 291 -41 -133 229 -127 155 201 -314 322 -158 -68 195 -76 469 256 -252 288 12 -133 252 -230
4325b30L16N2n06O25j66l52L95m67K97P8l50K68J39l08N62l61J27L08n26L34N2
$$ -230 86 138 -368 257 91 -261 134 -333 -36 42 -308 -40 99 -209 353 -8 119 427 -99 235 287
4346B87l08Q9j66J84J01m37N71k92k00K47j25j23L88l49M0K72n29N17k18j74M68
$$ 287 -21 68 -98 86 187 -250 321 29 -171 76 -49 -172 216 -133 -93 179 -350 167 -51 -225 243
4367B43l82Q7L42n34L96J01l48L28l62L79n1l95M80j52l94N85m27J51L36o63M92
$$ 243 -139 -52 290 -244 152 253 -95 233 -129 250 199 -196 284 132 -262 323 -104 47 383 -280 212
4388B12J3m25M23m22M3L62l60K98j17J5K87n93J41L79m88K53J87l01N81k79k42
$$ 212 225 -200 223 -199 -156 206 -154 144 27 42 329 -264 -123 256 -232 21 208 -93 488 209 -33
4409c3K65k95p8L52m90L90j25p8L06n54K93K53m31L94j65m33O81n32J86L88o29
$$ -33 232 -63 -141 211 -279 111 -14 -92 214 -340 -47 206 -225 169 4 -429 252 -280 -94 294 -335
4430c35M51j97k38M59l48J59L26n00J05K35j68M62l29j25M19o34M15J10m72M55
$$ -335 116 -81 -319 140 -208 -49 277 -223 -118 117 -51 411 82 -43 376 -258 157 267 -205 250
4450B50k49j83L50j98j7K23l65K55q0k57L38k52J17K25m41L22n8j00L81m20J24
$$ 250 1 -182 168 -30 -47 176 -189 66 -14 -271 67 -185 -68 157 -284 38 -20 -120 261 -159 -35
4471c5K48l50K29K3k36M65l82j01M61n80L93J13o32O00l20P1L72l99m1R6l42L62
$$ -35 213 -137 92 115 -121 344 -38 -139 322 -258 135 248 -384 216 -104 -33 339 -60 -101 -5 -347 15
4493A5p6o5K08l10J76J50l62M85j55l30P35n57O3K09l82N57j94k74L02k95Q4L22
$$ 15 -61 -126 82 -228 -52 98 -264 221 66 -264 471 -86 -23 186 -196 361 167 -107 195 -100 -16 306
4515C06m68K47l1k36M19j67j56K09l69K74o6l50N76j13l93M02k63J52J96l74O51
$$ 306 -162 85 54 -182 237 70 -86 123 -246 28 -38 -388 188 75 -318 84 -179 -27 169 -205 446
4536D46m16j13N14n11j64O02o71P37m25q8K47m00L04Ll74L62rk87M00k00k13M55
$$ 446 30 -83 431 -80 -244 358 -313 424 -1 -89 158 -242 62 65 -309 53 44 -243 157 -43 -256 199
4558A99m99L41nl24M02k44J71K06n30N98k05l03L23m3j22M13m14L9K01m91L96
$$ 199 -300 41 36 -288 114 -130 41 247 -283 315 110 -193 130 87 -35 378 -36 3 204 -287 109
4579A09M1l00M14n23O1L15l42L60k42j5K58l51J50K11m18L98j24j55M05l53K5
$$ 109 150 -150 264 -259 -198 117 -225 135 -107 -122 136 -215 -65 146 -272 126 2 -153 252 -101 -76
4600g6M97n60L17L7j93J60l5l34M95n09L31r5k55M37l72L4N37n80L60j29m47O21
$$ -76 421 -139 178 215 22 182 147 -187 308 -201 130 35 -220 217 -155 -121 416 -164 196 67 -380 241
4622B41k14j87J60j28N9J76j94L78l93p9N22l06q2L74o15O38r4m46L32k70j04
$$ 241 27 -160 0 -128 -69 107 -87 291 -102 -181 341 35 -47 327 -288 350 256 -190 142 -128 -232
4643b32J45r4L36l7k89L10j93p1L59n19L45R5n59N32j86k58M66m29L89K23m72
$$ -232 -87 -181 155 118 -171 139 -54 -125 234 -285 60 155 -404 128 -58 -316 150 -279 110 333 -139
4664a39K46j71k4K69l72K20J20l38M98j96j87K83l39o5J23q4K92k85N2K75k41
$$ -139 107 -64 -88 181 -191 29 149 -189 309 113 -74 209 -130 -195 -72 -156 136 -149 -97 178 -63
4685f3m4K57j22p5p0k18N91k86o0L72m44L97n2m22N69l31P2K37l70j8L41l78K77
$$ -63 -107 150 28 -47 -117 -335 256 -30 -90 282 -162 235 183 -239 330 -1 71 308 -62 -80 261 -117 160
4708A60j64j10J93j91J84j22l49N82k64MJ18k77J28K59o14L78p1K1N34k41p7n3
$$ 160 -4 -114 79 -112 72 -50 -399 183 -81 -77 41 -236 -108 151 -463 -85 -156 -135 399 158 81 28
4730B8j21M3P2j16K21k04N3K58j07m2J18m40O05k53k75K93m88L40J09k95J70j84
$$ 28 -93 -50 22 -94 127 -77 -24 234 127 85 203 -237 368 115 -160 133 -355 -15 94 -201 -31 -215
4752b15J85K81n37K75K38m84K54K04m68M52k37k06N53n32M45p4k53K56l70j0M68
$$ -215 -30 251 -286 -11 227 -257 -3 201 -267 185 -52 -258 295 -237 208 134 -119 137 -233 -243 225
4773B25l22J74O2k47K65m59K70J77m22L42J86o46N90l68k6M72l76O4J74j20m2
$$ 225 -97 77 139 -108 157 -302 -32 145 -277 65 251 -395 195 -173 -199 273 -103 -39 135 15 -27
4794b7j76K03J61m7P5j6m95M66l8l36M09j33j77J24k35L67pl37L79j10k68M30
$$ -27 -203 0 161 114 189 173 -322 144 106 -230 179 46 -131 -7 -242 125 118 -219 160 50 -218 212
4816B12l78J69o1m2K15k2j90L24m09J87K76o56O25k7j37L7j78J46j1l44M38j83
$$ 212 -166 3 -58 -100 115 93 -97 227 -182 5 281 -375 250 223 86 123 -55 91 80 -264 174 -9
4838iPK26n57K96R5l82K41N6j98K85j16q2M61m23J76K15o36N76j04j01J93l95
$$ -9 -2 224 -333 -37 58 -324 -83 -27 -225 60 -56 -138 323 -100 76 291 -345 231 127 26 219 -176
4860a76L84o6l60M81k13k04L80m00P7L26l30P2j38K74L6j59O4O3l61L71k10q0
$$ -176 208 142 -218 263 50 -154 226 -174 -97 229 -101 -29 -167 107 143 -16 48 111 -250 121 -89 -169
4882a69J14o9R3L59m19L03j47k95M59j03p7J14m84N16Lm20M72l00J58L48o28L08
$$ -169 -55 -124 -31 328 -91 212 65 -230 229 126 49 163 -321 195 198 -222 250 -50 108 456 -172 136
4904A36j14j82J65ok70N21m56Q4K03m41N43l69J33K88l65J22K3j85L82p3j42K77
$$ 136 22 -160 5 -1 -271 250 -206 -122 81 -360 183 -186 -53 235 -130 -8 15 -170 212 139 -3 274
4926B74m12J99J70l93K94j02k08L80k38J12o8k03K91L0k66R2J98j71J27l86L19
$$ 274 -138 61 231 -162 132 30 -178 202 -36 76 8 -195 96 126 -140 -48 150 -21 106 -280 39
4947C9J21n72O61l28l6K89m78K31L94m56K79j33QN8k29M5K42k55L87k21k60M08
$$ 39 160 -412 249 -79 -115 174 -304 -73 321 -135 144 11 19 77 -152 -107 135 -120 267 46 -214 194
4969A94k64J10P0k38P9R7j28O3mj69L81l2N6l50pM96m07M3J67j86m0K63l32L39
$$ 194 -70 40 110 -128 -49 48 -80 -17 -21 -190 191 159 215 -135 -142 354 -53 -10 157 -29 -69 194 -138 201
4993B01k59J48L33l61r9J16j86J51k01K3J02p0K05p6l76N28l07q2K50k42L7N29
$$ 201 -58 90 423 62 -37 79 -107 44 -157 -134 -32 -102 103 27 -349 179 -128 -210 40 -202 -165 364
5015C64l04J03k06j59N75n88J33R2q0K77j10l21P72o85Q1K91l77JK40k79K59l17
$$ 364 60 163 -43 -202 373 -215 -82 10 -70 207 97 -224 548 -137 -56 235 -142 -141 99 -180 79 -238
5037b38J75J75m05Q6J84k76L87j21k24O56n82K89J6l30L76M8l16M59k85j3J07
$$ -238 -63 112 -293 -207 -23 -299 88 -33 -257 399 -183 106 122 -208 168 216 -100 359 74 61 168
5058A68l46J22J01q9K9j25l0K96j88J28j88j74K68n6O5K16m02K60J59l09K55j35
$$ 168 -178 -56 45 -44 -15 -140 -170 126 -62 66 -122 -296 -28 -84 -19 197 -205 55 214 -95 160 25
5080B5k32M29n62N44k02o8P3p8r1K28l32L89n1o8P9m3j81K91l4k82K23l77L57
$$ 25 -207 222 -340 204 2 -66 7 -71 -162 66 -266 123 72 4 83 40 -141 150 116 -166 57 -320 37
5103C7j12j35L14k88K4M7k78M84j23j8J49j82l7L77l72J25R0j00J44q7j98L55
$$ 37 -75 -210 104 -184 -160 -113 -391 93 -30 -48 101 -81 -118 259 -113 12 102 2 146 59 -139 216
5125B16l47K92j27K1L5k03J88M1k72K14J9l85M84k61j24J74k01j1L00j79J04J10
$$ 216 -131 161 34 55 90 -113 75 116 -156 58 77 -308 176 -85 -209 -35 -236 -247 53 -126 -22 88
5147H8k14K56l96K20K23k85J27n7j48N48o13J58L13l53J77m5k12K91j53q4L73
$$ 88 -126 130 -266 -46 177 -108 19 -38 -186 362 -251 -93 220 -133 44 -1 -213 78 -75 -159 214
5168B14l31q2K37k50L21k13r6L62k08OO1m03O48j26k47L29l36J20L04l57M02m22
$$ 214 -117 -199 38 -212 109 -104 -200 162 -46 -40 21 -382 266 140 -107 222 -114 6 310 -47 355 -67
5190f7J32J70l13J88K24k02j25N5l18J10J09Q7m0j50L14r6l35K61%j80L64l77
$$ -67 65 235 -78 110 334 132 7 62 -256 -146 -37 50 10 -140 174 78 -257 4 4 -176 188 -189
5212a89K16pj71L90k83pJ99k06J1M70m27N7J27m15M00k45J5J29j51J77O9l83L18
$$ -189 27 20 -151 239 -44 -51 148 -58 -47 423 -4 53 180 -235 165 -80 -65 64 -87 90 159 -224 94
5235I4k14j3J38j23K11Oj03K40k19k01M45n43M72p5j49L09j61k59L08j96KL21
$$ 94 -120 -133 5 -118 93 99 -4 236 17 -184 261 -282 190 115 -34 275 114 -145 163 -33 -31 290
5257B90k96J84k08k11N12k67j27K96m07M09k14L3r6J86j34J97k02K08j15n18N26
$$ 290 -6 178 -30 -241 271 4 -123 173 -234 175 -39 -6 -102 84 -50 147 -55 153 38 -480 46
5278D6J51j72J49k99K52q7j74K06j6j6J93l15R2L3j17K49j25j93L65k91j9M4k48
$$ 46 197 25 174 -125 127 40 -134 72 56 40 233 -82 10 43 -74 175 50 -143 222 -69 -88 -44 -292
5301b92M98k88m8J73l61L04K93m25Q9J57j31K54j58j11J59m02M00j18k03M40l56
$$ -292 206 -82 -130 43 -318 -14 279 -146 -57 100 -31 223 65 -46 113 -289 111 -7 -210 230 -126
5322a26J83J83l36P2Q7j60J84j44j33L04j96K39j30l05K56p7J15N4k41K47J45
$$ -126 57 240 -96 -24 63 -97 87 -57 -190 114 -82 157 27 -278 -22 -99 16 70 -171 76 221
5343B21l09K90m19K03K98n05J01K95l00J23m9mL05l20M1K52k72R7L0k01J91j88
$$ 221 -88 202 -217 -14 284 -221 -120 175 -125 -2 -51 -55 250 -70 -29 223 -49 48 78 -123 68 -120
5365a20J82P4k06J27J5m13L46k49K69J72l24K11P3l82L09k29q3L64l53J00K54
$$ -120 62 136 -70 57 72 -341 5 -244 25 197 -127 84 157 -225 84 -145 -228 136 -217 -117 137
5386A37l22K05j29k6K74j98mJ64l08K14p9l43N43j90J22K34l97P2K35k84J61j42
$$ 137 -185 20 -109 -135 139 -59 -63 101 -207 7 -72 -415 128 -62 60 294 -103 -31 204 -80 81 -61
5408f1n7J16j82J63J1k32L85l7j52L76l89K8J17m31M60q1J24l0m03K81j12J1p3
$$ -61 -118 -2 -184 -21 -10 -242 143 106 -46 330 -59 -31 86 -345 115 34 158 128 -275 6 -106 -95 -168
5431a68N4l1K94l14K04O2k95M66j71k62K38o8j02K26l35K82J0m11N98j88KJ0k39
$$ -168 -114 -145 149 -165 39 101 -194 272 101 -161 77 9 -93 133 -202 80 90 -321 277 89 91 101 -138
5454a38J90k77K08R1j40j40j9j10L99Q8k56L37k86M0J06k21Q5K18l02K20o7j10
$$ -138 52 -225 -17 74 -66 -206 -225 -335 64 152 -104 233 -53 -13 93 -128 -43 175 -127 93 26 -84
5476h4J30j58J91J34m05L82r6k58J65o0J99r4j7P1j5k34K57l20K41N2k12J13j2
$$ -84 46 -112 79 213 -192 190 94 -164 1 -59 140 46 29 100 85 -149 108 -212 29 81 -131 -18 -30
5499c0j18L24l64n1L78l33M48k62j45K66m9j86O2j66K63P4k91M51k34k79L46j49
$$ -30 -148 176 -188 -239 139 -194 254 -8 -153 113 64 -122 -60 -226 37 111 -180 271 37 -242 104 -45
5521d5K6J47m04K26m7j99K99k18K82J38l76N5J12j92M33k11J3K8m3K3j77LL12
$$ -45 -19 128 -276 -50 -97 -296 3 -215 67 205 -171 -116 -4 -196 237 26 39 67 24 47 -130 -127 185
5544A85l02p2J45k53M92m5l07J85p5m1L12m22L21o1k57K88j38J03J84m19K12P5
$$ 185 -117 -189 -44 -297 195 150 -157 28 -47 -88 224 -198 123 62 -195 93 -45 58 242 -177 35 110
5566A10l18L31k64J04J35r7J42R9l05J98o7l17L16J9j13o4J74k7O2k30M20m72
$$ 110 -208 123 -141 -37 98 1 143 242 -63 135 68 -249 67 86 -27 -91 83 56 118 -112 308 -164
5588a64L5L99l86J09k9k43K85j11QJ94j71l0K32k20K93k04q0J98j40P8j0k44L94
$$ -164 -129 270 -116 -7 -36 -279 6 -105 -97 97 -74 -104 128 -92 201 -3 -83 115 -25 53 43 -201 193
5611A93j00j77L22l44J01J22k36O0n0p7J89j49P5J96j77J29j88p8L96k79j00L99
$$ 193 93 -84 238 -106 -5 117 -119 -59 -109 -186 3 -146 -71 125 -52 77 -111 -189 207 -72 -172 227
5633B27l16J20J12l03K32o8p4K53j65j15N7k06L25j38rK57k16LQ4j88L29Qj85
$$ 227 -89 31 143 -160 72 4 -70 183 18 -97 -40 -246 79 -59 -68 189 -27 -24 60 -128 201 209 24
5656B4j13j02J16K89k87k4Q9p4M11l50%J17l06J56Q9j82L37p0j20J98m06J47J20
$$ 24 -89 -191 -75 214 -73 -97 -8 -82 329 -21 -21 96 -210 -54 35 -147 190 120 0 198 -208 -61 59
5679E9j89J21j25J04J10k43n7K21JK57l18K34j71r0NL90m82K58m7l69L25p4N7
$$ 59 -130 -9 -134 -30 80 -163 -220 1 2 259 -59 175 4 -86 -81 309 -173 85 38 -331 -6 -80 -23
5702b3J14k12K03k3k65M49m14P2K49k59O5JK55j05j28j20J54J4J0j0k87L33l1
$$ -23 91 -121 82 59 -206 243 -171 -99 150 -109 -44 -43 212 107 -21 -141 13 27 37 27 -260 73 42
5725D2Nk7j64J71K83l87Q5o6j05L64k73J76N9m90K16LK8J44k5l6K58m79K26p6
$$ 42 47 20 -144 27 310 -77 8 -58 -163 201 -72 104 163 -327 -111 -108 -80 64 39 3 261 -218 8 -68
5749f8k8J16j73K12J38j43n0k6n9R1o0O8N1j78J91K9r6J09j28k9J70k90K67j56
$$ -68 -96 20 -153 59 197 54 4 -22 -81 10 -50 18 69 -109 82 111 15 124 -4 -33 137 -153 114 -42
5773d2r5M25j68k49M04l65RK05l35K90m7l9j4l5O9M5k28K99j01K3J62k82M5K94
$$ -42 -137 288 120 -129 275 -90 -81 124 -211 79 32 -7 -21 -56 13 58 -170 129 28 51 213 -69 -24 270
5797B70k43J6Kj95K50j64N5L96l29lL7k17J99k23PK77k16j4J51l79L35P7j27J23
$$ 270 27 43 45 -150 100 -64 -9 387 58 55 92 -125 74 -149 -142 135 -81 -95 56 -323 12 89 -38 85
5821H5q6N3K1q2N9O6j95Q7l0o7L11j59n0O6p0qM5O2j1j85J05j87k8K67O2j50J97
$$ 85 -1 52 73 -9 50 116 -79 8 -22 -89 222 63 13 79 9 1 46 108 97 -88 17 -170 -198 69 131 -19 178
5848A78k58K6K3r3L14m27J84K49n30K73j8Q7J8O7m50L27K2m1J14j99K40j60R5
$$ 178 -80 -54 -31 -124 190 -237 -53 196 -334 -61 -79 8 26 93 -357 -30 -8 -49 65 -134 106 -54 41
5871D1J38l82N5J89k3P1j80p1K61J2r1J21m71M13k57J51J16k05J3L44l09J24k13
$$ 41 179 -203 -148 41 18 89 -91 -162 99 111 20 141 -330 83 -174 -23 93 -112 -99 245 -64 60 -153
5894a53J91l9jjL88m54K37l9j89K24j53k19J94j04L2K19l82N37l88R9J44l22J0
$$ -153 38 -1 -2 -3 385 -69 168 129 -60 164 11 -208 -14 -118 -86 133 -249 288 -100 -1 143 -179 -169
5917a69J20j43K99j70j48L27p2j68K68l30J30N6j04K55j83j45N46k41m0o1j73
$$ -169 -49 -192 107 -63 -211 116 44 -124 144 -186 -56 0 -104 151 -32 -177 369 128 88 27 -146
5938a46K93o7j44J54o4P6Nk10L24k80o7J43QN7J19j24R6q5J3j31J4J13pj98M8
$$ -146 147 80 -64 90 26 102 107 -103 221 -59 -126 17 25 82 201 77 173 88 101 -30 -16 97 90 -108 -60
5963f0J05k94N30j78r9J23r3Q2Q4j60J46n9q4pqM4o2l05L65k17Q1L06k16k6J24
$$ -60 45 -249 281 103 4 127 34 116 200 40 186 127 43 36 28 72 10 -295 70 -147 -66 240 24 -2 122
5988A22k48K72l9k77J95Q5o5J06k26J20Q7l61K83k94N5K28j78K70j61p2J19Ml20
$$ 122 -126 146 107 -170 25 110 45 151 -75 45 132 -229 54 -240 -185 43 -135 135 -26 -98 21 25 -295
6011b95M21j91o6L37l20J19J50k06K25k33J29J00k66J23j88J11J34j31M9J02j42
$$ -295 126 -65 -131 206 -114 5 155 -51 174 -59 70 170 -96 27 -161 -50 84 -47 2 104 -38
6032c8J33m6l59L35o7L2p4J31k6q3L1J36k81k9K63Pj04j01p6K15m3j39L20j97
$$ -38 95 49 -310 25 -42 -10 -84 47 21 -62 -31 105 -176 -205 58 65 -39 -140 -216 -1 -44 -183 137 -60
6056f0K91j76k13K41j9l14L74k38K28k32k4L27q6k19J55R4j75J69l42K01J11j66
$$ -60 231 55 -158 83 64 -250 124 -114 114 -118 -142 185 99 -120 35 129 -46 123 -219 -18 93 -73
6078g3O3O9J49j78j6j8j48K40J04k64J37L2k01J46O4k76L28j06j80K41K1j45N2
$$ -73 -10 59 208 30 14 -4 -152 88 192 -72 65 97 -104 42 106 -170 158 52 -128 113 134 -11 41
6101D1j37R8k06N6K23k00L15j32p9O1p4j12K72j43k25K78Q4j30j36j03L51j00
$$ 41 -96 2 -204 -148 75 -125 190 58 -21 40 -34 -146 126 -17 -242 36 120 -10 -146 -249 102 2
6123BMQ9j78K02p2j12K00k78J89J6k90K62ol55L60l6j46K12k74K04Pj81L56k72
$$ 2 6 95 -83 119 47 -65 135 -143 46 62 -228 34 28 -327 33 -3 -149 63 -211 -7 0 -181 175 -97
6147i7P4J93m39L21J08k61N5N4j3N3j04l7J35l02M04j54r0K32Kj67N5j65Q7J59
$$ -97 -23 170 -269 52 160 -101 -46 8 -5 48 -56 -93 42 -260 144 -10 -100 132 134 -33 22 -143 -56 103
6171A03j88L55m34J20J20k62J02r3J14J70j9k59J82L1Q1l0j11P4Q0J1j32j02K17
$$ 103 -85 270 -164 -44 76 -186 -84 -177 -63 107 88 -171 11 42 123 93 -18 56 136 147 15 -87 130
6194A30N1j82L2j29Q7J65j01j47K67m21J35K03j36J19j19L4l5M3j2N1r6j9J12
$$ 130 181 -1 31 -98 -11 154 53 -94 173 -248 -113 90 -46 73 -46 -12 -47 -4 -16 35 -61 -80 32
6217C2M8J01l81K04J11k69J40J18o3m6k31L9L04r8K48j13m20L57k13J66j25k2
$$ 32 80 181 -200 4 115 -154 -14 104 41 -5 -236 -197 107 9 257 144 -276 81 -132 34 -91 -113
6239a13J74j14j40M74j51j37j46J84k1j89J30J07o3NR2k05K30j7k87K00O0n0K51
$$ -113 61 -53 -193 281 130 -7 -153 31 10 -179 -49 58 -5 0 92 -113 117 100 -187 13 73 23 274
6262B74l80Q3R3K9k2j50Q7L2k27J55J02m02L44k9j37L64j90j09L15m62K98j83
$$ 274 -106 -23 70 99 77 -73 14 46 -181 -26 76 -326 18 -11 -148 216 26 -83 232 -230 68 -115
6284a15J89o4M9Kn9j30J48Lp0K12J5l46L40k13K60j65L7L6k26J18K8k4Q8n4j27
$$ -115 74 10 59 61 2 -128 20 23 -47 165 180 -166 174 -39 221 56 93 129 -97 21 49 25 113 59 -68
6309f8J41j53K60K2k60N9J25j90L79l98J45M1j9J38l03rJ65p6Q0j6j39K46r6M4
$$ -68 73 -80 180 202 -58 1 126 -64 315 -83 62 103 84 222 -81 -90 75 -1 79 63 -76 170 74 118
6333A18L8P9k59J35r9p2J04k28K29L8m7p7M2L2J84l00J26j17p0K48m7j69J73q9
$$ 118 156 235 -24 111 12 -60 44 -184 45 83 36 -41 1 33 217 -83 43 -74 -144 104 57 -112 61 -28
6357b8Kl1r7J33nj73K05m0j64J14Q1J15l79L62J58k43J12j82O0O6p2O4J18k00
$$ -28 -26 -57 -154 -21 -26 -199 6 -34 -198 -84 -3 112 -267 95 253 10 122 -60 0 66 -6 58 176 -24
6381b4J21j08r8K18n4j33K11j42jJ59j81J6m3K1O1p6K7J35k55J43J47n9p9J51
$$ -24 97 -11 -109 109 55 -78 133 -9 -10 149 -32 -16 -59 -38 23 -53 -26 109 -146 -3 144 85 6 157
6405A57k03J08l7J3j4m9r1K92k16K4j19K60m9j32L29l26kJ62m12J44J75k47N26
$$ 157 -46 62 25 38 24 -25 -116 176 -40 -16 -135 125 76 -56 273 -53 -55 107 -305 -161 14 -233 293
6428B93m47K07m5K8k51K12q0J34j46M1J48k03J03P8j74J78o8j38K81j40k31M22
$$ 293 -154 53 8 36 -215 -3 -83 51 -95 -54 94 -109 -6 72 -102 76 8 -130 151 11 -220 202
6450B02j91j71R0R1J7J6q4Q7k4n7J32k12L63l90J19k8j20J45R4j36J80n9k28J5
$$ 202 11 -160 -70 21 38 54 -30 57 33 -24 108 -104 259 -131 -12 -40 -160 -15 79 -57 123 64 -164 -149
6474a49l0K27j13J33L9l0l06L50O9j89R0l03J13J19q1K22o1O2j44j96R7J55k56
$$ -149 -179 48 -65 68 107 77 -229 121 190 1 91 -212 -99 20 -61 161 100 162 18 -178 -81 74 -182
6497a82J11j07K78N2k45J45k4q1J17j02J5K02k73n2L99m12M13k26p9n1L54k15
$$ -182 -71 -178 100 152 -93 52 28 -53 64 -38 -23 179 -94 -146 253 -159 254 28 -51 -102 252 37
6519C7r4Q0l0J74k85K14j44j8J55j33j3J64j09L4j57l3K30k50K13P0k97M21j37
$$ 37 -57 23 -7 167 -118 96 -48 -66 89 -44 -57 107 -2 32 -125 -158 72 -178 35 105 -192 229 92
6542I2j38O2r1K03K9j95M0r2J72n1q7Q8J68j56L3qk66K67l76K55N5l1J1J30j79
$$ 92 -46 16 -75 128 157 -38 2 -90 82 31 -56 32 200 44 77 69 -197 70 -306 -51 4 -27 -16 114 -65
6567f5J24j87k8J60J3J53j73opj32J48J05o1L4m0r5O0%j50L08k95J03K01k65R7
$$ -65 59 -128 -156 4 17 170 -3 -9 -16 -148 0 105 44 78 38 -57 3 3 -147 161 -134 -31 170 -95 2
6592BM6j35K3QR8Q3M2j09r8j20J93j20J26m5o3J10J4q0K20j84o1K92k38J45J01
$$ 2 48 -87 -64 -56 42 125 167 58 -40 -160 33 -87 39 -6 -69 41 55 -25 195 11 -50 242 4 149 250
6617B50k42K2o7m3J17l7p9K04k73K22k95M1J80j97O9O9p5kK38l36K80j41N1J44
$$ 250 8 30 -37 -80 37 0 -79 125 -148 74 -221 -180 0 -197 -128 -59 -134 -136 102 -234 46 -95 -44 100
6641A00r7j29J38j30M8q4K6J49l2p4O8j18J51P2m9o4n3J75N4q5M7k36J17Q5l32
$$ 100 3 -126 12 -118 -70 -154 -128 21 -11 -85 -17 -135 16 88 39 -25 -78 97 151 66 113 -123 -6 79 -253
6666b53K58n8L9R0M9m1jr3p8J21k70L25j53J68j21k50M82p2l65K20J15k83L26
$$ -253 5 -53 -14 76 125 84 83 -10 -88 33 -237 88 -65 103 -18 -268 214 142 -223 -3 112 -171 155
6689A55k82L31j28k1j26J8n3J90j48N0q1L2M1J16m1mj87N5K42k99J82o4j56L25
$$ 155 -127 204 76 55 -71 -53 -106 84 -64 -14 -95 -63 -22 94 53 49 -138 -83 159 -140 42 -22 -178 147
6713A47p5k3K4j29j30L60k65K70r4j61L52j20j62Q0j25l1J83m28K95J4k12K3Q1
$$ 147 72 49 73 -56 -186 174 -91 179 85 -76 276 156 -6 74 -51 -82 101 -327 -32 -18 -230 -207 -126
6736a26K37o8P5r0O0k05J88j18J06J6j59J46m1k2P3j50J92j49k96L79M1l96K89
$$ -126 111 43 118 28 88 -117 71 -47 59 75 -84 62 21 -1 72 -78 114 -35 -331 48 89 -307 -18
6759a8j30K61P3m98K84Nj90R8P1Q4J98l42J58k76O9J90m8J71k86j6K99j66o6R3
$$ -18 -148 113 186 -312 -28 -23 -213 -115 -44 40 238 -104 54 -222 -153 37 -11 160 -126 -142 157 -9 -75 18
6783A8J88l33J86j68K10k1q8K17k08l0Q5m17N69j97j21L24m2k21J30O6k47K44
$$ 18 206 -127 59 -109 101 80 -8 209 1 -29 56 -361 208 11 -110 214 172 -49 81 147 -100 144
6805A44j64m8L7J60K9k36L7L4j4P2J55k60r9J57M9Q3l02K12q5q5J72j3P1k3k1
$$ 144 -20 -68 -31 129 158 -78 -41 -7 -21 51 206 -54 -153 4 53 136 -166 46 -39 -124 48 35 106 83 62
6830F2k24K15l25L10j75K87R9l32J66k7j20L6M9k56K20m7j04J39J0l4J69k75K97
$$ 62 -162 53 -272 38 -137 150 249 -83 83 56 -64 -28 21 -235 -15 -62 -166 -27 -17 -51 118 -157 140
6853A40j46n1J42j85J14K46k04J27l85K91L4j86k8M6K46k97K25rJ13k85P2L2j85
$$ 140 -6 -57 85 -100 14 260 56 183 -202 89 123 -63 -91 -45 201 -96 129 120 233 -52 20 52 -133
6876a33J47N1j62M6K9l6K08l40L1J21j15L23l70J47P5r7J54q3j63M31k99q0L53
$$ -133 14 65 -97 -51 -22 -58 150 -190 -159 -38 -153 170 -200 -53 22 -75 79 -4 -167 264 -35 -115 238
6899B38l87oJ60p1K27j20j5k47L12P1r8j82J34K0o9J82k68N9L3o2K25k59K03j15
$$ 238 -149 -155 5 -66 161 41 26 -221 91 162 64 -118 16 36 -33 149 -119 -60 -27 -89 136 -123 80 -35
6923c5Q0P3j2j84QNK5K36j69R5j70j34J81J2l9p5J16j47K79l57K46n3j30K31q9
$$ -35 45 118 106 -78 -70 -65 -40 196 27 122 -48 -182 -1 11 -28 -103 13 -134 145 -212 34 -19 -149 82 -7
6948gJ36o5j64PK03k15J89k54J35m8q3K38n8j46K04j21m8L98l08L8J39k75J3J79
$$ -7 129 64 -100 -93 110 -105 84 -170 -35 -83 -166 72 14 -132 72 -49 -97 301 -7 31 170 -105 -92 87
6972H7j38J14j44j3J84n2o1j61j5M34k47k3J48r1q8K0n4K70K8k43J61l09K38m0
$$ 87 -51 63 -81 -94 90 38 -23 -184 -199 235 -12 -35 113 22 -66 -46 -100 170 198 -45 116 -193 45 5
6996Ej7J39r8j30J8NJ61J34j82j53J20K7K29j51q4K27k84J11r6j01L6K11l16J31
$$ 5 -12 127 29 -101 -83 -78 83 217 35 -118 2 29 258 107 23 250 -34 77 -19 -120 -84 127 -189 -58
7020e8j36K46J0J6J16l30K83j84O1P8r6J58n7j91O9Q2N5o2J6l03K71j42O4J62
$$ -58 -194 52 62 78 194 -136 147 -37 24 102 6 164 107 -84 -15 67 122 60 76 -227 44 -98 -34 128
7044A28j94J5pj05Q4J80k20J88P3k14K50k80K00j33r2L33k85R8n3r4P6r0KJ74
$$ 128 -66 -51 -58 -163 -79 101 -119 69 142 -72 178 -102 98 -35 -127 206 -79 19 -34 -128 -52 -142 -140 34
7068C4J5j34J56m5Pj06o7J59Q3m4J1O3j24Pj58J60j42J13J09p2k1N5q0q5O9mK47
$$ 34 49 -85 71 26 33 -73 -140 19 102 58 69 132 8 15 -143 17 -125 -12 97 25 4 59 -21 -106 -37 -41 206
7095B06l45j7J89K9lP8j90J21K6m7K8j13J34j94o1J47j70J18L30k98R4O1m3j52
$$ 206 -139 -156 33 62 59 137 -53 68 94 47 75 -38 96 -98 -159 -12 -182 -64 266 -32 62 123 80 -72
7119g2J94n1nr0J62k28m3J37p2J15j59m9K04mj18K24j45l8N3q1j1L04l75J31O5
$$ -72 122 71 66 -24 138 -90 -133 4 -68 47 -112 -161 43 39 -79 145 0 -38 15 -66 -77 227 -148 -17 48
7144D8j07J68j43J3J0j09K31k27Q6J2J18Rj16mQ3q8L3N3m9N1K7j97N5K46k55r8
$$ 48 -59 109 -34 -21 -11 -120 111 -116 -30 -18 100 109 -7 -11 72 -16 17 70 21 72 99 -98 -43 203 -52 -150
7170a50O6o3K61j46K24r1k38K47l33P5J80m0M0k15J05k3M3J66J9j90K3R6J60j83
$$ -150 -84 -147 114 -32 192 101 -137 110 -223 -148 32 -8 32 -183 -78 -101 -58 108 127 -63 -40 56 216 33
7194C3Q0j26r1P9l0j5J48r4P0k42L87j70j75J43j98J54K54j69K3j2o7K9k4P6J34
$$ 33 113 -13 -104 -25 -55 -70 78 -16 54 -188 199 29 -146 -3 -201 -47 207 38 61 49 -18 11 -13 63 197
7219A97o2j51M8k18P3O7O7P7qo4J19r3q1R9j13PqJ16j07LK7LJ2M2l11K58j23M3
$$ 197 135 -16 32 -186 -113 -46 21 98 90 26 145 52 -29 70 -43 -36 -44 72 -35 -32 -5 -2 10 52 -259 -1 -124 -81
7247h1K08j25Oj47K39j63K91k22J91k07r0Q9Q1K9j35P5J22j66j38J43J60j51K10
$$ -81 127 2 8 -139 100 -63 228 6 197 -10 -100 -11 70 99 -36 39 161 -5 -143 0 160 9 219
7270B19l39J46O2k11J88k44J47n3j1J20m8J8J36k18J66J23l77L29j38k4J37j53
$$ 219 -120 26 88 -123 65 -179 -32 -85 -96 24 -24 -6 130 -88 78 201 -176 153 15 -9 128 -25
7292b5J58p6j59J33P1j90J75l01M17j51k53J11J41j51N8K32k86J09k38N8L09j97
$$ -25 133 57 -102 31 102 -88 87 -214 203 52 -201 -90 51 -100 -42 190 -96 13 -225 -167 142 -55
7314e5M2L2r2J82j3q3J89j06J20j72o7q0p9K38j5m5K01l22N8O3p7J70L2j88j06
$$ -55 -13 19 -73 109 96 13 202 96 216 44 -23 -103 -182 56 41 -4 197 -125 -67 -4 -81 89 121 -67 -173
7339a73K63k95L98k6j7j32J9jm0o3K79j65n7J56k20J7J91p9k84N7J64r2M7J24
$$ -173 90 -205 193 167 150 18 37 36 -4 -67 212 47 -10 146 -74 -57 134 55 -229 -172 -8 -100 -53 71
7363G1q1P0o9m3N9j9M3k00L63Kk20K3K1k8J93j65K9j95Q8J88o8j47l3nJ21m1J73
$$ 71 -10 60 -9 -52 7 -12 31 -169 194 196 -24 -1 20 -8 185 20 49 -146 -58 130 62 -85 -118 -123 -2 -43 130
7390A30j33o3K53k92O4J69j88J13J36k16J37O4k33L45o6k18jl2J93r5k14L13k98
$$ 130 -3 -66 187 -105 -41 128 -60 53 189 -27 110 174 -59 286 220 2 1 -31 162 67 -147 166 -132
7413a32K07Q2l73m3L02j16J33j91K05m5j98K29p8j55K55r7j74K70j59J47j54J09
$$ -132 75 157 -216 -259 43 -73 60 -131 74 29 -169 60 -18 -173 82 -15 -189 81 -78 69 -85 24
7435B4K7r3j7J25N9j25L68l93J83k54J15j0q3Q8K8J47l9k15J5L4m3R9Q5k00J13
$$ 24 51 -42 -59 66 125 0 368 -25 158 -96 19 9 -74 14 42 189 150 -65 -50 -16 -59 40 125 -75 38
7460C8M3k03J63j75J46r7RK19j59l6R3k2n7P9l7J30k44M9J07j6P3ok84J78m1P4
$$ 38 81 -122 41 -134 12 -85 -76 143 -16 -52 41 19 -38 41 4 134 -110 -61 46 30 103 97 -187 -9 -50 24
7486B4J42j41k31K35M2j56K01k24J55o6J15j68Q4K13k16k9J53r0o5l6l0K5J35
$$ 24 166 25 -206 29 71 -85 116 -108 47 -19 96 -72 12 225 9 -20 133 43 -22 -58 -88 -63 72
7509G2j38%K04q5o3RL5n1k5Ol6J12o0j3j38J99o7j00J86M8l5M3j39J06j19J1j9
$$ 72 -66 -66 138 53 -10 -1 34 -17 -42 -36 -72 40 -20 -33 -171 28 -39 -139 47 95 60 103 -36 70 -49 -38 -57
7536e7L2j42L46k15q5L02J0J52m00J75K9j10L0l23K93J97k10j01J0K14q8P4k31
$$ -57 -25 -167 179 -36 -121 181 191 343 -57 118 147 37 67 -256 37 234 24 -77 -67 147 59 133 -98
7559i8J07j87J33k2J63m2Lj29K41k56O4J29j71K01%j58J37k93P1N6n8J26l5J3
$$ -98 9 -178 -45 -67 96 54 57 -72 169 -87 -23 106 -65 136 136 -22 115 -178 -107 -51 -109 17 -18 -5
7583eJ46j59p5K77j98j11L7P3j29J85j09J98k01R9j39M2K08k50l2J67l8j78K49
$$ -5 141 -18 -93 184 -14 -125 -88 -15 -144 41 -68 130 -71 28 -111 -69 139 -111 -143 24 -14 -192 57
7606E7j35l1K85j97j54P6J36j80J13K9j44o1J62Q6p2M0k5J6J9k71K42n7K23jj29
$$ 57 -78 -109 176 -21 -175 -99 37 -143 -30 -1 -145 -206 -44 42 -30 10 -15 1 20 -251 -9 -66 157 156 27
7631B7K6Q4r3j41K10j93J34j27J50K82l00p1L06l22K7k7M1Q8l6j06j55J63M3N6
$$ 27 53 137 44 -97 113 -80 54 -73 77 359 59 -12 294 -28 -1 -28 13 101 65 -41 -196 -33 10 66
7655F6L3p9j48K22j02K6J19j8L5j81k8Q6MK3o1p2ml1J29q6n1k2K43j22J13Oj30
$$ 66 99 20 -128 94 -8 18 137 119 154 -27 -55 31 35 58 -3 -75 -79 -110 19 -67 -118 -140 103 -19 94 100 -30
7682c0j1K3j92L36J1l11J72j79J11nK03J7k03j2k7L4J48m0j71OK98k10N0N8M8
$$ -30 -41 -18 -210 126 137 -174 -2 -181 -70 -75 128 145 -58 -70 -97 -63 85 45 -126 -120 178 -32 18 76 124
7707A24j63N2o4K09j41J01k20L5K20J3n8l0p6Jj10J01J25m11K69J9j54J86Or8
$$ 124 -39 13 -51 158 17 118 -102 -67 153 166 108 78 2 3 -107 -6 119 -292 -23 -4 -158 28 34 -64
7731f4M9K27j31j29J21j47J46j71K52k34J64j36p6J14J11m1j15j64K62Q9m22K89
$$ -64 -15 212 81 -48 73 -74 72 -99 153 -81 83 -53 -129 -15 96 55 -60 -224 38 127 -295 -6
7753fN5q9K6p0K8K88j94rj00j5J35j26J7J49l04K94k20J90LK9j93j2J37Q8J25
$$ -6 49 -40 -14 -84 -56 232 38 29 -71 -86 49 -77 -60 89 -215 79 -141 49 52 81 -112 -124 13 101 226
7778B26l35J32K3k41L34l28K83o5l07L81j28j0J41j53Kp8J85j24o3l9L44j57o6
$$ 226 -109 23 46 -195 139 -189 94 29 -278 103 -25 -35 106 -47 -45 -123 62 -62 -125 -164 180 23 -43
7801d3q1o4J47j40L28r6J6j7K9M4j26J5M6j2O9j86nk1J72j31pQ4o8N2n3J04q5
$$ -43 -124 -188 -41 -181 147 51 67 50 79 123 -3 12 58 46 115 -71 -76 -97 75 -56 -63 21 -47 5 -48 56 -29
7828b9J4lJ8k06P1J56J7k88J96m5j5J23j09R8n0PJ97m1j81K41j67o9KJ0M5L6j24
$$ -29 -15 -18 0 -206 -135 21 38 -250 -54 -99 -114 9 -100 -2 -52 -45 152 111 -70 171 4 -65 -63 -53 -8 28 -96
7855i6R0J07j12q5J31J19j78L08j33k37P3q6J08J6pQ8L7j80L2P5k1J01j5m9l0
$$ -96 -6 101 -11 -96 35 154 -24 284 151 -86 -13 -99 9 25 18 106 143 -37 -5 70 49 150 135 86 56
7880E6j67M3K29l40R4m5J41K72k71j70K06l6J24j38J6J08n4j78J11n1Lp2N6N8
$$ 56 -111 -68 161 -179 -85 -130 11 283 12 -158 48 12 136 -2 14 122 68 -110 1 -50 -47 -119 -63 -5
7904eL3Q5P6k43L5L9K1n0l4p4R8P3O2j99M5Q2k28J25K5j10K89n2q6K24r8j13n0
$$ -5 28 113 189 -54 -19 20 41 -9 -43 -117 -19 54 116 -83 -38 44 -184 -59 -34 -144 145 93 7 231 133 20 -30
7931c0RM7m8q7L3J66k54J13N6j1J69k50J2j04j44L35o5P0j75J36M0j49J17J15
$$ -30 -21 26 -22 -109 -76 90 -164 -51 5 -6 163 -87 -75 -179 -323 12 -53 17 -158 -22 18 -131 -14 101
7955A01k10oK39m7k33L24j26K6j19m1J97q4P0j71OJ33o3N5j42J3J44J60l12j08
$$ 101 -109 -115 124 77 -156 168 42 68 -51 -92 105 21 91 -80 -74 59 -4 51 -91 -78 66 226 -86 -194
7979a94J79r2J14oN0k04J49o4RM7J9n0n0J41k88J98n1k8K12q0j7J76k45Q4J69
$$ -194 -15 -107 7 1 51 -153 -4 -68 -59 -12 7 -43 -93 48 -240 -42 -93 -121 91 11 -6 170 -75 9 178
8004A78j23qmK0j70K06p5N1p5j97J96J26rk08J57L2j86J2P4l4O2k9K09k78O5K10
$$ 178 55 47 43 63 -107 99 24 75 0 -197 -1 125 116 -92 65 97 -89 -77 -3 -37 25 -4 205 -73 -8 202
8030B02j89qj3k28L00J47k09J21r8j17K68k20J08l4j20L6J7m1l0o8K53j32p6J40
$$ 202 13 5 -8 -236 64 211 2 123 25 -92 176 -44 64 30 -90 -54 -37 -78 -108 -176 77 -55 -131 9
8054Im3r2M02l09l1J32j28K60j89k18J80P4L4J8j06M3M6k12K06q8q2P1k02J87
$$ 9 -34 -126 276 -33 -64 68 -60 200 11 -207 -27 47 81 99 -7 36 82 -130 76 -12 -94 -23 -225 -38
8078c8J07r7n9K97k49Lm7k5K96l30L87l21j7J78j79l6J43K2n2LJ42k70K66l95
$$ -38 69 -28 -87 210 -39 -36 -83 -108 188 -142 245 -76 -93 85 -94 -130 13 35 -17 -14 128 -142 124 -271
8102b71K91k0j6J03R6j72J03k49J20j36Q5K14j96K83l26J4J12j7j1J46k86P9P6
$$ -271 20 0 -16 87 183 11 114 -135 -15 -151 -66 148 -48 235 -91 -77 35 18 7 153 -133 -54 22
8125B2K0r0J61k08J51N6r9n3J26J53k38l3M4P5m2k28J12J42j82J34R9k02MK17
$$ 22 42 -48 113 -95 56 112 13 -40 86 239 1 -32 12 87 45 -183 -71 71 -111 23 122 -80 -76 141
8149A41j71K20k72J79j08o2K10l8M7k57L33k21p8K6j20K99M7o7o9L1J63k74N3
$$ 141 -30 190 -82 97 -11 -73 137 99 146 -111 222 1 -77 -51 -171 128 175 108 39 70 233 -41 12
8172A2n7J65k01J6L9K22l27J97q4k00L65N3l67J22k0K24j67M9J12
$$ 12 -45 120 -81 -65 -26 196 -131 66 -18 -218 147 200 -167 -45 -65 159 -8 41 153
8191A53
$$ Imaginary data points
##PAGE= N=2
##DATA TABLE= (X++(I..I)), XYDATA
0@%%%%%%%%%%%%Qj6J6k3L1l7M5n6O9q1R7j17J38j61J88k18K53k93L37l85M39n00
$$ 0 0 0 0 0 0 0 0 0 0 0 0 0 8 -8 8 -15 16 -21 24 -32 37 -44 53 -64 74 -87 101 -117 136 -157 180 -205 234 -266
34b66N68o42P24q16R14j022J141j269J411j567J737j922K123k345K588k852L139
$$ -266 302 -340 384 -432 482 -540 601 -668 743 -824 913 -1009 1114 -1231 1357 -1495 1644
51A644l458L810m199M632n111N651o263O962p772Q718r838J1194j2875J5020j7858
$$ 1644 -1814 1996 -2203 2429 -2682 2969 -3294 3668 -4104 4614 -5224 5970 -6905 8115 -9743
66i743K1796k7626L7182p5792M56208m24096m37103P33990j61940m97637M69740
$$ -9743 12053 -15573 21609 -54183 402025 -22071 -459174 274816 112876 -384761 84979
77H4979J55530n90066K47061M43222m43177j28780M63255k31793k31554L77697
$$ 84979 240509 -349557 -102496 340726 -102451 -231231 232024 231 -231323 146374
87A46374j6263k66953J61516M7320j66228P3385J63848j23541j38523J63518N1645
$$ 146374 130111 -136842 24674 71994 -94234 -20849 142999 19458 -119065 44453 96098
98I6098j82217Q9948J13275j58032P001J33229j26217p7147K11469n546k64183
$$ 96098 -86119 3829 117104 -40928 -33927 99302 -26915 -104062 107407 101861 -162322
109a62322J40520J82209k76371L3822K50901k46948l4378K90355j97625j58194
$$ -162322 -21802 160407 -115964 -82142 168759 -78189 -112567 177788 -19837 -178031
119a78031K96064j1655k34877J49569R3074k25065P6405J80174k05506j4907J78772
$$ -178031 118033 106378 -128499 21070 114144 -110921 -34516 145658 -59848 -74755 104017
130A04017j67110l0980J92382j03116q2964J02906k1793k1934N2026k9004l7401
$$ 104017 -63093 -94073 98309 -4807 -87771 15135 -6658 -28592 23434 -5570 -42971
141d2971N2904L2397n5154l477L0907j8442L3896o240o0521N5746L059m7150O0592
$$ -42971 9933 42330 -12824 -16301 14606 -3836 30060 23820 -36701 19045 22104 -25046 35546
154C5546k5530l8660O3498l5222k2759O3394l1930l2155L8150m176k5272K3002
$$ 35546 10016 -28644 34854 -368 -23127 40267 8337 -23818 14332 10156 -15116 7886
166G886M538m8713L4659L7517r0427L1257P7141j03818K0698Q3941j02294K2658
$$ 7886 12424 -36289 -1630 35887 -54540 -23283 53858 -49960 -29262 54679 -47615 -24957
178b4957R3616r6563j6006J01229l7630n9939O7351R484p8215N8641M2562j12450
$$ -24957 68659 -27904 -43910 57319 19689 -40250 27101 36585 -41630 17011 59573 -52877
190e2877M0298P8292j03890J4937P2418p8391m66O2233l4351k4962L0353R217
$$ -52877 -12579 65713 -38177 -23240 49178 -29213 -29679 32554 -1797 -26759 3594 12811
202A2811l4696J2496M2585m9215j6072N7993k3701k3247K8309m121j3383l71K6677
$$ 12811 -21885 -9389 33196 -16019 -32091 25902 2201 -21046 7263 3142 -10241 -10612 16065
215A6065o019m6361N2716J9672p6578M6188L7947p5103K6405M9713n6078j4783
$$ 16065 10046 -36315 16401 36073 -40505 5683 43630 -31473 -5068 44645 -11433 -26216
227b6216N6287j4750n4848N2653K4220q5643M2159N5069r1660K4826O6423p4150
$$ -26216 30071 15321 -39527 13126 37346 -48297 -6138 48931 -42729 -17903 48520 -25630
239b5630J057N9174l8197k1748M3217L050m5799K1078L8474n4121M448N2488n2234
$$ -25630 -24573 34601 -3596 -25344 17873 20923 -24876 -3798 34676 -19445 -14997 37491 -14743
252a4743n428M7063l2581j0067K4496n137r759l849K0156q493k4459L6594n146
$$ -14743 -20171 26892 -5689 -15756 8740 3603 -6156 -10005 10151 1658 -22801 13793 8647
265H647l3601L3092k36k4132J7497N659r462q447J4850R731l2883K0556K3271
$$ 8647 -24954 8138 7902 -16230 1267 6926 -2536 -10983 3867 13598 -19285 1271 24542
278B4542m5927K1353K5943m2939J5676K2958k6701j74J5633j812j8017R452K0347
$$ 24542 -21385 -32 25911 -17028 -1352 21606 -5095 -5269 10364 8552 -9465 -13 20334
291B0334l3731N236L2423m0048M745L2507l5011K432K2227j6939k754O756N498
$$ 20334 -13397 -8161 24262 -15786 -11041 21466 -13545 -11113 11114 -5825 -8579 -1823 3675
304C675q705o361K3788j6353j1446L2795j9331j0348K6909j5538m254J1314m780
$$ 3675 -5030 -11391 12397 -3956 -15402 17393 -1938 -12286 14623 -915 -5169 6145 1365
317A365K199q204Q255N236k2435J9569M481k7322K2715K214k0305J5224O94o057
$$ 1365 3564 -4640 3615 8851 -13584 5985 10466 -16856 5859 8073 -12232 2992 3686 -2371
331b371k7K479Q316j7983P143J8487k9967J0723K0747l1821J1332J6018k1257
$$ -2371 -2398 81 8397 -9586 -2443 16044 -13923 -3200 17547 -14274 -2942 13076 -8181
344h181N827Q078l647n437J254J4766j7123k472K5781k5361k667K7030k4685j058
$$ -8181 -2354 5724 2077 -3360 -2106 12660 -4463 -6935 18846 -6515 -9182 17848 -6837 -7895
358g895J7466j4863K08L228J029j755r263J7234m947j6237K5051q157j3347K3292
$$ -7895 9571 -5292 -5084 -1856 -827 -2582 -11845 5389 442 -15795 9256 1099 -12248 11044
372A1044r292o499J1507m628K868n618K446Q337j8491J1394Q420k4683J6187N812
$$ 11044 1752 -4747 6760 2132 5000 -618 1828 10165 -8326 3068 11488 -13195 2992 8804
386H804j9206J3598o23p052N780k313N694q464j286J5707j7608K069J5790k2025
$$ 8804 -10402 3196 2573 -4479 1301 -1012 4682 -3782 -5068 10639 -6969 -4900 10890 -11135
400a1135P572J1357j6951P577J507m198O583o052O968j485p695J7175r369o328
$$ -11135 -3563 7794 -9157 -1580 -73 -4271 2312 -3740 3228 1743 -5952 11223 1854 -4474
414d474J6402j3480J547R737j4073N856k11n393P954j0304L288N344j1912J2927
$$ -4474 11928 -1552 -5 9732 -4341 1515 1304 -4089 3865 -6439 -3151 2193 -9719 3208
428C208k911j0180J6907q271j739J0975j1883N854L782p814P747q090P93Q119
$$ 3208 297 -9883 7024 -1247 -2986 7989 -3894 1960 5742 -2072 5675 -2415 -1622 6497
442F497j2942Q070j9j2209J5938n434p470J2391r167K895O200r215P093m162m12
$$ 6497 -6445 1625 1606 -10603 5335 -99 -7569 4822 -4345 -1450 4750 -4465 2628 -1534 -1946
457a946R568j3395M698N963j3474J2226n98j1173J1381l419L81M754p550Q843
$$ -1946 7622 -5773 -1075 4888 -8586 3640 3042 -8131 3250 -169 212 4966 -2584 6259
471F259l227l021J3560j4477j48J4483j5128L461N078j2140N817j150j390Q60
$$ 6259 3032 11 13571 -906 -1054 13429 -1699 1762 6840 -5300 517 -633 -2023 -1163
485a163r463J0644j439j0584J5709q472o374J7398r720j584P029o328O811l221
$$ -1163 -10626 18 -1421 -12005 3704 -4768 -11142 6256 -3464 -5048 1981 -4347 2464 -757
499g57j885O979j1791Q067O578j6075R982K729q888J0562l949j971M090l634R181
$$ -757 -2642 4337 -7454 613 7191 -8884 1098 3827 -5061 5501 1552 -419 3671 37 9218
514I218p149m926J4445j2438M6J2777j7265L045R563j0993L582l88j309K529m833
$$ 9218 2069 -2857 11588 -850 -804 11973 -5292 -2247 7316 -3677 -95 -483 -1792 737 -4096
529d096Q980n160p675J7163q520o241J4370j1913p7R918r841J829j459j141N906
$$ -4096 4884 -276 -7951 9212 692 -5549 8821 -3092 -3169 6749 -3092 -1263 -2722 -3863 2043
544B043r822M573L270j1187J2396p99j0094J1065l097m64N336o721O422k675k657
$$ 2043 -7779 -3206 64 -11123 1273 474 -9620 1445 -1652 -2116 3220 -3501 2921 246 -2411
559b411J1729j2614JJ2322j3148N334N787j1531O770J163j554K759o564P445j037
$$ -2411 9318 -3296 -3295 9027 -4121 1213 7000 -4531 2239 3402 1848 4607 -1957 5488 4451
574D451o585J1704r053m123J3206j1339k3O096j0411O307j01n514O253p381M008
$$ 4451 -2134 9570 517 -3606 9600 -1739 -1762 4334 -6077 230 129 -5385 868 -6513 -2505
589b505M685r723Q145j032n350J0213o357l52N856p535P178j935o343R907p395
$$ -2505 2180 -7543 602 -430 -5780 4433 -1924 -2276 3580 -3955 3223 1288 -5055 4852 -2543
604b543O6Q487j1774N127M818q673P786k829l067O658n340L870p20o306J0122
$$ -2543 -2477 6010 -5764 -637 4181 -4492 3294 465 -2602 4056 -1284 2586 1866 -4440 5682
619E682o163k442Q905j1442L633O998j0729O405m04n010Q458n536J391L312p258
$$ 5682 -481 -2923 5982 -5460 -1827 5171 -5558 847 443 -4567 3891 -1645 -254 3058 -4200
634d200Q832j612o365R218o566j49O780q725M157J4m889P751o850J72O595j0474
$$ -4200 4632 3020 -3345 5873 -693 -842 5938 -2787 1370 1384 -3505 4246 -2604 -2432 4163 -6311
650f311P055K457j0005R142j850m514P457n684J195K219m219O097n478j46P547
$$ -6311 744 3201 -6804 2338 488 -4026 3431 -2253 -1058 1161 -3058 3039 -2439 -2585 4962
665D962r803M886M155j0784R631l40p336Q811n030J20M841o681M952j142m410
$$ 4962 -4841 45 4200 -6584 3047 2707 -4629 4182 -848 -728 4113 -2568 2384 1242 -3168
680c168P728o884N64N591q699N930K46o305Q035n455K73O909r208N347K255p729
$$ -3168 4560 -2324 -1760 3831 -4868 1062 1308 -4997 3038 -2417 -2144 4765 -4443 904 3159 -4570
696d570R354l454m517Q430o118J523L196n706M729k325j077M625q170O022Q59
$$ -4570 4784 1330 -3187 5243 -875 648 3844 -1862 2867 542 -535 4090 -4080 1942 2801
711B801r330J0446l440p144J1132o723k697Q156o634J812J540k654L877m689L287
$$ 2801 -6529 3917 477 -6667 4465 -2258 -4955 3201 -3433 -1621 -81 -2735 1142 -3547 -260
726b60K825q067Q635j441p021J0943n509l079Q670p329K493L245o700O352l071
$$ -260 2565 -5502 3133 1692 -5329 5614 105 -2974 5696 -1633 860 4105 -2595 3757 686
741F86j739O111p610L152K705o877N617k053k776N513o576M020J257p632R493
$$ 686 -1053 5058 -2552 600 3305 -3572 2045 -8 -2784 2729 -3847 173 1430 -6202 3291
756C291m019n756J1896p498k238R208o860J100L068k595K439l104L500L62p500
$$ 3291 -728 -6484 5412 -2086 -4324 4884 -1976 -876 2192 -403 2036 -1068 2432 2794 -4706
771d706R712l134p803J1882o328m697J0081p446J58M369m756L588k601J84M340
$$ -4706 5006 1872 -5931 5951 -377 -5074 5007 -2439 -2281 2088 -2668 920 -1681 -1497 2843
786B843p094N121J661p424P754k105l812O635n667K284K639o607P719k958m648
$$ 2843 -4251 870 2531 -4893 2861 756 -3056 3579 -2088 196 2835 -3772 3947 989 -3659
801c659R963p053j410P686p310J790K214l389K519l665L281M79p474Q706k648
$$ -3659 6304 -749 -2159 5527 -1783 7 2221 -1168 1351 -2314 967 1446 -6028 2678 30
816C0p619J1931n832m648J0293o404n22N419m170K577j311P14L137o310N358O92
$$ 30 -7589 4342 -1490 -6138 4155 -2249 -2771 2648 -1522 1055 -256 458 3595 -2715 2643 3335
832C335p352Q627l205m841Q233o056M23M163o527M546p56l633O504n567M06M777
$$ 3335 -4017 4610 1405 -3436 4797 -1259 -836 3327 -3200 1346 590 -3043 3461 -2106 -1700 3077
848C077o633L924M11l990N185m351J383L238p272P081m17o953R699m468l411Q625
$$ 3077 -3556 368 779 -3211 1974 -2377 -994 2244 -5028 2053 1636 -5317 4382 -86 -3497 5128
864E128n890K95L961m154K921j985k24K971o381N224L5p404R124m156m906R213
$$ 5128 -762 -467 3494 -660 2261 276 52 3023 -3358 1866 1901 -5503 3621 -535 -5441 3772
880C772o353n33O176o271L342J052l694M673l128J149K368n433N688j724l977
$$ 3772 -2581 -3114 3062 -3209 133 1185 -2509 2164 -964 185 2553 -2880 2808 1084 -2893
895b893P257o105J19O026p834M590J654o999P088k175l383N976m941J078K253
$$ -2893 4364 -1741 -1622 4404 -3430 1160 2814 -4185 2903 728 -2655 3321 -1620 -542 1711
910A711m080L489k783N6L774o704N256M50p145R225k914n351R798n665j359O935
$$ 1711 -2369 1120 -1663 -1607 2167 -4537 719 1169 -5976 3249 335 -5016 4782 -883 -2242 4693
926D693n877J896J942k687K838l097J889O81m914O136l310m143Q550o739r05P474
$$ 4693 -1184 712 2654 -33 2805 -292 1597 2278 -2636 3500 190 -3953 4597 -2142 -3047 4427
942D427q894L536L889p376N192l02l193M548l181J042O68k642M360l837O33M107
$$ 4427 -4467 -931 2958 -4418 774 472 -2721 1827 -1354 -312 356 -2286 2074 -1763 -1130 2977
958B977p109N242K148q384Q511j668n839R149m894k576O294m649O54J614k301
$$ 2977 -4132 1110 3258 -5126 3385 1717 -4122 5027 133 -2443 3851 -798 -144 1470 -831
973h31J370k484L037m36n058P436l881l924J0059p796j101R411q813J969N865
$$ -831 539 -1945 1092 656 -4402 3034 -847 -4771 5288 -2508 -3609 5802 -3011 -1042 4823
988D823p034L485J355k958J880j631K134j679j787N329o122Q74O034r146M594
$$ 4823 -2211 1274 2629 -329 1551 -80 2054 375 -1412 3917 -2205 -1331 4703 -4443 151
1003A51L485r198P359L4o955P521k813k690N053l693N82P21l19J503l448L672
$$ 151 3636 -5562 1797 1831 -5124 2397 -416 -3106 1947 -1746 -1164 -443 -762 741 -2707 965
1019I65j22n107Q433l919m791J0595o729k344R856q687J96O856o718J502K238
$$ 965 843 -4264 4169 250 -4541 6054 -675 -3019 6837 -1850 -1654 5202 -1516 -14 2224
1034B224k634J12n01K980l982o90O639p505J043P649j0202M160N814j0217O109
$$ 2224 -410 -298 -799 2181 -1801 -2491 4148 -3357 -2314 5335 -4867 -707 5107 -5110 999
1049I99K125p088O369q60k956L101j550O26r57M95J722m788M733M11p175Q490
$$ 999 3124 -3964 2405 1545 -1411 1690 140 766 -191 304 2026 -2762 1971 2382 -4793 3697
1065C697k858o161J0263n876l972R636o677j258O159n313N76K147p62j062p13
$$ 3697 839 -5322 4941 -935 -4907 4729 -1948 -3206 2953 -2360 -1784 363 -399 -1461 -2174
1080b174M417l840j328P831p466l2R021r837K726O659r724M804L207o821M226
$$ -2174 2243 -1597 -2925 4906 -2560 -2592 6429 -3408 -682 5977 -3747 1057 4264 -2557 1669
1095A669J68k339J314p68J433k961J182K983o452M700J781q366Q219q94p325R165
$$ 1669 1837 -502 812 44 1477 -1484 -302 2681 -3771 929 2710 -5656 2563 1669 -5656 3509
1111C509l261m709Q299m738j570M908l036P8P64N45m23k185N084l408l140Q444
$$ 3509 248 -4461 3838 -900 -2470 2438 -598 -520 244 789 366 -1819 3265 -143 -3283 5161
1127E161o729j553Q687q439P96O963q687L042L629n743K630O93j372J72m15K754
$$ 5161 -1568 -3121 5566 -2873 -2077 4886 -3801 -759 2870 -2873 -243 450 -922 -750 -1165 1589
1143A589l607Q95M374o998M032L861q957O817J423p759P717j313m876O191k679
$$ 1589 -2018 -1123 3251 -3747 285 4146 -4811 2006 3429 -4330 3387 2074 -2802 3389 710
1158G10j418K275j518P25j864J784N41m312N278j541n222Q010m600l110Q307o576
$$ 710 -708 1567 49 774 -1090 694 1235 -3077 2201 660 -4562 3448 -1152 -4262 4045 -2531
1174b531l06O040o009J979K514l561K204l68K04n9j103L623l701J18N244o923
$$ -2531 -2837 3203 -2806 -827 1687 -1874 330 -38 166 107 -996 2627 -1074 -956 4288 -2635
1190b635K317M821q155M700K360p150N449l95l863M233k005m62P08j018K057l018
$$ -2635 -318 4503 -3652 1048 3408 -3742 1707 1312 -2551 1682 -323 -785 -77 -1095 962 -2056
1206b056J638K320n540M770M06n580O889k604l365O593m236o48M697m330J563
$$ -2056 -418 1902 -3638 1132 1538 -4042 2847 243 -3122 3471 -765 -1413 3284 -1046 517
1221E17J061k422K369k030J309M2k921M384k997j794N883o028Q47N058o921L259
$$ 517 1578 -844 1525 -505 804 846 -2075 2309 -688 -2482 3401 -2627 -1780 3278 -3643 -384
1237c84K655n795M176j14k562L159j764R42l24j185L679l652P97L686n826L496
$$ -384 2271 -3524 652 538 -2024 1135 -629 313 -11 -1196 2483 -1169 -372 3314 -2512 984
1253I84J731n634N393j084l720N241l266n93L042l614K020l22j495K384l036J596
$$ 984 2715 -2919 2474 1390 -2330 2911 -355 -948 2094 -1520 500 178 -1317 1067 -1969 -373
1269c73J116l877M437j538k667N514m232R0M468n096K336J967l960L259q31j082
$$ -373 743 -3134 1303 -235 -2902 2612 -1620 -1530 2938 -2158 178 2145 -1815 1444 613 -469
1285d69K261k605K102k09k349L935l419m56M195n064J974K245n261M099m19l091
$$ -469 1792 -813 1289 1080 -1269 2666 -753 -1209 2986 -2078 -104 2141 -3120 979 560 -2531
1301b531M099k837L77J927k833K427q40j420L575l501J365K204m365L751M0l543
$$ -2531 1568 -1269 -892 1035 -1798 629 -211 -1631 1944 -1557 -192 2012 -2353 1398 1438 -2105
1317b105M638k613r66L703l893J758R41l029L116j884p97K578l503K342J79k877
$$ -2105 2533 -80 -1046 2657 -1236 522 1463 -1566 1550 -334 -1131 1447 -2056 286 465 -2412
1333b412L923k340j033L870m080J653K140m156L553n10k109L483k568N03J719
$$ -2412 1511 -829 -1862 2008 -2072 -419 1721 -2435 1118 608 -1501 1982 -586 -83 1636
1348A636k870K620j019j573L638l423P04K485m404L165L9l169L909k333o99K821
$$ 1636 -1234 1386 367 -1206 2432 -991 -287 2198 -2206 959 998 -2171 1738 -595 -1294 1527
1364A527l620K068O11k790L247k036q8K790l483J887J003l149L838j785j130L624
$$ 1527 -2093 -25 586 -2204 1043 -993 -1081 1709 -1774 113 1116 -2033 1805 20 -1110 2514
1380B514l677J467J781l653L121p59j969L266l104Q72J513l186K780r60j846L794
$$ 2514 -1163 304 2085 -1568 1553 794 -1175 2091 -1013 -141 1372 -1814 966 6 -1840 1954
1396A954l538O06K640l853K447L33k687L377j910l71K585l112K136L44k668L534
$$ 1954 -1584 -978 1662 -2191 256 589 -2098 1279 -631 -1002 1583 -1529 607 951 -1717 1817
1412A817k198o43L232l508J788J118l324L220j285j416L297l363J303J310l206
$$ 1817 -381 -1024 2208 -1300 488 1606 -1718 1502 217 -1199 2098 -1265 38 1348 -1858
1427a858K920j056j789L466k966N45J975l147K783p48j823L394k464K59K370l346
$$ -1858 1062 6 -1783 1683 -1283 -738 1237 -1910 873 125 -1698 1696 -768 -509 1861 -1485
1443a485K398O9k374L188k203J46K172l354K130K55k636L243j980p97K788l214
$$ -1485 913 982 -1392 1796 -407 -261 1911 -1443 687 942 -1694 1549 -431 -1228 1560 -1654
1459a654J557J161l074L086j483j069L194l035P93J916l223L278j327j732L520
$$ -1654 -97 1064 -2010 1076 -407 -1476 1718 -1317 -524 1392 -1831 1447 120 -1612 1908
1474A908k653N07K047l090K287j98k187L295k347L05J843l117K148r5k256L205
$$ 1908 -745 -238 1809 -1281 1006 808 -1379 1916 -431 -126 1717 -1400 748 653 -1603 1602
1490A602k642J75K246l152J805N73l038L340j319q76K746k855J195J090k473K808
$$ 1602 -1040 -865 1381 -1771 34 607 -2431 909 -410 -1286 1460 -1395 -200 890 -1583 1225
1506A225j312o91K746k953J463J178l235L187j147j453L097k685K65J963l180
$$ 1225 -87 -778 1968 -985 478 1656 -1579 1608 461 -992 2105 -580 -315 1648 -1532
1521a532K288m62j588K654k182J43J623k614K257l15k299L351k163k31K637l195
$$ -1532 756 294 -1294 1360 -822 -679 944 -1670 587 272 -2027 1324 -839 -1070 1567 -1628
1537a628J692Q35k507K709j059p77K357k372J153Q50k441K669j483q72K530k894
$$ -1628 64 899 -1608 1101 42 -735 1622 -750 403 1253 -1188 1481 -2 -874 1656 -1238
1553a238J230J058k665K462p34j825K945k326J76K066k712J883L2j821K707j541
$$ -1238 -8 1050 -1615 847 113 -1712 1233 -1093 -917 1149 -1563 320 352 -1469 1238 -303
1569c03R2J764k713K246j38k155K926j756l98K536l226J517R22k558K509j532
$$ -303 -211 1553 -1160 1086 948 -1207 1719 -37 -435 2101 -1125 392 1314 -1244 1265 -267
1585b67q49K182k342J029P94k413K447j008j176K785k693J156J295k799K858n96
$$ -267 -1116 1066 -1276 -247 547 -1866 581 -427 -1603 1182 -1511 -355 940 -1859 999 403
1601D03j507K753k167L88J893k791J982l3j827K494k044L57J626k636J812n8k101
$$ 403 -1104 1649 -518 -130 1763 -1028 954 921 -906 1588 -456 -99 1527 -1109 703 645 -1456
1618a456K812k147l0J970k697J431O40k384K480r16j007K311k001R55Q12k020
$$ -1456 1356 -791 -821 1149 -1548 -117 523 -1861 619 -297 -1304 1007 -994 -39 773 -1247
1634a247K341r93r41K648k478R56J153k498K226q43j407K898k499K57J814k902
$$ -1247 1094 101 -840 1808 -670 286 1439 -1059 1167 324 -1083 1815 -684 -427 1387 -1515
1650a515J726J56j859K425j701n9J529k027J431j62j246K497j886J46K124k867
$$ -1515 211 367 -1492 933 -768 -827 702 -1325 106 -56 -1302 1195 -691 -545 1579 -1288
1666a288J727Q32k882K822r16j125K386k194Q50Q97j813J528r21p08K049k246
$$ -1288 439 1271 -1611 1211 295 -830 1556 -638 212 1109 -704 824 -97 -805 1244 -1002
1682a002J058P39k567K508q76j370K678k424L20K011k708J799K70j586K034j123
$$ -1002 56 795 -1772 736 -140 -1510 1168 -1256 -936 1075 -1633 166 436 -1150 884 -239
1698b39r4J336j840J586j64j301K325j879J95J813l020J726M61k525K706j046
$$ -239 -333 1003 -837 749 585 -716 1609 -270 -75 1738 -1282 444 905 -1620 1086 40
1714D0j164K129k005N88O61j454J583q55m97J814k041J377P12k580K727r99j232
$$ 40 -1124 1005 -1000 -412 249 -1205 378 -477 -974 840 -1201 176 888 -1692 1035 36 -1196
1731a196K795k123J84K007k667J578M36j885J744q72r7J030j694J174j85j314
$$ -1196 1599 -524 -340 1667 -1000 578 1014 -871 873 1 -96 934 -760 414 229 -1085
1747a085K596k201k81K268k986J497J026k686K500l73j418J838j316N27Q01j534
$$ -1085 1511 -690 -971 1297 -1689 -192 834 -1852 648 275 -1143 695 -621 -94 707 -827
1763h27J699r73k41J460k109J378P78k558K733n56k127K816j759r6J735k312Q55
$$ -827 872 -101 -342 1118 -991 387 1165 -1393 1340 784 -1343 1473 -286 -382 1353 -959 -104
1780a04N18j349J228r73M48P87j921J799l15j593K626j848l22K638k918J331J257
$$ -104 414 -935 293 -680 -232 555 -1366 433 118 -1475 1151 -697 -1019 1619 -1299 32 1289
1797A289k465K019k77j249J880j267N71K32j171J513j341k33J834k533J257J135
$$ 1289 -1176 843 566 -683 1197 -70 501 733 -438 1075 -266 -499 1335 -1198 59 1194
1813A194k887K364j80k147K585j417m65J872j723N98L05p34J109j049O83M97j867
$$ 1194 -1693 671 491 -1656 929 -488 -953 919 -804 -206 99 -635 474 -575 108 605 -1262
1830a262K404m94j953K997j795p08K617k489O14J448k303J336k29r14J271j126
$$ -1262 1142 648 -1305 1692 -103 -811 1806 -683 -69 1379 -924 412 183 -731 540 -586
1846e86P17K03j461J772j409j08K005k485J165J473l116K397J04j900K448j269
$$ -586 131 334 -1127 645 -764 -872 1133 -1352 -187 1286 -1830 567 671 -1229 1219 -50
1862e0l27J540j507Q35L3o56J232j765Q14J070k565K321n63k022K826j448j010
$$ -50 -377 1163 -344 491 524 -132 1100 -665 149 1219 -1346 975 412 -1610 1216 -232 -1242
1879a242K504k166J60J546j931J154k40l22J065j351R64K02j530K428j563m91
$$ -1242 1262 -904 -744 802 -1129 25 -215 -537 528 -823 141 343 -1187 1241 -322 -813
1895h13K424k409Q87J675k747J788J46j544J527q75l04Q15j046Q49n24n42J479
$$ -813 1611 -798 89 1764 -983 805 951 -593 934 59 -245 570 -476 373 -151 -693 786
1912G86j951J002J012k753K206J57k147K788j252j239K523j731K69J070j432J354
$$ 786 -1165 -163 849 -1904 302 459 -1688 1100 -152 -1391 1132 -599 -330 740 -692 662
1928F62o80q1R73j735J757j28j676K303j342j073K647k330K57J911k626J206N70
$$ 662 -18 -99 874 -861 896 768 -908 1395 53 -1020 1627 -703 -446 1465 -1161 45 615
1945F15j589J249p94J43P65j421J366o15p91K149j989P75J498k675J819N51k265
$$ 615 -974 275 -519 -376 389 -1032 334 -281 -1072 1077 -912 -137 1361 -1314 505 1056 -1209
1962a209K373q22j243K062j328L56M80j017R66q96J27J035k230J753L3k140K753
$$ -1209 1164 342 -901 1161 -167 189 669 -348 618 -278 -151 884 -1346 407 440 -1700 1053
1979A053j314j362K920j983j2J649j728Q38M48j027R38n98K19O14j441J956j126
$$ 1053 -261 -1623 1297 -686 -698 951 -777 61 509 -518 420 -178 41 655 -786 1170 44
1996D4p43K222k178L16J995l068J795P95k421J765m00j203J739j245J20N56q74
$$ 44 -699 1523 -655 -339 1656 -1412 383 1178 -1243 522 122 -1081 658 -587 -467 89 -785
2013g85J078j083J85J326k164J776M95k386K675r47j439K954j743l55J894j824
$$ -785 293 -790 -605 721 -1443 333 828 -1558 1117 170 -1269 1685 -58 -413 1481 -343
2029c43O37K08p66R37r80N76L84j707K098j078j127K275j927p9K073k344R34R60
$$ -343 294 502 -264 673 -307 269 653 -1054 1044 -34 -1161 1114 -813 -892 1181 -1163 -229 731
2047G31k078J546J93j226J133o43O20j31p72J659j515L87J349k027J068R34k510
$$ 731 -1347 199 392 -834 299 -344 276 145 -627 1032 -483 -96 1253 -774 294 1228 -1282
2064a282K198k89j724K459j666l66J452j357M42L21p72R72j201Q30M94j686K008
$$ -1282 916 627 -1097 1362 -304 -670 782 -575 -133 188 -584 388 -813 17 511 -1175 833
2081H33p78j300K595j790n07K116k068R11J026j945J469k16p34J249j277R42l48
$$ 833 55 -1245 1350 -440 -947 1169 -899 12 1038 -907 562 346 -388 861 -416 526 178
2098A78q70J724j401k65J798k478J197J154k565J991q6j700J933j068k33J216
$$ 178 -692 1032 -369 -634 1164 -1314 -117 1037 -1528 463 377 -1323 610 -458 -691 525
2114E25j193Q40J8o31J239j541P35Q23j837J980n72j634K756j585o80K066j895
$$ 525 -668 172 190 -441 798 -743 -8 815 -1022 958 386 -1248 1508 -77 -757 1309 -586
2131e86M73J089j597J022l10l39Q54j277O09K08j211J899j308m75K219k377O82
$$ -586 -113 976 -621 401 91 -248 606 -671 -62 146 -1065 834 -474 -949 1270 -1107 -425
2148d25J473k479J972l3j481J676q65k29J188j268J024n03m32J655j929O89Q38
$$ -425 1048 -1431 541 508 -973 703 -162 -391 797 -471 553 50 -382 1273 -656 33 871
2165H71k013J705k18j535K228j080q25J851j785N24R29j474J135n12m05J299j504
$$ 871 -1142 563 345 -1190 1038 -42 -867 984 -801 -277 652 -822 313 -199 -604 695 -809
2182h09J217Q1j432K039j330m42K153k011M96J367k262J552j44j181J618q55k05
$$ -809 408 489 -943 1096 -234 -676 1477 -534 -38 1329 -933 619 475 -706 912 57 -148
2199a48O32j119J099m07r12J735j692M84J053k193J805J09j732K122r26p50J574
$$ -148 484 -635 464 57 -855 880 -812 -328 725 -1468 337 446 -1286 836 -90 -840 734
2216G34j330P39N85j039Q21m60k37J093j674J300J95j603J731q56p41J924j836
$$ 734 -596 143 728 -311 510 50 -187 906 -768 532 727 -876 855 -1 -742 1182 -654
2233f54L22J025j677J326j84q26J327j027K8O06r24J031l88o48J575j386J11J592
$$ -654 -332 693 -984 342 158 -668 659 -368 -340 266 -658 373 -15 -663 912 -474 -363 1229
2251A229k210J351J63j417J928r42n44J434j624Q57K07j144J404j108l5J242j655
$$ 1229 -981 370 533 -884 1044 102 -442 992 -632 225 432 -712 692 -416 -451 791 -864
2268h64J191K14j685J657p98n99J638j331K00J157j560J281j92r90J629j245L22
$$ -864 327 541 -1144 513 -285 -884 754 -577 -377 780 -780 501 309 -681 948 -297 25
2285B5P44j270J073l39p59J691j245q2J233j992J138K05j351J642j020l30J145
$$ 25 769 -501 572 233 -526 1165 -80 -162 1071 -921 217 422 -929 713 -307 -637 508
2302E08j273O61J08q33J374p49n58J552j471Q51M88j711J759n06o88J559j338
$$ 508 -765 -104 4 -829 545 -204 -762 790 -681 170 658 -1053 706 200 -488 1071 -267
2319b67K69P62j430J241k87q01J247r87N2J025j751J134j45q45J398j146j14J462
$$ -267 2 764 -666 575 288 -513 734 -253 -201 824 -927 207 62 -783 615 -531 -645 817
2337H17j729Q76J35j155J871j083l03J365j506R08M57j417J466o61l88J216j302
$$ 817 -912 -36 99 -1056 815 -268 -571 794 -712 196 653 -764 702 41 -347 869 -433
2354d33P38O15j843J640n34q14J361j206L16O39j459J194l33o63J319j209L07
$$ -433 305 920 -923 717 183 -631 730 -476 -160 479 -980 214 -119 -782 537 -672 -365
2371c65J054j550J272j51r75J511j214K50J016j367R21J21j250J584q38l46J171
$$ -365 689 -861 411 260 -715 796 -418 -168 848 -519 402 523 -727 857 19 -327 844
2388H44j387P57L44j391J310n33o98J347j440L87R79j586J527o04o90J527j355
$$ 844 -543 214 558 -833 477 -56 -754 593 -847 -460 519 -1067 460 -144 -834 693 -662
2405f62M66Q98j542J260k30q18J700j365K55R73j493J031J57j312J395r03q2J272
$$ -662 -196 702 -840 420 190 -628 1072 -293 -38 935 -558 473 630 -682 713 -190 -272 1000
2423A000j569P00J10j196J532q03o16J615j396M57M14j051J177n87n86J383j249
$$ 1000 -569 131 241 -955 577 -226 -842 773 -623 -166 248 -803 374 -213 -799 584 -665
2440f65N37P58j468J481l21q32J274r69L37Q03j426R37j63q20J363j106K8O19
$$ -665 -128 630 -838 643 322 -510 764 -205 132 935 -491 446 283 -537 826 -280 -252 367
2458C67q50P74o9r60J090o97j11R92j640J145M28j154J209o49n74J360j102N52
$$ 367 -483 291 222 -738 352 -345 -456 536 -1104 41 469 -685 524 -125 -699 661 -441 111
2476A11M11j012J186o55k88J123j269P81Q7j326J269k66p91J480j220J99P63j252
$$ 111 522 -490 696 41 -247 876 -393 388 475 -851 418 152 -639 841 -379 -180 583 -669
2494f69R57l20p18J096o94l9R71j256P32L5o75J255r70QQ62j126Q11L13j098J414
$$ -669 288 -32 -750 346 -348 -387 584 -672 60 95 -580 675 -295 -287 575 -551 260 573 -525 889
2514H89o90o13J079r38M18L08q19J000n74n98J077j065K94P19j423J182k01p50
$$ 889 199 -414 665 -273 145 453 -366 634 60 -538 539 -526 -232 487 -936 246 45 -705
$$ [...]
8191B37
##END NTUPLES=NMR FID
##END=
