##TITLE=1H_70-2022
 CDCl3
 8 sc, 
 25.08.2022
##JCAMPDX= 6.0         $$ Bruker NMR JCAMP-DX V2.0
##DATA TYPE= NMR SPECTRUM
##DATA CLASS= NTUPLES
##ORIGIN= UXNMR, Bruker Analytische Messtechnik GmbH
##OWNER= root
$$ XWIN-NMR		Version 3.5
$$ Thu Aug 25 10:19:21 2022 Russian Standard Time (UT+4h)  she@DPX200
##.OBSERVE FREQUENCY= 200.1313499994
##.OBSERVE NUCLEUS= ^1H
##.ACQUISITION MODE= SIMULTANEOUS
##.ACQUISITION SCHEME= undefined
##.AVERAGES= 8
##.DIGITISER RES= 18
##SPECTROMETER/DATA SYSTEM= spect
##.PULSE SEQUENCE= zg30
##.SOLVENT NAME= CDCl3
##.SHIFT REFERENCE= (INTERNAL, CDCl3, 0, 15.7777)
##AUDIT TRAIL= $$ (NUMBER, WHEN, WHO, WHERE, WHAT)
$$ ##TITLE= Audit trail, XWIN-NMR		Version 3.5
$$ ##JCAMPDX= 5.01
$$ ##ORIGIN= Bruker BioSpin GmbH
$$ ##OWNER= she
$$ F:/spectra/data/she/nmr/H-F/1/pdata/1/auditp.txt
$$ ##AUDIT TRAIL=  $$ (NUMBER, WHEN, WHO, WHERE, WHAT)
(   1,<2022-08-25 10:17:08.40 +0400>,<she>,<DPX200>,
      <created by zg, POWCHK disabled, PULCHK disabled
       configuration hash MD5:
       00 E9 B6 7A A2 85 ED C7 34 08 36 98 17 FE 4E 26
       data hash MD5: 16K
       65 36 2E 55 6B 7E 56 B6 14 3B A6 84 A1 49 A1 81>)
(   2,<2022-08-25 10:17:16.85 +0400>,<she>,<DPX200>,
      <Start of raw data processing
       efp BC_mod = 2 LB = 0.24 FT_mod = 6 PKNL = 1 PHC0 = -18037.12 PHC1 = 10.20069 SI = 16K 
       data hash MD5: 16K
       95 D6 40 59 90 3C 8D 2A 73 EB 02 DC 3B 20 9E 59>)
(   3,<2022-08-25 10:17:37.79 +0400>,<she>,<DPX200>,
      <pk PHC0 = -84.81348 PHC1 = 7.8 
       data hash MD5: 16K
       AE 17 EC 21 A1 7E 43 D0 89 69 F6 DB 87 95 3D 79>)
(   4,<2022-08-25 10:17:41.71 +0400>,<she>,<DPX200>,
      <abs ABSG = 5 
       data hash MD5: 16K
       3D 2F 3C 55 DF 28 F6 F6 41 E8 43 3F 7E 16 9C D6>)
$$ ##END=
$$ 
$$ hash MD5
$$ 58 8D 55 DC 8D 5D DF 73 00 7B 9F B6 9E 1C 86 A1
##$RELAX= 
##$RELAX= 
##$RELAX= 
##$RELAX= 
##$RELAX= 
##$RELAX= 
$$ Bruker specific parameters
$$ --------------------------
##$DU= <F:/spectra>
##$EXPNO= 1
##$NAME= <H-F>
##$PROCNO= 1
##$TYPE= <nmr>
##$USER= <she>
##$AMP= (0..31)
100 100 100 100 100 100 100 100 100 100 100 100 100 100 100 100 100 100 
100 100 100 100 100 100 100 100 100 100 100 100 100 100 
##$AQSEQ= 0
##$AQ_mod= 1
##$AUNM= <au_zg>
##$AUTOPOS= <>
##$BF1= 200.13
##$BF2= 200.13
##$BF3= 200.13
##$BF4= 200.13
##$BF5= 200.13
##$BF6= 200.13
##$BF7= 200.13
##$BF8= 200.13
##$BYTORDA= 1
##$CFDGTYP= 0
##$CFRGTYP= 5
##$CHEMSTR= <none>
##$CNST= (0..31)
1 1 145 1 1 1 1 1 1 1 1 1 1 1 1 1 1 1 1 1 1 1 1 1 1 1 1 1 1 1 1 1 
##$CPDPRG= <>
##$CPDPRG1= <>
##$CPDPRG2= <>
##$CPDPRG3= <>
##$CPDPRG4= <mlev>
##$CPDPRG5= <mlev>
##$CPDPRG6= <mlev>
##$CPDPRG7= <mlev>
##$CPDPRG8= <mlev>
##$CPDPRGB= <>
##$CPDPRGT= <>
##$D= (0..31)
0 1.2 0 0 0 0 0 0 0 0.06 0 0.03 0 0 0 0 0.0002 0 0 0 0 0 0 0 0 0 0 0 0 
0 0 0 
##$DATE= 1661408227
##$DBL= (0..7)
120 120 120 120 120 120 120 120 
##$DBP= (0..7)
150 150 150 150 150 150 150 150 
##$DBP07= 0
##$DBPNAM0= <>
##$DBPNAM1= <>
##$DBPNAM2= <>
##$DBPNAM3= <>
##$DBPNAM4= <>
$$ [...]
##$SUBNAM3= <"">
##$SUBNAM4= <"">
##$SUBNAM5= <"">
##$SUBNAM6= <"">
##$SUBNAM7= <"">
##$SUBNAM8= <"">
##$SUBNAM9= <"">
##$SW= 18.0517283424941
##$SWIBOX= (0..15)
0 0 2 0 0 0 0 0 0 0 0 0 0 0 0 0 
##$SW_h= 3612.71676300578
##$TD= 16384
##$TD0= 1
##$TE= 0
##$TE2= 300
##$TE3= 300
##$TEG= 300
##$TL= (0..7)
0 120 120 120 120 120 120 120 
##$TP= (0..7)
150 150 150 150 150 150 150 150 
##$TP07= 0
##$TPNAME0= <>
##$TPNAME1= <>
##$TPNAME2= <>
##$TPNAME3= <>
##$TPNAME4= <>
##$TPNAME5= <>
##$TPNAME6= <>
##$TPNAME7= <>
##$TPOAL= (0..7)
0.5 0.5 0.5 0.5 0.5 0.5 0.5 0.5 
##$TPOFFS= (0..7)
0 0 0 0 0 0 0 0 
##$TUNHIN= 0
##$TUNHOUT= 0
##$TUNXOUT= 0
##$USERA1= <user>
##$USERA2= <user>
##$USERA3= <user>
##$USERA4= <user>
##$USERA5= <user>
##$V9= 5
##$VALIST= <valist>
##$VCLIST= <CCCCCCCCCCCCCCC>
##$VD= 0
##$VDLIST= <DDDDDDDDDDDDDDD>
##$VPLIST= <PPPPPPPPPPPPPPP>
##$VTLIST= <TTTTTTTTTTTTTTT>
##$WBST= 1024
##$WBSW= 4
##$XGAIN= (0..3)
0 0 0 0 
##$XL= 0
##$YL= 0
##$YMAX_a= 33820
##$YMIN_a= -38616
##$ZGOPTNS= <>
##$ZL1= 120
##$ZL2= 120
##$ZL3= 120
##$ZL4= 120
##$ABSF1= 15.74799
##$ABSF2= -2.30386
##$ABSG= 5
##$ABSL= 3
##$ALPHA= 0
##$AQORDER= 0
##$ASSFAC= 0
##$ASSFACI= 0
##$ASSFACX= 0
##$ASSWID= 0
##$AUNMP= <proc_1d>
##$AZFE= 0.1
##$AZFW= 0.1
##$BCFW= 0
##$BC_mod= 2
##$BYTORDP= 0
##$COROFFS= 0
##$CY= -3
##$DATMOD= 1
##$DC= 0
##$DFILT= <>
##$DTYPP= 0
##$F1P= 0
##$F2P= 0
##$FCOR= 1
##$FTSIZE= 16384
##$FT_mod= 6
##$GAMMA= 0
##$GB= 0
##$INTBC= 1
##$INTSCL= 1.705223e-09
##$ISEN= 128
##$LB= 0.24
##$LEV0= 0
##$LPBIN= 0
##$MAXI= 10000
##$MC2= 0
##$MEAN= 0
##$ME_mod= 0
##$MI= 1.114404
##$NCOEF= 0
##$NC_proc= -10
##$NLEV= 6
##$NOISF1= 3.799351
##$NOISF2= 2.8
##$NSP= 0
##$NTH_PI= 0
##$NZP= 0
##$OFFSET= 15.77774
##$PC= 1
##$PHC0= -18121.93
##$PHC1= 18.00069
##$PH_mod= 1
##$PKNL= yes
##$PPARMOD= 0
##$PSCAL= 0
##$PSIGN= 0
##$REVERSE= no
##$SF= 200.129998757755
##$SI= 16384
##$SIGF1= 3
##$SIGF2= 2
##$SINO= 5.538805
##$SIOLD= 16384
##$SREGLST= <1H.CDCl3>
##$SSB= 0
##$STSI= 16384
##$STSR= 0
##$SW_p= 3612.71676300578
##$SYMM= 0
##$S_DEV= 0
##$TDeff= 16384
##$TDoff= 0
##$TI= <>
##$TILT= no
##$TM1= 0
##$TM2= 0
##$TOPLEV= 0
##$USERP1= <user>
##$USERP2= <user>
##$USERP3= <user>
##$USERP4= <user>
##$USERP5= <user>
##$WDW= 1
##$XDIM= 16384
##$YMAX_p= 546648310
##$YMIN_p= -1706076
$$ End of Bruker specific parameters
$$ ---------------------------------
##NTUPLES= NMR SPECTRUM
##VAR_NAME=  FREQUENCY,     SPECTRUM/REAL,   SPECTRUM/IMAG
##SYMBOL=    X,             R,               I
##VAR_TYPE=  INDEPENDENT,   DEPENDENT,       DEPENDENT
##VAR_FORM=  AFFN,          ASDF,            ASDF
##VAR_DIM=   16384,         16384,           16384
##UNITS=     HZ,            ARBITRARY UNITS, ARBITRARY UNITS
##FACTOR=    0.220516191357247, 1,           1
##FIRST=     3157.59899150667, 0,            0
##LAST=      -455.117771499107, 0,           0
##MIN=       -455.117771499107, -1706076,    0
##MAX=       3157.59899150667, 546648310,    0
$$ Real data points
##PAGE= N=1
##DATA TABLE= (X++(R..R)), XYDATA
$$ [...]
6504C7795k9592m0281n013K6778k5171m362M5478j3744n8877p57O2583J001O116
6491A954l3961J1550L609J7269k8741k1882P604Q8287j9343m451j4717j6270N5135
6478D6043N701l8866o9732R405K9771K1537J6305N0131J8163j10058K0913N5325
6466E4638j2169O879j32398r689m8528P7036p1030P2221Q1167P6789q1845m8421
6454c5350k6111r7532Q4308M1628o9188J8365O6198p8300j5827l2299K1077R9036
6442b3995O6941m4728K5022n3168M0858p428K7005j4322o0262j4339R3357j13586
6430g8645q7779J08947p3741J57558j9278j6982J3646k6336J1213p8802k2717
6419a12916Q4426L6084k8610k5217O6286l8076m5748L8659K0815k6301p0827N9167
$$ y = [37795, 8203, -32078, -37091, -10313, -35484, -39846, 5632, -8112, -66989, -67746, -5163, -4162, 1954, -32007, -20457, -16848, 421, -28320, -50202, -42598, 45689, 26346, 21895, 7178, -9092, 46043, 51744, 12878, -56854, -47449, -17678, 3859, 20164, 70295, 88458, -21600, -687, 54638, 42469, 49348, -83050, -92739, -141267, -64231, -135261, -63040, 18127, 94916, 13071, -35350, -61461, -158993, -74685, -33057, -102245, -83880, -17682, -95982, -111809, -144108, -123031, -23995, 42946, -1782, 23240, -29928, 10930, 3502, 30507, 16185, -44077, -58416, 34941, -78645, -166424, -57477, -131218, 26340, 7062, -9920, 3726, -22610, -11397, -90199, -112916, -28490, 7594, -21016, -46233, 20053, -18023, -63771, -25112, -4297, -30598, -101425, -42258]
6407d2258L7487M4795m4929K6772J55310j03423r7345L7860J4587n5283L4156
6396G729N3785l1061K6780r9969Q7260j8646o5112p5871n1138K4573L5675J27975
6384B1980n1892p1270l2082N6845M286n6264L119N9590L6119K5444k3901o2314
6372i0340O7900R1605p2899J9731m9178J01233j9965j28831P927P2265m6417n8354
6360a05323M5134O5193k5257l1559L9955Q887P6282Q1376k4630o4466p8069p6305
6348h8782J34502m2646J4255k2538m6832K8951M6930N3211l5746l7634P493o3619
6336e2455K8650M0265p3927l6171m9M1242J9892N308K4797K1117N723m7934j823
6323b5365L7406o426o3292O1171k0869M1026K6173n8163p7416N8391m2861q4865
$$ y = [-42258, -4771, 40024, -4905, 21867, 177177, 73754, -23591, 14269, 28856, -26427, 7729, 61514, 30453, 57233, -42736, 44524, 25878, -39234, -115105, -166243, -141670, -105995, 21980, -29912, -101182, -133264, -76419, -72133, -128397, -125278, -65688, -29569, -4125, -28026, -90340, -22440, 69165, -3734, 15997, -33181, 68052, 48087, -80744, -72817, -552, -46969, -105323, -60189, 5004, -20253, -51812, -11857, -2970, 73312, 154688, 130058, 65592, -12477, -88782, 45720, 3074, 17329, -5209, -52041, -23090, 23840, 77051, 41305, 3671, 11164, -52455, -23805, 16460, -57467, -93638, -93687, -52445, -32553, -27245, -2448, 18669, 24392, -23542, -25365, 12041, 5615, -57677, 3494, -17375, 23651, 49824, -8339, -85755, -27364, -70225, -155090]
6311a55090N3537M1544Q0054l3364m7720n7681K1478J3580R3025K9830K6289r3592
6299b8110J128J09787j07997M2509o0522N9961J6145Q1936L0523p1681l5094o3446
6287b4861p3629J6733O4541N729j361l3249q872o0741M0158L9424Q0710p9868
6275c5286p412P907O8093J1170r2366j1981O6841J3380p4435M9627m0031R338
6263c5155J6936M4965r973k0550m772j3962O6531k3644k1348N2106r229j7725
6251B4180k3054k6555J03962l8595j29526m1153m2705O5184J17374r449j2751
6240a3088m3267P4093j1898p8578J0509j1217K6128l4047L089J30789n4210j19115
6228a20812k6238J01129Q0343O5256j37050K8570m464k4831K4815j5013P1911
$$ y = [-155090, -101553, -60009, 20045, -13319, -61039, -118720, -97242, -83662, 9363, 39193, 65482, -28110, -26982, 82805, -25192, 17317, -43205, 16756, 32901, 114837, 145360, 73679, 38585, -24861, -98490, -81757, -17216, -11487, -12848, -46097, -54969, -115710, -75552, -36128, 44582, -35286, -42698, -34791, 33302, 44472, -47894, -59875, 6966, 20346, -54089, -4462, -44493, -35155, -18219, 26746, 16773, -3777, -8549, -22511, 44020, 20376, -972, 51134, 41905, 24180, 1126, -25429, 78533, 39938, -89588, -130741, -173446, -108262, 9112, -337, -13088, -56355, 17738, 5840, -72738, -62229, -73446, -47318, -81365, -78276, 52513, -1697, -120812, -147050, -45921, 34422, 99678, -37372, -8802, -13266, -38097, -13282, -28295, 43616]
6217D3616m1177n7449j3263O1365J4035N4916m447l353N946q1009j2524j3664
6205d7008J4092J3445K192R0386O594l4034o8571l9703p2766k5596P9176N9307
6193b2486M0739j04212M1099N0226r644L5710j6902o7041P2853O3267n3456n4584
6181b4431J8061J30595M0190j13608m2390p6833m0732M9639J08008q641o4507
6170b4649J17178l5971q7277q9908J41554p7758M4358L7382j6452P1232o0277
6159A9412n8899k8856j1512p326N3759J06666J90062k36696m9881p749o7554J41249
6147D2675K7090o3360j91553J23585L8255j7088N3500P70l6261P3300l0567n8399
6135c8053j9897Q2552R6253l7468K2305K2175r2447n8017r101q291m938K5059
$$ y = [43616, 2439, -55010, -68273, -6908, 7127, 62043, 57596, 54243, 60189, -20820, -33344, -47008, -32916, -19471, -17279, 73107, 79701, 45667, -22904, -62607, -135373, -160969, -81793, -22486, 18253, -85959, -44860, 5366, -4278, 31432, 14530, -52511, 20342, 83609, 30153, -24431, -6370, 124225, 164415, 50807, 8417, -68416, -109148, -59509, 48499, 39858, -24649, 92529, 56558, -30719, -120627, 20927, -56831, -12473, 24909, 8457, 79689, 19412, -39487, -68343, -79855, -87181, -33422, 73244, 263306, 26610, -23271, -31020, -98574, 42675, 69765, 6405, -185148, -61563, -23308, -40396, 13104, 13874, -22387, 50913, 20346, -38053, -57950, 24602, 120855, 83387, 105692, 127867, 35420, -22597, -31698, -39989, -44927, -19868]
6123a9868K5879K3244Q2538Q5578j80854n8829M2387r566L1037R8432k4000j25085
6111b9107N651l1877J1075k5192P421K5403j4694L0157L5460r6546l1721l7558
6099a51528P4805Q6373j972p6212l9764Q9217J64268M5182n6222l3157J6273O9726
6087A86989N824j22786k8069n8996L0700K6848l5627j59146k3205Q8754l3694
6076a22408J41509L1582l0379j05636O7468l9709q4028o4569k1669R1547M8190
6065h8102j1161M914R7826m7691O0651N6364j08280l1374R426k6782P3303L0250
6053A9344l158N531L2776L2771J909n8274p845J5997l9933j18141N4843N8144
6041f036N8812n98r0561M4639k171j3210O3152j16348n3160Q4955M6227o7024
$$ y = [-19868, 6011, 29255, 111793, 197371, 16517, -42312, 75, -9491, 21546, 119978, 95978, -29107, -23456, -55333, -44258, -69450, -62029, -36626, -51320, -21163, 14297, -82249, -113970, -151528, -76723, 9650, 7678, -68534, -108298, -19081, 145187, 190369, 134147, 100990, 117263, 186989, 192813, 70027, 41958, -17038, 13662, 40510, 4883, -154263, -177468, -88714, -122408, 19101, 50683, 20304, -85332, -17864, -57573, -141601, -206170, -227839, -136292, -88102, -99263, -94349, 3477, -44214, 16437, 72801, -35479, -66853, -57427, -84209, -10906, 19344, 16186, 21717, 54493, 87264, 89173, 30899, 23054, 39051, -882, -119023, -64180, -6036, 52776, 52178, -38383, 6256, 4085, -9125, 54027, -62321, -115481, -30526, 15701, -51323]
6029e1323m8200O6243P2507K1623l9305J3071r5105r116N5800o41q39j3719p2757
6016a01761K1544N3694l2423j5803n0837K0714N7605P0933j9843p5937O3121m3950
6004e2943K6027M2535n815O1601j12889L4332N9943p4799K9622P3295q3321Q102
5992E690M4664r6810Q6506L6966k1441L0616o0966j09573N5865P6780l3504p517
5980G276l0846Q846l2776L1615p21n1274L230O4595k6836l4351J0739M2310n5571
5967f3764k8747J33564M458l3625n3366R7352L3341Q636l2214m0099K0338j01432
5955e5558k1257O7958j3942Q9897j04379r5543R5504M7685K2328l59o7240k5462
5943f0368J4358J6037j0280O3904M0946j24502j0948o3982N4223N1284p250k6838
$$ y = [-51323, -99523, -33280, 39227, 60850, 21545, 34616, -60489, -69605, -13805, -14446, -15285, -29004, -101761, -80217, -26523, -58946, -74749, -125586, -104872, -47267, 23666, 3823, -72114, -8993, -52943, -26916, 15619, 9804, 71405, -41484, -7152, 52791, -22008, 7614, 80909, -2412, 5690, 50354, -46456, 40050, 77016, 55575, 86191, 25225, -84348, -28483, 48297, 14793, 7276, -23570, -14724, -47500, -15885, -16606, -67880, -64650, -55, -26891, -61242, -50503, -8193, -63764, -92511, 41053, 45511, 11886, -41480, 55872, 89213, 97849, 65635, 25536, 45874, -55558, -76815, -8857, -22799, 67098, -37281, -132824, -37320, 10365, 32693, 32334, -34906, -60368, -46010, -29973, -40253, 23651, 64597, -59905, -70853, -134835, -80612, -29328, -36578, -63416]
5931f3416j5487J02571k8240J015m3029M385M2467p047n2859l0903J3233k4603
5919a01913O711J6144j7856J5912M5640P3207j22531o6749k9009J14514N5232
5908a0698K4903q8720L2947P4190j07820Q3394P6931L449l3133j9934p656J2376
5896D0229r1990j4750L9006j141k7501m4274L0824J2789p521J4469N311k2039
5884f6588k2428m6833j258L3329l3362k9205Q405N6291p4676K9177R1964J3475
5872d1709r7872k9369J04909K3583m2455j399R150k8695N1324M8773n5422R9730
5860D0548k2781o3620m1638q999r9664P1264J38738M9682K535n3451j20224k2160
5848a29770R3792P8474j30939l2541P9474Q7314K5973l364L4642L7926K6081j36511
$$ y = [-63416, -78903, 23668, -4572, -3557, -46586, -42201, 266, -6781, -59640, -90543, -77310, -101913, -95202, -79058, -96914, -81002, -35362, 37845, -84686, -151435, -180444, -65930, -10698, 14205, -74515, -41568, 32622, -75198, 8196, 85127, 88576, 55443, 35509, 27853, 40229, -51761, -66511, -27505, -28646, -56147, -100421, -69597, -56808, -64329, -49860, -44549, -66588, -89016, -135849, -137107, -103778, -137140, -166345, -157940, -101649, -176325, -147148, -55184, -41709, -139581, -168950, -64041, -40458, -82913, -84312, -75162, -103857, -52533, -3760, -59182, 40548, 17767, -45853, -87491, -96490, -196154, -124890, 13848, 63530, 66065, 12614, -107610, -129770, -35978, 42496, -88443, -120984, -41510, 45804, 71777, 68413, 103055, 140981, 167062, 30551]
5836C0551K3019n735O6033p1036M7391Q2011j30722j41191L4819P0559l8895m0176
5824g3372M2806N7478N122J8379O9464p9024j31896M479o293M7762N2170O4492
5812G1567j42971p657L7150k5001K8364P6733j40797n8134J19149Q903O1224j39035
5800a10505k4841K648P4678n5428k5115P3K0215J09799K5789J0931k9315l9473
5788d0544k3229P0200m8356P3801M2378m5950K1015k9653k7374l9709M5402o1815
5776f3834L2305N5380l6584k8604m4916O97N435O3489K2606K5600j12048O0200
5764b0274J48051j38513M02N0553r3996o952K8736k2072K9045R9545n0474n0558
5752b6507M7703o9900r173N3060l4835l2210N8370l2914R8668q8296p6229O3636
$$ y = [30551, 53570, 47835, 113868, 42832, 90223, 172234, 41512, -99679, -64860, 5699, -33196, -73372, -30566, 26912, 32034, 50413, 119877, 40853, -91043, -86564, -92857, -45095, 7075, 71567, -71404, -79061, -41911, -66912, -38548, 38185, -102612, -160746, -41597, -32694, 28530, -110505, -135346, -132698, -58020, -113448, -138563, -138490, -118275, -8476, 17313, 28244, -1071, -40544, -63773, 6427, -41929, 31872, 74250, 28300, 49315, 19662, -7712, -47421, -2019, -63834, -31529, 23851, -12733, -41337, -86253, -85556, -80121, -16632, 5974, 31574, -80474, -20274, 127777, -10736, -10334, 40219, -53777, -60729, -31993, -54065, -25020, 74525, 24051, -26507, 21196, -48704, -57877, -4817, -39652, -71862, -13492, -46406, 52262, -36034, -112263, -48627]
5740d8627K1213N8881J0137L3640n9396K4279l4471l957O110L0660q468P3613
5728A03614m4161q3123j5653m7666L5463M1391R290l4656M9421m8874L635j6237
5716d7556l9451O9258N127k6327O8429J5395k599q422M6809m0074k3530O662L2895
5703E6616r2126K12706r6471J00043j99688l13059J97250k9998J84067L9198K8999
5692H7537q1196j1977J7769J7653j04214M2514N9686J0462j04303j6476k2479
5681a05024N0085N4450l7113L1426k6775M9572j02389J23792K6663l0208J16076
5670A50555k5935l8343l6892P271k4527m1704o4748J20712q4366k6203N4054J7552
5658G426k6531m5935O5907L440O4989M1093q7588m8408N468j1288J2809N0393
$$ y = [-48627, -27414, 31467, 41604, 75244, 15848, 40127, 5656, 1699, 7809, 38469, 30001, 103614, 59453, -23670, -39323, -86989, -51526, -10135, -845, -35501, 13920, -34954, -31319, -47556, -87007, -17749, -12622, -38949, 29480, 44875, 42276, 33854, 80663, 40589, 17059, 23721, 56616, -35510, 177196, 80725, 180768, -18920, -331979, -134729, -164727, 19340, 58538, 87537, 6341, -5636, 12133, 29786, -74428, -31914, 27772, 38234, -66069, -82545, -105024, -54939, -489, -37602, -6176, -32951, 16621, -85768, 38024, 64687, 34479, 150555, 124620, 86277, 49385, 56656, 32129, -9575, -74323, 46389, -37977, -64180, -10126, 7426, -19105, -65040, 867, 4307, 69296, 110389, 22801, -25607, -20139, -31427, -18618, 31775]
5646C1775n7902k7238M6441k4914O1651q7193n3451P9264P5167q7448j5963j5115
5634g4926j4745P3391L1722k7441k4575l7456P3257M4261k05946j1657P1627l1228
5622a33716J04278R7808n9194K6858p0573k5887M192l4593K9899K5708L7357p7569
5610g5432q1026k2507J09577k6117M8274N457R953l0384k222J05181n7814j3508
5598c0568k2338M687K0586N6052k8193l7891J03323p1935j155O9699m4212n037
5586A3018j2204L7952q798o2322O6249P884J0920q0115k7041k309l9746j2177
5574a08689R8277n3757L8787J16836r1407k2186o3571P4286m1305n234Q627K5337
5562b3999o989K2674l0145n3999O6360P1783r8514L4692L2740j09166J15744J1094
$$ y = [31775, -26127, -53365, -6924, -31838, 29813, -57380, -110831, -31567, 43600, -43848, -59811, -74926, -89671, -16280, 15442, -11999, -36574, -74030, -773, 43488, -162458, -174115, -102488, -133716, -29438, 68370, 9176, 36034, -34539, -60426, -56234, -90827, -60928, -35220, 2137, -75432, -156458, -178965, -69388, -95505, -47231, -41774, -31821, -62205, -64427, 40754, -17060, -30568, -52906, -48219, -27633, 28419, 226, -37665, 65658, -6277, -7432, 62267, 18055, 13018, 814, 38766, 29968, -32354, 33895, 41779, 52699, -27416, -54457, -56766, -96512, -108689, -10412, -64169, -25382, 91454, 47, -22139, -85710, -11424, -52729, -57963, -49336, -23999, -30988, -8314, -38459, -92458, -26098, 45685, -52829, -18137, 14603, -94563, 21181, 32275]
5550C2275j2014j288k653l1366J3507J9387j5734m3093k4668J01139k6570m0831
5538c1909L0852K1239j15863K4667O3186l0264k6784J8842P732K9378p4747L0209
5526e3462L4954J04717N932q9892k0855J3556l8296P1365K0527q461n28L4218
5514G3775L7968p1841J0178L2829R414j15516K25O3006o671R3513J4685j8061
5502A23504j08001P027P2556m6780j3449j24578J6094j7043J4567m376L5349R6669
5490E1539l8759o0027N0019o1085K5736j0124n4843L1473J89150k3985n8066l6268
5478D760m9888L932k3044m3785J7842M4743O7352j4408n2753J1360M2225j00664
5466i2328L854M0168l2292n8149L1638P9142J05049L7955p4070j13585N6384P5621
$$ y = [32275, 20261, 18973, 16320, -15046, -1539, 17848, 2114, -40979, -65647, 35492, 8922, -31909, -1057, 20182, -95681, -71014, -7828, -38092, -64876, -46034, -38302, -8924, -83671, -53462, -18508, 86209, 92141, 2249, -18606, -5050, -43346, 28019, 48546, 40085, 39557, 73775, 111743, 39902, 50080, 82909, 92323, -23193, -22968, 40038, 33367, 126880, 141565, 123504, 15503, 22530, 95086, 48306, 34857, -89721, -73627, -90670, -76103, -80479, -45130, 51539, 12780, -47247, 2772, -58313, -32577, -42701, -97544, -66071, 123079, 99094, 41028, 4760, -45128, -41196, -64240, -108025, -90183, -45440, 21912, 7504, -45249, -33889, 8336, -92328, -88474, -48306, -80598, -138747, -107109, -27967, 77082, 115037, 40967, -72618, -16234, 59387]
5454E9387n6842p4323J4752O0412n5613O126N445n5422L8605O9988Q1751n167
5442H9099j78583J6949M7091O7447k3182m2917Q2782N9828q9632n352j17493N6107
5430c7856Q0956p9292k7534N4332N6756L4276L5447q4320k4074r5387n1597K9023
5418a09270K3824J7568P6970o5767k1119o0765N8405N9349j9970K3846O1645o5985
5406b1269n0350R3424R998k7177k5602m2508N4634Q1598j0116j3945l7532M2444
5394E3599L819K7870j12928L3997j36m8348M0844N0530o4498j3196L6518j4177
5382f106q0455M2183o275J3576k9168R2191j0619j5571Q1064Q0447o8689L2870
5370A25448J7101o3150N2781q0508q4532N2348o1277J7331J5114l0533J02343
$$ y = [59387, 2545, -71778, -57026, 3386, -52227, -46101, -40656, -96078, -57473, 12515, 94266, 89099, -89484, -72535, -25444, 42003, 18821, -24096, 58686, 118514, 28882, 23530, -93963, -37856, 43100, -36192, -63726, -9394, 47362, 81638, 117085, 32765, 8691, -86696, -138293, -109270, -85446, -67878, 9092, -56675, -77794, -138559, -80154, -20805, -40775, -16929, 44716, -21269, -71619, 21805, 31803, 4626, -20976, -63484, -8850, 72748, 62632, 48687, 11155, 53599, 57418, 85288, -27640, 6357, 6221, -42127, -1283, 49247, -15251, -28447, 8071, -6106, -86561, -44378, -50653, -37077, -66245, 25946, 15327, -244, 80820, 161267, 92578, 125448, 142549, 79399, 132180, 51672, -32860, 19488, -41789, -24458, -9344, -39877, 62466]
5359F2466K2873N033K4637p319j02051k4485j2131k5524K5782O754m8885K5762
5347d7088j43M8888R0792k6781M0566k6575M8911j7348o5083k8882M7615N30k0926
5334D4476M3395j3225O1480r0260m7710M5001o6730p1616R9676O7264j6441j6537
5322C8773N5077K2992l7608K3892l7034n0604M6118n3828J04601p401m546o9573
5310C0859l8261J3505J00470l4925j6020O9387O428p6771m0217m9373P4407P2097
5298A11586j32625l5969J70935K6763p0323P3128K2988j52424k4806k100n5496
5287f8343m5365J5632P2800j9112o9690j665J28507P3925K1493L9212n1546j74741
5275g8893O3122j6139l1698J03903q6655P6912l195R6472m1979q0912L031k1487
$$ y = [62466, 85339, 90372, 115009, 107690, 5639, -18846, -30977, -56501, -30719, -23965, -72850, -47088, -47231, 1657, 92449, 65668, 106234, 79659, 128570, 111222, 46139, 17257, 64872, 65402, 44476, 87871, 74646, 136126, 45866, -1844, 43157, -23573, -95189, 4487, 71751, 55310, 38773, 93850, 116842, 79234, 103126, 66092, 15488, 61606, 7778, 112379, 104978, 100432, 30859, -7402, 6103, 106573, 71648, 55628, 125015, 131443, 54672, 14455, -34918, 39489, 111586, -21039, -57008, 113927, 140690, 70367, 143495, 166483, 14059, -10747, -12847, -68343, -113708, -98076, -25276, -44388, -114078, -115743, 12764, 86689, 108182, 147394, 95848, -78893, -15771, -31910, -63608, 40295, -46360, 30552, 27357, 123829, 81850, 938, 3969, -17518]
5263a7518Q109p3247k1879l4558J02393N2937K373l1082J0417m659q3621O0692
5251b9643O5572j2655j31296j6557Q6069o1070Q7528L326R8201M2841j4363L8640
5239A56593r2902q1989N8310J01908M3439l8024J2937j8045n9236l9290m9785
5228f084l6861N0181N810O3621n3513K6309K1798q5399k6290N3393L6396Q1346
5216A30707j0509l1349Q33M4585L9325j48860j2040O0591m7642O7617k7328p841
5204E8089J05502j04477J3233o4334L4949K9265o211p9221l3066P8187K1526P6028
5192A29470O5794n822o3321j02497o0730J0070n27R9883j17859J03291m5816J8075
5180C0011j3486m1868k1962n2017O4775R0057J60726n3403j86329p9759J1187
$$ y = [-17518, -9409, -82656, -104535, -139093, -36700, 16237, 18610, -12472, -2055, -6714, -90335, -29643, 35929, 23274, -108022, -124579, -38510, -99580, -12052, -8726, 89475, 132316, 117953, 156593, 63691, -18298, 40012, 141920, 185359, 147335, 160272, 142227, 82991, 43701, -6084, -42945, 7236, 13046, 76667, 23154, 49463, 71261, -14138, -40428, 12965, 49361, 130707, 120198, 88849, 89682, 134267, 173592, 24732, 12692, 73283, 25641, 93258, 65930, 58089, 163591, 59114, 72347, 8013, 42962, 72227, 66016, -13205, -46271, 31916, 53442, 129470, 195264, 189442, 126121, 23624, -37106, -27036, -27563, 72320, -45539, 57752, 11936, 30011, 16525, -25343, -47305, -99322, -34547, 55510, 216236, 162833, -23496, -103255, -92068]
5169i2068P7440K0190N3311j4751N88K0435n5909K928k8833J2272J06819m5102
5157E7320m885K6858K8462K4848o2725m6476L5876O3340j01744J00060j18764
5146B170o729J7921J863L4257L4879m7116p5321l2130J2258M2161K9025J4354
5134B7592p1353k6383R9129K3276J5751j2844J9631o7911j55595q0043J56582
5123g2168J14971Q9328r6363o6334K2218N7472l9767j8666n6783J6376J16091
5112F6375o6626J7935k5243R8297l0033k6780N0358M2677q6782r6516N3021m0307
5100d3624L6591L9520n9353L5671m3426M0343O6974k0229o7355R7655P1475j2946
5088A41296n6771q2414J8494p449N2096j2898Q9765p8717j04853k8814P3746J8148
$$ y = [-92068, -14628, 5562, 58873, 44122, 44710, 65145, 9236, 12164, -16669, -4397, 102422, 57320, 52435, 79293, 107755, 132603, 69878, 23402, 59278, 122618, 20874, 120934, 2170, -4559, 13362, 15225, 49482, 84361, 37245, -38076, -70206, -57948, -15787, 13238, 27592, -43761, -70144, 28985, 52261, 68012, 55168, 74799, 6888, -148707, -228750, -72168, 42803, 132131, 35768, -30566, -8348, 49124, 9357, -9309, -66092, -49716, 66375, -251, 17684, -7559, 90738, 60705, 33925, 84283, 126960, 40178, -56338, -3317, -43624, -7033, 32487, -26866, 8805, -34621, 5722, 72696, 52467, -14888, 82767, 154242, 141296, 84525, 2111, 20605, 13156, 65252, 52354, 142119, 63402, -41451, -70265, 3481, 21629]
5076B1629J1805m0920l9032N4545L8574j3301o5931m6579k3875R6663J4715P1563
5064G9856K4354p2956n2393m4482q1676O7130J06120P534j2763j5083K1808q397
5052A9052l3899l8656O7540N7389K3912k2464p1248J12672j14375r7093K0491
5041g6679L2156p5368M9338j0489L580J55646l0200o5352P5706L5333l1271o6492
5029d092M2407L0205M404J7676j13797l2182J1005M6994R766k4740P6457j08998
5017d4895j8509K1180J0806q2652j3942K6092J10002L7619M4752l6279n9296J6490
5005A1368L4383J7098j34203J17276q7868r2176K4263j7407P7010l6379O988J17731
4993C8084k3531p1574m8684P7428L1656p88P7258K3647M0941j28891j12223J27775
$$ y = [21629, 33434, -7486, -46518, 8027, 46601, 33300, -32631, -79210, -103085, -6422, 8293, 79856, 104210, 31254, -21139, -65621, -147297, -80167, 25953, 33487, 20724, 5641, 27449, 19052, -14847, -53503, 14037, 71426, 95338, 72874, 1626, 114298, -77, -97170, -76679, -44523, -119891, -70553, -81042, -77462, 78184, 47984, -17368, 58338, 93671, 62400, -4092, 38315, 68520, 72924, 90600, -23197, -55379, -44374, 2620, 12386, -12354, 64103, -44895, -63404, -42224, -31418, -114070, -128012, -101920, 8082, 45701, 90453, 54174, -5122, 11368, 45751, 62849, -71354, 45922, -41946, -134122, -109859, -127266, -50256, -86635, -79647, 38084, 14553, -57021, -105705, -28277, 3379, 2591, 79849, 103496, 144437, 15546, -96677, 31098]
4981C1098Q055M4390j40054J6529O7741J9458M6873K6686l7134r9959n405M6303
4969B4581M429L9272K956k4254j1224K9913n1619m2974J9510K7914k0179M5605
4957D3930M5728j5596R018j65218M6281J00854O4282k7413k01520K6882P5214
4946B442O5867o7967q3273k8394K6345K0436J22522n6800j5669R039r0265R7754
4934B037l0966R8118j7646j4377L3018l9225K0428K6765m2822j9575k2732n6394
4922f3371R6631L7497l2337O7278m1153l900J4294k3070p4905k2205P9011j0151
4910B3619j33147L5821P6790L4091j05020M0610P1601L4183M5782k5898p8218
4899B0214o7074P4789k0964R4506l6377q7610o863m2830Q7426M5678N7599l3352
$$ y = [31098, 39153, 83543, -56511, -39982, 27759, 47217, 94090, 120776, 83642, -16317, -21722, 24581, 29010, 68282, 71238, 46984, 35760, 65673, 14054, -28920, -9410, 18504, -1675, 43930, 89658, 74062, 83080, -82138, -35857, 64997, 129279, 101866, -99654, -72772, 2442, 68309, 342, -82931, -111325, -84980, -64544, 57978, 1178, -14491, -5452, -95717, 2037, -28929, 69189, 51543, 37166, 70184, 30959, 51387, 78152, 35330, 15755, -6977, -63371, 33260, 70757, 38420, 105698, 64545, 60645, 74939, 51869, -23036, -45241, 33770, 23619, -109528, -73707, 3083, 37174, -67846, -27236, 44365, 78548, 124330, 98432, 20214, -46860, 27929, 6965, 101471, 65094, -22516, -29379, -72209, 15217, 60895, 118494, 85142]
4887H5142o3833m2696l1807P4762n2247j51O3645J6477o8567m694O0176j1193
4875B5014r4451M2775k1984n4175J60258O0720o6606j6538J7102p3171L2984J07015
4863A18943o8636q4502K4749J8644m0850R6716Q931K673p3332R4514j9788j14961
4851c6899J19377L1755n1504l774N3745r3216l9081q114k5199l5729J00909N3020
4839F5290l6736K3691l6880Q5569j6436m4399M528J5294M5365K0833P088m2718
4827I0489r7111o694R8336L134o1035q3762L9435L3106J04604Oj21144l3801K7927
4814f510M039j907J2293k8958j0369P8301J2845l918j9180m1848k9662J5010N5238
4801C5374L2287k6530P3386o6700k0154q475j9092m944M704p7019Q2203J15967
$$ y = [85142, 21309, -21387, -53194, 21568, -30679, -30830, 32815, 49292, -19275, -23969, 36207, 25014, -69437, -26662, -48646, -102821, 57437, 118157, 51551, 35013, 52115, -21056, 11928, 118943, 50307, -34195, -9446, 9198, -31652, 65064, 73995, 76668, 3336, 97850, 78062, -36899, 82478, 114233, 62729, 58955, 112700, 19484, -19597, -27711, -52910, -88639, 12270, 65290, 28554, 52245, 15365, 100934, 84498, 40099, 44627, 59921, 105286, 126119, 133207, 90489, -6622, -13316, 85020, 88154, 27119, -56643, -17208, 15898, 120502, 120508, -636, -34437, -6510, -2471, -4378, 7915, -21043, -31412, 46889, 59734, 55816, 36636, -5212, -34874, -19864, 35374, 67661, 41131, 114517, 47817, 27663, 19188, 96, -4848, -144, -77163, 5040, 121007]
4789A21007k2872j09359o0924l159P4693J075q1817P5604J8671M3686J7255j21329
4777d7469O2171L6289l8558N1446j6309m8709l7667N6261n9674Q640Q9117K9172
4765H4710r6633L8260K0071L7391r803k6829O262j33l8846N2933L5695j2771L5745
4752A26052o9336j48842j0747P8454q421J8047l1100p6319N6942P6509J38759
4741A49998j7219j2486p1599m850n3194j15970O8027r4568J7843J8915J6917R8274
4729H8j5230L9917o0009O2112K2234O1181m7877j06775O1134m0443j2758R6125
4717E9699M0657m9632o084o6362O9379Q66l9743P3413j560M441p2825N590J362
4704A9201p8869L0798n9412M2564R1662K9531q954o7380N7363Q075o8672K1813
$$ y = [121007, 98135, -11224, -72148, -75307, -614, 461, -81356, -5752, 12919, 56605, 73860, -47469, 14702, 50991, 12433, 63879, 47570, -1139, -38806, 17455, -42219, -33579, 55538, 84710, -11923, 26337, 46408, 83799, 73996, 47167, 53429, 53296, 14450, 67383, 103078, 90307, 126052, 56716, -92126, -102873, -24419, -32840, -14793, -45893, -122212, -65270, 11239, 149998, 132779, 120293, 48694, 43844, -9350, -125320, -57293, -151861, -134018, -115103, -98186, 88, -15142, 24775, -35234, 26878, 49112, 110293, 62416, -44359, 16775, -23668, -36426, 59699, 100356, 50724, 44640, -21722, 47657, 48523, 8780, 82193, 80633, 85074, 12249, 17839, 19201, -59668, -28870, -88282, -45718, 45944, 75475, 66521, -859, 56504, 64579, -4093, 17720]
4692A7720R1626L4476k668l0223j03808J14829o832n7119L1638O0533l2814p5238
4680D2120n9732k5301O5862P724r5495o5869J72418J4991j14663N6303O0062m6088
4668A2332L1154M5914l6614j08785m3158J69185K3968k53O8948n0965j877J02102
4656B11951m8195n5407p460L7005j8690l0683k3508m1124L0601P922J8305K5030
4644A05747k9494M5688l7057k07583N0829J42301l3369K2276R4197j14776m3850
4633e091R3674J107m7585Q1021m1858j91R0217p5363k4674n2684N6657k5338M2265
4620I2157p233J2220l1531p087j6103p3037o7001L890M8880o0174O5653M9389
4608A0023O2318q5378Q7762K2857j11618K8956j7821k3729K4J06521O3575J1854
$$ y = [17720, 109346, 143822, 141154, 110931, 7123, 121952, 115120, 58001, 89639, 150172, 117358, 42120, -17612, -42913, 22949, 30673, -64822, -130691, 41727, 56718, -57945, -1642, 58420, 12332, 43486, 89400, 52786, -55999, -99157, 70028, 93996, 93743, 162691, 111726, 109849, 211951, 163756, 108349, 100889, 137894, 119204, 88521, 65013, 23889, 54490, 62412, 80717, 105747, 76253, 121941, 84884, -122699, -71870, 70431, 37062, 59338, 153535, 38759, -5091, 88583, 89690, 42105, 123126, 81268, 81077, 171294, 95931, 71257, 18573, 75230, 49892, 92157, 84924, 97144, 65613, 58526, 42423, -30614, -97615, -93725, -44845, -105019, -39366, 10023, 72341, -13037, 74725, 97582, -14036, 14920, -2901, -26630, -26606, 79915, 143490, 155344]
4596A55344k2722J9928L7534N1715j68954p4010J09756k2397n1039J4087K7952
4585G7194p5107O7412J9709m3443j5664j7848L9249O461O5481P3943j3723L8373
4573B22037j41027p0728J2141j11231l2850p390n5996R4635J99664J2046l6141
4562H5160J04157p5283p6553R4922N6344q8922N826j1009l472K164m6734l0841
4550A5759J3159N230K7445N2488l384j3661r8729M9585R473k710k048l1155k1100
4537C52k1391P2775P6723n4216R1109O7168Q583q2090j34632N0153P643j4760
4525F7417K1224l3441L7669n7858l2599R8534k0684J09828p5139j15461O5959
4514F5449J8587N349R0140p6054l0874L2038m9890o7388J0240P4661K8650M3069
$$ y = [155344, 132622, 152550, 190084, 241799, 72845, -1165, 108591, 86194, 35155, 49242, 77194, 2087, 69499, 89208, 45765, 30101, 12253, 51502, 57963, 123444, 197387, 183664, 222037, 81010, 10282, 22423, -88808, -121658, -129048, -185044, -90409, 109255, 121301, 85160, 189317, 114034, 37481, 132403, 188747, 99825, 105651, 94642, 91170, 93334, 46600, 15759, 28918, 34148, 61593, 114081, 110697, 97036, -1693, 47892, 57365, 54655, 52607, 21452, 352, -21039, 51736, 128459, 74243, 165352, 232520, 241103, 159013, 24381, 74534, 82177, 67417, 88641, 55200, 92869, 35011, 2412, 100946, 80262, 190090, 114951, -510, 65449, 84036, 89385, 179525, 103471, 72597, 104635, 54745, -12643, -2403, 72258, 100908, 143977]
4502A43977l3722l7832n0815l077M7886o8036Q6025O0535n5556p0265p4363J04719
4490D9476p8846m9578R7683J16288k5792o9204j9341J06093O8014M5559m2575
4479A97777r1854Q2097l9502R1440M3358k1277L2520J532n8791K6236j29946M2262
4467A75852O5745J8531j6920j25698o507L0364K5532O1537n5998o9231J5215O711
4455A25133P9241P2624O5908n3259j78712L6645M001L3824L3156M7298n1734m2866
4443A71259Q7768n7987n397m1768O1770l5968K510j2862K3655J242P2627q4634
4431A82215K1607O2990N7430o585O8789l4204j0368K9010n0837L798o389Q8100
4419D05556M1357o6036j1785k5623n0944J05876Q9808R622J8410r7415J5040O684
$$ y = [143977, 110255, 72423, 21608, 18531, 66417, -1619, 84406, 144941, 89385, 19120, -55243, 49476, -29370, -78948, 18735, 135023, 109231, 40027, 20686, 126779, 194793, 240352, 197777, 105923, 188020, 148518, 239958, 283316, 262039, 294559, 296091, 237300, 263536, 133590, 175852, 241597, 260128, 243208, 117510, 111003, 141367, 166899, 228436, 172438, 103207, 118422, 125133, 204374, 276998, 342906, 289647, 110935, 147580, 151581, 185405, 218561, 265859, 214125, 171259, 259027, 201040, 195643, 153875, 215645, 179677, 182187, 169325, 192980, 194222, 266849, 182215, 203822, 266812, 324242, 317657, 386446, 352242, 341874, 370884, 320047, 323845, 317456, 405556, 446913, 380877, 369092, 343469, 292525, 398401, 488209, 497831, 516241, 418826, 433866, 440550]
4407D40550L8246r4240R5834J78555m6583n054j03467O5076J1739m9605q441M0138
4395E62748M4237N6189K4969Q6390N7889J5523r0625q0072P6679R7489R2934K089
4383I46439N0509J30066m6893L5790P9180j5690Q6466J1363R1219J16905M3261
4372A528615J39318J74091J05028J57772J02752R4291L15483J75904J07974K18828
4362C120056J40962J93685K01405J00240J08273L3499O6488Q1353Q4067l5730
4352D094298r5545j50283j25980j11117k3817j65396n0421q1945m3913q5906j84920
4341B975055k09587j02564N4957k43067k43722j27679k29473j24034j28942j28313
4331A492631n6790n3354o6454p1040m4491l0948j18368L0748o4272Q411o2125
$$ y = [440550, 478796, 384556, 480390, 658945, 612362, 607308, 503841, 568917, 580656, 531051, 522610, 562748, 606985, 663174, 688143, 774533, 832422, 847945, 757320, 677248, 753927, 851416, 944350, 946439, 996948, 1127014, 1080121, 1115911, 1195091, 1179401, 1265867, 1277230, 1368449, 1485354, 1528615, 1667933, 1842024, 1947052, 2104824, 2207576, 2301867, 2617350, 2793254, 2901228, 3120056, 3261018, 3454703, 3656108, 3756348, 3864621, 3898120, 3964608, 4045961, 4130028, 4094298, 3998753, 3848470, 3722490, 3611373, 3587556, 3422160, 3371739, 3289794, 3245881, 3159975, 2975055, 2765468, 2662904, 2717861, 2474794, 2231072, 2103393, 1873920, 1749886, 1620944, 1492631, 1435841, 1382487, 1316033, 1244993, 1200502, 1169554, 1051186, 1081934, 1017662, 1026073, 963948]
4320I63948r0173j12045m9801N3787K4101j6200j20820L981n9746R4639m0423
4309F51248J978r3774j49325K227L4311M8522k5609o7212N224K7048l0363N3785
4297D58060j6353q8283Q7164l4540Q8035K7843j27604o3773L8086o725M7166j1269
4285C97807k8348o9275q6513k2287P3062n6199m5361L6598l2807P1618k6502l9655
4273A72138l0243o988j1544Q9746R6599N9867o1245r7073P493O530j0636j5799
4261A98845K3291M9757O3450j24544L8657J04246l9934n3070K9811J3808M6533
4250C50850J1435J7040K670N793j3708q9294k0318K8225r5963K5030j3554k1623
4238A86583Q3417K739p6666J4975J02377l6911J2963j1386j5891J4185m3647j9622
$$ y = [963948, 873775, 761730, 711929, 765716, 789817, 773617, 652797, 656778, 597032, 691671, 651248, 653226, 559452, 410127, 412354, 446665, 495187, 469578, 402366, 407590, 434638, 404275, 458060, 441707, 353424, 440588, 406048, 494083, 521926, 394322, 330549, 368635, 361910, 409076, 397807, 369459, 300184, 213671, 191384, 264446, 208247, 162886, 199484, 166677, 238295, 211793, 172138, 141895, 134907, 123363, 213109, 309708, 369575, 308330, 211257, 218750, 225280, 214644, 198845, 222136, 271893, 335343, 210799, 249456, 353702, 313768, 260698, 290509, 304317, 350850, 362285, 379325, 381995, 387788, 374080, 284786, 264468, 292693, 196730, 221760, 208206, 186583, 270000, 272739, 196073, 211048, 313425, 276514, 289477, 278091, 262200, 276385, 232738, 213116]
4226B13116O1726j7044k618k1061O2484j5770o2966j185M979l4093K9569o4656
4214A52481n7003J17504m1434k0712M9593L248P2933j09454L855N9282N0583j82641
4202I8235M7367J66174M1662o8521j3130m3237n2214j3517K1255J02329j8338
4191B68065q5127q2472O0978L5018r2074m1890j1160M8799q0262k6058J63226
4180A57043L8495J27606j34928K585m2739O3336M1014J6435M4686k9717J7621
4169C01437m8258r1897M4105j2303L7014o2604n1693K5955K1208M8440n6542p0415
4157H4447R7906J8404J3519M513j7095O1609n6983J06976J8836q0369l3784k9272
4145A88707k2392j8212L1684O1462N4467n8614m2390L6136j1408m5796Q2486K0315
$$ y = [213116, 274842, 257798, 255180, 234119, 296603, 280833, 217867, 216682, 221661, 187568, 217137, 152481, 95478, 212982, 171548, 150836, 200429, 203677, 276610, 167156, 171011, 230293, 280876, 98235, 145602, 311776, 353438, 284917, 271787, 228550, 176336, 162819, 184074, 286403, 268065, 182938, 100466, 161444, 196462, 104388, 62498, 51338, 100137, 19875, -6183, 157043, 195538, 323144, 188216, 190801, 148062, 211398, 252412, 268847, 313533, 283816, 301437, 253179, 161282, 205387, 193084, 230098, 167494, 115801, 141756, 162964, 211404, 154862, 84447, 182353, 200757, 214276, 218789, 201694, 263303, 206320, 313296, 332132, 251763, 217979, 188707, 166315, 148103, 179787, 241249, 295716, 237102, 194712, 230848, 219440, 173644, 256130, 276445]
4133B76445q0002j9149l2545J17027O7243N9454j02551n2305m9071O727M7753
4122B39026J8439K7379J38348l7804r2689p2708j31402J53568m6568q448R0947
4111B78088o3802J3298k4259O2761m8733O255P1198m5475j14863J08861l7857
4100B05472n1127P6646k8655K4177l3778K8509k7298r245M410q8572L9379R8235
4088B38153O840L3990j51498r9519N6044P6868N8241j13699Q7849L869l2676K4635
4076A89097n065o2279O5293Q1570n2088N1200J0275o2055l72Q6057l1269r3953
4064A76411j25088Q8282J9696J86779M7403J5000m1717n3056K6761p8007K9570
4053B92034K0337N9801N2300k6611j342p4929p5499L546J93427M7547p4812l0668
$$ y = [276445, 196443, 177294, 144749, 261776, 329019, 388473, 285922, 233617, 184546, 191273, 239026, 257465, 284844, 423192, 385388, 292699, 219991, 88589, 242157, 195589, 187141, 278088, 214286, 227584, 203325, 266086, 217353, 223608, 294806, 249331, 134468, 243329, 205472, 154345, 230991, 202336, 226513, 192735, 221244, 193946, 184701, 189111, 100539, 139918, 238153, 244993, 278983, 127485, 27966, 84010, 160878, 219119, 105420, 193269, 197138, 164462, 189097, 184032, 121753, 187046, 268616, 216528, 267728, 278003, 215948, 215576, 301633, 270364, 176411, 51323, 139605, 159301, 346080, 393483, 408483, 366766, 313710, 340471, 262464, 292034, 312371, 372172, 424472, 397861, 396519, 321590, 246091, 249637, 443064, 490611, 415799, 385131]
4041C85131o8283p3320J51713L4091O0536k4311k4339j2860L2298N2314o9746
4030D43224P200j21990K699l8529R610L6464L9633k5269o0149K619o537o4660
4018B24315k8979P8533R8531K0339L0698o6326p4684K3994r1713k604J28884m8533
4006B92455l8458K2401o255J5590l857k5313r8465O816p140l3159k3333K5987
3994A27269J88969j4509j35257r022N8714r648q317L5875J8078l4325J01116q1084
3982B37859K6627p417J9575k1568m8430J8056M2478l530l19J5137q5884J11926
3970C04510m0172J0574R0920K6711K277M027M0431j4612Q7831n2942M9855J2512
3958E21922q3708O3872K2684k2495j2293l09K5412J1176n3320K4861K3854q7072
$$ y = [385131, 316848, 243528, 395241, 429332, 489868, 465557, 441218, 428358, 460656, 512970, 443224, 450424, 328434, 331133, 292604, 302214, 338678, 378311, 353042, 292893, 295512, 288975, 224315, 195336, 273869, 372400, 392739, 423437, 357111, 282427, 306421, 214708, 212104, 340988, 292455, 253997, 276398, 270143, 285733, 281876, 256563, 158098, 164914, 157774, 124615, 101282, 127269, 316238, 301729, 166472, 157450, 216164, 206516, 198199, 234074, 252152, 217827, 318943, 237859, 264486, 257069, 276644, 255076, 206646, 224702, 267180, 263650, 263331, 278468, 192584, 304510, 264338, 274912, 365832, 392543, 394820, 398847, 439278, 424666, 512497, 459555, 509410, 521922, 438214, 502086, 524770, 502275, 489982, 489673, 515085, 526261, 472941, 497802, 521656, 434584]
3946D34584J1419J55439M6005R399R7333l2548o8154j343q5687L4129o5683L1323
3934E66216N7069m9065n9688J7567L4176M5929J65695n9974o7585M7999M6260
3923G44599N0054j3359J19642n635l5530n0860N7509M0248l1026K2051j0598q544
3911H78551l5470O7019j9353p3026M6164m5852m1239J59525n3178j9850Q225q7230
3899G84286l5880K6373R552M4269l2658j07783J78526J3481l1n090J0375j0654
3887H74766m0611J66250J26791j41287j17247M4877k6662J02137R47j02219M0864
3876I28606Q5086j8340l4175J37703M0974n674K8200K4284K5897M368j953n2551
3864A162425L2470R7550k1371K8312K8203j26904m0055Q6182k2760l3721J90242
$$ y = [434584, 446003, 601442, 647447, 656846, 754179, 721631, 653477, 652134, 566447, 600576, 534893, 566216, 623285, 574220, 514532, 532099, 566275, 612204, 777899, 717925, 650340, 698339, 744599, 794653, 781294, 900936, 895301, 859771, 808911, 866420, 906668, 875642, 897693, 887095, 878551, 843081, 910100, 890747, 817721, 863885, 818033, 776794, 936319, 883141, 863291, 871516, 784286, 748406, 774779, 784331, 828600, 795942, 688159, 866685, 880166, 880135, 875045, 885420, 874766, 834155, 1000405, 1127196, 985909, 868662, 913539, 886877, 989014, 989961, 887742, 928606, 1013692, 995352, 961177, 1098880, 1139854, 1134180, 1162380, 1186664, 1212561, 1216929, 1214976, 1162425, 1194895, 1292445, 1271074, 1299386, 1327589, 1200685, 1160630, 1246812, 1224052, 1190331, 1380573]
3853A380573k4432n7709Q5632P5815R6282m0131m6299P682L4610M453j39510J83309
3841A560275L2625j48266K6256Q6409P398o8946Q8936n8113k4283p7699j6104
3830A408488k8367M1611J6936O651M2720J2926j31523J6807J21630o4655L7216
3819A480440L9606P9789o8204N1257O529j25407j02549J08887J06344O651j7718
3808A565625p0264M6552j7298l8785P5061O229P5858J4377j1780M4159p8680n860
3796A605194N2823K3204L4416R8437k5934l298L0872q6896j22037K5927Q5316
3785A718024J05622n7536q417M8490j09083O2320Q6636l0762j3263N8421K8648
3774A889100M9325K1804M5842N1254j8019K9855J03835J7297j45418R078J33928
$$ y = [1380573, 1356141, 1298432, 1384064, 1459879, 1556161, 1516030, 1469731, 1477413, 1512023, 1516476, 1376966, 1560275, 1592900, 1444634, 1470890, 1557299, 1564697, 1495751, 1584687, 1526574, 1502291, 1424592, 1408488, 1380121, 1421732, 1438668, 1445319, 1488039, 1500965, 1369442, 1386249, 1507879, 1443224, 1480440, 1520046, 1599835, 1531631, 1582888, 1589417, 1464010, 1361461, 1470348, 1576692, 1583343, 1565625, 1495361, 1541913, 1524615, 1485830, 1560891, 1567120, 1642978, 1657355, 1645575, 1689734, 1611054, 1605194, 1658017, 1681221, 1715637, 1814074, 1788140, 1784842, 1815714, 1728818, 1606781, 1632708, 1718024, 1823646, 1766110, 1757693, 1806183, 1697100, 1759420, 1846056, 1815294, 1802031, 1860452, 1889100, 1938425, 1960229, 2006071, 2057325, 2039306, 2069161, 2172996, 2190293, 2044875, 2053953, 2187881]
3763B187881J11289j4883J7683R0871q9149o7860k2594M6258L9943Q0353Q3306
3752B463098K8700m9484Q853J8581m883Q2176M3329J46817Q8279j0135l5761K4819
3740B804389R7321l6048N0327R6636J06448j5040j4234J2502o8976K3318O7518
3729C124161R7257j0987k7106J17226P993J14563M3016O8184R4035J14150M946
3718C747438N0398Q7387j1678P0695J16722M6609q2386J4562J13563O3801R0407
3707D307518J14404j5821L427L4454K37029P2156O4068Q6474P3072M220R7297
3696E078298N5046J58689J48949L9385J59682J80596P3326q428J75532K06670
3686F267745m918R3451K65994J99719J52757M6659J85756K08362R9590K31374
$$ y = [2187881, 2299170, 2284287, 2301970, 2392841, 2303692, 2235832, 2213238, 2259496, 2299439, 2379792, 2463098, 2491798, 2442314, 2451167, 2469748, 2464865, 2547041, 2590370, 2737187, 2825466, 2815331, 2779570, 2804389, 2901710, 2865662, 2915989, 3012625, 3119073, 3104033, 3089799, 3102301, 3033325, 3056643, 3124161, 3221418, 3210431, 3183325, 3300551, 3308544, 3423107, 3466123, 3534307, 3628342, 3742492, 3747438, 3797836, 3885223, 3873545, 3944240, 4060962, 4107571, 4025185, 4039747, 4153310, 4217111, 4307518, 4421922, 4406101, 4409528, 4443982, 4681011, 4753167, 4817235, 4903709, 4976781, 4981001, 5078298, 5133344, 5292033, 5440982, 5480367, 5640049, 5820645, 5893971, 5885543, 6061075, 6267745, 6262827, 6356278, 6622272, 6821991, 6974748, 7021407, 7207163, 7415525, 7515115, 7746489]
3676G746489K16315J41125J99794K81573K29333K83852K90381J86325J70431M09529
3666A0155147L35813L41313M28824L97622M62567M77134M72076N14023N43017
3657A4127536O94924P13930Q44001P88845R64854J040737J091328J151433J166202
3648B2583790J133622R47588R02334O59493N70509N97545M94847N40069O32404
3639B9062201P47186P86265P90526P71717N72864N79882K98753K66428L69191
3630C4245013M43719N29162N16482Q23799J013400R52630J426825J443006J569599
3621D2963635J603196J816687J726963J609898J339895R77601N56050K34525j15326
3612E2713124k92944l27155l41375j76658j24371J36702K78366L79542N24521
$$ y = [7746489, 7962804, 8103929, 8303723, 8585296, 8814629, 9098481, 9388862, 9575187, 9745618, 10155147, 10490960, 10832273, 11261097, 11658719, 12121286, 12598420, 13070496, 13584519, 14127536, 14822460, 15536390, 16380391, 17169236, 18134090, 19174827, 20266155, 21417588, 22583790, 23717412, 24665000, 25567334, 26226827, 26797336, 27394881, 27889728, 28429797, 29062201, 29809387, 30595652, 31386178, 32157895, 32730759, 33310641, 33609394, 33875822, 34245013, 34688732, 35217894, 35734376, 36558175, 37571575, 38524205, 39951030, 41394036, 42963635, 44566831, 46383518, 48110481, 49720379, 51060274, 52037875, 52593925, 52828450, 52713124, 52420180, 52093025, 51751650, 51574992, 51450621, 51587323, 51865689, 52245231, 52769752]
3603E2769752N72295N02066O55236M29745L30022N24432N63631N54203P10633
3594E7612015Q03487R80191J202128J421776J507658J381588J546326J511436
3586F7966605J457337J523687J620748J641014J518195J471305J528463J446676
3578H0174030J659834J832978J919803J958069J991665J755830J362578Q99395
3570I3554182J39063m56717q37158j248688j191841j136298j175790j023422q08690
3561H5814641q76174p71950n71071p15157n64729m56585j21737L01574P06127
3552H2744939J078094J625724K122155K791002L302822L942672M437382N023862
3544A07068652N343818N770198O227502O394605O153758N869875N319686M425968
$$ y = [52769752, 53342047, 53844113, 54499349, 54929094, 55259116, 55783548, 56347179, 56901382, 57612015, 58415502, 59395693, 60597821, 62019597, 63527255, 64908843, 66455169, 67966605, 69423942, 70947629, 72568377, 74209391, 75727586, 77198891, 78727354, 80174030, 81833864, 83666842, 85586645, 87544714, 89536379, 91292209, 92654787, 93554182, 93693245, 93236528, 92399370, 91150682, 89958841, 88822543, 87646753, 86623331, 85814641, 84938467, 84166517, 83595446, 82880289, 82315560, 81858975, 81737238, 82038812, 82744939, 83823033, 85448757, 87570912, 90361914, 93664736, 97607408, 102044790, 107068652, 112412470, 118182668, 124410170, 130804775, 136958533, 142828408, 148148094, 152574062]
3536A52574062L419581K414815J804666J405346J103476J225147J143516J140875
3528A66231484R74659N83220j97981r16203j723128k378396k923697l345724l335524
3519A52968710l459513l371631l344374l339198l327601l134571l063257k854438
3511A27074127k751058k541025k501892k282655k135398j914564j631792j555486
3503A09760257j363922j075997j240980j188562j216330j114440j175292j361112
3495A00023622j284408j303367j317827j286548j270104j242314j382363j536553
3487H9400138j483237j513308j551802j500721j390254j384073j126119j065509
3479G8385115j053468q95449q82920q07020p19562o02122n88051m17071k43684
$$ y = [152574062, 155993643, 158408458, 160213124, 161618470, 162721946, 163947093, 165090609, 166231484, 167206143, 167789363, 167591382, 166675179, 164952051, 162573655, 159649958, 156304234, 152968710, 149509197, 146137566, 142793192, 139453994, 136126393, 132991822, 129928565, 127074127, 124323069, 121782044, 119280152, 116997497, 114862099, 112947535, 111315743, 109760257, 108396335, 107320338, 106079358, 104890796, 103674466, 102560026, 101384734, 100023622, 98739214, 97435847, 96118020, 94831472, 93561368, 92319054, 90936691, 89400138, 87916901, 86403593, 84851791, 83351070, 81960816, 80576743, 79450624, 78385115, 77331647, 76436198, 75553278, 74746258, 74026696, 73424574, 72836523, 72419452, 72175768]
3470G2175768j21579j86432q5800m4106K8638Q9456k85567k53707l18505m82553
3460G0515613p25593p65617r69728q63848q44692p53903o67285n54016n34474
3451F3836457m03260l28438l02373l45736m43426n30777m08943m90646l84003
3442F0198855m35345n44946m84322n62354n45782n16416m44840m55750m13480
3433E5795620l40834l00862k64994j72006k95834j19524k76225k53049k87802
3424E3484490l81991m51558k96680m06947m22179m75975n73552m79201n45133
3415D9451274o52852n83592o59703n28538n07046l71058m47005m41732k65607
3406D4994141j25224j79548m0846M9136K12806K70584L40180M46753M93040M72460
$$ y = [72175768, 72054189, 71867757, 71781957, 71737851, 71766489, 71855945, 71570378, 71316671, 70998166, 70515613, 69790020, 69024403, 68054675, 67190827, 66346135, 65592232, 64924947, 64370931, 63836457, 63433197, 63104759, 62802386, 62456650, 62013224, 61482447, 61073504, 60582858, 60198855, 59763510, 59218564, 58734242, 58171888, 57626106, 57109690, 56664850, 56209100, 55795620, 55454786, 55153924, 54888930, 54716924, 54421090, 54301566, 54025341, 53772292, 53484490, 53102499, 52650941, 52354261, 51947314, 51525135, 51049160, 50475608, 49996407, 49451274, 48798422, 48214830, 47555127, 47026589, 46519543, 46148485, 45701480, 45259748, 44994141, 44868917, 44689369, 44648523, 44697659, 44910465, 45181049, 45521229, 45967982, 46461022, 46933482]
3396D6933482M86622N81234M81480M79105M49063K67445K86344J94026K23878
3387E0382679J85623Q4287L25187L23290K93345L10324M17442N14895N63290N14125
3377E3914487M75192O13983P16697O98428P94853P79983Q79910R54351J087797
3368F0915681J090733J151083J181196J232104J255791J428273J499541J631046
3360G1385448J520297J731867J694145J668434J575860J495128J454079J369511
3352H3894769J338089J217564J076470R33909Q94932Q67429R49258R85445Q90252
3343I3048117R85553Q86151J041141J018214R71497J070036J194894J216566J369391
3334A02801560J361035J421870J454316J445923J517498J479731J584633J567269
$$ y = [46933482, 47420104, 48001338, 48482818, 48961923, 49410986, 49678431, 49964775, 50158801, 50382679, 50568302, 50652589, 50977776, 51301066, 51594411, 51904735, 52322177, 52837072, 53400362, 53914487, 54389679, 55003662, 55720359, 56418787, 57213640, 57993623, 58873533, 59827884, 60915681, 62006414, 63157497, 64338693, 65570797, 66826588, 68254861, 69754402, 71385448, 72905745, 74637612, 76331757, 78000191, 79576051, 81071179, 82525258, 83894769, 85232858, 86450422, 87526892, 88460801, 89355733, 90223162, 91172420, 92157865, 93048117, 94033670, 94919821, 95960962, 96979176, 97950673, 99020709, 100215603, 101432169, 102801560, 104162595, 105584465, 107038781, 108484704, 110002202, 111481933, 113066566, 114633835]
3326A14633835J533299J483428J506847J403998J445721J411096J361021J250335
3318A26029580J149350J228003J036724J071288J108920R58215J012318J055958
3310A34650356J113493J176560J187454J075921J331435J217216J268898J507700
3302A44529033J426854J546128J726042J787053J902401J957647K176013K031164
3294A59082335K175890K266243K152748K206374K379863K473348K421037K339889
3286A77497727K397161K441862K509368K664040K774314K704099K891524L014268
3278A98894363L123435L372515L468170L595117L696704L778403L883914L891917
3270B27704538L956826L977883L979078M018062M096267M050079L926387L883940
$$ y = [114633835, 116167134, 117650562, 119157409, 120561407, 122007128, 123418224, 124779245, 126029580, 127178930, 128406933, 129443657, 130514945, 131623865, 132582080, 133594398, 134650356, 135763849, 136940409, 138127863, 139203784, 140535219, 141752435, 143021333, 144529033, 145955887, 147502015, 149228057, 151015110, 152917511, 154875158, 157051171, 159082335, 161258225, 163524468, 165677216, 167883590, 170263453, 172736801, 175157838, 177497727, 179894888, 182336750, 184846118, 187510158, 190284472, 192988571, 195880095, 198894363, 202017798, 205390313, 208858483, 212453600, 216150304, 219928707, 223812621, 227704538, 231661364, 235639247, 239618325, 243636387, 247732654, 251782733, 255709120, 259593060]
3262B59593060M003373M079110M174542M323918M634415M734403M932705N028544
3254B95504070N041236N260235N058022N335619N468546N408371N476379N839790
3246C38392268O104839O554697P253472P816137Q419022Q898386R295810R453771
3238D02188402R369605R304271Q903663Q394137Q059179P772054P869317Q122534
3230D69983162Q259416Q451356Q662152Q627304Q224018P764036P179490O417527
3222E33568461N429743M249309K620028P80769j656818m730272q075893j1711883
3214E20473444j4956055j8024442k0203170k1473136k1975380k1316554k0431952
3207C82092755j9176792j7789060j6371525j5319637j4101521j2922247j1969626
$$ y = [259593060, 263596433, 267675543, 271850085, 276174003, 280808418, 285542821, 290475526, 295504070, 300545306, 305805541, 310863563, 316199182, 321667728, 327076099, 332552478, 338392268, 344497107, 351051804, 358305276, 366121413, 374540435, 383438821, 392734631, 402188402, 411558007, 420862278, 429765941, 438160078, 446219257, 453991311, 461860628, 469983162, 478242578, 486693934, 495356086, 503983390, 512207408, 519971444, 527150934, 533568461, 538998204, 543247513, 545867541, 546648310, 544991492, 540261220, 532185327, 520473444, 505517389, 487492947, 467289777, 445816641, 423841261, 402524707, 382092755, 362915963, 345126903, 328755378, 313435741, 299334220, 286411973, 274442347]
3200B74442347j1023020j0433767r815888r391274q984902q641177q496690q469423
3192A99186206q405168q099859q091311p974958p598012p224725p082877o552046
3184A38157250o164488n787257n324337m936130m642450m414331l893279l668838
3176I9326140l398583l288868l183176l038145k721976k819248k633532k539347
3168G5703265k504426k288214k321561k224304k094313j986701k082883j844629
3160E8356234j717763j773149j698112j557590j655205j495829j281692j347822
3152D5829072j248228j268481j171786j172306j194444j017083r81495j064147
3144C6711102r29587j083810j049975r62985q86145q14533r41178q22718p08157
$$ y = [274442347, 263419327, 252985560, 243169672, 233778398, 224793496, 216152319, 207655629, 199186206, 190781038, 182681179, 174589868, 166614910, 159016898, 151792173, 144709296, 138157250, 131992762, 126205505, 120881168, 115945038, 111302588, 106888257, 102994978, 99326140, 95927557, 92638689, 89455513, 86417368, 83695392, 80876144, 78242612, 75703265, 73198839, 70910625, 68589064, 66364760, 64270447, 62283746, 60200863, 58356234, 56638471, 54865322, 53167210, 51609620, 49954415, 48458586, 47176894, 45829072, 44580844, 43312363, 42140577, 40968271, 39773827, 38756744, 37775249, 36711102, 35781515, 34697705, 33647730, 32684745, 31798600, 30984067, 30042889, 29220171, 28512014]
3135B8512014q02375p64469p31732o63425o35297n70554o11433n95804n88790
3126B2548135o80324n36960l92098n19300n06685n27990m67307m21498n32376
3117A7963597l52013l23714l79204l91043l73503l29197k17602l15962k41679
3108A5039680k93208k26892k45343l38167j75483k27530j56498l22263j20056
3099A2934240j58151k79461k08714k91001j61703j49067k15248j62456r0937q0565
3089A1136937k02821j73355j32595r6821L1611j54226j56145j29424o7118j38026
3079I918017l4776j16710k14499o627m0396j67255k7156p3868j28994j15669q4302
3068H907765p6088K6404r9305j05685r5038n8389o8815q4769j03667k4479L1959
$$ y = [28512014, 27709639, 26945170, 26213438, 25550013, 24914716, 24344162, 23732729, 23136925, 22548135, 21867811, 21330851, 20938753, 20419453, 19912768, 19384778, 18917471, 18495973, 17963597, 17611584, 17287870, 16908666, 16517623, 16144120, 15814923, 15597321, 15281359, 15039680, 14746472, 14519580, 14274237, 13936070, 13760587, 13533057, 13376559, 13054296, 12934240, 12776089, 12496628, 12287914, 11996913, 11835210, 11686143, 11470895, 11308439, 11217502, 11136937, 10934116, 10760761, 10628166, 10531345, 10562956, 10408730, 10252585, 10123161, 10056043, 9918017, 9883241, 9766531, 9552032, 9545405, 9505009, 9337754, 9310598, 9236730, 9107736, 8992067, 8907765, 8831677, 8858081, 8758776, 8653091, 8558053, 8499664, 8430849, 8346080, 8242413, 8217934, 8249893]
3057H249893j36413o4163n0586J6024n4048r0413L053q7374j34080M3320M423
3046G699636j13012p4205o0090J25627N5367m6740n8320m7607L3090o5826O3909
3035G511829j41202j3969K862r0280O0573J1797m2768N003R276j44112q3021o1242
3023G024746P6843J07959j2307n2894J03709L7630p8428J39475K9928o438j0772
3012G359451J3664O5582M9768n06l34Q3404j95l4328P2541Q3651m714O9488J07417
2999G864889J47024J82887K1460J40170O3585P7558O5772l915J42103Q8552P6303
2988H866388J05748K11616R135P2938J67164J11383J28267J22462J68366l4517
2978I928950O1934J52209K88702J12862J60185J48123J38983K21398K00848K44697
$$ y = [8249893, 8113480, 8049317, 7998731, 8014755, 7960707, 7870294, 7873347, 7785973, 7651893, 7695213, 7699636, 7586624, 7512419, 7452329, 7577956, 7633323, 7586583, 7528263, 7480656, 7513746, 7447920, 7511829, 7370627, 7356658, 7359520, 7269240, 7329813, 7341610, 7298842, 7303845, 7313121, 7169009, 7085988, 7024746, 7101589, 7209548, 7197241, 7144347, 7248056, 7285686, 7207258, 7346733, 7376661, 7370223, 7359451, 7373115, 7438697, 7488465, 7487959, 7487625, 7571029, 7570834, 7536506, 7609047, 7692698, 7687984, 7757472, 7864889, 8011913, 8194800, 8216260, 8356430, 8420015, 8497573, 8563345, 8559430, 8701533, 8790085, 8866388, 8972136, 9183752, 9192887, 9265825, 9432989, 9544372, 9672639, 9795101, 9963467, 9928950, 9990884, 10143093, 10431795, 10544657, 10704842, 10852965, 10991948, 11213346, 11414194, 11658891]
2968A1658891K07530J31861J76975K69347L03783K00003J75861K75168K11165
2959A3610584J96340K08483L05602K99700K51026L41535L92677L14715L45824
2950A6266486M53690L63661K91578L01871M43961M03147M35382N28902M07408
2941A9896086M88640M31574N25344M97072M82264N31895O02664N59166M93929
2932B4508634O07781O59696P22138P58599P44847P01629P86088Q93545R46868
2923C1329825J018350J008615J105064J112169J190870J177967J541332J548417
2915D1032609J578257J742638J859273K077069K245293K300574K552167K914333
2907E8302213L071130L383146L679314L975058M340175M853472N099632N488703
$$ y = [11658891, 11866421, 11998282, 12175257, 12444604, 12748387, 12948390, 13124251, 13399419, 13610584, 13806924, 14015407, 14321009, 14620709, 14871735, 15213270, 15605947, 15920662, 16266486, 16720176, 17083837, 17375415, 17677286, 18121247, 18524394, 18959776, 19488678, 19896086, 20384726, 20816300, 21341644, 21838716, 22320980, 22852875, 23455539, 24014705, 24508634, 25116415, 25776111, 26498249, 27256848, 28001695, 28703324, 29489412, 30382957, 31329825, 32348175, 33356790, 34461854, 35574023, 36764893, 37942860, 39484192, 41032609, 42610866, 44353504, 46212777, 48289846, 50535139, 52835713, 55387880, 58302213, 61373343, 64756489, 68435803, 72410861, 76751036, 81604508, 86704140, 92192843]
2899I2192843N912368O169154O233250O099092N699263M890426L850281K685839
2891A33732516J852331J213848Q85456N88965M82304M71765N22404N27022M02708
2882A40679319N68599Q07718R28570J243113J737327K216603K898468L662332
2874A54742049M714128N720931O859318Q541096J0459560J2725046J4777205J6708106
2866B35247439J6389315J2136792K701434q989328j6490354j9682286j9629184
2859B01683828j7631861j4743668j2162720r765450p812594o291803n195169m557839
2851A23522724l919103l448514k829467k318329j850610j393076j062470n72913
2843A06128242j16381K66488M85026J017176J469249J772246J898356J703899
$$ y = [92192843, 98105211, 104274365, 110507615, 116606707, 122305970, 127196396, 131046677, 133732516, 135584847, 136798695, 137684151, 138273116, 138755420, 139227185, 139749589, 140276611, 140679319, 141247918, 142055636, 142984206, 144227319, 145964646, 148181249, 151079717, 154742049, 159456177, 165177108, 172036426, 180577522, 191037082, 203762128, 218539333, 235247439, 251636754, 263773546, 266474980, 257485652, 240995298, 221313012, 201683828, 184051967, 169308299, 157145579, 147380129, 139567535, 133275732, 128080563, 123522724, 119603621, 116155107, 113325640, 111007311, 109156701, 107763625, 106701155, 106128242, 106011861, 106278349, 106763375, 107780551, 109249800, 111022046, 112920402, 114624301]
2835A14624301R06533l49117j932540l293691m648986n657313o034282o101920
2827H7512985n948068n709982n165722m681268m215194l753883l609180l197933
2819E1231755k956767k773335k433246k330242k153454j993373j719723j626944
2811C3244671j498241j521478j108761j216339j063396r73619j064796r76703
2803B3821338r01633q52128o94422p63457p08202o49916p44190o53261n98618
2794A7255511n33368o11638m70469l91286n50986m08792m46738l53622l29814
2785A3158798m96814l95046l30073k78513l72369l33307k64388k85060m01640
2776A0001588k09992k53728j76199j71220j28214k60963k50983k69027k29945
$$ y = [114624301, 115530834, 115181717, 113249177, 109955486, 105306500, 99649187, 93614905, 87512985, 81564917, 75854935, 70689213, 66007945, 61792751, 58038868, 54429688, 51231755, 48274988, 45501653, 43068407, 40738165, 38584711, 36591338, 34871615, 33244671, 31746430, 30224952, 29116191, 27899852, 26836456, 25862837, 24798041, 23821338, 22919705, 22067577, 21373155, 20609698, 19901496, 19251580, 18507390, 17854129, 17255511, 16722143, 16110505, 15640036, 15248750, 14697764, 14288972, 13842234, 13488612, 13158798, 12661984, 12266938, 11936865, 11658352, 11285983, 10952676, 10688288, 10403228, 10001588, 9791596, 9537868, 9361669, 9190449, 9062235, 8801272, 8550289, 8281262, 8051317]
2767H051317k45672j91599j41954j07759l04366k52925q0952j77198m0990j77252
2757F330650j90940j33487k16408j86084R7770p0310k09625j30429j02796J5899
2747E204240n2093j48121j2149j77830j45125K8980j72731j29310j7455m6390
2737D332016j19733N8923r0396j20030K0055l0150q1079J0579m6487N38O5103
2726C999339k8906k5726j61442j10817j17404m8507n2362j7058r6556r9631j31809
2715C109121J2815p4569M169m8694p6274L1922n607q1572r5307R877O6031o9067
2703B782845p2040M4666j7137q0698m6185k3956K6901j11672j14236P6259j0439
2692B454308q6707j55773q1409k2157R8558o4641k4213l997K8266l4934k0113
$$ y = [8051317, 7805645, 7614046, 7472092, 7364333, 7059967, 6807042, 6726090, 6548892, 6507902, 6330650, 6139710, 6006223, 5789815, 5603731, 5701501, 5631191, 5421566, 5291137, 5188341, 5204240, 5152147, 5004026, 4991877, 4814047, 4668922, 4697902, 4525171, 4395861, 4378406, 4332016, 4212283, 4271206, 4180810, 4060780, 4080835, 4050685, 3969606, 3980185, 3933698, 3934236, 3999339, 3970433, 3944707, 3783265, 3672448, 3555044, 3506537, 3454175, 3437117, 3340561, 3240930, 3109121, 3121936, 3047367, 3051536, 3002842, 2926568, 2958490, 2952883, 2871311, 2776004, 2785881, 2851912, 2782845, 2710805, 2755471, 2738334, 2657636, 2611451, 2587495, 2614396, 2502724, 2388488, 2464747, 2454308, 2367601, 2211828, 2130419, 2108262, 2206820, 2142179, 2117966, 2113969, 2142235, 2107301, 2087188]
2681B087188q2622M173l2559J2365L744M4703q8131p3513K4850r8564P8938m0390
2669A840182j3413o6885K1718l2539M6942r8491J783j078o7532M9067J7242K4806
2657A721802n7301Q196q3948J0065l9368K563K8975j6375M837N0859J9820q4851
2645A565274P8764J4442K6768K0566p2525q6459O7871L4947o3747p6069L5350
2634A545182J1720k141O363r397j0975J08985J730k9618K6147J6810m8737M9658
2622A665727q638R1548R5756K7895M0919n3906M4591n476r466l2864J16670L7066
2610B009822L3100J8911j39585O7831p4125j1297Q3969j3924j18946j14035J22205
2599A863926p027p535m9869J2873p8103o512L9855k7306o7886M8992l9291Q6372
$$ y = [2087188, 2004566, 2008739, 1976180, 1988545, 1992289, 2036992, 1948861, 1875348, 1900198, 1801634, 1880572, 1840182, 1826769, 1759884, 1781602, 1749063, 1796005, 1697514, 1699297, 1698219, 1630687, 1679754, 1696996, 1721802, 1664501, 1672697, 1588749, 1598814, 1559446, 1562009, 1590984, 1574609, 1579446, 1630305, 1650125, 1565274, 1644038, 1658480, 1685248, 1705814, 1633289, 1546830, 1614701, 1649648, 1585901, 1509832, 1545182, 1556902, 1554761, 1561124, 1551727, 1540752, 1649737, 1651467, 1621849, 1647996, 1664806, 1616069, 1665727, 1657089, 1748637, 1844393, 1872288, 1913207, 1859301, 1903892, 1898416, 1888950, 1856086, 1972756, 2009822, 2042922, 2061833, 1922248, 1990079, 1915954, 1904657, 1988626, 1974702, 1855756, 1741721, 1863926, 1856899, 1849364, 1799495, 1812368, 1734265, 1727753, 1767608, 1740302, 1672416, 1721408, 1682117, 1768489]
2587A768489Q113J39542R2195J3962J44290M1902R1772J710N6806j83791j77999
2576A996991j32207j54556o8285j68875N7185m2931j21906P319J0947n2558j391
2565A329733P831k4907o5066j7285L9080L6378j5350l2044n9169J35625j2930
2554A321896j3648p049P6971P3594n7340n3099n3509j7788P3357j4897m5124p5776
2542A207588p9389O9152p625O391p2916p11k8277m0624R5870K2055r7513q6552
2530I87449j07944J3085k9879r8795l4299K9201o877N8717l6795j15127j3835
2519F44901L4526j5964K2392J0017M663o7843O5535Q8966j03746P02J16690N8061
2507H58900l6855j06126j073M8296q0260j1805L0672K9504k3390l2761J5413j09082
$$ y = [1768489, 1776602, 1916144, 2008339, 2022301, 2166591, 2208493, 2300265, 2301975, 2358781, 2174990, 1996991, 1864784, 1710228, 1641943, 1473068, 1530253, 1487322, 1365416, 1372735, 1383682, 1331124, 1329733, 1337564, 1312657, 1247591, 1230306, 1269386, 1305764, 1290414, 1258370, 1199201, 1334826, 1321896, 1308248, 1301199, 1378170, 1451764, 1394424, 1341325, 1287816, 1270028, 1343385, 1328488, 1283364, 1207588, 1128199, 1197351, 1189726, 1196117, 1123201, 1122490, 1094213, 1053589, 1149459, 1171514, 1074001, 987449, 879505, 892590, 862711, 763916, 729617, 758818, 751941, 810658, 773863, 658736, 644901, 679427, 663463, 685855, 695872, 700535, 632692, 698227, 787193, 683447, 684149, 800839, 858900, 822045, 715919, 714846, 763142, 682882, 671077, 701749, 731253, 707863, 675102, 690515, 581433]
2495E81433l7227k5378L2816K3016R642J9486r7763n876J21136K338j5941m371
2483F03311o5613n0492N1560j5268O6374m1387K9527j79816j5791O2877n4595
2472C90687J15789N3314n5631K471o3698j6242p745m0889M8456J22781j15998
2461D33295m4066N9407J7790O3023r394p4550K1923p4700K8768J04633o2602n3369
2449D10158L2171m53j9741N3308Q2863l134K0116J9548j16877m14j6885J8479
2437D79139j16739K2354l65R5485m0714q7563J23953J17026r7137p8818k2981
2426C93640R5296J4679m0137p0860o5801P0035j08169R9112N0160q7232N3529
2415D04252L0659k1548j03815j4306P8570J0771k8993k3570K4015R3855r331m1130
$$ y = [581433, 544206, 518828, 551644, 574660, 584302, 603788, 506025, 500149, 621285, 623623, 607682, 603311, 537698, 487206, 538766, 523498, 589872, 548485, 578012, 398196, 382405, 445282, 390687, 506476, 559790, 504159, 506630, 442932, 426690, 418945, 378056, 426512, 549293, 433295, 389229, 448636, 466426, 529449, 520055, 445505, 467428, 392728, 421496, 526129, 463527, 410158, 442329, 441876, 422135, 475443, 558306, 555172, 575288, 594836, 477959, 477545, 460660, 479139, 362400, 384754, 384389, 479874, 439160, 351597, 475550, 592576, 495439, 416621, 393640, 488936, 503615, 463478, 392618, 326817, 396852, 288683, 387795, 437955, 350723, 404252, 434911, 413363, 309548, 295242, 373812, 384583, 355590, 332020, 356035, 449890, 440559, 399429]
2403C99429r8156j3765K9980J9196j8521k8859O3093K5079r598N3377o0441L0957
2391C91771l0005L2554j03697J5887l4448M8488O8131L1816k0146j27083r769
2380B63499j905P7919r5593m6337N8204q7115N5898L1925l1534o8033Q6056J46427
2368C89411J9899p1153R8268k3308j119K1051m1319n7931o4699J14647J2037L0496
2356D26280p5703p2779J5124O4712o0974M1854l3275l7425L7111j7598Q1702n0189
2344C18840l6520l7442N5835K5297j22964j395J78348J7717l0247k223O8614k4722
2332D09138p4593K7439j18121j0131M445K9424k5252l355j10980j1739M2770M8003
2320B07048M018O8934o3486O9261K6229j27755M6924N1455l8731J5542r443l4200
$$ y = [399429, 301273, 287508, 317488, 336684, 318163, 289304, 352397, 377476, 367878, 421255, 360814, 391771, 361766, 394320, 290623, 306510, 272062, 320550, 388681, 420497, 400351, 273268, 263499, 261594, 339513, 243920, 197583, 255787, 168672, 224570, 256495, 224961, 156928, 242984, 389411, 409310, 338157, 436425, 413117, 411998, 433049, 391730, 333799, 269100, 383747, 395784, 426280, 350577, 277798, 292922, 357634, 296660, 338514, 305239, 267814, 304925, 287327, 369029, 318840, 282320, 244878, 300713, 326010, 203046, 201651, 379999, 397716, 367469, 365246, 433860, 409138, 334545, 361984, 243863, 233732, 238177, 267601, 242349, 238994, 128014, 116275, 159045, 207048, 211066, 280000, 216514, 285775, 312004, 184249, 231173, 282628, 243897, 259439, 249996, 215796]
2308B15796O3616k162n4715k7586p8496J0321Q537K6409P595Q9158K3523j41191
2296A40805l7210M3623J00399L473m9814r315m4656K7648K7016o0827o6701k7558
2284D6883q6532O6369J03679P0234n5417L8582N133p7108K0691M9689j0140P8300
2272B50363m2678q7846l9228J17559l9493Q757R4194N0592l9096o3461J3757k5903
2260A97517j75491j6104M4391N7483K2479J7857o8875l4936P2310j5381J78M0290
2248A41718N4200r1794J271o858L0448m8135J4467O7855N871l706J5980k0963
2236A60354k8164J4837n8916P9150J02927l1356N4725r9461N5581k5166n2002
2225A72509O6278m2514p8864J15528O0183K643m6890o4145n3739P0067L317L235
$$ y = [215796, 279412, 277250, 222535, 194949, 116453, 126774, 135311, 161720, 169315, 258473, 281996, 140805, 103595, 147218, 247617, 251090, 201276, 191961, 147305, 174953, 201969, 141142, 74441, 46883, -39649, 26720, 130399, 200633, 145216, 183798, 188931, 111823, 132514, 182203, 172063, 250363, 207685, 119839, 80611, 198170, 158677, 167434, 261628, 312220, 273124, 209663, 223420, 197517, 22026, 5922, 50313, 107796, 130275, 148132, 79257, 44321, 116631, 101250, 101428, 141718, 195918, 104124, 105395, 98537, 128985, 80850, 95317, 163172, 169043, 165337, 181317, 160354, 132190, 147027, 88111, 167261, 270188, 238832, 293557, 194096, 249677, 224511, 172509, 238787, 196273, 117409, 232937, 293120, 295763, 248873, 184728, 130989, 201056, 204373, 207608]
2213B07608n2427K7330L602K0746j164Q1032j73992L6107k2521k8991M4098K4020
2201A65448l4804J3840j0905j05510Q0919N7117j5476K7917L1928K7882k9277
2190B09079o4639J8217l6003J3281o930k2601P5678N1903p7767N6629K6621P3101
2178C16569j6586m0585N200M6641o631K9876J5850o8831J5438r6384J5806P9776
2166B96139l3929n1139O2216M2216J08146n3465Q61o8128K5296K2179m9283L4690
2154C35799q5969M57Q0959j3977L5714J2910L4068K8853N078J7211l3396M2996
2142D60703P3728k0336o1606J42951k671n6662L6069K0088l0855L3029J5292L3005
2130F42735M3963N2353l922m4396m6864O3789M5773p730o6389J16194m5879J43
$$ y = [207608, 155181, 182511, 186113, 206859, 205695, 286727, 112735, 148842, 126321, 97330, 141428, 165448, 130644, 144484, 133579, 28069, 108988, 166105, 150629, 178546, 210474, 238356, 209079, 144440, 162657, 126654, 139935, 133005, 110404, 186082, 237985, 160218, 216847, 243468, 316569, 299983, 259398, 264598, 311239, 304608, 334484, 350334, 281503, 296941, 200557, 216363, 296139, 262210, 211071, 273287, 315503, 423649, 370184, 371045, 302917, 328213, 350392, 301109, 335799, 249830, 250287, 331246, 317269, 352983, 365893, 399961, 428814, 433892, 451103, 417707, 460703, 534431, 514095, 452489, 595440, 592769, 536107, 572176, 592264, 561409, 594438, 609730, 642735, 686698, 739051, 735129, 690733, 643869, 707658, 753431, 745701, 679312, 795506, 749627, 749770]
2118G49770N4664K4717R532J01794M6584r2658M5388J33477j6539p6470l9581
2107I40678P19k1466J57125P9304m4952Q5512K27468O356Q9459P0433j6088J20868
2095A695416N1224J52574J00895M2470J27974J66338R0881L2776P1207K19878
2085B751633K49914J12997K18970K63695L63271K66149K13419L36053L13638L44256
2075E433995O29241P52210R67418J093933J421683J858865K128192K691057L384298
2066B0360892L267149K308285j270039l425265l474134l455235k605439j962067
2058I744147j403434j046697p68053n84936m28531m48381k53589k88547k40117
2049D281862l22678l15792k37664k45530l08304j43488j86504j50462j07754j46075
$$ y = [749770, 804434, 829151, 838683, 940477, 987061, 894403, 939791, 1073268, 1056729, 980259, 940678, 941397, 919931, 1077056, 1156360, 1111408, 1196920, 1424388, 1430744, 1520203, 1590636, 1574548, 1695416, 1746640, 1899214, 2000109, 2042579, 2170553, 2336891, 2427772, 2460548, 2531755, 2751633, 3001547, 3114544, 3333514, 3597209, 3960480, 4226629, 4440048, 4776101, 5089739, 5433995, 6063236, 6815446, 7782864, 8876797, 10298480, 12157345, 14285537, 16976594, 20360892, 23628041, 25936326, 24666287, 21241022, 17766888, 14311653, 11706214, 9744147, 8340713, 7294016, 6525963, 5941027, 5512496, 5064115, 4810526, 4521979, 4281862, 3959184, 3643392, 3405728, 3160198, 2851894, 2708406, 2521902, 2371440, 2263686, 2117611]
2039B117611k47507l6741L9098p3586q1993r7757q0584p9056k03214j8334j6759
2028A221178l5640k6096P1549j4946j67708j08490J2832r267J5957o1131L5471
2017I33709K8455j7272j30622m940n9019K5892N2996j2551l0435n0034k3176n5751
2005F57252n5334m4778P763J08015L1045j03816j37195O4835k9730p9293J24717
1994E43481m4457q672p248k5719q3m1165p9059Q3721O5789L5960o5106r2825o4304
1981C00313j2469L6258Q9744o061l7355o4520J5720J852k6447J8542j6982N9586
1969C58181o6988K7503k0330j5057j0576N8385J8133o9784O6836j5305j17641
1958B13357k6141n4018M099L7136m0559K4455Q7222Q415J3512p894j05344r9j5863
$$ y = [2117611, 1870104, 1833363, 1872461, 1798875, 1716882, 1619125, 1538541, 1459485, 1256271, 1237937, 1221178, 1185538, 1159442, 1230991, 1216045, 1048337, 939847, 952679, 943412, 959369, 898238, 933709, 962164, 944892, 814270, 809330, 750311, 776203, 829199, 816648, 786213, 736179, 713003, 657252, 601918, 557140, 564903, 672918, 703963, 600147, 462952, 527787, 498057, 418764, 543481, 499024, 490352, 483104, 457385, 457302, 416137, 337078, 420799, 486588, 522548, 457442, 364617, 300313, 287844, 324102, 413846, 407785, 370430, 305910, 321630, 323482, 297035, 315577, 298595, 358181, 291193, 318696, 298366, 283309, 272733, 331118, 349251, 279467, 346303, 330998, 213357, 187216, 133198, 137297, 174433, 133874, 158329, 245551, 253966, 267478, 259584, 154240, 154141, 138278]
1945A38278r76O3111m0917k5289M2568o861J7275J172j5345q7311J01670l709
1933A83666n2250j345J1496P396K5499o8728l8180M4065P6523L3229o706p3031
1921A41634r723J2319n4261p8681n4287n828P3870m256n8144J15766l1971m8622
1909b184N2785n5748J50593l1621L5521P2620m6139o0874k0564k0943K0593k6766
1897F7273N0360n4346J01692m0698L2662O6200m4652K6823q9151J4491N9526K5676
1885B15856q8176J25l0537m2923m117j1066n9517N7333n9004O8457J9835P1491
1873A37757k8308m3046j4954J4053L7182q7921q475P4491n3988n469M1361j79
1861F2504o7481Q4823R588O234M4922l0614M8935J1324M8610o9919r0325l1956
$$ y = [138278, 137302, 200413, 159496, 134207, 176775, 169914, 187189, 188361, 173016, 85705, 187375, 183666, 131416, 130071, 141567, 148963, 174462, 105734, 67554, 111619, 188142, 221371, 214665, 141634, 131911, 144230, 89969, 11288, -42999, -48827, 25043, 20787, -37357, 78409, 46438, -2184, 50601, -5147, 145446, 113825, 149346, 221966, 175827, 114953, 94389, 73446, 94039, 67273, 117633, 63287, 164979, 124281, 156943, 223143, 178491, 205314, 116163, 130654, 190180, 215856, 127680, 127805, 97268, 54345, 50228, 39162, -20355, 36978, -22026, 46431, 66266, 137757, 109449, 66403, 51449, 65502, 102684, 14763, 6288, 80779, 26791, 21322, 62683, 62504, -4977, 79846, 89434, 95668, 140590, 109976, 158911, 170235, 218845, 148926, 58601, 26645]
1849B6645n5821k4521O7300N7388K1653j2393j5610n5816o0826O0997J62216k1344
1837A49868m9320r5136m8936J44077k5014P0950j1617L8851N580m6029m5728m8326
1825C9220l6390j8734K4783Q729J12435l8069l7517O4374p2224n840K4745n6458
1813I054O2306m0018n1971O6915k1796l7054K0078N2097l0810L2430J18094q2955
1801I6370q763P8578J9613j0467p7991l0104k7419N5332M9484j4798Q4349j8561
1789A95623j06373m7902l3810J89230l6653j40235K6241J4068p6415N8034K4526
1778F6334M908l9673r872O7488p4965r99o4346K0157K5561J48912j9373j2021
1766A12111l6256M1146j01367K0432N5910j12391k9909P5146J07406M1377m9660
$$ y = [26645, -29176, -53697, 13603, 70991, 92644, 80251, 64641, 8825, -52001, 8996, 171212, 149868, 100548, 5412, -43524, 100553, 75539, 146489, 134872, 173723, 179303, 133274, 87546, 39220, 2830, -15904, 8879, 17608, 130043, 91974, 54457, 118831, 46607, 40767, 65512, 9054, 71360, 31342, -20629, 46286, 24490, -12564, 7514, 59611, 28801, 61231, 179325, 96370, 87607, 166185, 185798, 175331, 97340, 67236, 39817, 95149, 144633, 129835, 214184, 195623, 89250, 41348, 7538, 196768, 160115, 19880, 46121, 60189, -16226, 41808, 66334, 71242, 31569, 21697, 89185, 14220, 13221, -51125, -30968, -5407, 143505, 124132, 112111, 75855, 117001, 15634, 36066, 91976, -20415, -50324, 24822, 132228, 173605, 123945]
1755A23945j66146j6709K8299P8258K9270k7177L3605O2985o7187m5910O226m4964
1743e505N1611J7276q0562P9576l6925M6495o1276M1839M3349n372l9810n2186
1731a490P3824n277r8209R198J00616j9799n9256L9432O7842J0777L1266l1452
1719A17472j10796n075K7678K6981q968L0119J8913L1838J09682p4623n9899K6618
1707A29940r572j11158J6564l3974J30973j21569p5631K8161l5114P915R3281
1696A9816J01012n4312r7437K6164N9949r2031L15J02605R4321j03434r3004Q3788
1684D7752j6888P1582M099K4548K2610O144r6465j26178l6341J9091K6856k4130
1672g7320M7225L2877L4901J00294j707o3702J2259m2757J24768j22302L7611
$$ y = [123945, -42201, -58910, -30611, 47647, 76917, 49740, 83345, 146330, 79143, 33233, 39459, -5505, 46106, 63382, -17180, 62396, 25471, 71966, 10690, 52529, 95878, 90506, 50696, -1490, 72334, 67057, -31152, -21954, 78662, 58863, -393, 39039, 106881, 117658, 148924, 117472, 6676, 1601, 29279, 56260, 47292, 77411, 96324, 128162, 237844, 163221, 103322, 129940, 120368, 9210, 25774, -8200, 122773, 1204, -74427, -46266, -81380, -73465, 19816, 120828, 66516, -30921, -4757, 55192, -36839, -36524, 66081, 160402, 56968, -36036, 47752, 30864, 102446, 106545, 131093, 153703, 159847, 63382, -62796, -99137, -80046, -53190, -77320, -30095, 2782, 37683, 137977, 136270, 72568, 84827, 42070, 166838, 44536, 82147]
1661H2147L6704N6919J9008j10522p7113K4406o2634l8029R1138k0216k8788Q4399
1649E7419K3462m072q900n366L7638m7659N6827N5521j13724o1664n8824Q0681
1637A1339o8809o2055N5647k1219R3779L3528n9764q837O3003k6270r107K7824
1625B9059j8920K0572M0912m4880N8171j0457q7234l3034L9127j0425K4995N1192
1613E9078n9453p0333k2294M238P8130O6050J0688O028n492q2336l0210k1511
1601f7417N9254n1797J37214Q2996K5017j16322l8376K0293J7867j5519K0088
1590G3298l2224n0594J4646q9042m1425N5463R3847L1225M8882j24851j0825O2552
1578C0952L0227K1688j8374k7738n975R0353m7645l3053r715K4890P2248n3609
$$ y = [82147, 118851, 175770, 194778, 84256, 7143, 31549, -31085, -69114, 22024, 1808, -26980, 57419, 80881, 76809, 67909, 62543, 100181, 52522, 109349, 164870, 51146, -10518, -69342, 11339, -57470, -119525, -63878, -85097, 8682, 42210, -17554, -26391, 36612, 10342, 1235, 29059, 10139, 30711, 71623, 26743, 84914, 74457, -12777, -45811, -6684, -17109, 7886, 59078, -375, -70708, -93002, -88764, -10634, 55416, 66104, 72132, 66640, -15696, -45906, -67417, -8163, -59960, 77254, 160250, 185267, 68945, 30569, 50862, 68729, 53210, 73298, 41074, -9520, 5126, -83916, -125341, -69878, 23969, 55194, 104076, -20775, -31600, 30952, 61179, 82867, 64493, 36755, 30780, 121133, 73488, 40435, 30720, 55610, 127858, 74249]
1566G4249m0646m8966M4789M3288L3004l3681Q880J2586l8418o5919J32577j3027
1554A08716r5912l5229l703m91M5922p8524J22481l8240p3011J27137j9077r2013
1542c1944J6718K1114k8605K5825q6919j2775J11002m112n0407J00741O3806l1178
1530I3266p775m5852k727L4859m7197j2419o3186p7798J86459K4728j33847l9925
1518i1414k647K0798q010Q5642M3432j1280J05299m9608n8921N030q5585R4355
1506D7091o4606j9406j2917n8737l796n897r8422J0857J57111J59791k0963n8120
1494C1986K0164n0297n8402J8844l356j8580J37398n4249n5093m64k7890Q9311
1482B9372L2193m3908n4003P3847N683P9138o9232q6077m2631Q4042J6967j20773
$$ y = [74249, 33603, -15363, 29426, 72714, 105718, 72037, 80917, 93503, 55085, -10834, 121743, 108716, 12804, -22425, -26128, -26619, 19303, -59221, 63260, 25020, -47991, 79146, 60069, -31944, -15226, 5888, -22717, 3108, -83811, -96586, 14416, 10304, -40103, 60638, 124444, 93266, 85491, 39639, 36912, 71771, 24574, 12155, -51031, -128829, 57630, 82358, -51489, -91414, -94061, -73263, -81273, 4369, 47801, 36521, 141820, 92212, 33291, 38321, -47264, 47091, -17515, -36921, -49838, -108575, -112371, -118268, -216690, -205833, -48722, 111069, 90106, 31986, 52150, 1853, -56549, -37705, -41061, -59641, 77757, 23508, -31585, -32049, -59939, 29372, 61565, 17657, -36346, 37501, 43184, 122322, 53090, -32987, -75618, 8424, 25391, -95382]
1470i5382M0520j783j2521k9180n1503L6140J43577o1001j832O755L6353l2811
1458b2668O9993J45349l1626o6978j22155O9101M6071m2928q3915j8950O4545
1447E839j0529l2695o5689M2054J08581q4000k3407J4077p8450Q2405L7938n4038
1435e7914J9570l7176j6817l5728R3227P2503o1352P4435j4000L3790L1777m8663
1423E3652o2719l3249R861L1325l3062j7464O0385L685q1662K0512L8965J3774
1411D003m6489k017k2778R9943j5284l3975N0746n4374k0147J860p999M0591M8030
1398D2110Q6077l5926n8060M523R296l6704n0711n2153L3199P5136l9449Q9277
1386F6615m5407J04047j31461n5760J14234n1090L906N1820n9374O513L0361o1388
$$ y = [-95382, -54862, -56645, -69166, -98346, -149849, -113709, 29868, -31133, -32965, -26210, 10143, -22668, 47325, 192674, 161048, 94070, -28085, 41016, 87087, 44159, -39756, -58706, 5839, -4690, -37385, -103074, -61020, 47561, -36439, -59846, -45769, -124219, -41814, -3876, -57914, -38344, -75520, -92337, -128065, -34838, 37665, -23687, 50748, 36748, 70538, 102315, 53652, -9067, -42316, -32455, -1130, -34192, -51656, 8729, 12414, -69248, -48736, -9771, 4003, -42486, -44503, -67281, 32662, 17378, -16597, 34149, -20225, -40372, -38512, -46511, -5920, 42110, 128187, 92261, 34201, 38724, 48020, 11316, -39395, -91548, -58349, 16787, -22662, 66615, 21208, 125255, -6206, -61966, 52268, 1178, 5084, 56904, -2470, 4043, 34404, -26984]
1374b6984m5254N3563O8837r0009k0792L6830m7361L3573P3204n7149M0481K8565
1362D7504j00843P9915r2440j104P684Q4346K4324p1564j0238K0652k8528K6075
1350a4217K2379J5566m2709L4831j74j2172J11539p752j26256m2770M2562n9235
1338g8408P7195J0349q976j52475N7426J08880j3804m1901O3926k6474m1702M6753
1326G89J7012n7009O537R6624K4739j16866m8887l470m8587K7944l623J09565
1314D768K6980M252J17810j08939r6992p7980j3881J1400O6334P8375l0461J2385
1302e949j14980k0924l1899L3269J03907r001J7235J517N6178p4589K4472J41455
1290A20691R340j59528K2330M1962p0329O654L4494J9949m8662J4377P4327L2436
$$ y = [-26984, -72238, -18675, 50162, -39847, -60639, -23809, -71170, -37597, 35607, -21542, 18939, 47504, -53339, 26576, -65864, -66968, -59284, 25062, 49386, -22178, -32416, -11764, -40292, -14217, 8162, 23728, -18981, 15850, 15676, 3504, 115043, 107291, -18965, -61735, -19173, -78408, -1213, 9136, 160, -152315, -94889, 13991, 187, -41714, 22212, -4262, -45964, 789, 17801, -39208, -32671, 63953, 88692, -28174, -77061, -80531, -129118, -101174, -104797, 4768, 31748, 36000, 153810, 44871, -52121, -130101, -143982, -132582, -66248, 12127, -18334, -5949, -120929, -141853, -173752, -140483, -36576, -45577, -28342, -26825, 29353, -45236, -20764, 120691, 130031, -29497, -7167, 34795, -35534, -28880, 5614, 25563, -23099, -8722, 65605, 98041]
1278I8041J6302o7972q6842L7321J29614J1210l9292r4652N9600M1324q1431N6261
1266G9484k0504Q4668N461l2834P991J002L6493k348j3423m3277j9528q5631O004
1253C558J35490r1196j08103K656Q1181k6707k7208M8039r3851M2979J69822m5077
1241I1583j23214J04554J5862p3963O0252l4082l1355m5874o2432R8331j6823
1230a7161k9170J0490k732N5538K678k379j18067N4742P7092j08873r636J8047
1218f9431j2240J47228k9947j26698J4775j22608O6155J23027l614P7333O6229
1207A30209n4925j7664o7257Q7950m6604j101n8657o5351J2859O08J27768j02289
1195e4454J5224l2619N6118K1317n613M2095m6722r2773k4479O0458J09302n8822
$$ y = [98041, 114343, 46371, -40471, -3150, 126464, 137674, 98382, 3730, 63330, 104654, 23223, 79484, 58980, 143648, 149109, 116275, 124266, 125268, 161761, 159413, 145990, 102713, 83185, -2446, 3558, 139048, 47852, -60251, -57595, 23586, -3121, -30329, 17710, -76141, -33162, 136660, 91583, -31631, 72923, 88785, 14822, 75074, 40992, 9637, -36237, -98669, -338, -17161, -46331, -35841, -38573, 16965, 19643, 17264, -100803, -46061, 31031, -77842, -87478, -69431, -81671, 65557, 35610, -91088, -76313, -198921, -132766, -9739, -13353, 63980, 130209, 75284, 57620, -9637, 78313, 31709, 30608, -28049, -93400, -80541, -79933, 47835, -54454, -39230, -71849, -15731, 5586, -27, 42068, -4654, -97427, -121906, -61448, 47854, -10968]
1183a0968K297o4006k7255O0891k6736P1175k3635m7358O008k6451J18032p942
1171B4052k9313P6494q3843o0258Q0980l4895N2236j1600K2814O6230L387j2434
1159I3850r0495K2746j7480J3168o1492j6887K1611q912L3292J3715j7709o473
1147b1066L9001K4675K9021L5634j01655K1814r904m5735k9409n0550O7433K9824
1135a0917k2639N8673M9533K293r0150N7519L4750n3082n6901q7269O0469N3300
1123d421l7851J2743J10042J7754l9943l4401M6530j432j30569J00499J1053q0794
1111c0790Q6707m749k9148q7439J5624l1614P1242K1427o0087J8317j568O3172
1099C1094l8258p5589R5805n0629q3125J5771J9107L9821K6378Q3010k9237p3594
$$ y = [-10968, -8671, -72677, -99932, -39041, -65777, 5398, -18237, -65595, -59587, -86038, 31994, 24052, -5261, 71233, -12610, -72868, 8112, -26783, 25453, 13853, 36667, 102897, 106284, 93850, 3355, 26101, 8621, 21789, -39703, -56590, -34979, -43891, -10599, 3116, -14593, -21066, 17935, 42610, 71631, 107265, 5610, 27424, 17520, -28215, -57624, -108174, -40741, -10917, -33556, 25117, 74650, 76943, -13207, 44312, 79062, 25980, -30921, -118190, -57721, -4421, -42272, -29529, 80513, 98267, 58324, 23923, 70453, 69021, -61548, 38951, 50004, -30790, 55917, 51168, 22020, -65419, -49795, -81409, -10167, 11260, -48827, -30510, -32078, 31094, -7164, -82753, 13052, -37577, -120702, -104931, -85824, -46003, -19625, 63385, 34148, -39446]
1087c9446j2200J653j4802r0775K4430j5107O1412L5286P3q505K9705M7566J9880
1074C9170n2791k2746M7102J22056j4931p8222k4089q2510l4820N5953P7164j28166
1062i6830J50547o4613L5450N6272n8060l1560R0251l1339l8266J8233L2431Q9366
1050A51882l0406j36765m6346q8286J24699M1782j0995M423O0017k9130o6473
1039b5598n1008l029p046R3907l6528j50940P3732J14j4615J15296Q035m8305
1027d5985M5150Q15k0572N3590p9973o244J14400j4485j1669p8098k2208L6120
1015b9159O0830J7060n1435j27697K518N7440J8771j92J146m8691j1272L587J25881
1002A8787j7889l3056P7063R0300j37448P1760M9501j8688j20888O4262J08784
$$ y = [-39446, -51646, -49993, -64795, -155570, -131140, -146247, -84835, -49549, -49476, -57981, -28276, 19290, 39170, -13621, -36367, 10735, 132791, 117860, 39638, 15549, -66961, -101781, -45828, 31336, -96830, 53717, -10896, 24554, 80826, 22766, -8794, 81457, 50118, 11852, 30085, 62516, 151882, 121476, -15289, -61635, -149921, -25222, 16560, 5565, 9988, 70005, 40875, -25598, -76606, -79635, -86681, 7226, -29302, -180242, -106510, -106396, -121011, -5715, 2320, -45985, -835, -20, -20592, 32998, -46975, -53219, 61181, 46696, 35027, -43071, -65279, -29159, 31671, 48731, -2704, -130401, -127883, -70443, -51672, -51864, -50718, -99409, -110681, -107094, 18787, 898, -32158, 44905, 135205, -2243, 69517, 119018, 100330, -20558, 43704, 152488]
991A52488n9209k2848r504J5333K0K8040o8125j1880j8477P8907J3779j09304
979a0780q0609R2762Q655r0438L7848r4597Q9933m4319R3955m452r6782N0903
967d7921N1634O961L8899n4262l2485K0775M2578O3483l4750p9839m3180L1405
955c6702O0481j08255M1390J04907r9848p2851r3422M8455R3863m1898N6944J66862
943A19926O379j1601j8344l371j10501o9613R9811j5407M9877J37864r5699n2526
931C6795k8201M3920K0181K3342p3443q8939l7662P7634l8579k1559M7896O6759
919B8144J6790m1539k6422k7979Q7474j04234K5008l5188J7188N2904P8019L2001
907A02166n4824n2119M9224N6050p5027L545r0466l6905N585O2076K0039n2443
$$ y = [152488, 93279, 70431, 60927, 76260, 76280, 104320, 36195, 24315, 5838, 84745, 98524, -10780, -91389, 1373, 10028, -80410, -42562, -137159, -47226, -91545, 2410, -2042, -98824, -47921, 3713, 10674, 49573, -4689, -37174, -16399, 26179, 89662, 54912, -24927, -68107, -36702, 23779, -84476, -43086, 61821, -38027, -110878, -204300, -155845, -61982, -103880, -46936, 119926, 126305, 114704, 96360, 92989, -17512, -87125, 12686, -2721, 47156, 185020, 89321, 36795, 8594, 52514, 72695, 96037, 22594, -66345, -104007, -26373, -64952, -86511, -38615, 28144, 44934, 3395, -23027, -51006, 36468, -67766, -42758, -77946, -60758, -7854, 70165, 102166, 47342, -4777, 44447, 100497, 25470, 29015, -61451, -98356, -92771, -30695, -10656, -63099]
895f3099j9691P9578k4917Q1792J01430j32707p0617K2994J6422L3376l2289K4317
883A6589R073r200K5505n6348n9167K9909m2113K5538M6481k3579l2129K7468
871d1973Q3983K4820k5896Q4849J4325l9823j07776L0667M478j29J4353j34K8868
858G0612L2307q5480j0516j1971K6490l9994p4976J3383n6000k6570K6009N8025
846g8681L5858l2722k007k1685j09667J05029J5322O8240J5873N0039n6595M944
834f052N0691k3891o466M1882n76N5636j31011j55207J05451K863J524k4708J4068
821g5796O9411K0634J4433M650q1723o2266M8675O8332o7316J1091o097K3452
809c2520M7937k1976J756J6598j138k5034P068P3775n0232j01124L5900J7346
$$ y = [-63099, -82790, -3212, -28129, 53663, 155093, 22386, -48231, -25237, -8815, 24561, -7728, 16589, 25662, 16462, 41967, -14381, -73548, -43639, -85752, -60214, -13733, -37312, -69441, -41973, 42010, 66830, 40934, 125783, 140108, 100285, -7491, 23176, 27654, 27525, 41878, 41744, 70612, 102919, 17439, 6923, -5048, 21442, -18552, -93528, -80145, -136145, -162715, -136706, -78681, -42823, -75545, -77552, -99237, -208904, -103875, -88553, -20313, -4440, 45599, -10996, -6052, 44639, 20748, 14282, 56164, 55588, 111224, -19787, -174994, -69543, -66680, -65156, -89864, -75796, -6385, 14249, 28682, 33332, -48391, -110657, -61982, 6350, -60966, -49875, -55972, -32520, 15417, -6559, -4803, 11795, 10657, -14377, -7309, 66466, 16234, -84890, -48990, -31644]
797c1644K2760k8319O3932k959m5331O1083N2529p9711O7515M4799k5743l0075
785F8836n0330k7620k7841K1329J33510k6620L8135N4026j28239K4441n0828K8496
773E7295J643m8171k6837N4353l3232m8244O9426m3152Q0458l0021j9012j0099
761D407o662j00843J34477O3719n5115Q1903m5813j19195q6837R4528r701n3261
749i8393J2075N9798O8855m7058n7259k1510J5365R1490M0629L0100q4140j1107
737a155L4239k8211R475j04548k4967J4199K0043n779L3124N9420o6350L1065
725b9445L137J0592m057R9136n7144L466Q4682k7084p3267k7170j36639Q9300
713f4493J52888j22396j05791k2014N3244m170J7938J32263N5407m5138l2387
$$ y = [-31644, -8884, -37203, 26729, 23770, -21561, 39522, 92051, 12340, 79855, 124654, 98911, 68836, 18506, -9114, -36955, -15626, 117884, 91264, 129399, 183425, 55186, 79627, 28799, 57295, 58938, 10767, -16070, 38283, 5051, -43193, 26233, -16919, 63539, 33518, 14506, 4407, -2255, -103098, 31379, 95098, 39983, 121886, 76073, -43122, -129959, -35431, -45132, -98393, -86318, -26520, 42335, -4723, -61982, -83492, -68127, 23363, 63992, 94092, 9952, -1155, 33084, 4873, 14348, -90200, -115167, -100968, -80925, -86704, -53580, 5840, -60510, -29445, -26308, -15716, -19773, 79363, 22219, 25685, 110367, 83283, 10016, -17154, -153793, -64493, 88395, -34001, -139792, -161806, -108562, -112732, -94794, 37469, 92876, 47738, 15351]
702A5351J4605L4379j16225q2232p6004N2070J5266J23045L5352l5487K8264q4123
690g5739K2136j6143K9881p5697m8533P3162P5834l6605j09395J15633M151K4945
678a6370r221p5015r468P7363L4836k5532o1551L6906o670k4480O2445K769N4338
665D0350j4745p3536j30245J09705J92547l4437j01038K2272j8389n2039K7204
654c2351P1518r279K2658O632l3799L5443q2497q4908n6850N8637J32617m5857
642a8036q156l0927j0339J35184k549p4218L5290l3556p5633K3630N5382J3809
630I881j07091l3029p8593J19959N1839j6985m347J8710q835q8386l2121J59962
618i036J96704m8144q8450P732j6764j82242p0835K5399Q4220k1696M0255K0575
$$ y = [15351, 29956, 64335, -51890, -134122, -210126, -158056, -142790, -19745, 15607, -19880, 8384, -75739, -53603, -69746, -39865, -115562, -164095, -90933, -15099, -51704, -161099, -45466, -41315, -16370, -25591, -100606, -110074, -32711, 2125, -23407, -84958, -48052, -54722, -79202, -16757, -13988, 40350, 25605, -47931, -178176, -68471, 124076, 89639, -11399, 10873, -7516, -59555, -32351, 39167, 29888, 52546, 59178, 25379, 60822, -21675, -106583, -163433, -104796, 27821, -18036, -26192, -57119, -67458, 67726, 65177, -9041, 26249, -7307, -82940, -59310, -3928, 9881, -97210, -130239, -208832, -88873, -37034, -54019, -58366, -39656, -48491, -136877, -168998, -9036, 187668, 139524, 51074, 58806, 42042, -140200, -211035, -185636, -101416, -123112, -82857, -62282]
606f2282j5493l0433O3588M4328O1791o4181n860R8660p5633P32o0494k8177k1343
593i4797J7179j2370j0910Q7178j7417m302L3014K815p9221k6398K1820Q6821
581C412M1651q0680j10205K2315R6200L4399j9303P355j23148R8982N3506p4911
569e0427K6942O1948K5974l7380o804l6903j5215J20443K4477l9052K1511m4779
557E0735o7548N3516j5303m1078n6358J4217R0174J5246j3568j4301m6718j0427
545d1413P5869K0277J818r2681l5166k1328J23103L0808p5167p3390M6647n1877
533i2500L9250J4811N56k8054J64006O4200o9731r2449p5054k7354N3146R4086
521D4913p2103n6814O7721k6770M1640O2808l8111o4910p8493L0310Q2900J20946
$$ y = [-62282, -77775, -108208, -44620, -292, 61499, -2682, -8542, 90118, 14485, 15217, -45277, -73454, -94797, -77618, -89988, -100898, -13720, -31137, -35439, -2425, 390, -78831, -105229, -83409, 3412, 45063, -35617, -145822, -123507, -27307, 7092, -12211, -4856, -128004, -29022, 24484, -50427, -23485, 38463, 64437, 27057, 20253, -16650, -31865, 88578, 113055, 74003, 95514, 50735, -16813, 36703, 21400, -19678, -76036, -61819, 28355, 43601, 30033, 15732, -30986, -41413, 34456, 54733, 56551, -36130, -71296, -92624, 30479, 61287, -13880, -87270, -40623, -92500, -53250, -38439, -37883, -65937, 98069, 162269, 92538, 89, -74965, -102319, -49173, 44913, -27190, -84004, -16283, -43053, -1413, 61395, 23284, -41626, -120119, -89809, -6909, 114037]
509A14037r3189J8998n7738m836p7880J03512K7872m9696M5149m663O1218l5176
497D7608j02336l5810O3345K9206j40072j3359J65315p7610J10146j5706m1323
486a0596N8848j1241j25768O0411J0241N2597o2892K0160J00599N239p3069l7942
474a3413L0202O8736j7370j17708l1390l7909Q0217Q6537j06945m5807J00126
463d724j7250N4128j0381k0180k8171O6532J6148K7404r0112j25114J12508M8448
451B9236k3796o1598m9939M171p5292K4054N0462L2588O8094L4706P916j4587
439B6015j8146j5691J6875j4908O3598l2741j3103K4494o3965o8542N2783J20023
427G6692k4633L5336j3912k9590L7866m1677j63856k2010k7857P0962P1209O8740
$$ y = [114037, 20848, 39846, -17892, -22728, -100608, 2904, 30776, -18920, 26229, 21566, 82784, 47608, -54728, -90538, -27193, 2013, -138059, -151418, 13897, -63713, 46433, 30727, -10596, 48252, 37011, -88757, -28346, -18105, 34492, -28400, -8240, 92359, 97598, 24529, -13413, 16789, 85525, 68155, -49553, -80943, -118852, -38635, 47902, -59043, -104850, -4724, -21974, 32154, 21773, 1593, -26578, 39954, 56102, 83506, -6606, -131720, -19212, 29236, 5440, -56158, -106097, -101926, -177218, -153164, -102702, -70114, -2020, 32686, 40602, 26015, 7869, -7822, 9053, -5855, 57743, 25002, 11899, 36393, -27572, -96114, -43331, 76692, 52059, 87395, 73483, 43893, 81759, 40082, -123774, -145784, -173641, -102679, -31470, 37270]
415C7270k3922K2786n443J2676r1433m1902K3531J00780o4776J163P0556j0285
403C1001k598M96l1022m3309L9672J8855K1897l7237k2148o6567J39412M631p7258
390b4175N5592q1933L6819J2375L2390L2812l3982p32p7041j7834o166k911P0768
377d018N1136j8381l561m6195Q1030m5692o4857N7567p6825M8803j8797l6623
365g6413P6908m9693o2004L3848J18969l0484l6463m9676l927O7450N618N419
353d48J4088J2378L9359K6859m4140p8100P8387m7490K7420J6922o0844k8516
341d4125l1947o1615k0329J18706K338J15374l4053j18013J44100M0259m5383
330F5312j26854L4285Q0835j3859O6501j07721K1804K3533K2533j32669n2060
$$ y = [37270, 13348, 36134, 30691, 43367, -48066, -89968, -66437, 34343, -30433, -29270, 41286, 31001, 28403, 28899, -2123, -45432, -5760, 13095, 34992, -2245, -24393, -90960, 48452, 53083, -24175, 31417, -50516, -13697, -1322, 31068, 63880, 29898, 29166, -47875, -65709, -71875, -74786, -4018, 47118, 28737, 25176, -21019, 60011, 14319, -50538, 7029, -69796, -20993, -39790, -76413, 495, -49198, -111202, -77354, 41615, 11131, -25332, -75008, -78935, -11485, -5867, -448, 13640, 26018, 65377, 92236, 48096, -30004, 48383, 893, 28313, 45235, -15609, -44125, -76072, -137687, -158016, -39310, -36972, 78402, 44349, -73664, 70436, 110695, 65312, -61542, -27257, 53578, 39719, 106220, -1501, 20303, 43836, 66369, -66300, -118360]
319a18360Q0441M3751j28115k6674N869O5657M9867M0748L1778k4985P0290p2474
307A7793K3137o3895L5294q4726l8979Q422R1081k9028J4680J0680M1774k2768
295C465M1349K7996P7593p2704m4484l4820l3568M6558K1787m8839m721L3261
283A2873l5237O7001m0720Q7835k6766q3787m0861N3520J4474P1439l4830j20804
271g5863O9329N5685K4185J3926j9624j7313o0028K0944O0195k9742k8843l3624
259b0773O9917q5584l3317Q3288j7361K9790p1767K5087J914J5938J6692o6403
247e2579O465n639K8219P7698p5679N1397o5385k2685k3965o4062k9697R8644
235g7268Q3501K160M0458o9353M7508O0206j3845n3009r3814J6034R1570j760
$$ y = [-118360, -37919, 5832, -122283, -148957, -143088, -77431, -27564, 13184, 44962, 19977, 90267, 17793, 40930, -22965, 12329, -72397, -111376, -102954, -11873, -40901, -26221, -15541, 26233, 3465, 44814, 72810, 150403, 77699, 33215, -1605, -35173, 11385, 33172, -15667, -20388, 12873, -22364, 44637, 3917, 91752, 64986, -18801, -59662, -6142, 8332, 79771, 44941, -75863, -6534, 49151, 73336, 87262, 67638, 50325, -9703, 11241, 71436, 41694, 12851, -20773, 49144, -36440, -69757, 13531, -3830, 25960, -45807, -20720, -18806, -2868, 13824, -52579, -46114, -51753, -23534, 54164, -21515, 29882, -35503, -58188, -82153, -146215, -175912, -77268, 6233, 8393, 48851, -20502, 27006, 87212, 73367, 20358, -73456, -57422, 34148, 32388]
223C2388j3467j8270P4505n8101p334o1646K7950l2502l401K8110m8929L2662
211d8035k3834l9525R9373Q5067o2378o4840j00706J9440J4629P2735j4538o0936
199a23548M16L8545L6157J36261o104o8183P9657L5641p5939k0162M5814k4756
187E3799P240o3946j9531K5716K4915q22l1899n5030N4932R770k1277L4971l1673
174a2835J9272Q052j390j37587J13720k4199m4982m8906J04486K8536m2172n873
162d3878K6223m814p2049J8779Q0231j1855L6909k602k5227J2436l8550m9129
150g3526N2669L3992j0921j3498n8189O5876l4356J625L3104K4639L4098N0946
138A06459o4110K9188R245l4134N4167Q4460m5384m0791J7793o2143r5404p8795
$$ y = [32388, 18921, 651, 75156, 17055, 9721, -51925, -23975, -56477, -59878, -31768, -80697, -48035, -71869, -111394, -12021, 73046, 10668, -54172, -154878, -135438, -120809, -48074, -62612, -123548, -123132, -84587, -48430, 87831, 81727, 13544, 93201, 128842, 52903, 32741, 78555, 53799, 61039, -2907, -22438, 3278, 28193, 27371, -4528, -59558, -4626, 5144, -16133, 18838, -12835, 6437, 14489, 13099, -124488, -10768, -34967, -79949, -128855, -24369, 4167, -38005, -43878, -17655, -22469, -94518, -75739, 4492, -7363, 29546, 26944, 1717, 14153, -24397, -73526, -20857, 13135, 2214, -11284, -69473, -3597, -37953, -36328, -3224, 21415, 55513, 106459, 42349, 71537, 80782, 46648, 100815, 185275, 139891, 99100, 116893, 54750, -40654, -119449]
126a19449N1534J23686N8248o9510m4525L8039M6063q0394n3625M5956j01819
115a05796L9518J4559N3007l1955P1213j0526k2022o540l9894m8888N8993O1831
103C3500j1270o2208j7676Q647N3493j6288n2129M571R6279O0621q0176m8664
91c1300J1447L4270J9246j5137k8902M2906o1178J7119N8388n2412J09357k207
79A01597n4959m9854m1954j6546k8885Q5186O8296k8327r1736l1778L4874K2174
67c1912M6460l7006l3636N5802p1932l4113K3338L9084L4187J9013N199Q2787
55I7271J1295M2596n4082n2217l9990n6767k6608K8797j1251n5966L6561J16699
43C6338p7m8538k7276K7568J1774n6132K8367J7741K2700j13394J0031R0955P5225
$$ y = [-119449, -67915, 55771, 114019, 44509, -16, 38023, 84086, 3692, -49933, -3977, -105796, -66278, -51719, 1288, -30667, 40546, 30020, 7998, 1458, -38436, -87324, -28331, 33500, 22230, -39978, -57654, -49007, 4486, -11802, -63931, -59360, 36919, 97540, 17364, -31300, -19853, 14417, 33663, 18526, -10376, 32530, -28648, -11529, 46859, -5553, 103804, 101597, 46638, -3216, -45170, -61716, -90601, -5415, 62881, 34554, -57182, -88960, -54086, -31912, 14548, -22458, -56094, -292, -72224, -106337, -82999, -43915, -9728, 9285, 14484, 97271, 108566, 151162, 97080, 44863, 4873, -51894, -78502, -49705, -60956, -116922, -80361, 36338, 36261, -12277, -39553, -11985, -211, -56343, -27976, -10235, 12465, -100929, -90898, 57, 75282]
30G5282r9866n9376L7107k9215M4682k1764P8843L8220K44j21333O3599O0966
18F7389k4269r3540L3894J08080l9224m3669r810L2678O013l6272l5865K3618
6a0977o029K6673l7211M8026O173n3697
0b7042
$$ y = [75282, -24584, -83960, -46853, -76068, -31386, -53150, 25693, 63913, 64157, -57176, 6423, 67389, 43120, -50420, -16526, 91554, 52330, 8661, -1149, 31529, 37542, 1270, -34595, -10977, -17006, 9667, -27544, 20482, 26655, -27042]
$$ Imaginary data points
##PAGE= N=2
##DATA TABLE= (X++(I..I)), XYDATA
16383b801689N272N4828Q9624L9639m269j3091K6678J9236L16N1454L309N2150
16371b476543J7043J1746N4368N0908Q3587M1208P1945J0991L5097j990P9943
16360b021697L197j5077K6027R5812p9267J5279J33039l4792N3638O1583J9535
16349a742723p266K0137K4239O283m5301Q7549J13778R826L150J9189K0758N8427
16337a431954N1160K5535K260O3598L1275J7185n4924J1854J25217n137N822j4012
$$ y = [-2801689, -2796417, -2741589, -2651965, -2612326, -2616595, -2629686, -2603008, -2583772, -2583456, -2532002, -2528693, -2476543, -2459500, -2447754, -2393386, -2342478, -2258891, -2217683, -2145738, -2134747, -2099650, -2101640, -2021697, -2018500, -2033577, -2007550, -1911738, -1991005, -1975726, -1842687, -1877479, -1823841, -1762258, -1742723, -1749989, -1729852, -1705613, -1699330, -1744631, -1657082, -1543304, -1533478, -1530328, -1511139, -1490381, -1431954, -1380794, -1355259, -1352999, -1289401, -1258126, -1240941, -1295865, -1284011, -1158794, -1163931, -1158109, -1172121]
$$ [...]
##END NTUPLES=NMR SPECTRUM
##END=
