##TITLE=1H_7-2022
 CDCl3
 8 sc, 
 7.02.2022
##JCAMPDX= 6.0         $$ Bruker NMR JCAMP-DX V2.0
##DATA TYPE= NMR FID
##DATA CLASS= NTUPLES
##ORIGIN= UXNMR, Bruker Analytische Messtechnik GmbH
##OWNER= root
$$ XWIN-NMR		Version 3.5
$$ Mon Feb  7 12:29:15 2022 Russian Standard Time (UT+4h)  she@DPX200
##.OBSERVE FREQUENCY= 200.131346
##.OBSERVE NUCLEUS= ^1H
##.DELAY= (6, 6)
##.ACQUISITION MODE= SIMULTANEOUS
##.ACQUISITION SCHEME= undefined
##.AVERAGES= 8
##.DIGITISER RES= 18
##SPECTROMETER/DATA SYSTEM= spect
##.PULSE SEQUENCE= zg30
##.SOLVENT NAME= CDCl3
##.SHIFT REFERENCE= (INTERNAL, CDCl3, 0, 15.7039)
##AUDIT TRAIL= $$ (NUMBER, WHEN, WHO, WHERE, WHAT)
$$ ##TITLE= Audit trail, XWIN-NMR		Version 3.5
$$ ##JCAMPDX= 5.01
$$ ##ORIGIN= Bruker BioSpin GmbH
$$ ##OWNER= she
$$ F:/spectra/data/she/nmr/H-F/1/audita.txt
$$ ##AUDIT TRAIL=  $$ (NUMBER, WHEN, WHO, WHERE, WHAT)
(   1,<2022-02-07 12:26:56.39 +0400>,<she>,<DPX200>,
      <created by zg, POWCHK disabled, PULCHK disabled
       configuration hash MD5:
       00 E9 B6 7A A2 85 ED C7 34 08 36 98 17 FE 4E 26
       data hash MD5: 16K
       CD 64 45 1E 01 72 C0 1B B8 7C D1 AB 46 64 2B B2>)
$$ ##END=
$$ 
$$ hash MD5
$$ FF BE 27 3E F4 63 DA B5 FD 95 81 38 DD 8E E2 03
##$RELAX= 
##$RELAX= 
##$RELAX= 
##$RELAX= 
##$RELAX= 
##$RELAX= 
$$ Bruker specific parameters
$$ --------------------------
##$DU= <F:/spectra>
##$EXPNO= 1
##$NAME= <H-F>
##$PROCNO= 1
##$TYPE= <nmr>
##$USER= <she>
##$AMP= (0..31)
100 100 100 100 100 100 100 100 100 100 100 100 100 100 100 100 100 100 
100 100 100 100 100 100 100 100 100 100 100 100 100 100 
##$AQSEQ= 0
##$AQ_mod= 1
##$AUNM= <au_zg>
##$AUTOPOS= <>
##$BF1= 200.13
##$BF2= 200.13
##$BF3= 200.13
##$BF4= 200.13
##$BF5= 200.13
##$BF6= 200.13
##$BF7= 200.13
##$BF8= 200.13
##$BYTORDA= 1
##$CFDGTYP= 0
##$CFRGTYP= 5
##$CHEMSTR= <none>
##$CNST= (0..31)
1 1 145 1 1 1 1 1 1 1 1 1 1 1 1 1 1 1 1 1 1 1 1 1 1 1 1 1 1 1 1 1 
##$CPDPRG= <>
##$CPDPRG1= <>
##$CPDPRG2= <>
##$CPDPRG3= <>
##$CPDPRG4= <mlev>
##$CPDPRG5= <mlev>
##$CPDPRG6= <mlev>
##$CPDPRG7= <mlev>
##$CPDPRG8= <mlev>
##$CPDPRGB= <>
##$CPDPRGT= <>
##$D= (0..31)
0 1.2 0 0 0 0 0 0 0 0.06 0 0.03 0 0 0 0 0.0002 0 0 0 0 0 0 0 0 0 0 0 0 
0 0 0 
##$DATE= 1644222415
##$DBL= (0..7)
120 120 120 120 120 120 120 120 
##$DBP= (0..7)
150 150 150 150 150 150 150 150 
##$DBP07= 0
##$DBPNAM0= <>
##$DBPNAM1= <>
##$DBPNAM2= <>
##$DBPNAM3= <>
##$DBPNAM4= <>
##$DBPNAM5= <>
##$DBPNAM6= <>
##$DBPNAM7= <>
##$DBPOAL= (0..7)
0.5 0.5 0.5 0.5 0.5 0.5 0.5 0.5 
##$DBPOFFS= (0..7)
0 0 0 0 0 0 0 0 
##$DE= 6
##$DECBNUC= <off>
##$DECIM= 32
##$DECNUC= <off>
##$DECSTAT= 4
##$DIGMOD= 1
##$DIGTYP= 9
##$DL= (0..7)
0 120 120 120 120 120 120 120 
##$DP= (0..7)
150 150 150 150 150 150 150 150 
##$DP07= 0
##$DPNAME0= <>
##$DPNAME1= <>
##$DPNAME2= <>
##$DPNAME3= <>
##$DPNAME4= <>
##$DPNAME5= <>
##$DPNAME6= <>
##$DPNAME7= <>
##$DPOAL= (0..7)
0.5 0.5 0.5 0.5 0.5 0.5 0.5 0.5 
##$DPOFFS= (0..7)
0 0 0 0 0 0 0 0 
##$DQDMODE= 0
##$DR= 18
##$DS= 0
##$DSLIST= <SSSSSSSSSSSSSSS>
$$ [...]
##$SUBNAM2= <"">
##$SUBNAM3= <"">
##$SUBNAM4= <"">
##$SUBNAM5= <"">
##$SUBNAM6= <"">
##$SUBNAM7= <"">
##$SUBNAM8= <"">
##$SUBNAM9= <"">
##$SW= 18.0517287032376
##$SWIBOX= (0..15)
0 0 2 0 0 0 0 0 0 0 0 0 0 0 0 0 
##$SW_h= 3612.71676300578
##$TD= 16384
##$TD0= 1
##$TE= 0
##$TE2= 300
##$TE3= 300
##$TEG= 300
##$TL= (0..7)
0 120 120 120 120 120 120 120 
##$TP= (0..7)
150 150 150 150 150 150 150 150 
##$TP07= 0
##$TPNAME0= <>
##$TPNAME1= <>
##$TPNAME2= <>
##$TPNAME3= <>
##$TPNAME4= <>
##$TPNAME5= <>
##$TPNAME6= <>
##$TPNAME7= <>
##$TPOAL= (0..7)
0.5 0.5 0.5 0.5 0.5 0.5 0.5 0.5 
##$TPOFFS= (0..7)
0 0 0 0 0 0 0 0 
##$TUNHIN= 0
##$TUNHOUT= 0
##$TUNXOUT= 0
##$USERA1= <user>
##$USERA2= <user>
##$USERA3= <user>
##$USERA4= <user>
##$USERA5= <user>
##$V9= 5
##$VALIST= <valist>
##$VCLIST= <CCCCCCCCCCCCCCC>
##$VD= 0
##$VDLIST= <DDDDDDDDDDDDDDD>
##$VPLIST= <PPPPPPPPPPPPPPP>
##$VTLIST= <TTTTTTTTTTTTTTT>
##$WBST= 1024
##$WBSW= 4
##$XGAIN= (0..3)
0 0 0 0 
##$XL= 0
##$YL= 0
##$YMAX_a= 482360
##$YMIN_a= -471933
##$ZGOPTNS= <>
##$ZL1= 120
##$ZL2= 120
##$ZL3= 120
##$ZL4= 120
##$ABSF1= 10
##$ABSF2= 0
##$ABSG= 5
##$ABSL= 3
##$ALPHA= 0
##$AQORDER= 0
##$ASSFAC= 0
##$ASSFACI= 0
##$ASSFACX= 0
##$ASSWID= 0
##$AUNMP= <proc_1d>
##$AZFE= 0.1
##$AZFW= 0.1
##$BCFW= 1
##$BC_mod= 2
##$BYTORDP= 1
##$COROFFS= 0
##$CY= 11.3945322036743
##$DATMOD= 1
##$DC= 2
##$DFILT= <>
##$DTYPP= 0
##$F1P= 2.36226072786647
##$F2P= -0.459571619588291
##$FCOR= 0.5
##$FTSIZE= 0
##$FT_mod= 4
##$GAMMA= 1
##$GB= 0.15
##$INTBC= 1
##$INTSCL= 1
##$ISEN= 128
##$LB= 0.24
##$LEV0= 0
##$LPBIN= 0
##$MAXI= 10000
##$MC2= 0
##$MEAN= 0
##$ME_mod= 0
##$MI= 1.114404
##$NCOEF= 0
##$NC_proc= 0
##$NLEV= 6
##$NOISF1= 3.799351
##$NOISF2= 2.8
##$NSP= 1
##$NTH_PI= 0
##$NZP= 0
##$OFFSET= 15.70392
##$PC= 1
##$PHC0= -15866.21
##$PHC1= 8.800779
##$PH_mod= 1
##$PKNL= yes
##$PPARMOD= 0
##$PSCAL= 0
##$PSIGN= 0
##$REVERSE= no
##$SF= 200.130013532006
##$SI= 16384
##$SIGF1= 3
##$SIGF2= 2
##$SINO= 400
##$SIOLD= 16384
##$SREGLST= <1H.CDCl3>
##$SSB= 0
##$STSI= 0
##$STSR= 0
##$SW_p= 3612.71676300578
##$SYMM= 0
##$S_DEV= 0
##$TDeff= 0
##$TDoff= 0
##$TI= <>
##$TILT= no
##$TM1= 0
##$TM2= 0
##$TOPLEV= 0
##$USERP1= <user>
##$USERP2= <user>
##$USERP3= <user>
##$USERP4= <user>
##$USERP5= <user>
##$WDW= 1
##$XDIM= 8192
##$YMAX_p= 0
##$YMIN_p= 0
$$ End of Bruker specific parameters
$$ ---------------------------------
##NTUPLES= NMR FID
##VAR_NAME=  TIME,          FID/REAL,        FID/IMAG
##SYMBOL=    X,             R,               I
##VAR_TYPE=  INDEPENDENT,   DEPENDENT,       DEPENDENT
##VAR_FORM=  AFFN,          ASDF,            ASDF
##VAR_DIM=   8192,          8192,            8192
##UNITS=     SECONDS,       ARBITRARY UNITS, ARBITRARY UNITS
##FACTOR=    0.0002768,     1,               1
##FIRST=     0,             0,               0
##LAST=      2.2672688,     0,               0
##MIN=       0,             -471933,         0
##MAX=       2.2672688,     482360,          0
$$ Real data points
##PAGE= N=1
##DATA TABLE= (X++(R..R)), XYDATA
0@%%%%%%%%qJ6j6J6k4L2m0N2o1Q1j04J20j44J76k08K44k85L33l89M53n25O02o89
$$ 0 0 0 0 0 0 0 0 0 -8 8 -8 8 -16 16 -24 28 -33 48 -56 64 -80 96 -112 132 -153 180 -209 244 -281 321 -368
31c68P89r00J020j153J300j461J641j840K056k288K545k828L135l467L830m232
$$ -368 421 -479 541 -612 688 -773 868 -972 1084 -1204 1341 -1487 1648 -1819 2011 -2221
47b221M671n151N675o248O883p587Q366r233J0208j1312J2572j4027J5724j7739
$$ -2221 2450 -2701 2974 -3274 3609 -3978 4388 -4845 5363 -5949 6623 -7404 8320 -9419
61i419K0178k3197K7049l2159L9302n0063O8318j07238L31659l24178k40448P82556
$$ -9419 10759 -12438 14611 -17548 21754 -28309 40009 -67229 264430 -59748 -300196 482360
73D82360m30652l69209N71786O7740n98950K62683L05301m57348q6153N01119
$$ 482360 51708 -317501 254285 322025 -276925 -14242 291059 -166289 -252442 248677
83B48677j50734k53944K85571N4197l10107L4114J75277n4215p8797J54558j8806
$$ 248677 97943 -156001 129570 183767 -126340 -92226 83051 28836 -49961 104597 85791
94H5791k54639J14878K10628k80756j7672L80583j56919l13894K88004P3551m17051
$$ 85791 -168848 -53970 156658 -124098 -141770 238813 81894 -232000 56004 129555 -287496
105b87496J46506L78658l57785j24329M44508k50406l47161M93213J01489m22913
$$ -287496 -140990 237668 -120117 -244446 200062 -50344 -397505 95708 197197 -225716
115b25716K18474K63948l34053o5144K63450j29798j25669K40347l3255k09884
$$ -225716 -7242 256706 -77347 -142491 120959 -8839 -134508 105839 72584 -137300
125a37300J39282K3421j87657J21150J48294r3330k8637M9600k2336n3951K7256
$$ -137300 1982 25403 -162254 -41104 107190 13860 -14777 34823 12487 -41464 -14208
136a4208P2746n7755k4201J28335o3007j66032J16953J18906j54390n665K26933
$$ -14208 58538 783 -23418 104917 41910 -124122 -7169 111737 -42653 -48318 178615
147A78615r7754k31653J76791O7028k30014J31576J43405k44249K4655J91901
$$ 178615 80861 -150792 25999 93027 -136987 -5411 137994 -106255 -81600 110301
157A10301j80008p7736K25126q421j29472J24441L0580j70442O5089Q9344j38640
$$ 110301 -69707 -147443 77683 69262 -60210 64231 94811 -75631 -10542 78802 -59838
168e9838O1483J24551j71842n0679J42441m6221p9534P8989O0876m7135k8648
$$ -59838 1645 126196 -45646 -96325 46116 -105 -79639 -650 60226 13091 -15557
179a5557M3296k6806n5319O8040M1676o3464j82N8461m2732q9195Q3445J00369
$$ -15557 27739 933 -54386 13654 55330 -8134 -8316 50145 7413 -81782 1663 102032
191A02032j17203j1430J34574r3975p2136J13961n4744o6890J27621j1603j32023
$$ 102032 -15171 -26601 107973 13998 -58138 55823 1079 -65811 61810 50207 -81816
202h1816O1424P1887j19281N63J48362o1515p4544J09836m3004q5802J09696k328
$$ -81816 -20392 51495 -67786 -67223 81139 19624 -54920 54916 11912 -73890 35806 33478
214C3478r8941O7320N3787q4712l9484O2076J4609m6609L1644L7794m2706l065
$$ 33478 -65463 1857 55644 -29068 -68552 -6476 8133 -38476 -6832 30962 -11744 -14809
226a4809J5394k4035P990K7997L068l4612j0077N8172k9487o4994P8722K8677
$$ -14809 585 -23450 -15460 12537 15605 -19007 -29084 29088 -399 -65393 13329 42006
238D2006o4818L7352J8179o0987K2565M2046n0818j3573P9583k6293r4226P2569
$$ 42006 -22812 14540 32719 -28268 -5703 36343 -14475 -28048 51535 25242 -68984 3585
250C585M8374r6747L1850O6926o4998Q231M5924n6761j4489O2658l606n9235K3058
$$ 3585 51959 -44788 -12938 53988 -11010 -2779 43145 -13616 -28105 34553 30947 -28288 -5230
263e230M9682n7026k6239N7885j1304k0005K5066j2789r057J4183N60j5585j2948
$$ -5230 44452 -12574 -38813 19072 7768 -12237 12829 40 -9017 5166 5726 -9859 -22807
276b2807M0168J0634o3749J8466M7511m2728j1586L6999m853j5725J3222M106
$$ -22807 17361 27995 -35754 -17288 30223 -12505 -24091 12908 8055 -7670 5552 9658
288I658k9891J8846M0410n7168j1647P7017l6084n0547N2078M500l0321J7119
$$ 9658 -20233 -1387 39023 -18145 -29792 47225 11141 -39406 12672 17172 -13149 3970
300C970N874j9750N568K4406k6885k4462N5107q59n6089L0867K4426k9499R58
$$ 3970 9844 -9906 -4338 20068 -6817 -31279 23828 22969 -33120 -2253 22173 -7326 -6368
313f368M152P73M906m933n67j1960R891K3799l3846q340M2176r603k4980P352
$$ -6368 -2216 -1443 3463 -1470 -2037 -13997 -4106 19693 -14153 -22493 19683 10080 -14900 -7548
327g548J4703M33j9011O707P165j5893K1059n529l4364L9614J6587m3696R008
$$ -7548 7155 7588 -11423 -4716 2449 -13444 7615 2086 -32278 7336 23923 -19773 -10765
340a0765K9315p724j6047L964J3617j0486K018P561k6553J7745K6763m0053n45
$$ -10765 18550 10826 -5221 -1257 12360 1874 3892 11453 -15100 2645 29408 -10645 -11190
353a1190L5220r928j0799k74O251Q935j4673l474J261k769J1974j7200j4578K6470
$$ -11190 24030 14102 3303 3029 9280 18215 3542 68 1329 -1440 10534 -6666 -21244 5226
367E226Q18j3965l20O648J8327j4831j6492K2402l889p491N949k0188Q236J7616
$$ 5226 6044 -7921 -8241 -1593 16734 1903 -14589 7813 3924 -3567 2382 -17806 -9570 8046
381H046k4269o618J9167R316j0964j2462J9056M120j5884Q992q205q55K4086k5149
$$ 8046 -16223 -22841 -3674 5642 -5322 -17784 1272 5392 -10492 -1500 -9705 -10560 13526 -11623
395a1623j5983K9450l5r288L016O068J3976p343q936N029J578Q669j1308j5137
$$ -11623 -27606 1844 1809 -7479 -4463 1605 15581 8238 -698 4331 5909 14578 3270 -11867
409a1867J9953k834j8635K932K267J7799L903k1199J4744J0778j1974M296o088
$$ -11867 8086 5252 -13383 -10451 -8184 9615 13518 -7681 7063 17841 5867 10163 4075
422D075K248J6129j7062j6612P480P442p638j5724K0619J5789k3589K591J824
$$ 4075 6323 22452 5390 -11222 -3742 3700 -3938 -19662 957 16746 -6843 -4252 -2428
435b428j2652K3693l377k5809J9623P802j9497p234P136J6546l80l509J0629p30
$$ -2428 -15080 8613 5236 -20573 -950 6852 -12645 -19879 -12743 3803 3423 -86 10543 9813
449I813K153o486j4993K2867R179k1476l047p155O61P950j9206R093K7142q743
$$ 9813 11966 5480 -9513 13354 22533 1057 -1990 -9145 -8484 -534 -19740 -10647 16495 7752
463G752l084K885l924Q153K889j781K388R198j885l6193r05L5791j6152j0454
$$ 7752 4668 7553 3629 11782 14671 12890 15278 24476 22591 -13602 -14507 21284 5132 -5322
477e322K2201r418k842J854k0789O918J6051o103o346m460l01j0060r637J2154
$$ -5322 16879 7461 4619 6473 -14316 -7398 8653 2550 -3796 -8256 -8557 -18617 -28254 -16100
491a6100R824J4158Q74k8902J1383J9973k5244P59J5294k636J979k0265j7098
$$ -16100 -6276 7882 8756 -20146 -8763 11210 -14034 -13275 2019 -617 1362 -18903 -36001
504c6001J2762j591j846J5366J0283j812j2139m53L946O151K6029r485k2496K8730
$$ -36001 -23239 -24830 -26676 -11310 -1027 -2839 -14978 -15431 -11485 -5334 20695 11210 -11286 17444
518A7444m668l6327J3230J4384L986J3033r882o692N829r283p114J4210K2547
$$ 17444 12776 -23551 -10321 4063 8049 21082 11200 4508 10337 1054 -6060 8150 30697
531C0697r244k2842P318o080q971K1627n990n43L3080j0033k3941L019J593J1538
$$ 30697 21453 -1389 5929 -151 -9122 12505 6515 5972 39052 29019 5078 8097 9690 21228
545B1228L537r421Q184o649l0009j3086J8310J6889j6233O11J9137j8838o441
$$ 21228 24765 15344 23528 16879 -13130 -26216 -7906 8983 -7250 -6639 12498 -6340 -12781
558a2781J0510j8034J6859K9907j8303j1374k334j2973K748L915N803J6555J745
$$ -12781 -2271 -20305 -3446 26461 8158 -3216 -5550 -18523 -15775 -11860 -6057 10498 12243
571A2243k1201j6282K0217Q885k7864J6367K7560k2661q293m252j9263J7358J7281
$$ 12243 -8958 -25240 -5023 3862 -24002 -7635 19925 -2736 -11029 -15281 -34544 -17186 95
584I5j539R769k345r232l473k904J0667J5892L557j5955r838J6670j6719l0679
$$ 95 -1444 8325 5980 -3252 -6725 -9629 1038 16930 20487 4532 -5306 11364 -5355 -36034
598c6034K8669K1236r483N478j2485j2173J2251m090N281K1593k095j3127q154
$$ -36034 -7365 13871 4388 9866 -2619 -14792 -2541 -6631 -1350 20243 18148 5021 -3133
611c133m868k211N415J1962q009N714K3192l1688k7131K9236P408l149J2181r726
$$ -3133 -8001 -10212 -4797 7165 -844 4870 28062 -3626 -30757 -1521 5887 2738 14919 5193
625E193o628l768j6107N910J8671O297n698j345P113j0759p238J0609j740J7022
$$ 5193 -1435 -5203 -21310 -15400 3271 9568 3870 2525 9638 -1121 -8359 2250 510 17532
639A7532J6932l1777j4464J0660p365N219P718N94J1247j1939k0177R131J2101
$$ 17532 34464 2687 -11777 -1117 -8482 -3263 4455 5049 16296 4357 -15820 -6689 5412
652E412l774l271J6510O817k3506n670m02j0278K7288J2987k5358O024N233j8795
$$ 5412 1638 -1633 14877 21694 -1812 -7482 -7884 -18162 9126 22113 -3245 2779 8012 -10783
666a0783R02P688Q030P483q766q316j548J61q383p428K4447J3560j9521k591n293
$$ -10783 -9881 -2193 5837 13320 4554 -3762 -5310 -5149 -13532 -20960 3487 17047 -2474 -5065 -10358
681a0358o524J8589o17m769J6385n901j4016k582k123Q960M742k800M631M031
$$ -10358 -16882 1707 1090 -3679 12706 6805 -7211 -9793 -11916 -2956 1786 -1014 3617 7648
695G648m149j9058k249K7515J180q264Q438j3274m353R487j4286M551K1468o257
$$ 7648 3499 -15559 -17808 9707 10887 2623 11061 -2213 -6566 2921 -11365 -6814 14654 8397
709H397j0194R63Q09l858m439R323P328K885j13k2146k784K0153p569k497J1641
$$ 8397 -1797 -834 -25 -3883 -8322 1001 8329 11214 11101 -11045 -13829 6324 -1245 -3742 7899
724G899m002K32n624j1462J0865O876l663K032J049J824q916j0216P534Q144Q064
$$ 7899 3897 4129 -1495 -12957 -2092 4784 1121 3153 4202 6026 -2890 -13106 -5572 2572 10636
739A0636m292j5843J0888M152j7895Q998Q954l368O803p954q573Q133j04m955
$$ 10636 6344 -9499 1389 5541 -12354 -3356 5598 2230 9033 1079 -7494 639 535 -4420
753d420K485J1607L243j7596k292P341k400Q332k792q077J5432m213j7222P454
$$ -4420 -1935 9672 12915 -4681 -6973 368 -2032 6300 3508 -4569 10863 6650 -10572 -3118
767c118N250R11N66m776M244r48q108j416Q23J1200K013j3520K524L382k148K559
$$ -3118 2132 3043 3609 -1167 3077 2129 -5979 -7395 -6572 4628 6641 -6879 -4355 -973 -3121 -562
783e62q086P429J3536j4538n069Q328l830Q31N8p93P717r62o415n481M878J2806
$$ -562 -8648 -1219 12317 -2221 -7290 1038 -2792 -1961 -1903 -2696 5021 4059 -2356 -7837 -2959 9847
799I847j0254n639J4271n749m587L453q692Q043Q344j1125m41O370J233n030n927
$$ 9847 -407 -6046 8225 2476 -2111 1342 -7350 693 9037 -2088 -2529 3841 5074 44 -5883
814e883J1358N200q831M88k172J948M931j0834J120Q681l690L38n723j741J2867
$$ -5883 5475 10675 1844 2332 160 2108 7039 -3795 -2675 6006 2316 2654 -3069 -4810 8057
829H057o467q527R859J568l993n023j680O523j657j801j337l239J1378k850j4514
$$ 8057 1590 -6937 2922 4490 497 -4526 -6206 317 -1340 -3141 -4478 -7717 3661 811 -13703
844a3703J3030O211r357K598j249R57M354p052j531L827L965o84j0274O212R607
$$ -13703 -673 5538 -3819 -1221 -2470 -1513 2841 -4211 -5742 -1915 2050 1366 -8908 -2696 6911
859F911r093j13L034N8O390q139m413J0480k685k848m83j996R288k165q868N703
$$ 6911 -2182 -2295 739 797 7187 -952 -5365 5115 2430 -418 -901 -2897 6391 4226 -4642 1061
875A061M550K13m231l996R316j622p106K960l934M609M438j3853L806J1501p986
$$ 1061 5611 5824 1593 -2403 6913 5291 -1815 1145 -2789 1820 6258 -7595 -3789 7712 -274
890b74k812K100K819K721n919j382J715J098K702j0316m63J3673p945n997O651
$$ -274 -3086 -986 1833 4554 -1365 -2747 -1032 66 2768 -7548 -8011 5662 -2283 -8280 -1629
905a629r60L736j680o201Q369J746m692j260j413P729%r138M646M173K96j525
$$ -1629 -2589 1147 -533 -6734 1635 3381 -1311 -2571 -3984 3745 3745 -5393 -747 3426 3722 2197
921B197o273R018M657r813L272mj888O203q854k911J1925k804p294N76N035L599
$$ 2197 -4076 4942 9599 -214 3058 3054 1166 7369 -1485 -4396 7529 4725 -2569 -1993 3042 6641
937F641p100J001N308l038M250n462q292J3139n57j1328N402J900j488j919n641
$$ 6641 -459 542 5850 2812 7062 1600 -6692 6447 5890 -5438 -36 1864 376 -1543 -7184
952g184N662L672l816j150l051M896J398j0715K824O004q69K61p631K570Q609
$$ -7184 -1522 2150 -1666 -2816 -5867 -971 427 -10288 -7464 -1460 -2329 -2068 -9699 -7129 1480
967A480q778M12P425k328K614l445o339P471K438m515k234M795O949r654n319
$$ 1480 -7298 -6886 539 -1789 825 -2620 -8959 -1488 950 -3565 -5799 -1004 5945 -3709 -9028
982i028J0754j510J631M376q279N115M839j1099J251O851J476j577n231L385K199
$$ -9028 1726 216 1847 6223 -2056 3059 7898 -3201 -1950 4901 6377 4800 -431 2954 5153
997E153m807M36n56O447O502j2027k951O346k902J883j310o69Q872p162p819O008
$$ 5153 346 782 226 6673 13175 1148 -1803 4543 1641 3524 2214 1545 10417 3255 -4564 1444
1013A444L29L47J018j887L950j160n141n065l61J2897j503j2040Q014K30q560
$$ 1444 1773 2120 3138 1251 5201 4041 -1100 -6165 -6526 6371 4868 -7172 842 1072 -7488
1028g488L893j336K832Q210o126m234K909L6k223l992P825P322p025k531m022
$$ -7488 -3595 -4931 -2099 6111 -15 -4249 -1340 -1304 -3527 -7519 306 7628 603 -1928 -5950
1043e950j774J0857l629l814R699k459m942k403l176Q535J609n944N807K201n331
$$ -5950 -7724 3133 -496 -4310 5389 2930 -2012 -4415 -7591 944 2553 -3391 2416 4617 -714
1058g14o472j052R628K934j122O07q268K724M832j1733N490J1498n382j773j543
$$ -714 -7186 -8238 1390 4324 3202 3809 -4459 -1735 3097 -8636 -3146 8352 2970 1197 -346
1073c46l517K471k047N74O913M102k801j2904k22J0706m344J009N913m550K287
$$ -346 -3863 -1392 -3439 -2865 4048 8150 5349 -7555 -7777 2929 -1415 -406 5507 957 3244
1088C244l298r384O597M803J10K666k732R07k391r258L592R905M695l987q653
$$ 3244 -54 -9438 -2841 1962 2072 4738 2006 2913 522 -8736 -5144 4761 9456 5469 -3184
1103c184M671L20q090O412K632j9P755q875p699O535k595j551O274M340O69q346
$$ -3184 1487 1807 -6283 129 2761 2742 10497 1622 -6077 458 -2137 -3688 2586 6926 7595 -751
1119g51n759J458K894P618l333m763R899m635j1258M355J588M073M909n105J112
$$ -751 -6510 -5052 -2158 5460 2127 -2636 7263 2628 -8630 -4275 -2687 1386 6295 1190 2302
1134B302j188p959j86M147P757L028p939k702o26K60K424n145O105J0409r536
$$ 2302 1114 -6845 -7031 -2884 4873 7901 -38 -2740 -3366 -3106 -682 -5827 278 10687 1151
1149A151m964J371m788N065L474j089O869k183r530l667M166Q119j906j459M594
$$ 1151 -3813 -2442 -7230 -2165 1309 220 7089 4906 -4624 -8291 -4125 3994 2088 629 5223
1164E223m114j263j621p898J0014Q441p238J165o47n740o78j125N897P454l100
$$ 5223 1109 -154 -1775 -9673 341 8782 1544 2709 2062 -3678 -4356 -5481 416 7870 4770
1179D770m852m383J771L209n362L116O920j596L35p791n775R868q0j999Q046j243
$$ 4770 -82 -4465 -2694 515 -4847 -1731 5189 3593 3928 -3863 -9638 230 150 -1849 6197 4954
1195D954n114l980k972O139M577j73j495j803M136m762q526P626M204M26L896
$$ 4954 -160 -4140 -7112 -973 3604 3431 1936 133 4269 -493 -9019 -1393 2811 3237 7133
1210G133q127k754M770o287R26Q961J533k501o388m04L559k335J350J385K370
$$ 7133 -994 -3748 1022 -5265 -4339 4622 6155 3654 -2734 -3138 421 -1914 -564 821 3191
1225C191N092q687o300N544o11L524L514m623L290k086r330L073N803J575j482
$$ 3191 8283 -404 -6704 -1160 -1771 1753 5267 644 3934 1848 -7482 -4409 1394 2969 1487
1240A487l015L080j281n204M04L88P259M282r679L28K543n719L392K470j53N063
$$ 1487 -1528 1552 271 -4933 -4529 -4141 3118 7400 -2279 -1951 592 -5127 -1735 735 582 5645
1256E645m182o144K039K289J434l413K311P224m691m809o09j166P386L98n436
$$ 5645 1463 -4681 -2642 -353 1081 -2332 -21 7203 2512 -2297 -2906 -4072 3314 3712 -1724
1271a724N539j288o149J549n11L968L615m437n59J539m44k241l822O059N242n207
$$ -1724 3815 2527 -3622 -2073 -2584 1384 4999 562 3 1542 1098 -1143 -4965 1094 6336 1129
1287A129q04k935n68N441m830k1Q694l357m403K35o37L102j184j541K848RL06
$$ 1129 325 -2610 -3178 2263 -2567 -2588 6106 2749 -1654 -1419 -2056 1046 -138 -1679 1169 1178 1484
1304A484n236l850Q342Q50l445L081k091J017P47o577M286N449l858j167m39J075
$$ 1484 -3752 -7602 740 1590 -1855 1226 -865 152 899 -5678 -1392 4057 199 -968 -1407 -332
1320c32R68m154J479L606J605O64o334P87N975m926J56K893j900K747l358m869
$$ -332 636 -3518 -2039 1567 3172 3836 -2498 -1711 4264 -662 -506 2387 487 3234 -124 -4993
1336d993N709J256k791K49J263L445l337l826L304O88J596q74n369M729J355o606
$$ -4993 716 1972 -819 -570 693 4138 801 -3025 279 967 2563 1689 -3680 1049 2404 -4202
1352d202K618J871M14K583m628k03M803k390k132k63K838J980o318l20K928j841
$$ -4202 -1584 287 701 3284 -1344 -1547 3256 866 -1266 -1529 1309 3289 -3029 -3349 -421 -2262
1368b262K396k248j661P339k444m901L966L38R93m30l776L652J191k933j204q3
$$ -2262 134 -2114 -3775 3564 1120 -3781 185 523 1516 1086 -2690 962 2153 -780 -1984 -2067
1384b067M627O3n004L540J119j389J403m337K235M999o484j136L112r78P95k235
$$ -2067 2560 2623 -2381 1159 2278 889 2292 -2045 190 5189 -1295 -2431 681 -297 498 -1737
1400a737k96M697n96j630j158J322M502m938k505N059k213q91l53l708M988J342
$$ -1737 -2033 2664 2068 438 -720 602 5104 166 -2339 2720 507 -384 -737 -4445 543 1885
1416A885n894K574K502O6n53k771K825J702k580o30j628K691J702o405K022M182
$$ 1885 -4009 -1435 1067 1133 580 -2191 634 2336 -244 -874 -2502 189 1891 -4514 -2492 1690
1432A690k882J261j426n53N277l285l396L371N50o69k499p76L839q87q03K65o7
$$ 1690 -1192 69 -1357 -1910 3367 82 -3314 57 607 -62 -2561 -3337 502 -385 -1188 -923 -990
1449i90N140j700n039N592R73l308R55k479J316K240m928p88L111R67q40k877
$$ -990 4150 2450 -2589 3003 3976 668 1623 -856 460 2700 -2228 -3016 95 1062 222 -2655
1465b655K860K674l141O67l42N69L872n689j690N443k260j190Q06p16L761r68
$$ -2655 205 2879 -262 405 63 632 4504 -1185 -2875 2568 308 -882 -76 -792 2969 2001
1481B001l909J978J731O92l022j846M143j651k764R18j569L255K026o011L399
$$ 2001 -1908 70 1801 2493 -529 -2375 1768 117 -2647 -1729 -3298 -43 1983 -4028 -629
1496f29M074m100J29O32J136K237l259k008R66J014r6l920K194M724l950m17J390
$$ -629 3445 -655 -526 106 1242 3479 220 -1788 -822 192 96 -3824 -1630 3094 -856 -1273 117
1513A17j565L916j472l391N074l91l993k66j32K744M26k457J081R12J279k046
$$ 117 -1448 2468 996 -2395 2679 2288 -1705 -1971 -2103 641 1067 -1390 -309 603 1882 -164
1529a64l356N523J522m567J949j426j333K415m020O98O125k205k453M44J041J821
$$ -164 -3520 2003 3525 -1042 907 -519 -1852 563 -3457 -2759 3366 1161 -1292 -848 193 2014
1545B014j998MJ853J36J163n019k469O071k066j985L850j213nj74m070L550L558
$$ 2014 16 20 1873 2009 3172 -1847 -4316 1755 -311 -2296 1554 341 336 162 -3908 -358 3200
1562C200k406j008K82J154j413l446J949J570J771J299n237J274L674m910J315
$$ 3200 794 -214 68 1222 -191 -3637 -1688 -118 1653 2952 -2285 -1011 2663 -2247 -932
1577i32M215j385R13k855l184L338K89k172L34K702K313m636k209K311m75L117
$$ -932 3283 1898 2811 -44 -3228 110 399 -1773 -1439 1263 3576 -1060 -3269 -958 -1433 1684
1593A684N89l740L717r74o252K920K484J19J403k210J78J566k167j574Q35M704
$$ 1684 2273 -1467 2250 1276 -4976 -2056 428 547 1950 -260 -82 1484 -683 -2257 -1422 3282
1609C282J464n343J13j25k423K853p84n0N267l853m391L163M8L68P85m4K672k25
$$ 3282 4746 -597 -484 -609 -3032 -179 -963 -1013 4254 401 -3990 -827 -779 -411 374 330 3002 2777
1627B777l360k930P83N580m79k647L291k525k513J424k526L240M510m742r01K153
$$ 2777 -583 -3513 -2730 2850 2371 -276 3015 490 -2023 -599 -3125 115 4625 -117 -1018 1135
1643A135j994j764n07L157L501q64j748l796P83L525k886J533M350l252j252o78
$$ 1135 -859 -2623 -3130 27 3528 2664 916 -2880 -2097 1428 -1458 75 4425 1173 -79 -757
1659g57l208L915J063k704K948J519k484l654j295L714K495O25j86k906J633k53
$$ -757 -3965 -50 1013 -1691 1257 2776 292 -3362 -4657 -943 1552 2177 1991 -915 718 465
1675D65m728M577L604k764J277j651k803J820k222p66M295K361j714m820n86K941
$$ 465 -4263 314 3918 1154 2431 780 -2023 -203 -2425 -3191 1104 3465 1751 -3069 -3655 -714
1691g14n81J901J030n59K773m112m190M961K56j294L371q17k08q55m529N24L937
$$ -714 -1295 606 1636 1077 3850 -262 -4452 509 765 -529 2842 2025 1817 962 -3567 -3043 894
1708H94K503j031l464J119q93k757J780J90K053L396n125j032L873l463j80L625
$$ 894 3397 2366 -1098 21 -872 -3629 -1849 -1659 394 3790 -1335 -2367 1506 -1957 -2137 1488
1724A488J398J519k712m030l43J557K021j508r8L421l059k489J203j136L536K376
$$ 1488 2886 4405 1693 -2337 -2680 -1123 898 -610 -708 2713 -346 -2835 -1632 -2768 768 3144
1740C144l772K573Q25n575q60K211K850J520k396r86k72K23L25j912L504L217
$$ 3144 -628 1945 2770 -2805 -3665 -1454 1396 2916 520 -466 -738 -515 -190 -2102 1402 4619
1756D619l845k63q96k715K707n62j010M967m38m461q48J541K930l23o9J356j096
$$ 4619 774 511 -385 -3100 -393 -955 -1965 3002 2564 -1897 -2745 -1204 1726 1403 1334 2690 1594
1773A594j2k519l083M606P67k934K866j102k114R90k124K081M714r09k433j371
$$ 1594 1582 -937 -4020 586 1353 -1581 1285 183 -1931 -941 -3065 -984 3730 2821 388 -983
1789i83R06K61k501J246J816M4Q11l504q37M185k321K46M032j451o43j558l263
$$ -983 -77 184 -2317 -1071 745 789 1600 -1904 -2741 1444 -877 -631 3401 1950 1307 -251 -3514
1806c514K348K262j508j031O16K005k152k211L056O86J285J506l749J281J153
$$ -3514 -1166 1096 -412 -1443 -827 1178 -974 -3185 -129 557 1842 3348 -401 880 2033
1821B033m905J109L238n89j5k058o06K284j51l24q0K366J738l811j489J452j412
$$ 2033 -2872 -1763 1475 886 871 -1187 -1793 491 340 16 -64 2302 4040 229 -1260 192 -1220
1838a220J129j86j730L413j373m025K672J820N43M81j374J035N34j902r79o97
$$ -1220 -91 -277 -2007 1406 33 -3992 -1320 500 1043 1524 150 1185 1719 -183 -1162 -1859
1854a859K926M39l985J832Q66k212J937p02P71L602l081k143K119m42m00j425
$$ -1859 1067 1506 -2479 -647 219 -1993 -56 -758 13 3615 534 -1609 510 68 -332 -1757
1870a757N08J918r83p90o88K71L780j349j398L520j258j736N06k010J829J370
$$ -1757 -1249 669 -314 -1104 -1792 -1521 2259 910 -488 3032 1774 38 544 -1466 363 1733
1886A733l462L46J590k10r22p78K596J305j030M10j255M96J585l966N58K886k291
$$ 1733 -1729 -1383 207 -3 -925 -1703 893 2198 1168 1578 323 819 2404 -1562 -1004 1882 -409
1903d09l39p3p85K811n89j809K008J044l32k214p18K513j243j050Q28j359K125
$$ -409 -748 -821 -1606 1205 616 -1193 815 1859 1527 -687 -1405 1108 -135 -1185 -357 -1716 409
1920D09q9l195L231J878j927P75o02M21J189k598q29J191K79o74k359J459K014
$$ 409 320 -2875 356 2234 307 1082 480 901 2090 -508 -1337 -146 133 -541 -2900 -1441 573
1937E73k226Q62P91l01K789k463j701L341q98j718N23m96J126l6j823R32J060
$$ 573 -1653 -791 0 -301 2488 25 -1676 1665 767 -951 -428 -924 202 166 -1657 -725 335
1954C35J166j179j594L206n61k480J307r67M21J156l510Q51K672j587l61P09Q50
$$ 335 1501 322 -1272 1934 1373 -1107 200 -767 -346 810 -2700 -1849 823 -764 -1125 -416 434
1971D34J284j301m77Q85J72L66k681J85K915k348j014J526o97J717J92k310K421
$$ 434 1718 417 -60 825 997 1363 -1318 -1133 1782 -566 -1580 -54 -751 966 1158 -1152 1269
1988A269J240k167j62r9J177p26j616R23jM20l3k054K417J811l053J143P48q94
$$ 1269 2509 342 180 81 1258 532 -1084 -161 -162 258 225 -1829 588 2399 -654 489 1237 343
2006C43J108j681j137K634o67j510k33P03J346j607R8J507m87Q45j346j604L257
$$ 343 1451 -230 -1367 1267 600 -910 -1143 -440 906 -701 -603 904 417 1262 -84 -1688 1569
2023A569q64k669J747P0j75L24k013J281J918j092m91L7J353r7k375J259K79m37
$$ 1569 705 -1964 -217 -147 -322 2 -2011 -730 1188 96 -395 -358 995 898 -1477 -218 61 -376
2041c76R83k424L62K946k552m44K442j22K43q76j280K086M5p86m58K62J507k085
$$ -376 607 -1817 -1455 1491 -1061 -1505 937 815 1058 182 -1098 988 1033 247 -211 51 1558 -527
2059e27j403K116n30J59P56j919J867P34l231Q49J583q7L03j520M14J178p76l8
$$ -527 -1930 186 -344 -185 571 -1348 519 1253 -1978 -1129 454 367 670 -850 -436 742 -34 -72
2077g2l43J407J363l019L69J447j867Q38k67q82K724j633k571J504O78L38j86
$$ -72 -415 992 2355 -664 -295 1152 -715 123 -144 -1026 1698 65 -2506 -1002 -324 14 -172
2094a72n43J625j29r21m01l51K788pk678K487k53k127Q39r18J006K062k274j124
$$ -172 -715 910 781 -140 -541 -892 1896 1889 -789 1698 1445 -682 157 -761 245 2307 33 -1091
2112a091J036l17J6j008J114J632r35k14j069r1K152j599j54L033j518j499L11
$$ -1091 -55 -372 -356 -1364 -250 1382 447 233 -836 -927 1225 -374 -528 2505 987 -512 -201
2129b01j419K127O92j991N01P36m64j407r15K163M09k46N93j482N32P51k811K032
$$ -201 -1620 507 1199 -792 -291 445 -19 -1426 -2341 -178 231 -15 578 -904 -372 379 -2432 -400
2147d00K993j568l45n22o98J354j151k99J297M47k53k255n48J604p75P19J363
$$ -400 2593 1025 680 158 -540 814 -337 -636 661 1108 855 -1400 -1948 -344 -1119 -400 963
2164I63q13J169j112k559K976J129j171J020p69j25j4j927J65J345J068q5k075
$$ 963 150 1319 207 -2352 624 1753 582 1602 833 708 694 -1233 -1068 277 1345 1260 -815
2181h15Q41j69k347J765O95k29J687k747j416K578o93n85J373P71J315j378j568
$$ -815 26 -143 -2490 -725 -30 -259 1428 -1319 -2735 -157 -850 -1435 -62 709 2024 646 -922
2198i22K93J4J564k26q84J613k136k279J780k12J184J428k008P83J024j752j20
$$ -922 -629 -615 949 723 -161 1452 -684 -2963 -1183 -1395 -211 1217 -791 -8 1016 -736 -856
2215h56L57J511J444j562o21o99l41R94r49J650K441k993p28J124j353J372n4
$$ -856 -499 1012 2456 894 273 -426 -767 227 -722 928 3369 376 -352 772 -581 791 737
2232G37r16J908j30k199j046J92J818M16n4J043j232k81j37j485K436J000k442
$$ 737 -179 1729 1599 -600 -1646 -1454 364 780 726 1769 537 256 119 -1366 1070 2070 -372
2249c72O13l00j262J35j363R54K706l52q92q69o5Q20o85J091J353j515L28j695
$$ -372 241 -59 -1321 -1186 -2549 -1595 1111 759 -133 -1002 -1067 -247 -932 159 1512 -3 325 -1370
2267a370r98K574q24p88K545j75o42o66j543J376J491j24l40q16M47r91j913K508
$$ -1370 -2368 206 -618 -1406 1139 964 322 -344 -1887 -511 980 856 516 -300 147 -844 -2757 -249
2285b49O13k01J388j694Q9J600k321L31K181j71N6j713j294R33j20L84M52K69
$$ -249 364 163 1551 -143 -54 1546 -775 -444 1737 1566 1622 -91 -1385 -452 -572 -188 264 533
2303E33J160j942q94J725p50L53R00j362J337n63k990R05J216N21N00q87L60o
$$ 533 1693 -249 -1143 582 -168 185 1085 -277 1060 497 -2493 -1588 -372 149 649 -238 122 116
2321A16p09N67l63J377Q06k663N80N93k055R37K15J73K247j478j526J043J40M43
$$ 116 -593 -26 -389 988 1794 -869 -289 304 -1751 -814 -599 -426 1821 343 -1183 -140 0 443
2339D43j31j37J097j137r49j57n29J791k1r75J949l44j389P01o49J397J277j796
$$ 443 312 175 1272 135 -814 -971 -1500 291 270 -705 1244 900 -489 212 -437 960 2237 441
2357D41l76L84n86l68q20J398J071j181N50p36j33J423j443K03K359j479r66k62
$$ 441 65 449 -137 -505 -1325 73 1144 -37 513 -223 -356 1067 -376 -173 2186 707 -259 -521
2375e21p97J279L8p50R41K2J79o63o67J803k21p25J017r51J62j87j992J488J340
$$ -521 -1318 -39 -1 -751 190 212 391 -272 -939 864 643 -82 935 -16 146 -41 -2033 -545 795
2394G95j185O54n94K72Q55j091K11O61J07m2j598Q8J150j530L39R53p70J446j017
$$ 795 -390 264 -330 -58 797 -294 -83 578 685 643 -955 -867 283 -1247 -908 45 -725 721 -296
2413b96j315K124Qp56M12k45O49n89j042O23k12P83M1j319J486M21j929J233J8
$$ -296 -1611 513 521 -235 177 -68 581 -8 -1050 -427 -639 144 185 -1134 352 773 -1156 77 95
2432I5p4J122j755q3J417j113m87N62J73P64r39q8Q19l29P45p88%J566j225j019
$$ 95 21 1143 -612 -695 722 -391 -878 -316 -143 621 -318 -406 413 84 829 41 41 1607 382 -637
2452f37J060n41N68M01j424J045O24r73o4L8J006j85j294P17j1m56L66j374P99
$$ -637 423 -118 450 851 -573 472 1096 123 59 97 1103 918 -376 341 330 -126 240 -1134 -335
2471c35J435j794L60O54l88Q07p98l87J350m13o27j34j18J033j109m15J069m97
$$ -335 1100 -694 -334 320 -68 739 -59 -446 904 491 -136 -270 -388 645 -464 -879 190 -307
2489c07J96p6j123J946o3j559J065L0j30J13r34O36N75o71Q4j16O33L39j387P80
$$ -307 -111 -187 -1310 636 573 -986 79 109 -21 92 -842 -206 369 -302 -218 -334 299 638 -749 31
2509C1O60q27N98q81k87J731j081q33J105l35L13k06o10J173k97k25m1j97J134
$$ 31 691 -136 462 -419 -706 1025 -56 -889 216 -119 194 -12 -622 551 254 29 -12 -209 925
2528I25p94r43J280j20p23M85j135R21O57j606M52N96l04M13r47O22O15q40M85
$$ 925 131 -812 468 348 -375 110 -1025 -104 553 -1053 -601 -5 -309 104 -843 -221 394 -446 39
2547C9m51M12J100j492l5J423j051J75J24p13J105k98j289P86J72K9j40m51R31
$$ 39 -412 0 1100 -392 -427 996 -55 120 244 -469 636 338 -951 -165 7 36 -104 -555 376
2566C76n3o66N07m10R99K20j419J061N58r84J42l67J89J195j192m42L92r7K09
$$ 376 323 -343 164 -246 753 973 -446 615 1173 189 331 -36 153 1348 156 -286 106 9 218
2585B18j005L14J165r07j9j03l97J404q57o49J625l14q52L13n14P11L84r64M22
$$ 218 -787 -473 692 -215 -234 -337 -734 670 -187 -836 789 475 -377 -64 -578 133 517 -447 -25
2604b5j20J14j66p30J119L24j231R18p18K66P55j322K32J540q70J07j72k25R89
$$ -25 -145 -31 -197 -927 192 516 -715 203 -515 -249 506 -816 -584 956 86 193 21 -204 785
2623G85n55j52M92N3q8r19l92J388o25m39P33n90O04n6j480J250O92m70J76l20
$$ 785 230 78 570 623 535 -384 -776 612 -13 -452 281 -309 295 239 -1241 9 701 231 407 87
2643H7P3J48q90N03L37r2K69j283L89O98j322M98O22m13P88j010j035J291k25
$$ 87 160 308 -582 -79 258 166 435 -848 -459 239 -1083 -585 37 -376 412 -598 -1633 -342 -567
2662e67O5J32J8N63o57m62Q64l72R66L2q81J407o41j456O77J49M49O52j515J91
$$ -567 -502 -370 -352 211 -446 -908 -44 -416 550 582 -299 1108 467 -989 -312 -163 286 938 -577 -386
2682c86N10m83J47K5Q69M62r25K26N4m83O76m65K11J463j318r21M91k36P76P5
$$ -386 124 -359 -212 -187 682 1144 219 445 499 16 692 227 438 1901 583 -338 153 -83 693 768
2702G68n71Q70k77q77o8l25J075j94m85O20n37l67Q2p46J178J225j468Rk00n20
$$ 768 197 1067 790 -87 -155 -480 595 401 -84 536 -1 -368 -286 -1032 146 1371 -97 -88 -288 -808
2722h08N24m54J64Q72n26k22n20o8P96p49O64J141o19k34n08p72J565p4n06M99
$$ -808 -284 -738 -574 298 -228 -450 -970 -1038 -242 -991 -327 814 195 -39 -547 -1319 246 172 -334 165
2742A65j97j40k39n70N98P30m1K26n17J24j30j349J248Q29m93L08j079r1J225
$$ 165 -32 -172 -411 -981 -383 347 306 532 15 139 9 -1340 -92 737 244 552 -527 -618 607
2761F07r74N8J151p6J20q82n38P15l79L20K23j18N42j201r18J360L8L15K92p36
$$ 607 -367 -309 842 766 886 4 -534 181 -198 122 345 227 769 -432 -1350 10 48 363 655 -81
2781h1K02L97j504M25N78L97J21q13N3Q3p28Q58P8L82Q23j461j73N48n94L31K15
$$ -81 121 518 -986 -561 17 414 535 -278 -225 -142 -870 -12 66 448 1271 -190 -363 185 -409 -78 137
2802A37j59Q90o42j096L32n1Q66O7j61P50r74o64K32o6J167M5j051O38r5p60K08
$$ 137 -22 868 226 -870 -538 -589 277 344 183 933 -41 -705 -473 -539 628 673 -378 260 165 -595 -387
2823c87k33R32O42o07k17j50j86K42m50Q22O02j058p5k36l03R54l62j61J183n82
$$ -387 -620 312 954 347 130 -20 -206 36 -414 408 1010 -48 -123 -359 -662 292 -70 -231 952 370
2843C70n18k86k39P54J77k91M63n31jm76l14J264K48n93M71m99k9M44j134P29
$$ 370 -148 -434 -673 81 258 -33 430 -101 -102 -578 -892 372 620 27 498 -1 -30 414 -720 9
2863IP42m23m8n89l02M70k08K75N04k35J99r92r1J038p14O8N64l86L54n49j067
$$ 9 751 328 280 -309 -611 -141 -349 -74 430 195 394 -598 -689 349 -365 -297 267 -119 235 -314 -1381
2884a381J142L75j19J23m62O26n02o17P59L3L65J21j295P09K35r66O77L01r6Q64
$$ -1381 -239 136 17 140 -322 304 -198 -815 -56 -23 342 463 -832 -123 112 -854 -177 124 28 892
2904H92j131l11N85k84L68J2K43M92r07m38O15k99N84j54l40R90m76r12O51n9
$$ 892 -239 -550 35 -249 119 131 374 866 -41 -479 136 -163 421 267 -73 917 441 -471 180 121
2924A21M48J12p77M95k07l34J36k60Q44J62j025L28J22m88N84p43L86J064j197
$$ 121 569 681 -96 399 192 -142 -6 -266 578 740 -285 43 165 -323 261 -482 -96 968 -229
2943b29k46L15l82O19j59l60R55n08q9j39k85J157o57j50O46o13N3O5p51Q38N10
$$ -229 -475 -160 -542 77 -82 -442 513 5 -84 -223 -508 649 -8 -158 488 -125 -72 -7 -758 80 590
2964E90r51K30J22j67K35o15O29M09m50J1m88K83Q00j137M44M87l38K05n39j40
$$ 590 -361 -131 -9 -176 59 -556 73 482 32 43 -445 -162 638 -499 -55 432 94 299 -240 -380
2984c80P37p4o08O94l53K39m12m25Q14j94m1Q6n52P87k13q61P29M6j29K46n49
$$ -380 357 283 -325 369 16 255 -157 -582 232 38 -3 83 -469 318 105 -756 -27 19 -110 136 -413
3005d13L6P88q42n0O04l64M89q66L97L49m41L42j01k05Q18o93m74J091m09R1k5
$$ -413 -377 411 -431 -481 123 -241 248 -618 -221 128 -313 29 -72 -277 541 -152 -626 465 56 147 122
3026A22k94N74k26n91M97m4J40l2n80Q33m6o00N63n77K87O89j265O56L51o10N28
$$ 122 -172 402 176 -415 82 38 178 146 -434 399 353 -247 316 -261 26 715 -550 106 457 -153 375
3047C75n28K09N14o49q4L81k41L33n14j60P99o40j48L96m33N86j59o29Q17j31
$$ 375 -153 56 570 -79 -163 218 -23 310 -204 -364 435 -205 -353 43 -390 196 37 -592 225 94
3067I4m74L26l33N57K03p68M32o9J58J41p14O60N25r49L10Pj39O66o84r2P74n85
$$ 94 -380 -54 -387 170 373 -395 37 -32 126 267 -447 213 738 -211 99 106 -33 633 -51 -143 631 46
3089D6M3o1j69O95n95K3M51n49N37m57n42J012k50m38M13m08M93p0q35N76L32
$$ 46 89 28 -141 554 -41 -18 433 -116 421 -36 -578 434 184 -254 159 -249 244 174 -661 -85 247
3110B47l48J43m50M34O8p04N20M6l35N96q92J06Q34o54o4L38l63M91m04l96P76
$$ 247 -101 42 -408 26 94 -610 -90 -44 -379 217 -675 -569 265 -389 -453 -115 -478 13 -391 -787 -11
3131a1l54K02j91q5N26k74m93O06J01n8K83p50P51m1n35M25M4J73K96o37J58M23
$$ -11 -365 -163 -354 -439 87 -187 -680 -74 27 -31 252 -498 253 212 -323 102 146 319 615 -22 136 559
3153E59n70K72k26M26M20r45L22L49n05N11l76j69Q11n79k78K76k61O61k38n09
$$ 559 -11 261 35 461 881 -64 258 607 102 613 237 68 879 300 22 298 37 698 460 -49
3173d9M80j74j52pl06P34k54o53P26j79m79K87m38M21O48r75J77J43l80N50o67
$$ -49 431 257 105 98 -208 526 272 -381 345 166 -313 -26 -464 -43 605 -370 -193 -50 -430 120 -547
3194e47K41M08l43P7j98q9O86m82j43O81l75m5j22n41O34J59l55L40k78J87q7
$$ -547 -306 102 -241 -164 -362 -451 235 -247 -390 291 -84 -129 -251 -792 -158 1 -354 -14 -292 -105 -192
3215a92n16Q83O8m17J45l81K59K01q72N85O53m98L16n63Q3M21k92J81J70j83J88
$$ -192 -708 175 243 -174 -29 -410 -151 50 -822 -237 416 -82 234 -329 -246 175 -117 64 234 51 239
3236B39n27j15P28k02o7L37m08O12m74q42Q85M7n6L65n71J28lm87M72N5J7L75
$$ 239 -288 -403 325 123 56 393 -15 597 123 -719 166 213 157 522 -49 79 76 -411 61 116 133 508
3258E08p73L84M6m33M19j0J46M16r19j89N32l76N40Q1l25M01l45l41J85k93N81
$$ 508 -265 119 165 -268 151 141 287 703 -216 -405 127 -249 291 372 47 448 103 -238 -53 -346 235
3279B35q2o7L35n56m30M25k75M87N71j058L21J15l85K10q1K95M66o84K09l08j48
$$ 235 153 86 421 -135 -565 -140 -415 72 643 -415 -94 21 -364 -154 -235 60 526 -158 51 -257 -405
3300d05M48l72K15Q78r42j03k2j3N85p8l18M35j60l54l7k04P68k17k69L88j96
$$ -405 43 -329 -114 764 -178 -281 -303 -316 269 191 -127 308 148 -206 -243 -447 321 104 -165 223 27
3321B7j22j54m48R17L55m70J46l57j61L59m45K46N25q9j11m05M3L73n19L00N71
$$ 27 -95 -249 -697 220 575 105 251 -106 -267 92 -353 -107 418 329 218 -187 -144 229 -290 10 581
3342E81m69R5n40n06J093m04k10O29l84J51k74l39N49K31j06Q9n13L84q1p46R74
$$ 581 112 207 -333 -839 254 -150 -360 269 -115 36 -238 -577 -28 203 97 186 -327 57 -24 -770 204
3363B04j32Q1L34p98k9O19n54L54J77l4J59l54m15M22l76L22J10j92N90o81m83
$$ 204 72 153 487 -311 -340 279 -275 79 256 222 381 27 -388 34 -342 -20 90 -102 488 -193 -676
3384f76P53r1J50K80o01M02j33m89K73J28L35Q0m99L18j96l91L96k39N65K45r41
$$ -676 77 -14 136 416 -185 217 84 -405 -132 -4 331 411 -88 230 34 -357 39 -200 365 610 -331
3405c31K11J55n37O24k93K39M82n43k26L7k41N47o8m1N34p11j03P9m05R65j54
$$ -331 -120 35 -502 122 -171 68 550 7 -219 -182 -423 124 56 15 549 -162 -265 -186 -591 374 220
3426B20m19N92m29q3K36m03L73K19m27L28k59j12K09l39N52L5k34J72n82k5O95
$$ 220 -199 393 -36 -119 117 -286 87 306 -121 207 -52 -164 45 -294 258 293 59 231 -351 -376 319
3447C19n36j4P37n45OQ7m10M34r6k1K86l61K03j60m66J036l58j05K19o45M68K3
$$ 319 -217 -231 506 -39 -33 54 -356 78 -18 -39 247 -114 89 -71 -537 499 141 36 255 -390 78 101
3469A01o39N83k0k24M07m59n5K51l13J89K44j24L49n63J81L65m25M00J9m85O61
$$ 101 -538 45 25 -199 208 -251 -306 -55 -368 -179 65 -59 290 -273 -92 273 -152 248 267 -218 443
3490D43l45n58O81l05J30J55l89L10j86j89M01j11K72q8o39N76l8n32M95j50m9
$$ 443 98 -460 221 -84 46 201 -188 122 -64 -253 148 37 309 221 -418 158 120 -412 83 -67 -116
3511a16N39o16K0N59n91J82n9J3M48n42K07j62n3N31m10j21N78m15m18O63l84
$$ -116 423 -193 -173 386 -205 -23 -82 -69 379 -163 44 -118 -171 360 -50 -171 407 -8 -426 237 -147
3532a47L94K4m27L24O8j34m0q1J80L5l93L84k57R7K47o19M67L93m85R5nk28M24
$$ -147 247 271 -156 168 236 102 62 -19 161 196 -197 187 -70 27 274 -345 122 515 30 125 120 -108 316
3555C16r9k76N52l26r3j90k4N96m54k04M21l38J87m1o16O78K6l73K76j96jJ59
$$ 316 217 -59 493 167 74 -116 -140 456 2 -202 219 -119 68 27 -589 89 115 -258 18 -178 -179 -20
3577b0k79K68J19l54L07m00J00N53o80K57N5l31N02k70l90N83k21k36L36j07K60
$$ -20 -299 -31 88 -266 41 -359 -259 294 -386 -129 -74 -405 97 -173 -563 20 -201 -437 -101 -208 52
3598E2j54j08K04k79K77j20k14O10l38k97M67k23K79J17n43L55K04l80K43M2n8
$$ 52 -102 -210 -6 -285 -8 -128 -342 268 -70 -367 100 -123 156 273 -270 85 289 -91 152 194 136
3619A36J07l43K16L13m39L84l54O8O79p49R3K44m47L89M0o24N05m7k95K68j63
$$ 136 243 -100 116 429 -10 374 20 88 767 18 111 355 -92 297 337 -287 218 171 -124 144 -19
3640a9K98j57l08O12l46j78M56n17L24L23q57N36J04m41K72j70m5M15m77K07L3
$$ -19 279 122 -186 426 80 -98 358 -159 165 488 -369 167 271 -170 102 -68 -113 302 -175 32 65
3661F5k68K65l15P5L17n18L86j49m05P77j76k82M09m42M9J62k67L16L4k93K7J20
$$ 65 -203 62 -253 -178 139 -379 7 -142 -547 230 54 -228 181 -261 -212 -50 -317 -1 33 -260 -233 -113
3683a13O8j29j41L51k6k91L08j76j28M62o67K59L24j70O9j23jJ85l49L17J24q7
$$ -113 -45 -174 -315 36 10 -281 27 -149 -277 185 -482 -223 101 -69 0 -123 -124 61 -288 29 153 66
3705F6J96k56k25P14o76J43K13l62L57j1k79O2M48l50K37l09J64Ql30L13O7j65
$$ 66 262 6 -219 495 -181 -38 175 -187 170 159 -120 -58 390 40 277 -32 132 140 -190 123 190 25
3727B5L14o96L42L42n74K88J39j45L79l96j18L67k08J40j84j58L57k32JJ29l27
$$ 25 339 -357 -15 327 -247 41 180 35 414 18 -100 267 59 199 15 -143 214 -18 -17 112 -215
3748b15M42K9n67M16r8m09L38j97K55K78o99L62L0k79K50R9M8R9m33J61n1p4M52
$$ -215 227 256 -311 105 7 -402 -64 -261 -6 272 -427 -65 -35 -314 -64 35 83 182 -251 -90 -141 -215 237
3771B37l42r4M04l17n1K06l04M10m6j39K16j83k88J43j29O72l85k58L66k45o6
$$ 237 -105 -199 205 -112 -163 43 -261 149 103 -36 180 -3 -291 -148 -277 395 10 -248 118 -127 -193
3792a93K67m19N12Q7l59K39k82PK74JN4J76k14R0m90l6O24n09J52K94l90J90j64
$$ -193 74 -345 167 254 -105 134 -148 -141 133 134 188 364 150 240 -250 -286 338 -171 -19 275 -115 75 -89
3815h9k69M45ok32M92l83l8N1k57L20M9j8J19k93J75J17n17M32J30j78J63m25
$$ -89 -358 87 81 -151 341 -42 -80 -29 -286 34 83 65 184 -109 66 183 -334 98 228 50 213 -212
3837b12j1L21k64K48M9p8L9l34Q5K12m8K7P7j30K79m44k81N32j55K92O0m89M07
$$ -212 -223 98 -166 82 131 53 92 -242 -157 55 7 34 111 -19 260 -184 -465 67 -88 204 264 -225 182
3860A82j12l85L13p5K92M0j74o9n8l46L16LJ50K95m76j6k3k43N95r4k07L65k39
$$ 182 70 -315 -2 -77 215 255 81 12 -46 -392 -76 -73 77 372 -104 -120 -143 -386 209 115 -92 273 34
3883C4k57N2N6K93r9%L06m01j89J90k44N25J98o03L51k13k06J05Q8J19K54l16
$$ 34 -223 -171 -115 178 79 79 385 -16 -205 -15 -259 266 464 -139 212 -1 -207 -102 -14 105 359 43
3905D3K40m50K58O7m31M21L08n80K86k48l74O94k04j62M65l52K0j51LK83J7J7
$$ 43 283 -167 91 158 -273 148 456 -124 162 -86 -460 234 30 -132 333 -19 1 -150 -147 136 153 170
3927A70M3l08J33j98k28N73l3r3J16k53r0L37l91K77J24l31L49k46j19K14k49
$$ 170 213 -95 38 -160 -388 185 152 59 175 -78 -168 169 -222 55 179 -152 197 -49 -168 46 -203
3948b03L80j50Q6K10l08l72M34j12K11M4l82M13k03m75L70J17m7J58j79J1p4l09
$$ -203 177 27 113 323 15 -357 77 -35 176 220 -162 251 48 -427 -57 60 13 171 -8 3 -71 -380
3970c80L57K1k8L13n18J27K43l63L72K4j63O7j32j41K47j26O6j1J05J25k81N8
$$ -380 -23 -2 -30 283 -235 -108 135 -228 144 168 5 72 -60 -201 46 -80 -14 -25 80 205 -76 -18
3992a8M2l80N45N8l79M19l46k20M77k55O2K93l00p3K47m93L41j85L34J45l99J85
$$ -18 24 -356 189 247 -132 287 -59 -279 198 -57 5 298 -2 -75 172 -321 20 -165 169 314 -85 100
4014A00k49nK57k71L32K51m30k3L14m28M23j28j60K26k38J86j60j67L76k62p9
$$ 100 -149 -154 103 -168 164 415 -15 -38 276 -152 271 143 -17 209 -29 157 -3 -170 206 -56 -135
4035a35L96k10j6k7l92N47M1l18K30k52r0K06j81K38K2q1N3l44K35J64l66J42
$$ -135 261 51 35 8 -384 163 204 -114 116 -136 -226 -20 -201 37 59 -22 31 -313 -78 86 -280 -138
4057a38K17k67L73j15n67N44j32l4K14k96J93r7M6J26k36P2K39l38L69j81k34
$$ -138 79 -188 185 70 -497 47 -85 -119 95 -201 -8 -105 -59 67 -169 -97 142 -196 173 -8 -242
4078b42L68J9j38J75k70l6K45k58M9K42p3M6n4n1J61j23J94j84p2K38k58p3L62
$$ -242 126 145 7 182 -88 -124 121 -137 -88 154 81 127 73 22 183 60 254 70 -2 236 -22 -95 267
4101B67m93L90j76k06L81q3k11K42j32K59pl04R7N7j29K34l07J72J86k25J26J39
$$ 267 -226 164 -12 -218 163 80 -131 111 -21 238 231 -73 24 81 -48 186 -121 51 237 12 138 277
4123B77l38K60k96l1K69l30J02M3k06L11j91nK39n19M44J9m65M49L0l49N14k84
$$ 277 -61 199 -97 -128 141 -189 -87 -44 -250 61 -130 -135 104 -415 29 48 -417 32 62 -287 227 -57
4145e7m0Kj12L58j60j55K37o9m3J06l12K06rj78L44k68k21L98j70m9L47m69L01
$$ -57 -97 -95 -207 151 -9 -164 73 4 -39 67 -245 -39 -48 -226 118 -150 -371 27 -143 -192 155 -314 -13
4168a3N4j96L52m17K70l6j16L29k46p6K63j75n5N1O5J14L8l57L80nn1J1j07j0
$$ -13 41 -155 197 -220 50 14 -102 227 -19 -95 168 -7 -62 -11 54 168 206 -151 229 224 173 184 77 67
4192F7l7j31L4J52k9K4l09J38K04k69M27j8k58K09j63j96L11L7j29R6m10L25l9
$$ 67 30 -101 -67 85 56 80 -229 -91 113 -156 271 253 -5 204 41 -155 156 193 64 160 -250 75 36
4215C6k16J64J5K1K81o32K94N8l72M89j49J50j58o1N1P8rJ4j77J57J09l55K37
$$ 36 -180 -16 -1 20 301 -331 -37 21 -351 138 -11 139 -19 -80 -29 49 40 54 -123 34 143 -212 25
4238B5J53m82N36k19j00L29m09J08J55j81N3J12k32K72k71R3J69k15J96jk82K91
$$ 25 178 -304 232 13 -87 242 -167 -59 96 -85 -32 80 -152 120 -151 -58 111 -104 92 91 -191 100
4260A00n2k39K01k20K86N1k58J01J18k50K62j33k4K41j88k2m5K5K74k36L8L17
$$ 100 48 -191 10 -210 76 127 -131 -30 88 -162 100 -33 -57 184 -4 -26 -71 -46 228 -8 30 347
4282C47o34K41l6j24L29j71j00L50j93N6j95k31O00j92P5n5K9l88M53m52M65L8
$$ 347 -287 -46 -82 -206 123 -48 -148 202 9 65 -130 -361 239 47 122 67 96 -292 161 -291 174 212
4304B12l77L58l18o9K93l29J86K01j21J7n1j42L16l43J02M13n75L73k20j16L03
$$ 212 -165 193 -125 -194 99 -230 -44 157 36 53 2 -140 176 -167 -65 348 -227 146 -74 -190 113
4325A13r1j22K00k13R0J7k17K38K08l04L55m91K74m2k76L29j33R1J25k89O2J85
$$ 113 22 -100 100 -113 -23 -6 -223 15 223 -81 274 -217 57 15 -261 68 -65 26 151 -138 -76 109
4347A09n04K87J50j57K44k48p0J92j96L33n6j49J88k03l5R3j20L27J64l51L3p3
$$ 109 -395 -108 42 -115 129 -119 -189 3 -193 140 84 -65 123 -80 -115 -22 -142 185 349 -2 31 -42
4369d2j88L84l32K20K70l81J16k15j44O15m57M6L67m81K75k01k65M08Q7k85L62
$$ -42 -230 154 -178 42 312 -69 47 -168 -312 303 -154 -108 259 -222 53 -148 -413 -5 82 -203 159
4390A59k24j15P2r0L23q7o6L1M1l3J2k05M08j33j17K89l70k24M92m23K87R6j84
$$ 159 -65 -180 -108 -198 125 38 -28 3 44 11 23 -182 226 93 -24 265 -105 -329 163 -260 27 123 -61
4413f1L40m28J65P0j59J72J61l23K44k64l25L89J2O3J45m00K35o1k47K99P6q8
$$ -61 279 -149 16 86 -73 99 260 -63 181 -83 -408 -19 -7 56 201 -199 36 -25 -272 27 103 15
4435A5J07k09o1k9J81q4l8Q0L34m51J45rn7J09Q7k11J39l9k18K02J44n1k4j2J33
$$ 15 122 -87 -148 -177 4 -80 -118 -38 296 -155 -10 -19 -76 33 120 -91 48 9 -209 -7 137 86 62 50 183
4460A83k51L4L65n24L10N0k54J18o2o5m5j45K89K43k25J65j38j25J84j95J12J47
$$ 183 -68 -34 331 -193 117 167 -87 31 -31 -96 -141 -286 3 246 21 186 48 -77 107 -88 24 171
4482A71j57J60j14k58K91j42P2J68l84K30K9k14K14j3O7j9k49K10l1l03L60M8
$$ 171 14 174 60 -198 93 -49 23 191 -193 37 66 -148 66 53 120 101 -148 62 31 -272 88 136
4504A36q5P4k70p3K54k54K89P0k62K89l00OR8p1J09Q6k25J98k37J22J67j63J77
$$ 136 51 125 -145 -218 36 -218 71 141 -121 168 -132 -126 -28 -99 10 96 -129 69 -168 -46 121 -42 135
4527A35L2k89J92Ll37J90J20j9r6J23o1J23l01K20n4n4L14k71J1j34j48M00j05
$$ 135 167 -122 70 73 -264 -74 46 27 -69 54 -7 116 -185 35 -19 -73 241 -30 -19 -153 -301 99 -6
4550fl7K20k64O9J69j35Q7J6j30R5j79J25J17k85J23N0j03L4r6K0J29j18K71j88
$$ -6 -43 177 -87 -18 151 16 103 119 -11 84 -95 30 147 -138 -15 35 -68 -34 -130 -110 19 -99 172 -16
4574a6J23j74P2j78L28k13P9P0j84K33k18n4L86m42J10M16m04L3J74l62K37J14
$$ -16 107 -67 5 -173 155 -58 21 91 -93 140 -78 -132 254 -188 -78 338 -66 -33 141 -221 16 130
4596A30r6J44k66Q5L0j38J47p5k44L71k45L20j73k59L73r4q4J86k02m1K21j85
$$ 130 34 178 -88 -3 27 -111 36 -39 -283 88 -157 163 -10 -269 104 10 -74 112 -90 -131 90 -95
4618i5J79j72o7K53k01M6J19q5Q4rl98L62k0k45M62l21q0J64n4R3r8m2K89l20
$$ -95 84 -88 -155 98 -103 -57 62 -23 61 52 -346 16 -4 -249 213 -108 -188 -24 -78 15 -83 -125 164 -156
4642a56K53k8o5K1K4j77K09q1oJ11j34J22j13K5O8L2n0l6n5j57K84rj0j16j40
$$ -156 97 69 4 25 49 -128 81 0 -6 105 -29 93 -20 5 73 105 55 19 -36 -193 91 82 72 -44 -184
4667a84K54k67R4M41n74K42J39j42J36r9n7J72r5q7o0P8J32j10o0K16j42j93K14
$$ -184 70 -197 -103 338 -236 6 145 3 139 40 -17 155 60 -27 -87 -9 123 13 -47 169 27 -166 48
4690D8Kl9P1p7M2m4j38L05j99Q4l9j25J23k6R8Q6l73J87K05m08K62n4j33K92k20
$$ 48 50 11 82 5 47 3 -135 170 -29 55 16 -109 14 -12 86 172 -201 -14 191 -217 45 -9 -142 150 -70
4715g0O0J79k66J77j43J30O2j70p9K31l32K17K00l81K15K8k02J77k09K41J28k73
$$ -70 -10 169 -97 80 -63 67 129 -41 -120 111 -221 -4 196 -185 30 58 -144 33 -176 65 193 -80
4737h0J24KK2J4r5P0M9j63Q8L1k41J56Jk8R6Qk5k4k15K36j35r8N8P6p2Q6p8L20
$$ -80 44 46 68 82 -13 57 106 -57 31 62 -179 -23 -22 -50 46 54 29 5 -210 26 -109 -207 -149 -73 -145 -59 -137 183
4765A83k61R6R9j83L3O1k8m0P6k21L28l7j20Q2p2j80L53k72L29k47m3L07l22M7
$$ 183 -78 18 117 -66 -33 28 0 -40 36 -185 143 106 -14 68 -4 -184 169 -103 226 -21 -64 243 -79 -32
4789c2K60k85N4j19p7K52r1pJ74j27n6j10J79mj26J11K27k45j5L6j52K8K04k76
$$ -32 228 -57 -3 -122 -199 53 -38 -45 129 2 -54 -164 15 11 -115 -4 223 -22 -37 -1 -153 -125 79 -197
4813a97L17j50M6J2k04M30j02j39O8k73J25K12k49J33J19k99J53k8O7J07j47K7
$$ -197 120 -30 16 28 -176 254 152 13 81 -192 -67 145 -104 29 148 -151 2 -26 41 148 1 28
4835B8J12l22J35l1N3P2j40K18j07j51Q5K27l12K79j15p8P6lQJ57k80Q5J17j84
$$ 28 140 -182 -47 -78 -25 47 -93 125 18 -133 -48 179 -133 146 31 -47 29 26 34 191 -89 -4 113 -71
4859g1J94r0j61N9K3J67j14j32J98j55M6J53j67M4K7j09K39k14J10O0j75N3J48
$$ -71 123 33 -128 -69 -46 121 7 -125 73 -82 -36 117 -50 -6 21 -88 151 -63 47 107 -68 -15 133
4882A33l22K93j51o9K01j11J86j9k88O8K40l12K36j34L6J46j88Q1p4m0K12r7L0
$$ 133 -189 104 -47 -116 85 -26 160 141 -147 -79 161 -151 85 -49 -13 133 -55 26 -48 -88 124 27 57
4905E7P4j66J9Kj75L54k8k12L11l95J55P5j63M2J57l35K19j54N8P8l0P2J10j88
$$ 57 131 -35 -16 -14 -189 165 137 -75 236 -159 -4 71 -92 -50 107 -228 -9 -163 -105 -27 -57 15 125 -63
4929f3P5R6j74L11m10J44K13l44L7J8jJ62j12R8R4k10J71k25k0J40j30K20O5k88
$$ -63 12 108 -66 245 -165 -21 192 -152 -115 -97 -98 64 -48 50 144 -66 105 -120 -140 0 -130 90 155 -133
4953a33K28R4l06J78P6m0j3k47K50j46R4l3K7P6o6j98J09J94j16K6kj01J98r7
$$ -133 95 189 -117 61 137 97 84 -163 87 -59 35 2 29 105 39 -159 -50 144 28 54 52 -49 149 52
4977E2j87K90j98J23j25k5J90j15J9J39j41J15j68j19K99J5l10K05m0kJ22j38
$$ 52 -135 155 -43 80 -45 -70 120 5 24 163 22 137 -31 -150 149 164 -146 59 19 17 139 1
4999Aj3K53k69J70j02k8Q4j17j47K02P1J10k00J6J9j61p1J59k8P9pp0J37j17j24
$$ 1 -12 241 -28 142 40 12 96 -21 -168 34 105 215 15 31 50 -111 -182 -23 -51 28 21 -49 88 -29 -153
5024a53K49j60P6m1jJ04j46p2P6O2OJ62j71P8k40O7L43l96J22J37k16J95j77j21
$$ -153 96 -64 12 -29 -30 74 -72 -144 -68 -6 0 162 -9 69 -171 -104 239 -157 -35 102 -114 81 -96 -217
5048b17J86K8R5J7j89J60n1j40L5M9m2Q9j17J10j9o5Q2J0m3L5j42Q2j22mL01O9
$$ -217 -31 -3 92 109 -80 80 29 -111 -76 -27 -69 20 -97 13 -6 -71 11 21 -22 13 -129 -47 -169 -173 128 197
5074A97l23K37k37P9J17j75J27N4r5Qm6m9R8L5mm6R0J1m6j73L89l03J06Nj45K44
$$ 197 -126 111 -126 -47 70 -105 22 76 -19 -11 -57 -106 -8 27 23 -23 67 78 32 -141 248 -55 51 56 -89 155
5100A55k48N8q7J02O0J6j96J62K3p5K86l77K80M5l19J48P3j44o7J23mR8k71J44
$$ 155 -93 -35 -122 -20 40 56 -140 22 45 -30 256 -121 159 204 -115 33 106 -38 -105 18 14 112 -159 -15
5124a5J04j93P8q7J4J41k9j03m7O7O5J43k52J32o3j56K13j81P6P5L0j04J7R9J01
$$ -15 89 -104 -26 -113 -99 42 13 -90 -137 -70 -5 138 -114 18 -45 -201 12 -169 -93 -18 12 -92 -75 24 125
5149A25j73QJ93j69P3M7r6oK18k43K00n9r5k0j16K05nj88J45m0P7j9p1Kj7p2J72
$$ 125 -48 -40 153 -16 57 104 8 2 220 -23 177 118 23 3 -113 92 87 -101 44 4 81 62 -9 -7 -24 -96 76
5176G6p8Q0P0k35M0J05n6J55p3j75K90l46J69Rm9j27J15lJ8m5J01J11j68L7Jn9
$$ 76 -2 78 148 -87 -47 58 2 157 84 -91 199 -147 22 31 -18 -145 -30 -33 -15 -60 41 152 -16 21 22 -37
5202c7P2p8Q6j46N7J00%o7JJ07j16P0q1J32j79K00q6j12m3J40K1k2J84j55Q7k15
$$ -37 35 -43 43 -103 -46 54 54 -13 -12 95 -21 49 -32 100 -79 121 35 -77 -120 20 41 19 203 48 135 -80
5228h0J9Jo4J53O7o0p0N8L2L4p8m9J34k09QO4o8K46j44j88K25Lp1J00k23K20O1
$$ -80 -61 -60 -124 29 96 36 -34 24 56 90 12 -37 97 -112 -104 -40 -108 138 -6 -194 31 34 -37 63 -160 60 121
5255A21k92J58j16rJ45j34J06P8k16J51M2l7r1k9K69j15l0P8r0L4Q6j01J59j91
$$ 121 -171 -13 -129 -138 7 -127 -21 57 -159 -8 34 -3 -94 -123 146 31 1 79 -11 23 109 8 167 -24
5279b4j34Q4J53j91J31R8j36J41j5n9j38Q5J95l06K06J5j98J85j48M6P0q1rR4
$$ -24 -158 -74 79 -112 19 117 -19 122 107 48 -90 -5 190 -116 90 105 -93 92 -56 -10 60 -21 -30 64
5303F4pm2J41j86J17Ol18J55q2L09j17j35J66l8rO5j00N3k0j40R1J03k16O8J38
$$ 64 57 15 156 -30 87 93 -225 -70 -152 157 40 -95 71 33 24 89 -11 42 22 -118 -27 76 -140 -72 66
5328F6k9j42N6L2m0lM6p0n6K04k44R7K20k14Q6k0j73L30j34l14K84kO6j7K9N1
$$ 66 37 -105 -49 -17 -57 -60 -14 -84 -140 64 -180 -83 137 -77 9 -11 -184 146 12 -302 -18 -20 46 29 58 109
5354A09j43n3J28q4P7P4l49L52o8j90L75k29QJ2k03K73L4j50N1j84J75j1o9j6
$$ 109 -34 -87 41 -43 34 108 -241 111 43 -147 228 -1 7 19 -184 89 123 -27 24 -160 15 4 -65 -81
5378h1R3j2P7o3j50J60m0j1P6q4L0r5mJ91j79M7J41k06Q1J9m1k8p7J54N2k2j57
$$ -81 12 0 77 14 -136 24 -16 -27 49 -35 -5 -100 -104 87 -92 -45 96 -110 -29 -10 -51 -79 -156 -2 50 28 -129
5405a29K09n7J45k62j44L36k00K5J70r4J50l32o4L56r7j59J89K5k3j07p6Q3J07
$$ -129 80 23 168 -94 -238 98 -102 -77 93 -1 149 -183 -247 109 12 -147 42 67 44 -63 -139 -56 51
5428E1j87L54j89J7R5j94J36q9r4L14k23k17J83p7L21j99Q0l6k2P4l7k9j27J92
$$ 51 -136 218 29 46 141 -53 83 -6 -100 214 -9 -226 -43 -120 201 2 82 46 24 98 61 32 -95 97
5452I7k03K67k45J75J6l36K81j0j98RK81n4p9k40L43l9j17n4K43j24J96k08QJ90
$$ 97 -106 161 -84 91 107 -229 52 42 -156 -147 134 80 1 -239 104 65 -52 -106 137 13 209 1 9 199
5476A99j52N8j07j00J72l9k21L66k67L2J6r3J15K5j79J97l7o0Q7J00j61r5J38
$$ 199 47 105 -2 -102 70 31 -190 176 -91 -59 -43 -136 -21 4 -175 22 -15 -75 12 112 -49 -144 -6
5499fj27J46L4K6k26M3P4J37j21Nk7Q9k5k0Q5k43J33J1k9rq1Q9Q2o2o0j3J74J6
$$ -6 -133 13 47 73 -153 -110 -36 101 -20 -15 -42 47 22 2 87 -156 -23 -12 -41 -50 -131 -42 40 -22 -82 -95 79 95
5527I5j44J60o9k9n8j72K60n6J21j79M6m1J08K9k24K34J8p3j08J49p5N7PK4j19
$$ 95 -49 111 42 13 -45 -217 43 -13 108 -71 -25 -66 42 71 -153 81 99 26 -82 67 -8 49 56 80 -39
5552c9M4J63p7j36J07O8Q3p2j49Kj14l8J61NJ32k3n9l3J0j00J35Kr3j21R5o4j7
$$ -39 5 168 91 -45 62 130 213 141 -8 -6 -120 -158 3 8 140 117 58 25 35 -65 70 72 -21 -142 -47 -111 -128
5579a28O6P5n8J61r6J3o9J79j91N5R8k54J24L8j66P2J0k7O2M3P2P7p4l14J19K31
$$ -128 -62 13 -45 116 20 33 -36 143 -48 7 105 -149 -25 13 -153 -81 -71 -98 -36 7 79 156 82 -232 -113 118
5605A18l2l18J37j26L29n3j27p4O8r2l1J86J3N2j47J8R8K6j7o8o1K46n1j76J23
$$ 118 86 -232 -95 -221 108 55 -72 -146 -78 -170 -201 -15 -2 50 -97 -79 19 45 28 -40 -101 145 94 -82 41
5630D1j10M1J06j57P7Q4o3R2j47J21j79K6J03p9j5J0N5k8J54j49J7L7k8k7N6M5
$$ 41 -69 -28 78 -79 -2 82 19 111 -36 85 -94 -68 35 -44 -59 -49 6 -22 132 -17 0 37 9 -18 38 83
5656H3j1j20K1K9l5R2j98n4L43l06K54j04R0oj53JJ64j27L2L6N4q5Q4L2n0r9P0
$$ 83 72 -48 -27 2 -33 59 -139 -193 150 -156 98 -6 84 78 -75 -74 90 -37 -5 31 85 0 84 116 66 -33 37
5683C7j16N4lN7L3J13r9n7J01n9k8L8j14N3J03j98J40k22K42o1PO4q7Nm3m2J18
$$ 37 -79 -25 -28 29 62 175 76 19 120 61 33 71 -43 10 113 -85 55 -167 75 14 21 85 -2 3 -40 -82 36
5710C6j10k3K20p4o2O2k14M13k22PO5n5j61J95j13N6nJ11p1Q7p0r9M3j0j31Q2
$$ 36 -74 -97 123 49 -13 49 -165 248 26 33 98 43 -118 77 -36 20 15 126 55 142 72 -27 16 6 -125 -43
5736d3O7j43MP9J31j15J2j47O4K56k57M4J00l7l0j00j00K07j01K27M9k31J26%
$$ -43 24 -119 -115 -36 95 -20 -8 -155 -91 165 -92 -48 52 15 -15 -115 -215 -8 -109 118 167 -64 62 62
5760F2l5m6q0K50%m7k02J50nP2j27k2J28Oj47M7L3P1j28q7K69k44J21m9p1P0J55
$$ 62 27 -19 -99 151 151 104 -98 52 47 119 -8 -30 98 104 -43 4 37 108 -20 -107 162 -82 39 -10 -81 -11 144
5787A44k17j5O1j33K43k35J88L8j28J06j5k41J12N3l0Q0m0j0q6Q7J03Mj67J26
$$ 144 -73 -88 -27 -160 83 -152 36 74 -54 52 37 -204 -92 -39 -69 11 -29 -39 -125 -38 65 69 -98 28
5811B8l0J48k5j20O9J02j87L1O7j05r1J67j63J19n1J49j68M4J19j58mp9K12m5
$$ 28 -2 146 121 1 70 172 -15 16 83 -22 -113 54 -109 10 -41 108 -60 -16 103 -55 -59 -138 74 29
5835B9J1J68j06j55N6jn2J82j83J4J69j35L9k8l9J78k14M2J25j68J98j34pNJ08
$$ 29 40 208 102 -53 3 2 -50 132 -51 -37 132 -3 36 8 -31 147 -67 -25 100 -68 130 -4 -11 -6 102
5860A02M2j78L0J32j66J56j08j20J7m4M9J03N9k83K07o6Q7j54J64j20O9rL5j7
$$ 102 144 -34 -4 128 -38 118 10 -110 -93 -137 -88 15 74 -209 -2 -68 19 -135 29 -91 -22 -31 4 -13
5884a3r4K03j12M1j07L3K1K6m8J6o3p7L27k62J29m4j44J2K06o0mQ3j5Pjk23J14
$$ -13 -107 96 -16 25 -82 -49 -28 -2 -50 -34 -97 -174 153 -109 20 -24 -168 -156 50 -10 -14 69 54 61 60 -163 -49
5911d9oJ29k53O9J77n8J17j06r5J51j43n1J63n4N1p5o1P1m0NJ68j77L3J1k2J23
$$ -49 -55 74 -179 -110 67 9 126 20 -75 76 -67 -118 45 -9 42 -33 -94 -23 -63 -58 110 -67 -34 -23 -45 78
5937G8j43J29J04k71J76j6q5K5o7O2M8m1O2j45P4l4Q1j52Q5P1r0P2J9K6o0L7k8
$$ 78 -65 64 168 -103 73 57 -28 -3 -70 -8 40 -1 61 -84 -10 -44 37 -115 -30 41 -49 23 42 68 8 45 17
5964A7Kq9N5j31K50J3k42J69k2n0J16Ok71Q9N5O4N3j25l1K98j91k7P5kn9j79J43
$$ 17 19 -70 -15 -146 104 117 -125 44 22 -28 88 94 -177 -88 -33 31 84 -41 -72 226 35 8 83 81 22 -157 -14
5991a4n0k0J0J44n9o4J53m7p3q7J46j14JP1J08j03n0j06J97P6k85K85p5j20J46
$$ -14 -64 -84 -74 70 11 -53 100 53 -20 -107 39 -75 -74 -3 105 2 -48 -154 43 119 -166 119 44 -76 70
6016G0j86J58j15K23k15Q5l8J37k72K30j03R1qJ4j9j18R8k38L31m7p2J99k88P5
$$ 70 -116 42 -73 150 -65 20 -18 119 -153 77 -26 65 57 71 52 -66 32 -206 125 78 6 205 -83 -8
6040hJ21N6n7k09L29k53Q5pr7k4J73j25J98j97j19L74k22L8J32j36J02k41K0P7
$$ -8 113 169 112 -97 232 -21 64 57 -40 -64 109 -16 182 -15 -134 240 18 56 188 52 154 -87 -67 10
6064A0J09k10L00o8j20l3r5K30j15j13N4n7L7j4J12j43K50k51l2Q6j92K81j19
$$ 10 119 -91 209 141 21 -12 -107 123 8 -105 -51 -108 -71 -85 27 -116 134 -117 -149 -63 -255 26 -93
6087i3J72J6j04L8q9L7J46k66R2J91j63R1j65J10p3lP9q5q6J51m7N4J22k67K61
$$ -93 79 95 -9 29 -60 -23 123 -143 -51 140 -23 68 -97 13 -60 -63 16 -69 -155 -4 -51 3 125 -142 119
6112A19q9N4o4pK3j88K23j15N6j43P4J52j60m1P2P4jJ1j56L13l38J31o7n2J8j50
$$ 119 30 84 20 13 36 -152 71 -44 12 -131 -57 95 -65 -106 -34 40 39 50 -106 207 -131 0 -67 -119 -101 -251
6138b51L21j13L3J02n6l6l6n6P9J64j48r3N2QJ5J39j78n7K02q6P9k03O5O6j45
$$ -251 70 -43 -10 92 36 0 -36 -92 -13 151 3 -90 -38 -30 -15 124 -54 -111 91 5 84 -119 -54 12 -133
6163a33K03j36J8Kp9J57R3k78K13J08k68K56k34J98j27P5k21L40j79k1oj68K90
$$ -133 70 -66 -48 -46 -125 32 125 -153 60 168 -100 156 -78 120 -7 68 -153 187 8 -13 -19 -187 103
6186A03Nk1Q1j55P1j03J20OKp1j5K0l5p7Q7k39R5J59r8Q3J4ORJ51k4n9q3J8l8
$$ 103 108 87 168 13 84 -19 101 107 109 38 23 43 8 -69 18 -221 -126 33 -65 18 32 38 47 198 174 115 32 50 12
6215A2No5J27j21J59o3R5j23N6j50RK05o2q7kMJ8P3m7j25l3L21j93P6j18K5rk8
$$ 12 17 -48 79 -42 117 54 149 26 82 -68 -59 146 84 -3 -5 -1 17 90 43 -82 -115 206 13 89 -29 -4 -13 -41
6243d1P4Q7l10R8K20j71J24J31l27L7J10k22J33J69j50L7J72j72l1L4j1K2J6o4
$$ -41 33 120 -190 -92 128 -43 81 212 -115 -78 32 -190 -57 112 -38 -1 171 -1 -32 2 -9 13 29 -35
6267c5N5O1m7q9J04k4m9J4q6K64j15j91J43P2j10M9j43J30j62K87j76L7p9LJ39
$$ -35 20 81 34 -55 49 25 -24 -10 -96 168 53 -138 5 77 -33 16 -127 3 -159 128 -48 -11 -90 -87 52
6292E2j5q3R7r3J49j77rJ93j22J70k24K1LJ19j25K64k20J04l32J80q7P7K2KR5
$$ 52 37 -46 51 -42 107 -70 -79 114 -8 162 -62 -41 -38 81 -44 220 0 104 -228 -48 -135 -58 -36 -34 61
6317F1%l3n5K45k63J35j96K9p1J55n6Q2k1Oj9q4O1J73j14o6MJ11r0l6O0q1K6J66
$$ 61 61 28 -27 218 -45 90 -106 -77 -148 7 -49 33 12 18 -1 -85 -24 149 35 -31 -27 84 -6 -42 18 -63 -37 129
6345A29j45m7oJ82k25J24N0k0n7l1o3k4J10k9mK90j38k27M3Q4p0J28j17K12j39
$$ 129 -16 -63 -69 113 -112 12 62 42 -15 -46 -109 -133 -23 -52 -56 234 96 -131 -88 -4 -74 54 -63 149 10
6370A0m1j4J01r6M5j26J96r9M1R9j53Q4K44k79r6j11J84J7j32O0J33m2j39K60
$$ 10 -31 -45 56 -40 5 -121 75 -24 17 116 -37 47 291 12 -84 -195 -11 6 -126 -66 67 25 -114 146
6394A46k04m9J88k22J33O0j05M6J4r2J43L0k34K30p1k3qq6J24p3OQ5r7KO7K28
$$ 146 -58 -107 81 -141 -8 52 -53 -7 7 -85 58 88 -146 84 13 -10 -18 -104 20 -53 -47 38 -59 -57 10 238
6420B38k95JJ43k6o3J51j91N5J16m8j20J03p0N1j92N6J28j51LJ71n0K2p7P9l6
$$ 238 -57 -56 87 61 -2 149 -42 13 129 81 -39 64 -6 45 -147 -91 37 -114 -111 60 10 32 -45 34 -2
6445bO0Q7j21j36J27mJ12k23L1L5J1q7J23Q2j5j03j0r6K26j75J64j24p9J69k29
$$ -2 58 145 24 -112 15 11 123 -100 -69 -34 -23 -110 13 95 80 -23 -33 -129 97 -78 86 -38 -117 52 -177
6470a77K38j66J53l4k9n2Q6N2j04r1k8J50l6J17k8j23J33j27K13k69K22k14R4
$$ -177 61 -105 48 14 -15 -67 19 71 -33 -124 -152 -2 -38 79 51 -72 61 -66 147 -122 100 -114 -20
6493b0Q9K3k7j32K30j32r8lO2o0O6Q9j88L29k12pJ72l19J45j5j26J90n6n9RJ53
$$ -20 69 92 65 -67 163 31 -67 -70 -8 -68 -2 87 -101 228 16 9 181 -138 7 -8 -134 56 0 -59 -50 103
6519A03M7L1j89Qm6N0L0o4M1j9J36j69L9m3J58j09j13P2m8L3L3n3K90l33P4O6
$$ 103 150 181 -8 0 -46 4 34 -30 11 -8 128 -41 -2 -45 113 4 -109 -37 -85 -52 -19 -72 218 -115 -41 25
6545B5l0j32J06j29L0K71j45o6J86l4k3ml2jk16n1J99L4NQ2J36j08Oj7o2j55J87
$$ 25 -5 -137 -31 -160 -130 141 -4 -70 116 82 59 55 23 22 -194 -245 -46 -12 -7 75 211 103 109 92 30 -125 62
6572F2j1p1J77Mk17L6Q7O9j8j04lj9R6j89O2J74m5n9J6j61J07j0j8O8r9J71o2
$$ 62 51 -20 157 161 -56 -20 67 136 118 14 11 -8 88 -101 -39 135 90 31 47 -114 -7 -17 -35 33 -66 105 43
6599D3j43J31l2L5j19J03j9j79J74N6K8j42j0K7k4P5Q3l38K74K6j40J15O7q5m8
$$ 43 -100 31 -1 34 -85 18 -1 -180 -6 50 78 -64 -74 -47 -71 4 87 -251 23 49 -91 24 91 6 -42
6624d2R8n6j00J93J1j17k56L23j5j61L4K11j70K07j57J7j6p0R0j52M9K4K35j98
$$ -42 56 0 -100 93 104 -13 -269 54 39 -122 -88 123 -47 160 3 20 4 -66 24 -128 -79 -55 180 -18
6648a8j43K29k29O5K47k17K7j8j19L40j59M7j49J68q7L6jR5o7Nmj40J34r6l7L9
$$ -18 -161 68 -161 -96 151 -66 -39 -57 -176 164 5 52 -97 71 -16 20 19 114 47 52 48 -92 42 -54 -91 -52
6674e2M9k0J70k54J33J0k20J80J84k61L38j91r4j2P0l7J42k31J68j08O2M6k7L7
$$ -52 -3 -23 147 -107 26 36 -184 -4 180 -81 257 66 -28 -40 30 -7 135 -96 72 -36 26 72 45 82
6698H2j72j1J51Mj07P3j59Q4j02L09l76L14k49M0J17kj0j74LK16j09J44K9r0R0
$$ 82 -90 -101 50 54 -53 20 -139 -55 -157 152 -224 90 -159 -119 -2 -4 -14 -188 -185 31 -78 66 95 5 95
6723I5o1l8n7N0Q5K1j30J41j49J05r2N3N6L1m4o8o5J29j00J68j82J76j02k04K79
$$ 95 34 -4 -61 -11 74 95 -35 106 -43 62 -30 23 79 110 66 -2 -67 62 -38 130 -52 124 22 -182 97
6748I7m5k5n4j39K28j01o9K30j67J63j84P5Jj22MJ22j03J73J6n1o6j06m0K74l19
$$ 97 52 27 -27 -166 62 -39 -108 122 -45 118 -66 9 10 -112 -108 14 -89 84 100 49 -17 -123 -163 111 -208
6773b08J05J10o4j1J04k9n8J17j27j5J20r5Pl3j36K26L3o1oqrk25L80Oj09L2O6
$$ -208 -103 7 -57 -68 36 7 -51 66 -61 -76 44 -51 -44 -77 -213 13 46 -15 -21 -29 -38 -263 117 123 14 46 112
6800A12j09l8p2p0K34n9j13J8N8J12j81p1K43nj43J13r8K44r6q4j00J40Oj40L4
$$ 112 3 -35 -107 -177 57 -2 -115 -97 -39 73 -108 -179 64 59 -84 29 -69 175 79 -5 -105 35 41 -99 -65
6825f5JK53j92r7J60j3m5j86K53K4j94J33j53K14Kj15J21k19J64J95k10k7Rk9
$$ -65 -64 189 -3 -100 60 47 2 -184 69 93 -101 32 -121 93 95 -20 101 -118 46 241 31 4 13 -16
6849a6K0J92k83J57j00P0j9p2K41j89J2J87k61O0L6ON7n0j71M0O3J07j65O6R6
$$ -16 4 196 -87 70 -30 40 21 -51 190 1 13 200 -61 -1 35 41 98 48 -123 -83 -20 87 -78 -12 84
6874H4j48N3kK3Oj00N2J52j39j2J09k04J00K3J1j46J25j06J43LJ6k4j11o2P9J42
$$ 84 -64 -11 -13 10 16 -84 -32 120 -19 -31 78 -126 -26 -3 8 -138 -13 -119 24 27 43 19 -92 -154 -75 67
6900F7p9J20o4J2M6k55N6J54j35K01o3o7J27k04O4j1O7p1j16J87L8k09J76n4r4
$$ 67 -12 108 44 56 102 -153 -97 57 -78 123 60 -7 120 -84 -20 -31 36 -35 -151 36 74 -135 41 -13 -107
6925a07J69n6OO7j81J11J7j41J74j05pN2o2J28j21P8j04J46k08J05n3L5J48j40
$$ -107 62 6 12 79 -102 9 26 -115 59 -46 -53 -1 -63 65 -56 22 -82 64 -144 -39 -92 -57 91 -49
6949d9J65j22P5k98K27k0N0j21N1j98M35r7l38L49k36R9nJ22n5P1k4j10m6J75
$$ -49 116 -6 69 -229 -2 -22 28 -93 -42 -240 195 98 -240 109 -127 -28 -33 89 34 105 81 -29 -75 100
6973A00J4K1K6r3j60o3J67J0k7N6k08J58O6j24J83k20k7L9n9K29R9k72J66j09
$$ 100 114 135 161 68 -92 -155 12 22 -5 51 -157 1 67 -57 126 -94 -121 -82 -141 88 187 -85 81 -28
6997b8N4P6k66O5M2J19O3j57K9N7O4j66qj07L33j5l25L17j69P4j36J71j01J79
$$ -28 26 102 -164 -99 -57 62 125 -32 -3 54 118 -48 -56 -163 170 155 -170 147 -22 52 -84 87 -14 165
7021A65k27p6K65o2j91kK14j87k3K38j72q4K37j22K2q8J79k2p0R6N2kk67J33K7
$$ 165 -62 -138 127 65 -126 -128 86 -101 -124 114 -58 -142 95 -27 -5 -93 86 64 -6 90 142 140 -127 6 33
7046C3N9r1Q6J63j94k50J96j44Q8N8q9K48j07k2o2R1j91K47j73P6P1k23J37j18
$$ 33 92 1 87 250 56 -194 2 -142 -54 4 -85 163 56 34 -28 63 -128 119 -54 22 93 -130 7 -111
7070a11P3J65k53J11M9j49J24j7p2J38n7j13J05o4J21M2j2oj76J76P4l04J71j7
$$ -111 -38 127 -126 -15 34 -115 9 -8 -80 58 1 -112 -7 -71 50 92 80 74 -102 74 148 -156 15 -2
7094bMK00m7j40Q2j24j01K17j06M2o4M4J35j32mk3l2l6J42j86K16l1o4o0l6P5
$$ -2 2 202 155 15 97 -27 -128 89 -17 25 -39 5 140 8 4 -19 -51 -87 55 -131 85 54 -10 -70 -106 -31
7120c1n0j12J94j38n2K98j71K36j95L7J01k19L2J7Q9J44j90k4P8j40R3J14j80
$$ -31 -81 -193 1 -137 -189 109 -62 174 -21 16 117 -102 -70 -53 36 180 -10 -34 44 -96 -3 111 -69
7143f9J23q2O4PN0j30J44j82jL5P5N4k31J22n1J82j72J11n8p1P4J03j45P5q7J57
$$ -69 54 -28 36 43 93 -37 107 -75 -76 -41 34 88 -143 -21 -72 110 -62 49 -9 -80 -6 97 -48 27 -60 97
7169I7j37J9J16l11J51K58m3Nk41p9L92j36j16N8q1J38q9j17K23O3k28O0K2R9
$$ 97 -40 -21 95 -216 -65 193 150 155 -86 -165 227 91 -25 33 -48 90 1 -116 107 170 -58 2 24 123
7193A23p9j51J98q8Q8j59jM0O3j69N3J12O0Kj96K34M9j23r9N0j4K42j18j53N3
$$ 123 44 -107 91 3 91 -68 -69 -29 34 -135 -82 30 90 92 -104 130 179 56 -43 7 -7 235 117 -36 17
7218A7l2m2J39k9j1m3j44K66q2j14M2n6M1K02j50n5o7J8J00j4P1Q8k10p8l3J09
$$ 17 -15 -57 82 53 42 -1 -145 121 39 -75 -33 -89 -48 154 4 -51 -118 -100 0 -14 57 145 -65 -143 -176 -67
7244f7K11j07k72K80J7p8L8O8K2j5q0J30k38J59r7Q4J8n4k00J72j22K20j13J25
$$ -67 144 37 -235 45 62 -16 22 90 112 97 17 147 -91 68 -29 55 73 19 -181 -9 -131 89 -24 101
7268A01%k2j07J39p5Lj2j69L3K1J41j1j24M3P7P1j09j86J66mL9j15J70j19K25
$$ 101 101 79 -28 111 36 39 27 -142 -109 -88 53 42 -82 -39 38 109 0 -186 -20 -24 15 -100 70 -49 176
7293A76l60K15k4N2p1Q8j22O1P8k77J88r4j3J80k03L55j90l4j33J16n4M2l3o6
$$ 176 -184 31 7 59 -12 76 -46 15 93 -184 4 -90 -103 77 -126 229 39 5 -128 -12 -66 -24 -57 -123
7317a23J65m6j50K64j05k2N6Q8l0j45J63j77m7J17R8k33L29n5l1n5j26n0J65j94
$$ -123 42 -4 -154 110 5 -17 39 127 97 -48 115 -62 -109 8 106 -127 202 147 116 61 -65 -115 50 -144
7341a44J83j02L9o0q7K64O6j10o2J0l1O9m9kJ80j21K7r5J03r9J73r3M7l0Qm7k1
$$ -144 39 -63 -24 -84 -171 93 159 49 -13 -3 -34 35 -14 -16 164 43 70 -25 78 -21 152 59 106 76 84 37 16
7368A6Q9k3j08J16q6J11j73J2K6R3j27O0k8q2K06O9k28J54J16k27J8M9q9J1n4
$$ 16 105 82 -26 90 4 115 -58 -46 -20 73 -54 6 -22 -104 102 171 -57 97 213 -14 4 53 -36 -25 -79
7393g9O2j00R5R0j44K77k65J07J11j74O2J00k08P9j11q9J29J2K8J58l23J07J4
$$ -79 -17 -117 -22 68 -76 201 -64 43 154 -20 42 142 -66 13 -98 -187 -58 -46 -18 140 -183 -76 -62
7416f2m0J98j06l1k2m1O7m9R6J21j30P0L3j50J53j70k2L6n8J52n6NN0K8j61J55
$$ -62 -102 96 -10 -41 -63 -104 -37 -86 10 131 1 71 104 -46 107 -63 -85 -49 -107 45 -11 -6 44 72 -89 66
7442F6Ol7nN7JQj36J50l4Q1j83k1m3K75j71O8j91J24r8J36M7j1j29P5K1j68J04
$$ 66 72 35 30 87 88 96 -40 110 76 157 -26 -47 -90 185 14 82 -109 15 -83 53 100 89 -40 35 56 -112 -8
7469hq4Q3J0L9j42Q9P2q5O0k0p8P1m8Jk9J34P6k28J67j07j5J73j95J13o7L5N1
$$ -8 -92 -9 1 40 -102 -13 59 -26 34 14 -64 7 -41 -40 -69 65 141 -87 80 -27 -42 131 -64 49 -18 17 68
7496F8k23J31N2j58l2L09j87K2Rp9K51j78Q8j18O5J24j96j4J73j74O0n0O9n3N
$$ 68 -155 -24 28 -130 -162 147 -40 -18 -9 -88 163 -15 73 -45 20 144 -52 -66 107 -67 -7 -57 12 -41 -36
7521c6K1N5R7j00K17l77K83j52mj31K43j25J68k72J31p8o1M9r7J75L7M6k39K32
$$ -36 -15 40 137 37 254 -123 160 8 4 -127 116 -9 159 -113 18 -60 -121 -72 -169 6 43 89 -150 82
7545H2J0r1OK6KR0j79J76l66L76j98j30K13J1J4L2j38q0L55k24Q6k17J89k8M4
$$ 82 92 1 7 33 35 125 -54 122 -244 132 -66 -196 17 28 42 74 -64 -144 211 -13 73 -144 45 17 61
7570F1o6L8M3n3kk4J34j51j56J92n1J03J08k22K24k16K0J33l07K09N6j93R5K5
$$ 61 -5 33 76 23 21 -3 131 -20 -176 16 -35 68 176 -46 178 -38 -18 115 -192 17 73 -120 -25 0
7594@j16mKQ3J86j60K6J06k54K55j70n0J60j47Q7P8j31L7Lj61L53k71Q0Rk9J91
$$ 0 -116 -120 -118 -35 151 -9 17 123 -131 124 -46 -96 64 -83 4 82 -49 -12 -9 -170 183 -88 -8 1 -28 163
7620A63r2p8nJ46r4q3lqJ28j38J82j16l2J26p5Rj00l1J95Pj08J12q3j21J96j52
$$ 163 71 -7 -12 134 40 -43 -46 -54 74 -64 118 2 -30 96 21 30 -70 -101 94 101 -7 105 22 -99 97 -55
7646e5N4rQ1l5l1j67J85k23k1J19JM5q2J38QJ28L0k44o6K40o9k7J54j49o8kQ6
$$ -55 -1 -10 71 36 5 -162 23 -200 -221 -102 -101 -56 -138 0 8 136 166 -78 -144 96 27 0 154 5 -63 -65 21
7673B1o4o4J08P6j20P6J87k67J19R3l23L41j39j33K50j24p4j32J36N8j05N2R4
$$ 21 -43 -107 1 77 -43 33 220 -47 72 165 -158 183 44 -89 161 37 -37 -169 -33 25 -80 -28 66
7696F6k07K06j67P5L2n1L2L8p8J69k24J59j32o2J72n6k3r5J41l5O6Np3J85m2k08
$$ 66 -141 65 -102 -27 5 -46 -14 24 -54 115 -109 50 -82 -144 28 -28 -51 -146 -5 -40 26 31 -42 143 101 -107
7722a07J81J00k51J45j52J42j15k96L45j80K96j64P9J9L0l28K81jk03K28k14J56
$$ -107 74 174 -77 68 -84 58 -57 -353 -8 -188 108 -56 23 42 72 -256 25 24 -179 49 -165 -9
7744in3N5k07L00k23K56j35M3J40j01m4p7L4q7J24j63K71l1m6j4o9K60j60j76
$$ -9 -62 -7 -214 86 -137 119 -16 27 167 66 22 -55 -21 -108 16 -147 124 93 47 33 -36 224 64 -112
7768a12K17j85j66L54l19K66j97J57j4j13K33k7k56J7K87k03L4n0o1K34j66m7
$$ -112 105 -80 -246 108 -211 55 -142 15 1 -112 121 94 -162 -145 142 -61 -27 -77 -138 96 -70 -117
7790a17J40K1P6j40j08K46j32p7M8LL4q9P1N9n7jqmJ36j4j46q8K76l1n0k0k1J45
$$ -117 23 44 120 -20 -128 118 -14 -91 -43 -40 -6 -95 -24 35 -22 -23 -31 -35 101 87 -59 -147 129 98 48 28 7 152
7818A52k20O0q0J30Jm5j18J96j21K19j80L5l1j27M5m2J40J4j41K3K71j28l8n4
$$ 152 -68 -8 -88 42 43 -2 -120 76 -45 174 -6 29 -2 -129 -84 -126 14 28 -113 -90 181 53 15 -39
7842c9NP4O8l07L0P5R1p7J70L2k1j93O0J48j70K73j11j63P4J54j61l5j00K93m47
$$ -39 -34 40 108 -199 -169 -94 -3 -80 90 122 101 -92 -32 116 -54 219 108 -55 19 173 12 -23 -123 170 -277
7867b77O9K60Qk3L4p8j10J55k47J41J50m0n3j29N1P7J07l3L8m3q6K55k49P8L3
$$ -277 -208 52 60 37 71 -7 -117 38 -209 -68 82 42 -11 -140 -89 -12 95 62 100 57 -29 226 -23 55 88
7892H8n2QL8r1q3kJ17k06J29p7K07k2j85p0K22k1P7j02l28L96j47O7K57k85O4
$$ 88 36 44 82 -9 -92 -94 23 -183 -54 -131 76 54 -131 -201 21 0 77 -25 -353 43 -104 -37 220 -65 -1
7917aN0p1L4Q0k07K56k97J28J86j64Po1P4o0J9p1R0K5P1j82J56qj5j38J73Kj76
$$ -1 49 -22 12 92 -115 141 -156 -28 158 -6 1 -60 14 -46 -27 -98 -8 17 88 -94 62 54 39 -99 74 76 -100
7944a00K36l34L00j70k9J41j69Q7L3n8J2K92l58J17q9J0K12k53R6q4N2m1qJ38
$$ -100 136 -198 102 -68 -97 44 -125 -38 -5 -63 -51 241 -117 0 -89 -79 133 -120 -24 -108 -56 -97 -105 33
7968C3Kk9N1J9n9o4J60j36k6r6j2J98o4j45J47M8N6P6q4p3j54R5Lk4K23q9n8k33
$$ 33 35 6 57 76 17 -47 113 -23 -49 -145 -157 41 -23 -168 -21 27 83 159 75 2 -152 -57 -54 -78 145 56 -2 -235
7996b35J56P9M4o0l8J19j48K01j08j68J99q7LJ15p4Q7m6l6j24P4P9j2m0N6J15
$$ -235 -79 0 44 -16 -54 65 -83 118 10 -158 41 -46 -43 72 -2 85 39 3 -121 -47 32 20 -20 36 151
8021A51k69J53j02J2J30k66J94N5j47J08O8m6J23l04J67N0L0r6j21J33J01j95
$$ 151 -118 35 -67 -55 75 -191 3 58 -89 19 87 41 164 -140 27 77 107 11 -110 23 124 -71
8043g1J30m6J0J01k16p8K15n7Q7j05Q2p9M8j03J60j47q9r3K05M5l5k6J69q2K7
$$ -71 59 13 23 124 -92 -170 45 -12 75 -30 52 -27 21 -82 78 -69 -158 -251 -46 -1 -36 -62 107 25 52
8068E2p8r3K68j06j15M0j4N3k9j38J16J24J7oK8p0k8k11J48J54o7K2k0n1R4r5
$$ 52 -26 -119 149 43 -72 -32 -46 7 -22 -160 -44 80 97 91 119 49 21 -190 -42 112 45 67 47 -4 90 -5
8094eJ47k09l2j9K19j30J64j80J8N5l7o5J46k26K81j1j99K05n8o7N3p3j00J56
$$ -5 142 -67 -99 -118 101 -29 135 -45 -27 28 -9 -74 72 -154 127 116 -83 122 64 -3 50 -23 -123 33
8118C3j0j16j5L2J6J33o1j18L6J07l6k5J88j18r6J06k6R6N5j98l9O8L6Qj08K1
$$ 33 23 -93 -108 -76 -60 73 12 -106 -70 37 1 -24 164 46 -50 56 30 126 181 -17 -56 12 48 56 -52 -31
8144c1J86q2n8q8J4J00K2j50K9LR4Q5k78J32J9J3P3Lj70J11o9QJ4q6J5J24o0R3
$$ -31 155 73 15 -73 -59 41 63 -87 -58 -55 39 124 -154 -22 -3 10 83 86 -84 27 -42 -34 -20 -106 -91 33 -27 66
8172F6q9j98K84m5j28K35j96J51j19L0J02j59J37j67m5J29O5m6l2
$$ 66 -23 -221 63 18 -110 125 -71 80 -39 -9 93 -66 71 -96 -141 -12 53 7 -25
8191b5
$$ Imaginary data points
##PAGE= N=2
##DATA TABLE= (X++(I..I)), XYDATA
0@%%%%%%%%%%%qJ6j6J6k1K9l2M0m8N6p0Q0r0J04j25J47j69J93k19K50k85L25l67
$$ 0 0 0 0 0 0 0 0 0 0 0 0 -8 8 -8 8 -13 16 -16 24 -24 32 -38 42 -48 56 -69 78 -91 102 -117 133 -152 173 -194
34a94M13m65N23n85O49p20Q03q93R86j089J204j329J466j615J777j957K157k379
$$ -194 219 -246 277 -308 341 -379 424 -469 517 -572 632 -697 769 -846 931 -1026 1131 -1248
52a248K623k892L199l549L949m412M954n600O385p364Q618j0284J2608j6069K1728
$$ -1248 1375 -1517 1682 -1867 2082 -2330 2624 -2976 3409 -3955 4663 -5621 6987 -9082 12646
67A2646l2432N9011k31227k79931Q19949j88686n45654N97454K46137o90983P5150
$$ 12646 -19786 39225 -192002 -471933 348016 159330 -386324 211130 457267 -233716 -158566
78a58566M93506l45525k53316M59319j6276l36848K13748R1654l06089P9491K65187
$$ -158566 334940 -10585 -263901 195418 179142 -157706 56042 147696 -158393 -78902 186285
89A86285q9271j43216J45566N4089k65132P952K86628j48990j42178K97408n7971
$$ 186285 97014 -46202 99364 153453 -111679 -103727 182901 33911 -108267 189141 131170
100A31170l07316K36360J54676l71210Q8533M44063l18954l33660M35227m0729
$$ 131170 -176146 60214 214890 -156320 -67787 376276 57322 -276338 158889 118160
110A18160m65400L42561K47675m35304P0871L06818l00258r8865L52240o7285
$$ 118160 -347240 -4679 242996 -192308 -121437 185381 -114877 -213742 138498 71213
120G1213k19975K40601P9453k85272L5928J31104j37568M9882J23909j29243l8722
$$ 71213 -148762 91839 171292 -113980 -78052 53052 -84516 -34634 89275 -39968 -78690
131g8690Q5822m5004o0950P3393J08507o3265r7058J11587K0513j72548M5198
$$ -78690 7132 -37872 -98822 -25429 83078 19813 -77245 34342 54855 -117693 -72495
142g2495J53513q3881n1178J52949n9106j97257J76348J40868k45275O1138K39451
$$ -72495 81018 -2863 -54041 98908 39802 -157455 18893 159761 -85514 -24376 215075
153B15075k32911j20764K25834q0830j40431J70419J6735j44951R5441N3250j80170
$$ 215075 -17836 -138600 87234 6404 -134027 36392 53127 -91824 3617 56867 -123303
164a23303N6930J93056j18730n2132J52709r2699j00052J20532j9687p5554Q5797
$$ -123303 -66373 126683 7953 -44179 108530 15831 -84221 36311 16624 -58930 26867
175B6867K8031r2220j8515P6439j4207q2467O9431R5385p3368o5250M8074J2900
$$ 26867 54898 -37322 -55837 20602 6395 -76072 -6641 88744 15376 -49874 -1800 11100
187A1100n9902K5153Q1649o8238l3465J14793p3357r1619J61003Q001j32095J00105
$$ 11100 -48802 -23649 58000 -10238 -43703 71090 -2267 -93886 67117 75118 -56977 43128
199D3128O1934j34188m987Q1136o5622j6019J13965o3539j04110J29219R198j39638
$$ 43128 105062 -29126 -34113 47023 -18599 -34618 79347 15808 -88302 40917 50115 -89523
211h9523R4857Q6443j04087O099N8989n4222k7623M2229j702l5830L7586K9069
$$ -89523 5334 91777 -12310 -6211 52778 -1444 -29067 13162 11460 -24370 13216 42285
223D2285p8025j5400O9926q511l2517J8935K6999j2494m1831J8752J5335m0287
$$ 42285 -35740 -51140 18786 10275 -22242 -3307 23692 11198 -30633 -11881 3454 -36833
235c6833M0260J9691p0599M1586M4382q7134J639R0470k0737n6207M4364J8759
$$ -36833 3427 23118 -47481 -5895 38487 -48647 -47008 43462 22725 -33482 10882 29641
247B9641o8296K8242M6619q0812K3855Q4956q9969l1813R5167k5281n5741M8924
$$ 29641 -38655 -10413 36206 -44606 -20751 64205 -25764 -57577 37590 12309 -43432 5492
259E492L2087l6327r054K7451k7178j1402N4633k6683m2542N4507P073m8791K977
$$ 5492 37579 1252 -7802 19649 -7529 -18931 35702 9019 -33523 20984 28057 -20734 -17757
272a7757K9467Q251k7934N24L1678k7720r557K8639l1920J303M6654l0315l6878
$$ -17757 11710 19961 -7973 -7449 24229 -3491 -13048 15591 -16329 -15026 31628 1313 -35565
285c5565L6263K6823m3422j6720N7735j0127m3290M3410o497l8709N1095k818
$$ -35565 698 27521 -15901 -32621 25114 14987 -28303 15107 8610 -30099 20996 18178
297A8178n1425L8391L0590m3897j9322M1252R922m2070J4396K3199l1383J5969
$$ 18178 -33247 5144 35734 -8163 -27485 13767 23689 -18381 -3985 19214 -12169 3800
309C800J3333l9271K0091K8687k7978j3127J6466J8311j9494k3668L0588M891
$$ 3800 17133 -22138 -2047 26640 -1338 -14465 2001 20312 818 -22850 7738 12629
321A2629k4221J2977m256o201K0121p690j5326O794K0424k467l7420J8284L3140
$$ 12629 -11592 1385 -2871 -9072 11049 3359 -11967 -5173 15251 12784 -24636 -6352 26788
334B6788m0915n669K7839j9037L227J1502k1233M303K2607l049k5649P513L6247
$$ 26788 -14127 -19796 8043 -10994 -7767 3735 -17498 -13195 9412 6363 -19286 -11773 24474
347B4474k5315k4212L3573n487j3167J5215j5834L601K2244j2723q566Q474J7203
$$ 24474 -841 -25053 8520 3033 -10134 5081 -10753 -7152 15092 2369 -6197 2277 19480
360A9480J38k6322J1690J8843j8791m027q10N12J1728j4516n872J0705J642R820
$$ 19480 19618 -6704 4986 23829 5038 1011 201 713 12441 -2075 -7947 2758 4400 14220
374A4220j4159p501L4511j1029k7031J7329L546o045j763r958M808N204n90r831
$$ 14220 61 -7440 27071 16042 -10989 6340 9886 3841 2078 -7880 -3072 2132 1542 -8289
388h289p920K9103J225l2598J7952J0113j9403N104p174k397J8089j2188j2996
$$ -8289 -16209 12894 14119 -18479 -527 9586 -9817 -4713 -11887 -14284 3805 -8383 -21379
401b1379P748J1677M812j5590P145K2155r930o590l275l539J5969j1123j4319
$$ -21379 -13631 -1954 2858 -12732 -5587 16568 6638 48 -3227 -6766 9203 -1920 -16239
414a6239J5442l247m046k863r140K6556R567k2301J0326J2415n732n807o557P370
$$ -16239 -797 -4044 -8090 -10953 -20093 6463 16030 -6271 4055 16470 10738 4931 -1626 5744
428E744N390n30n170j9949J4696J5635l2102J0726L0264j8909p106J115q252Q699
$$ 5744 11134 10604 5434 -14515 181 15816 -16286 -5560 24704 5795 -1311 -196 -8448 251
442B51l223j0829L573Q334K925k1109n203K5959J938L32O985n587J0206q349k1718
$$ 251 -2972 -13801 -10228 -1894 1031 -20078 -25281 678 2616 2948 9933 4346 14552 6203 -15515
457a5515J7423O154j0015K74j4379L503J1336k1162j093K7692J3135j0308j0461
$$ -15515 1908 8062 -1953 -1679 -16058 -12555 -1219 -22381 -23474 4218 17353 7045 -3416
470c416J1226k321q302J8757n484n053K3944k3784k1440K9080K517r634Q878N921
$$ -3416 7810 5489 -2813 15944 10460 5407 29351 5567 -15873 13207 15724 6090 14968 20889
484B0889P652j0882k1629n93J2330J0207j3010r374J4457j5377j2714J7497j663
$$ 20889 28541 17659 -3970 -4563 7767 17974 4964 -4410 10047 -5330 -18044 -547 -2210
497b210J2330J6959k1739J31J0074j7214n118J027P301J2727j9584k5951jJ3563
$$ -2210 10120 27079 5340 5471 15545 -1669 -6787 -5760 1541 14268 -5316 -31267 -31268 -17705
511a7705Q06j1701K2775J6274k9413M04R249j6417J7891Q582j7202J6714L205
$$ -17705 -16899 -28600 -5825 10449 -18964 -18560 -9311 -25728 -7837 745 -16457 257 3462
524C462k6296o523R679J7085J2220k414r409o561J0395j0025j9673L2330J3408
$$ 3462 -22834 -29357 -19678 -2593 9627 7213 -2196 -8757 1638 -8387 -28060 4270 17678
537A7678k9467N961M126j3433O495o95J4217K9433n995j4433m166l987P643Q501
$$ 17678 -11789 -5828 -1702 -15135 -8640 -9335 4882 34315 28320 13887 9721 5734 13377 21878
551B1878J069q061N65N999l2699j2688L7513m625j2625K5744k421j3948o848j5493
$$ 21878 22947 14886 15451 21450 -11249 -23937 13576 8951 -3674 22070 19649 5701 -1147 -16640
565a6640J7478K5158r464j1678n62m191j2074K616J5296m107J1544J4622l4409
$$ -16640 838 25996 16532 4854 4292 101 -11973 -9357 5939 1832 13376 27998 -6411
578f411p406K1826k1032m186K6405K638r678k2286j4189J9539J1189l637O470
$$ -6411 -13817 8009 -13023 -17209 9196 11834 2156 -20130 -34319 -14780 -3591 -7228 -758
591g58J3273j841j9632J388P113r200J9766R746k4772P151k707l0477R428K2113
$$ -758 12515 10674 -8958 -7570 -457 -9657 10109 19855 -4917 2234 -473 -30950 -21522 591
605E91R353M571j7488q487J2016k843j1077Q525K5347n068k4426Q803m709j9153
$$ 591 9944 14515 -2973 -11460 556 -2287 -13364 -4839 20508 15440 -8986 -183 -4892 -24045
619b4045K2892R024m771K0350j3924k8811P291R969N188K027o040J463r32j0210
$$ -24045 -1153 7871 3100 23450 9526 -19285 -11994 -2025 3163 5190 -850 613 -319 -10529
633a0529j4822N074K9188j745j0220J8294r996j9623Q116J306J5179J5365k1197
$$ -10529 -25351 -20277 8911 7166 -3054 15240 5244 -14379 -6263 -4957 10222 25587 4390
646D390r604L579p544K019M076K874J0357O515j0481k2512Q092J8920j7051Q049
$$ 4390 -5214 -1635 -9179 -7160 -3084 -210 10147 16662 6181 -16331 -8239 10681 -6370 1679
660A679K7199k0993j6147K270o954J5815J2307j1162L250O300o976j2114l198
$$ 1679 28878 7885 -8262 -5992 -12946 2869 15176 4014 7264 13564 6588 -5526 -8724
673h724J2047N509M477j180j8567K633J351j8893J7840K1350j1560m710p120l317
$$ -8724 3323 8832 13309 12129 -6438 -3805 -2454 -21347 -3507 17843 6283 1573 -5547 -8864
687h864J0927o749l472J5080N083p883j3693k956M288O05J1801J076n597J1061
$$ -8864 2063 -4686 -8158 6922 12005 4122 -9571 -12527 -8239 -7634 4167 5243 -354 10707
701A0707j6708j7755K5530O952j0155O923l110l063J016j1005k503J3156J3219
$$ 10707 -6001 -23756 1774 8726 -1429 5494 2384 -679 337 -10668 -13171 -15 13204
714A3204n614j3098P568k825j2070J2137M573J626Q501j8116p879J4418m189l251
$$ 13204 7590 -5508 2060 -765 -12835 -698 3875 5501 14002 -4114 -11993 2425 -1764 -5015
728e015M664M487P962r593j2769K663O403O008l660L94Q840j2910p350O507l240
$$ -5015 -351 4136 12098 2505 -10264 -7601 -1198 4810 1150 1544 10384 -2526 -9876 -3369 -6609
743f609J2136M880j8663P799R349j5535l664O885Q170L505o540l402l363K823
$$ -6609 5527 10407 -8256 -457 8892 -6643 -10307 -3422 4748 8253 1713 -1689 -5052 -2229
757b229L618r609J0787J2714j6917l429O036m831P612j560n875J2753J142j0265
$$ -2229 1389 -8220 2567 15281 -1636 -5065 971 -3860 3752 2192 -3683 9070 10212 -53
771e3o017K554J1487k875o164O132j994k412m700n506J4287J574j0864N943j985
$$ -53 -6070 -3516 7971 5096 -1068 5064 3070 658 -4042 -9548 4739 6313 -4551 1392 -593
786e93j228M707j1794L008J5410n246q706j076M622J203p431N082M283k539M916
$$ -593 -1821 2886 -8908 -5900 9510 4264 -4442 -5518 -896 307 -7124 -2042 2241 -298 4618
801D618j0769l717J8152p322j0133J1519J213l196l948m901P172K939r46j515
$$ 4618 -6151 -9868 8284 962 -9171 2348 3561 365 -3583 -8484 -1312 1627 681 -834
815h34l445R530q11j1993Q267O031k369p48p599P162N482j3170K841O693j760
$$ -834 -4279 5251 4440 -7553 714 6745 4376 3628 -3971 3191 8673 -4497 -1656 5037 3277
830C277L856o407l442R741o52n589k204N904N222j3546j584R794o172J380J029
$$ 3277 7133 726 -2716 7025 6373 784 -1420 4484 9706 -3840 -5424 4370 -1802 -422 607
845F07q272J1326K217j3373L501O952N30m913m917P666J5n995J372l190N901M581
$$ 607 -7665 3661 5878 -7495 -3994 2958 3488 -1425 -6342 1324 1339 -4656 -3284 -6474 -573 4008
861D008j2484L422Q488m224l5m201K601R144r269m621P164m14P76m031j446Q820
$$ 4008 -8476 -5054 3434 -790 -825 -5026 -2425 6719 -2550 -7171 -7 -421 355 -3676 -5122 3698
877C698j137l136j125J531R636p145q654J2574j294o143K980n306M264O352r377
$$ 3698 2561 -575 -1700 -169 9467 2322 -6332 6242 4948 -1195 1785 -3521 743 7095 -2282
892b282j082O508L061l926p017R256L152r143K593j847n80O927j0308l468J1237
$$ -2282 -3364 3144 6205 2279 -4738 4518 7670 -1473 1120 -727 -1307 5620 -4688 -8156 3081
907C081k288m118j571R32P809n304n501N819N37P26m421m154Q998l60m878K110
$$ 3081 793 -3325 -4896 -3964 3845 -1459 -6960 -1141 -604 122 -4299 -8453 545 185 -4693 -2583
923b583j130P800o57j2314J0118O839q708J257p31J85L882n373k234L421M816
$$ -2583 -3713 4087 3430 -8884 1234 8073 -635 622 -109 76 3958 -1415 -3649 -228 4588
938D588K25j0577O087J0217j0737N23O496l024N098m360p959Q679K265m493j943
$$ 4588 4813 -5764 323 10540 -197 326 6822 3798 8896 4536 -3423 5256 7521 3028 1085
953A085P55O958m419p552N632J524Q08j372o435O809J0r503K489M56L260M484
$$ 1085 1840 8798 4379 -3173 2459 3983 4791 3419 -3016 3793 3803 -5700 -3211 -2755 505 4989
969D989j2328Q04J0078o390l232K776L079J828n468j653k19o02N473o930j012
$$ 4989 -7339 -6535 3543 -2847 -6079 -3303 -224 1604 -3864 -5517 -5736 -6338 -865 -7795 -8807
984h807J4282q077r832P983J078K317J274n551N076K327m931l330k02R284N74
$$ -8807 5475 -2602 -12434 -4451 -3373 -1056 218 -5333 -257 2070 -2861 -6191 -6393 2891 3465
999C465p523N174J6l438J510m123P252Q272r929j565K016j386M314n062j014J1320
$$ 3465 -4058 1116 1132 -2306 -796 -4919 2333 10605 676 -889 1127 -259 4055 -1007 -2021 9299
1015I299j153p294k584L057M331m941L122O487o838M4l080q186J2324L875j0969
$$ 9299 8146 852 -1732 1325 5656 715 3837 10324 3486 3530 450 -7736 4588 8463 -2506
1030b506L972K997l250k994m603N196N914J87j848o366L355Q54r833P901Q673
$$ -2506 1466 4463 1213 -1781 -6384 -1188 4726 4913 3065 -3301 54 908 -8925 -1024 7649
1045G649n089p40n588j411P830n092j454P603M1N03o053p223N393M214R47j123
$$ 7649 2560 1820 -3768 -5179 2651 -2441 -3895 3708 3749 4252 -1801 -9024 -3631 583 1530 407
1061D07O29M928j0618p336J2922R28j727M576o599J765L337j1080J17R253M392
$$ 407 1036 5964 -4654 -11990 932 1860 133 4709 -1890 -125 3212 -7868 -7751 1502 5894
1076E894j106o042o04j089l153N548Q5L491O886j3084n555R562k897r44K492J695
$$ 5894 4788 -1254 -1858 -2947 -6100 -552 -467 3024 9910 -3174 -8729 833 -2064 -3008 -516 1179
1092A179O762o557j0430K708L217M156K342j588J825n109l852Q57n14J0772K082
$$ 1179 7941 1384 -9046 -6338 -3121 1035 3377 1789 3614 -1495 -5347 -4490 -5004 5768 7850
1107G850j1625O034K818j0685R28K034M796Q668n322p964r39J772R54k182P586
$$ 7850 -3775 2259 5077 -5608 -4680 -2646 2150 10818 5496 -2468 -3407 -1635 -681 -2863 4723
1122D723N710r890j630p58l867Q004m27m067J0311q81r214m247j231R141M913
$$ 4723 10433 543 -1087 -1845 -5712 2292 1865 -2202 8109 7228 -1986 -6233 -7464 1677 6590
1137F590m048P14j365k910m040j812J0110K579m726K660m803k223L393q492M612
$$ 6590 2542 3256 1891 -1019 -5059 -6871 3239 5818 1092 3752 -1051 -3274 119 -8373 -3761
1152c761J3805l779o249l859k386L588Q33K004L128O23k69r726k039J0638l953
$$ -3761 10044 6265 16 -3843 -6229 -2641 -1808 196 3324 3947 3678 -6048 -8087 2551 -1402
1167a402r00Q665k426j246l916r290O822Q976m89j314l205J50j767n116M528M481
$$ -1402 -2302 6363 3937 2691 -1225 -10515 -3693 5283 4794 3480 275 425 -1342 -6458 -1930 2551
1183B551K400L00q016K004J727q771L985P331N63L028q266q127O678K252q36J724
$$ 2551 4951 5251 -2765 -761 966 -7805 -3820 3511 4074 7102 -1164 -9291 -2613 -361 -1197 527
1199E27K623J871o902l858L083l36N450N27l744P436m560j1992N174M772K877
$$ 527 3150 5021 -1881 -5739 -2656 -2992 2458 2985 -759 6677 2117 -9875 -4701 71 2948
1214B948L357o073k064J856k787q41N10O621L508p708l93Q98l785K954j307M006
$$ 2948 6305 232 -1832 24 -2763 -3604 -3094 3527 7035 -673 -1066 -168 -3953 -999 -2306 1700
1230A700R078q916p173L702j63K976J684k132L924j066m749k928P4P027p46l218
$$ 1700 10778 1862 -5311 -1609 -1772 1204 2888 756 4680 3614 -1135 -4063 -3989 3038 2292 -926
1246i26N399l353m278O4l971Q160P408q978j648K602k134o93j654L546M206k035
$$ -926 4473 1120 -3158 -3094 -7065 1095 8503 -475 -2123 479 -1655 -2348 -4002 -456 3750 1715
1262A715j007m228n6M547m634K125P779l479k244l395l366Q190R43n399L796J543
$$ 1715 708 -3520 -3576 971 -3663 -1538 6241 2762 518 -2877 -6243 1947 2890 -2509 1287 2830
1278B830j701l382k488N052K190q09R32k495K209j695p342O692M693l310J218
$$ 2830 1129 -2253 -4741 311 2501 1692 2624 129 2338 643 -6699 -7 4686 1376 2594
1293B594m408q51N694m082j866N364K449j063n771J74L937l684R72J693o79L448
$$ 2594 -1814 -2665 3029 -1053 -2919 2445 4894 3831 -1940 -1766 2171 -1513 -541 1152 473 3921
1309C921n771n114P396O30j688J684k398K960M32o206N66L139K227j647l966L939
$$ 3921 -1850 -6964 432 1062 -626 1058 -1340 1620 2052 -4154 -3588 -449 1778 131 -3835 104
1325A04K99m637K497P11K691L691p772j42N912l800r00P22M70L506l107l479J824
$$ 104 403 -4234 -1737 -1026 1665 5356 -2416 -2558 3354 -446 -1346 -624 -154 3352 245 -3234 -1410
1342a410J347K129l087j45O267l712l436K201j571L961l71o521M863K471m780
$$ -1410 -63 2066 -1021 -1166 5101 1389 -2047 154 -1417 2544 2173 -4348 515 2986 -1794
1357a794K68L47K875K061l599O27P09N36m58m974L502M268o461m30J350j019L612
$$ -1794 -1526 -1179 1696 3757 158 785 1494 2030 1572 -3402 100 4368 -2093 -2523 -1173 -2192 1420
1374A420l282k107O370n82l103l79L77L425k533k391K746l76J021k151l106O941
$$ 1420 -1862 -3969 2401 1819 -1284 -1663 -1286 2139 -394 -2785 -39 -415 606 -1545 -4651 2290
1390B290L13m922L146P7L22J678n655J421M345l060j949l13K551J437m188J895
$$ 2290 2603 -2319 827 904 1226 2904 -2751 -1330 3015 -45 -1994 -2307 244 1681 -2507 -612
1406f12K329l38K238m236j54O586m660l116L284r53Q26j578l227M083J511k451
$$ -612 1717 1379 3617 -619 -773 5813 1153 -1963 1321 368 1194 -384 -3611 472 1983 -468
1422d68l75N56M013k171l971L661r5n29L13m743L686L311o089Q01K994m47J348
$$ -468 -843 -287 3726 1555 -2416 1245 1150 621 934 -3809 -123 3188 -2901 -2100 894 447 1795
1439A795k876l60L665j666k403j067J898K470n269m27M266j910J633o35k066O311
$$ 1795 -1081 -1441 2224 558 -1845 -2912 -1014 1456 -3813 -4240 26 -1884 -251 -886 -2952 3359
1455C359l03n266L069J185l64j168k689K268Q15k188p30p98M355N79n439L625
$$ 3359 3056 -2210 859 2044 1680 512 -2177 91 906 -1282 -2012 -2810 1545 2124 -3315 310
1471C10K177k592J189k939J039M963m673k170K977L17J81j456N55L429r75j145
$$ 310 2487 -105 1084 -1855 -816 4147 -526 -2696 281 598 779 -677 -122 3307 2332 1187
1487A187j147o0M114l967l372N264j609k177Q16k997L587L114m323Q66K760j7
$$ 1187 40 -20 4094 127 -3245 2019 410 -1767 -951 -3948 -361 2753 -1570 -704 2056 2039
1503B039j691k205L262Q94k551K66k218J485K780o189J401O017k580l20p89j441
$$ 2039 348 -1857 1405 2299 -252 14 -2204 -719 2061 -4128 -2727 3290 710 390 -399 -1840
1519a840L969j224k906K561J005p79l367l91M068j364k57J501j342L552j414o383
$$ -1840 2129 905 -2001 560 1565 786 -2581 -2972 1096 -268 -525 976 -366 3186 1772 -4611
1535d611M966K717l169N99j843k07J845k989k28K844K292n98l532K481K072m372
$$ -4611 355 3072 -97 502 -1341 -1548 297 -2692 -2920 -76 2216 1618 -1914 567 2639 -1733
1551a733J659J160l87L533n036l871M970k52j232J430n4J998r72l442P87J724
$$ -1733 -74 1086 699 4232 -804 -4675 295 43 -1189 241 187 2185 1213 -2229 -1442 282
1567B82J687j700j746M223k423m591K344L42K838L158n882L54L997l460o22J433
$$ 282 1969 269 -1477 2746 323 -4268 -1924 -1582 1256 4414 -1468 -1114 2883 -577 -1199 234
1583B34J394J747k578j706m23K16J239k652K709N471n316k826J605j393L397N46
$$ 234 1628 3375 797 -909 -1332 -1116 123 -2529 180 5651 335 -2491 -886 -2279 1118 1664
1599A664l662L315Q42m336r37O80K986O70o19J235j059m82j160l069O133L356
$$ 1664 -1998 1317 2159 -2177 -3114 -2434 552 1222 603 1838 779 297 -863 -3932 2201 5557
1615E557n689J57j44k071K205k072l95N372l97l101j651M65J161j180K164K686
$$ 5557 -132 25 -119 -2190 15 -2057 -2452 2920 2523 -578 -2229 -1764 -603 -1783 381 3067
1631C067j247k77m068k227O947j74l403L986q19j681j98l432J548M053N8j191
$$ 3067 1820 1543 -2525 -4752 2195 2021 -1382 2604 1785 104 -94 -3526 -1978 2075 2133 942
1647I42j169P69k131l176M274K887j48P76n137P5M302l936l40M496J65j08k314
$$ 942 -227 542 -1589 -4765 -491 2396 2248 3024 -2113 -2038 2264 -1672 -2012 2484 2649 2541 227
1664B27l714J683J183L11O95J376R35n338k406M133J97J973J405l866L021J057
$$ 227 -3487 -1804 -621 -310 385 1761 2696 -2642 -5048 -915 -718 1255 2660 -1206 1815 2872
1680B872o484J021M186O63R68j912j370r13j946O23Q26L875J085n872NK024k238
$$ 2872 -3612 -2591 1595 2258 3226 1314 -56 -969 -2915 -2292 -1466 2409 3494 -2378 -2373 -349 -2587
1697b587K073K18m21N302k272n808J620J066J010J264Q51J387k335k720o92M66
$$ -2587 -514 -296 -717 4585 2313 -3495 -1875 -809 201 1465 2316 3703 1368 -1352 -2044 -1578
1713a578M781q71l989L276r16l967R11j366K302N657k735k566R93o26m50L7L347
$$ -1578 3203 2332 -1657 1619 703 -3264 -2353 -3719 -1417 4240 1505 -1061 -68 -694 -1144 -1107 2240
1730B240K141k820j415k186k57L330l016j24N933k132k597l21k526K984L106j586
$$ 2240 4381 1561 146 -2040 -2297 1033 -1983 -2107 3826 1694 -903 -1224 -3750 -766 2340 754
1746G54L86L78j784k772q51M136J070r97R19j723J221J57n099L440M892k336o97
$$ 754 1140 1518 -266 -3038 -3889 247 1317 320 1239 -484 737 894 -4205 -765 4127 1791 1094
1763A094j550k496J345j33R2K330J597o90l637P08L248j726M79K105j416J917
$$ 1094 -456 -2952 -1607 -1740 -1648 682 2279 1589 -2048 -1340 1908 182 661 2766 1350 3267
1779C267l033n376L972K306j497J275m68o2m70j994J159J912J611p31k933J575
$$ 3267 234 -5142 -1170 1136 -361 914 446 384 -86 -2080 -921 991 2602 1871 -1062 513
1795E13J30m061J587J205J048L171m176k223M069j043o51J855N74L62k617j813
$$ 513 643 -3418 -1831 -626 422 3593 -583 -2806 1263 220 -431 1424 1998 2360 -257 -2070
1811b070M68j17J657j320m57M406k157l438K432l0K040J928l783L49J325k661
$$ -2070 -1602 -1719 -62 -1382 -1839 2567 410 -3028 -596 -626 1414 3342 -441 -92 1233 -1428
1827a428j004Q01K256O52k193R90K52nP48j900J998L827m347j521O88j591J854
$$ -1428 -2432 -1631 625 1277 -916 74 326 321 1069 -831 1167 4994 647 -874 -186 -1777 77
1844G7n66j659L003M27k398m63J469K036j198m82J805j262m41r64l056M019J742
$$ 77 -489 -2148 855 1282 -1116 -1579 -110 1926 728 246 2051 789 348 -616 -3672 347 2089
1861B089l997J650P22r75J243j586N33K861r80j957q60R14J17k822Q76K445r95
$$ 2089 -1908 -258 464 -511 732 -854 -321 2540 1560 -397 -1257 -343 -226 -3048 -2172 273 -722
1878g22J039j691q72M491r59k146K604l18q04n52k329J455P35p21p00J13K431
$$ -722 317 -1374 -2246 2245 1286 -860 1744 1426 622 70 -2259 -804 -69 -790 -1490 -1377 1054
1895A054r01k469L105R95q11J178k725N91K232l538m72K310k37j18r90J44J751
$$ 1054 153 -2316 789 1784 973 2151 -574 17 2249 -1289 -1761 549 312 194 -796 -652 1099
1912A099k23k02n27P95J902l436j450K746j363k2J32j564K891M71k807J703J635
$$ 1099 876 674 147 942 2844 -592 -2042 704 -659 -681 -549 -2113 778 1249 -1558 145 1780
1929A780J8l14j289J296J38j716m65j147J840Q35l839J518K361j922J174m98k52
$$ 1780 1798 1484 195 1491 1629 -87 -552 -1699 141 976 -2863 -1345 1016 -906 268 -230 -482
1946d82K921j873j979J707K9k62j648J16K349j236k28M95n80K988j122k861L177
$$ -482 2439 566 -1413 294 323 61 -1587 -1471 878 -358 -586 -91 -671 2317 1195 -1666 1511
1963A511jk141L61j195P84J228k757M30J481N91m72j220K083R71j977Q02r34M3
$$ 1511 1510 -631 -270 -1465 -681 547 -2210 -1780 -299 292 -180 -1400 683 1654 -323 479 -455 -412
1981d12K144l310n95L327j694o73Q33m31J862k52j548J249O54L01j899j026K724
$$ -412 1732 -1578 -2173 1154 -540 -1213 -380 -811 1051 799 -749 500 1154 1455 -444 -1470 1254
1998A254j051j427J064q07J356Q26l168K121K149j929L9j01L13O30j725m59R95
$$ 1254 203 -1224 -160 -967 389 1215 -1953 168 2317 388 427 326 639 1269 -456 -915 80
2015H0O98l0k535J415K451k624M55J064q82J939j528k343K864k67j493K17M5J308
$$ 80 778 748 -1787 -372 2079 -545 -90 974 92 2031 503 -1840 1024 757 -736 -519 -474 834
2033H34p05j520J172N11J045p02j916K427J26k774J100j38j45J801k541k82K422
$$ 834 129 -1391 -219 292 1337 635 -1281 1146 1272 -1502 -402 -540 -685 1116 -1425 -1707 715
2050G15j136p07P45J235Q31j713l20Q38m63R58j373p34L314j761j984J579o70
$$ 715 -421 -1128 -383 852 1683 -30 -350 488 25 983 -390 -1124 2190 429 -1555 24 -646
2067f46Q35M82j872J493M51j695m99L80J692%j812J293P2k83P40k125J920K427
$$ -646 189 671 -1201 292 743 -952 -1451 -1071 621 621 -1191 102 174 -109 631 -1494 426 2853
2085B853k822p1P76j494J049p19o36K138o56j664m45O00J488j634l9K331r06Q0
$$ 2853 31 -40 736 -758 291 -428 -1064 1074 418 -1246 -1691 -1091 397 -1237 -1276 1055 149 229
2103B29m72k017L181J013k437J760o9j010P5j299J266J284j005n06p55R78k1k525
$$ 229 -243 -2260 921 1934 -503 1257 1188 178 253 -1046 220 1504 499 -7 -762 216 195 -2330
2121b330J820J790q70R90j837j027K707j273n56K426l91o12r82j027J455o0j53
$$ -2330 -510 1280 410 1400 -437 -1464 1243 -30 -586 1840 1449 837 -145 -1172 283 223 70
2138G0J10j71J643k256k480K606N6J77J339k172O20J212k485O54K125K27J07j276
$$ 70 180 9 1652 -604 -3084 -478 -422 -245 1094 -1078 -458 754 -1731 -1077 1048 1275 1382 106
2156A06J87K37j363L25j02J333J399l535p64J699j157J210Q82q13J903o13k485
$$ 106 293 530 -833 -508 -610 723 2122 -1413 -2177 -478 -1635 -425 457 -356 1547 934 -1551
2173a551J195P59J50J73LJ360j122j738J07k30K867P00l123J198K62k731R64p5
$$ -1551 -356 403 553 726 729 2089 967 -771 -664 -894 1973 2673 -450 748 1010 -1721 -757 -832
2191h32K36J834j559q32M56l56J66k90J850K286k027q91p71o39K446p86j515K612
$$ -832 -596 1238 -321 -1153 -697 -1053 -887 -1177 673 2959 932 41 -730 -1369 1077 291 -1224 1388
2209A388j185j853J26p36J483J173q88R64L5r33j118r12K891R00j200N96j840
$$ 1388 203 -1650 -1524 -2260 -777 396 -492 472 507 -426 -1544 -2456 435 1335 135 731 -1109
2226a109j94J887k057J021K946j238n75k02j056M94m03J58J553P9n50k384n52
$$ -1109 -1303 584 -1473 -452 2494 1256 681 479 -577 -83 -486 -328 1225 1304 754 -1630 -2182
2243b182L042l81J49J572j063O66l95k895J870J239j218M53l83l39p20j640J236
$$ -2182 860 479 628 2200 1137 1803 1408 -1487 383 1622 404 857 474 135 -585 -2225 -989
2260i89J578R70j85k343O00J158k101Q28J220q02J553j812j981J782k04j71J446
$$ -989 589 1559 1374 -969 -369 789 -1312 -484 736 -66 1487 -325 -2306 -524 -728 -899 547
2277E47O03O21k107j227Q83J62J087m49j601K063j039k175J378L36P90J696j102
$$ 547 1150 1771 -336 -1563 -680 -518 569 120 -1481 582 -457 -2632 -1254 -918 -128 1568 466
2294D66j75M76j498j9P70J323M99k410j68K53m04J093q17O97K849k141j177Q86
$$ 466 291 767 -731 -750 20 1343 1842 -568 -736 -483 -887 206 -611 86 2935 794 -383 503
2312E03j218O86O19n45Q45l69j808l40M58J937l51p88J566o94m54K36j838J732
$$ 503 -715 -29 590 45 890 521 -1287 -1627 -1169 768 417 -371 1195 501 47 283 -1555 177
2330A77J616k178J4K35j025J36j59R82J692r59n10n05K57R98j656K94J733j309
$$ 177 1793 -385 -371 -136 -1161 -1025 -1184 -202 1490 531 21 -484 -227 771 -885 -591 1142 -167
2348a67o4q14j418K403J36p94J708n2q48j33o49J062O04o40p5q22Q66k76k182
$$ -167 -231 -1045 -2463 -60 76 -718 990 938 90 -43 -692 370 974 334 259 -563 303 27 -2155
2367b155K017R31o32J207j270m48J611j452j42J643n34l38j274j61J103n09L40
$$ -2155 -138 793 161 1368 98 -350 1261 -191 -333 1310 776 438 -836 -997 106 -403 -63
2384f3K4J80J408j261j359J850o35K69N32j323P60R1k061R91P70L36P4p84J021
$$ -63 -39 141 1549 288 -1071 779 144 413 945 -378 382 473 -1588 -597 173 509 583 -201 820
2403H20J93j132M66l63L46J218k419Q0J128j355M65M11j55J393r87q73Q21K46
$$ 820 1013 -119 347 -16 330 1548 -871 -791 337 -1018 -553 -142 -297 1096 109 -764 57 303
2421C03R2p01j25J239q92p76N80o84J220J61j600J510M33j342O14l97L95P89j455
$$ 303 395 -306 -431 808 -84 -860 -280 -964 256 417 -1183 327 760 -582 32 -365 30 819 -636
2440f36r4K64N8l3j088J043J127j221M44k3l72J341j040o49J951r32o96K56l65
$$ -636 -730 -466 -408 -441 -1529 -486 641 -580 -136 -159 -531 810 -230 -879 1072 140 -556 -300 -665
2459f65J258l21o06O87N0M13n87q42J585j01j294Q38n42L8P67j580L90J554j074
$$ -665 593 272 -334 353 403 816 229 -613 972 871 -423 415 -127 -89 678 -902 -512 1042 -32
2478c2o1J44K83O54r30J31M74j59L47j352q4J638j198k65Q73p89Q95l07j440J728
$$ -32 -93 51 334 988 58 189 663 504 851 -501 -585 1053 -145 -410 463 -326 569 262 -1178 550
2498E50j55p32M4j24Q24k88j087R46O0M6K90j251J112R18j932P46L49n57R20j215
$$ 550 395 -337 -293 -417 407 119 -968 -22 38 84 374 -877 235 1153 -779 -33 316 -241 679 -536
2518e36k08J260o69Nl33K67J019j016j10Q55o80R22o91p07J792o44j303J032l33
$$ -536 -744 516 -153 -148 -481 -214 805 -211 -321 534 -146 776 85 -622 1170 526 -777 255 -78
2537g8K19K43j215Q52L65q19m7o0O30K14j408R37L2j89M66j029N43J576j575j68
$$ -78 141 384 -831 21 386 -433 -480 -540 90 304 -1104 -167 -135 -324 142 -887 -344 1232 -343 -511
2557e11R13l81L26m68m06J173n33m38j48k90J249r40n13J250n47j25L98q50J118
$$ -511 402 21 347 -121 -527 646 113 -325 -473 -763 486 -454 -967 283 -264 -389 9 -841 277
2576B77O09j429Q54K76l03K52p04N24O63o76k79k16K84O13j532M08J042j008N68
$$ 277 886 -543 311 587 284 536 -168 356 1019 343 64 -152 132 745 -787 -379 663 -345 223
2595B23k80o69J362o98m96R51n8J89o90l75J093l65j97J32n41Q77k28j427J266
$$ 223 -57 -726 636 -62 -558 393 335 524 -166 -541 552 187 -10 122 -419 458 230 -1197 69
2614F9J51n06O00q45J77P31j244L44P56Q6K69j091N31O75o78L45j79R7R47j441
$$ 69 220 -286 314 -531 -354 377 -867 -523 233 319 588 -503 28 703 25 370 191 288 1235 -206
2634b06m60J235o87p7M75n71R10k84j059O38N73M57j85p11O41L8q53K56k90P90
$$ -206 -666 569 -118 -195 280 -291 619 335 -724 -86 487 944 759 48 689 727 -126 130 -160 630
$$ [...]
8191a
##END NTUPLES=NMR FID
##END=
