##TITLE=1H_7-2021
 CDCl3,8 sc, 
 8.02.2021
##JCAMPDX= 6.0         $$ Bruker NMR JCAMP-DX V2.0
##DATA TYPE= NMR FID
##DATA CLASS= NTUPLES
##ORIGIN= UXNMR, Bruker Analytische Messtechnik GmbH
##OWNER= root
$$ XWIN-NMR		Version 3.5
$$ Mon Feb  8 11:20:54 2021 Russian Standard Time (UT+4h)  she@DPX200
##.OBSERVE FREQUENCY= 200.1315066352
##.OBSERVE NUCLEUS= ^1H
##.DELAY= (6, 6)
##.ACQUISITION MODE= SIMULTANEOUS
##.ACQUISITION SCHEME= undefined
##.AVERAGES= 8
##.DIGITISER RES= 18
##SPECTROMETER/DATA SYSTEM= spect
##.PULSE SEQUENCE= zg30
##.SOLVENT NAME= CDCl3
##.SHIFT REFERENCE= (INTERNAL, CDCl3, 0, 15.7039)
##AUDIT TRAIL= $$ (NUMBER, WHEN, WHO, WHERE, WHAT)
$$ ##TITLE= Audit trail, XWIN-NMR		Version 3.5
$$ ##JCAMPDX= 5.01
$$ ##ORIGIN= Bruker BioSpin GmbH
$$ ##OWNER= she
$$ F:/spectra/data/she/nmr/H-F/1/audita.txt
$$ ##AUDIT TRAIL=  $$ (NUMBER, WHEN, WHO, WHERE, WHAT)
(   1,<2021-02-08 11:19:05.76 +0400>,<she>,<DPX200>,
      <created by zg, POWCHK disabled, PULCHK disabled
       configuration hash MD5:
       00 E9 B6 7A A2 85 ED C7 34 08 36 98 17 FE 4E 26
       data hash MD5: 16K
       A7 16 62 A2 4B 4B 6B 5F 63 B2 37 31 53 C8 FE EA>)
$$ ##END=
$$ 
$$ hash MD5
$$ EE C8 9C C0 E1 C8 90 E0 C0 04 5B F0 F6 B3 64 33
##$RELAX= 
##$RELAX= 
##$RELAX= 
##$RELAX= 
##$RELAX= 
##$RELAX= 
$$ Bruker specific parameters
$$ --------------------------
##$DU= <F:/spectra>
##$EXPNO= 1
##$NAME= <H-F>
##$PROCNO= 1
##$TYPE= <nmr>
##$USER= <she>
##$AMP= (0..31)
100 100 100 100 100 100 100 100 100 100 100 100 100 100 100 100 100 100 
100 100 100 100 100 100 100 100 100 100 100 100 100 100 
##$AQSEQ= 0
##$AQ_mod= 1
##$AUNM= <au_zg>
##$AUTOPOS= <>
##$BF1= 200.13
##$BF2= 200.13
##$BF3= 200.13
##$BF4= 200.13
##$BF5= 200.13
##$BF6= 200.13
##$BF7= 200.13
##$BF8= 200.13
##$BYTORDA= 1
##$CFDGTYP= 0
##$CFRGTYP= 5
##$CHEMSTR= <none>
##$CNST= (0..31)
1 1 145 1 1 1 1 1 1 1 1 1 1 1 1 1 1 1 1 1 1 1 1 1 1 1 1 1 1 1 1 1 
##$CPDPRG= <>
##$CPDPRG1= <>
##$CPDPRG2= <>
##$CPDPRG3= <>
##$CPDPRG4= <mlev>
##$CPDPRG5= <mlev>
##$CPDPRG6= <mlev>
##$CPDPRG7= <mlev>
##$CPDPRG8= <mlev>
##$CPDPRGB= <>
##$CPDPRGT= <>
##$D= (0..31)
0 1.2 0 0 0 0 0 0 0 0.06 0 0.03 0 0 0 0 0.0002 0 0 0 0 0 0 0 0 0 0 0 0 
0 0 0 
##$DATE= 1612768745
##$DBL= (0..7)
120 120 120 120 120 120 120 120 
##$DBP= (0..7)
150 150 150 150 150 150 150 150 
##$DBP07= 0
##$DBPNAM0= <>
##$DBPNAM1= <>
##$DBPNAM2= <>
##$DBPNAM3= <>
##$DBPNAM4= <>
##$DBPNAM5= <>
##$DBPNAM6= <>
##$DBPNAM7= <>
##$DBPOAL= (0..7)
0.5 0.5 0.5 0.5 0.5 0.5 0.5 0.5 
##$DBPOFFS= (0..7)
0 0 0 0 0 0 0 0 
##$DE= 6
##$DECBNUC= <off>
##$DECIM= 32
##$DECNUC= <off>
##$DECSTAT= 4
##$DIGMOD= 1
##$DIGTYP= 9
##$DL= (0..7)
0 120 120 120 120 120 120 120 
##$DP= (0..7)
150 150 150 150 150 150 150 150 
##$DP07= 0
##$DPNAME0= <>
##$DPNAME1= <>
##$DPNAME2= <>
##$DPNAME3= <>
##$DPNAME4= <>
##$DPNAME5= <>
##$DPNAME6= <>
##$DPNAME7= <>
##$DPOAL= (0..7)
0.5 0.5 0.5 0.5 0.5 0.5 0.5 0.5 
##$DPOFFS= (0..7)
0 0 0 0 0 0 0 0 
##$DQDMODE= 0
##$DR= 18
##$DS= 0
##$DSLIST= <SSSSSSSSSSSSSSS>
$$ [...]
##$SUBNAM2= <"">
##$SUBNAM3= <"">
##$SUBNAM4= <"">
##$SUBNAM5= <"">
##$SUBNAM6= <"">
##$SUBNAM7= <"">
##$SUBNAM8= <"">
##$SUBNAM9= <"">
##$SW= 16.9725356469052
##$SWIBOX= (0..15)
0 0 2 0 0 0 0 0 0 0 0 0 0 0 0 0 
##$SW_h= 3396.73913043478
##$TD= 16384
##$TD0= 1
##$TE= 0
##$TE2= 300
##$TE3= 300
##$TEG= 300
##$TL= (0..7)
0 120 120 120 120 120 120 120 
##$TP= (0..7)
150 150 150 150 150 150 150 150 
##$TP07= 0
##$TPNAME0= <>
##$TPNAME1= <>
##$TPNAME2= <>
##$TPNAME3= <>
##$TPNAME4= <>
##$TPNAME5= <>
##$TPNAME6= <>
##$TPNAME7= <>
##$TPOAL= (0..7)
0.5 0.5 0.5 0.5 0.5 0.5 0.5 0.5 
##$TPOFFS= (0..7)
0 0 0 0 0 0 0 0 
##$TUNHIN= 0
##$TUNHOUT= 0
##$TUNXOUT= 0
##$USERA1= <user>
##$USERA2= <user>
##$USERA3= <user>
##$USERA4= <user>
##$USERA5= <user>
##$V9= 5
##$VALIST= <valist>
##$VCLIST= <CCCCCCCCCCCCCCC>
##$VD= 0
##$VDLIST= <DDDDDDDDDDDDDDD>
##$VPLIST= <PPPPPPPPPPPPPPP>
##$VTLIST= <TTTTTTTTTTTTTTT>
##$WBST= 1024
##$WBSW= 4
##$XGAIN= (0..3)
0 0 0 0 
##$XL= 0
##$YL= 0
##$YMAX_a= 259044
##$YMIN_a= -279436
##$ZGOPTNS= <>
##$ZL1= 120
##$ZL2= 120
##$ZL3= 120
##$ZL4= 120
##$ABSF1= 10
##$ABSF2= 0
##$ABSG= 5
##$ABSL= 3
##$ALPHA= 0
##$AQORDER= 0
##$ASSFAC= 0
##$ASSFACI= 0
##$ASSFACX= 0
##$ASSWID= 0
##$AUNMP= <proc_1d>
##$AZFE= 0.1
##$AZFW= 0.1
##$BCFW= 1
##$BC_mod= 2
##$BYTORDP= 1
##$COROFFS= 0
##$CY= 11.3945322036743
##$DATMOD= 1
##$DC= 2
##$DFILT= <>
##$DTYPP= 0
##$F1P= 15.9154993809931
##$F2P= -4.1035820241983
##$FCOR= 0.5
##$FTSIZE= 0
##$FT_mod= 4
##$GAMMA= 1
##$GB= 0.15
##$INTBC= 1
##$INTSCL= 1
##$ISEN= 128
##$LB= 0.24
##$LEV0= 0
##$LPBIN= 0
##$MAXI= 10000
##$MC2= 0
##$MEAN= 0
##$ME_mod= 0
##$MI= 1.114404
##$NCOEF= 0
##$NC_proc= 0
##$NLEV= 6
##$NOISF1= 3.799351
##$NOISF2= 2.8
##$NSP= 1
##$NTH_PI= 0
##$NZP= 0
##$OFFSET= 15.70392
##$PC= 1
##$PHC0= -10758.63
##$PHC1= 16.00094
##$PH_mod= 1
##$PKNL= yes
##$PPARMOD= 0
##$PSCAL= 0
##$PSIGN= 0
##$REVERSE= no
##$SF= 200.130013532006
##$SI= 16384
##$SIGF1= 3
##$SIGF2= 2
##$SINO= 400
##$SIOLD= 16384
##$SREGLST= <1H.CDCl3>
##$SSB= 0
##$STSI= 0
##$STSR= 0
##$SW_p= 3612.71676300578
##$SYMM= 0
##$S_DEV= 0
##$TDeff= 0
##$TDoff= 0
##$TI= <>
##$TILT= no
##$TM1= 0
##$TM2= 0
##$TOPLEV= 0
##$USERP1= <user>
##$USERP2= <user>
##$USERP3= <user>
##$USERP4= <user>
##$USERP5= <user>
##$WDW= 1
##$XDIM= 8192
##$YMAX_p= 0
##$YMIN_p= 0
$$ End of Bruker specific parameters
$$ ---------------------------------
##NTUPLES= NMR FID
##VAR_NAME=  TIME,          FID/REAL,        FID/IMAG
##SYMBOL=    X,             R,               I
##VAR_TYPE=  INDEPENDENT,   DEPENDENT,       DEPENDENT
##VAR_FORM=  AFFN,          ASDF,            ASDF
##VAR_DIM=   8192,          8192,            8192
##UNITS=     SECONDS,       ARBITRARY UNITS, ARBITRARY UNITS
##FACTOR=    0.0002944,     1,               1
##FIRST=     0,             0,               0
##LAST=      2.4114304,     0,               0
##MIN=       0,             -279436,         0
##MAX=       2.4114304,     259044,          0
$$ Real data points
##PAGE= N=1
##DATA TABLE= (X++(R..R)), XYDATA
$$ [...]
2398I75j499J944k500K330j676R83M3j447K633l100K893k521K037q22m26R24j547
2415g76J981k090J845j728J197q71K31P81j725K367k813K809k210J333J75j295
2431g89K194k856K585j777J214r80M16J44n38J359j860K509k824K724k073O27
2447G5O77j621K284k659K521k370J196j62m72R22r13J426j696J656j558J244l54
2464A96q3R89k215K738k514K375j389J44P43j456K010k364K101j827J229q61L41
2481A57q0n24J575k567K545k471K071p37p22J654k244K469j938J644j300L63J37
2498C2o86J181j458J690k111K181j826J112k32r69K134k878K666k533J887p35
2514e45k99R43j603J754j680J897j857J447q65M82Qo46J755k421K966k516J106
$$ y = [975, -524, 1420, -1080, 1250, -426, 557, 600, -847, 1786, -1314, 1579, -942, 1095, 273, -153, 771, -776, 1205, -885, 960, -768, 429, -442, -211, 570, -1155, 1212, -1601, 1208, -1002, 331, 506, -789, 1405, -1451, 1134, -643, 571, -409, 7, 151, -387, 972, -888, 1621, -1203, 1521, -552, 75, 752, -869, 1415, -1244, 1277, -1093, 103, -59, -531, 391, -522, 904, -792, 864, -694, 550, 196, 113, 1102, -1113, 1625, -889, 1486, 97, 241, 984, -472, 1538, -826, 1275, -552, 677, -184, 157, 77, -447, 1128, -1439, 1106, -1365, 706, -31, -753, 901, -1343, 1126, -812, 832, -468, -105, 32, -654, 527, -931, 759, -1352, 829, -997, 115, -117, -1086, 1048, -1830, 836, -1697, 190, -545, -844, 99, -1504, 250, -1430, 467, -1390, 57, -808, -326, -318, -964, 791, -1630, 1336, -1180, -74]
2531g4r4q04J824j893K258k199J883j227O83l95j67Q85j244J911k592K471j482
2548b56L90M18j502K158k310K161j710J365k73k85R01j255J655j625J412j693
2564d49J385o97L2J017k089K427k899K359j555L31L92j022J175j672J748j751
2580a268J524j632J282p79J70J540k388K640k104J937p44n17J037j378K049k461
2596a092K568j810R71n80o40N92o28R28j432J973k316J393lk17J389k545K288
2613H39j992J730n41Q9R39j351J428k008J826j363J901j478j13n6o36K425k643
2630a004K299k152J421k77j132J499j760K111k655L259k785J962k87j42N2q18
2646d09J858k923K997j855N34N18j313K229k666K241j971R49l41l01Q29j210J208
$$ y = [-74, -168, -972, 852, -1041, 1217, -982, 901, -326, 357, -38, -205, 680, -564, 1347, -1245, 1226, -256, 134, 552, -950, 1208, -1102, 1059, -651, 714, 441, 156, 1057, -198, 1457, -168, 1244, -449, 936, 239, 271, 1288, -801, 1626, -1273, 1086, -469, -138, 254, -768, 407, -1265, 483, -1268, 256, -1376, -94, -873, -703, 837, -1551, 1089, -1015, 922, 178, -339, 698, -680, 1369, -1092, 1476, -334, 637, 57, -583, 9, -619, 309, -1123, 850, -1466, -73, -76, -293, 1096, -1449, 839, -1153, 577, 36, 125, 1064, -287, 1141, -867, 959, -404, 1497, 19, -94, -150, -786, 1639, -1004, 1295, -857, 564, 287, -845, 654, -1106, 1005, -1650, 1609, -1176, 786, 499, 357, 409, -409, 1449, -1474, 1523, -332, 202, 720, -593, 1636, -1030, 1211, -760, 189, -152, -453, 376, -834, 374]
2663C74j243J375k032K075j086k24J070j756K248k359K446j764P83N48j402J797
2679H50j516J435j568J459j206N89J36n13J194j849K310k106J737j018j80R62
2695G16j556K285k211J664j203O60r0k78J035j461J734k179J988j573J374q15
2711I0j03J454k628K445k203J621r28L6N13j141J365j502J555j354J467j303O63
2728D7K52j250K063k408K520k171J342m49l80J275j676J669j861J438j081Q28
2744A58k95m06R09j635K157k328K357j862J118J69j317K090k054K343k134J614
2760H84q43Q3O76j225J073j422J843j941J412p95K72O43j544J987k106J990j518
2777e31P18K67q86J358j435J486j361J412j256J188p54k74J259j775K021k413
$$ y = [374, -869, 506, -1526, 549, -537, -761, 309, -1447, 801, -1558, 888, -876, -93, 455, -947, 850, -666, 769, -799, 660, -546, 43, 179, -334, 860, -989, 1321, -785, 952, -66, -246, 716, -840, 1445, -766, 898, -305, 355, 265, -13, 1022, -439, 1295, -884, 1104, -469, 905, 90, -13, 1441, -1187, 1258, -945, 676, -252, -216, 297, -844, 521, -981, 574, -780, 687, -616, 47, 299, -951, 1112, -1296, 1224, -947, 395, -54, -434, 841, -835, 834, -1027, 411, -670, 158, -137, -543, 366, -1269, 888, -1440, 917, -945, 173, 342, -975, 1115, -939, 1404, -730, 884, 41, 124, 800, -425, 648, -774, 1069, -872, 540, -255, 17, 660, -884, 1103, -1003, 987, -531, 187, 454, -432, 926, -509, 977, -384, 1028, -228, 960, 206, -68, 1191, -584, 1437, -976]
2793i76J584j060N37O07j620J763k144J754j166P51n33J59N74j101J668j760J905
2810I42j713J391n81n61J273j889K125k123J766r40O7M44j189J362j451J648j764
2827a193J625j403R72N0q41J754k064K313k255J742m14l01J041j642J913j854
2843e57J424j151J033n47l6O31j329J859k269K110j588O23M88j340J903k311J926
2860H69j691J206l49k35O09r51J304j520J902j688J240j151M09P85j813K342k472
2877a204J928j491J063p6q27J119j219J500j923J630j306J142p24k17J080j891
2893a416K314k477J969q72J58P47j454J802j727J673j158O56l43L75K62q43J263
2910I29j838J977k039J577p70j75J264k105K360k066J773j099J57O32r82J155
$$ y = [-976, 608, -452, 85, 692, -928, 835, -1309, 445, -721, 30, -503, -344, 230, -871, 797, -963, 942, -771, 620, 39, -522, 751, -1138, 987, -1136, 630, -310, -243, 201, -988, 374, -1077, 571, -1193, 432, -971, 1, 51, -790, 964, -1100, 1213, -1042, 700, 286, -15, 1026, -616, 1297, -557, 867, -284, 749, 202, 166, 797, -532, 1327, -942, 1168, -420, 203, 691, -649, 1254, -1057, 869, -822, 384, 35, -200, 409, -542, 762, -758, 1144, -544, 696, -455, -46, 739, -1074, 1268, -1204, 724, -767, 296, 220, -607, 512, -707, 793, -1130, 500, -806, 336, -388, -605, 475, -1416, 898, -1579, 390, -482, -324, 423, -1031, 771, -956, 717, -441, 215, -128, 247, 509, -334, 929, -909, 1068, -971, 606, -164, -339, 925, -1180, 1180, -886, 887, -212, -55, 577, -405, 750]
2926G50j388J625j735J530j127P92j90p47J884j940K039k483J592m86k90J127
2942I53j833J762j421J451j552Q80o37R8O41j038J759k257K167j751P22J42n67
2959d81J462k563K304j797J469n15n74L93l96Q76j096J605k008J928j336P51M05
2976D27j197K138k412J888j789J084L9o21J056j470J995j964J433n16N25o9j154
2993f07J206j497K163k331J822o91R58M61j227R29k169K424j317P4n18N42K15
3010D37j035R35j043J659j887J487l12j091J302j529K422j924J458o61k12K55
3026B61n77J111j113J202j367J488j830J309j93j271J797j848J753q85j09m95
3042g67P01p4j141K079j810J655j363J136n54M48M75j316J538k019K105j621R31
$$ y = [750, -638, 987, -748, 782, -345, 447, 257, -490, 1394, -546, 1493, -990, 602, 116, -174, 953, -880, 882, -539, 912, -640, 240, -397, -299, 342, -696, 1063, -1194, 973, -778, -56, 86, -481, 981, -1582, 722, -1075, 394, -121, -695, -302, -698, 178, -918, 687, -1321, 607, -729, 22, 427, -770, 1368, -1044, 844, -945, 139, 178, -443, 613, -857, 1138, -826, 607, 91, 616, 547, -607, 599, -898, 1265, -1066, 756, 65, 1023, 1484, 257, 1186, -983, 1441, 124, 198, -320, 222, 437, -598, 337, -706, 953, -934, 553, 241, -850, 452, -1077, 1345, -579, 879, 218, 6, 261, -316, 795, -318, 884, -483, 1005, -825, 484, 291, -980, 817, -1031, 722, -163, -272, -767, -66, -140, -1281, 798, -1012, 643, -720, 416, -138, 310, 785, -531, 1007, -1012, 1093, -528, 403]
3059D03l45o09J584j762J427j442J244q42N68k61j27Q36j409J364j618K000j267
3076b56N66L27j024J537j694J821j648O98j73m31J591k238J807k223K143j038
3092b35L48k67q8J020k085K014k210J807r02J041j38j016J348j279J214j119N78
3109C1j06l16R59j156J271j551J669j746J163o11j20J134j497J660j631J183q70
3126e34N33k30k67J010j231J561j783J838j369Q33n54l01J518k176K460k121J363
3143E50o75K0O50j207J615j345J216j170R92o89M79N7j145J664j980K025j507
3160d50Q11k87n30J358j414J384j325J008q19K75L90p07R02j722J864j503J480
3177G15j356M15M05j007K047k182J653j664R89n90J16P45q88J566j421Q48j165
$$ y = [403, 58, -551, 1033, -729, 698, -744, 500, -342, 226, -35, -162, 674, -735, 629, -989, 1011, -256, 310, 637, -387, 1150, -544, 1277, -371, 327, 154, -277, 1314, -924, 883, -1340, 803, -235, 113, -154, -242, 778, -1307, 707, -1503, 304, -598, 443, 305, -711, 637, -642, 572, -547, 31, -75, -391, 568, -588, 683, -868, 801, -945, 218, -393, -513, 621, -876, 784, -847, 336, -534, -1, -231, -498, 512, -719, 842, -941, 897, -472, 361, -193, -494, 1024, -1152, 1308, -813, 550, -125, -105, 545, -662, 953, -392, 824, -346, 646, -43, 436, 493, -652, 1012, -968, 1057, -450, 361, 74, -456, 902, -512, 872, -453, 555, -264, 11, 401, -306, 596, -1126, 738, -765, 715, -641, -226, 179, -828, 1219, -963, 690, -974, 15, -575, -459, 286, -602, 964, -457, 391, -774]
3194g74J257n87l18J125j589K166k236J933j299J79L15j084J956j437N53q10J003
3211C53l90L48p12q46K273j604J175j009J133j125K60R60j493J695j063P84o08
3228A31K57l17l91P98n00P96j615K108j901J106o4r37J210j267J839j871J159
3245E41n21n9L21p04J152j416J060n32P72q19K28P6n90J122j897J865j506J011
3263A04j53m16L80j109J706j450J204m15k44j99L66J113j279Q88j275J263j342
3280h58P11O85j304J443j759J771j459J330o56N4J7q98J284q47J247j674J704
3297G91n60k17R43j359J940k147J151j447J080L40q95J311j361J240j323J449
3313I36q99M62N9o23N49j229J780j831J952j493j81J052j408J891k580K066q08
$$ y = [-774, 483, -104, -422, 703, -886, 1280, -956, 977, -322, -143, 172, -912, 1044, -393, 160, -650, 353, -37, 311, -401, -1247, 1026, -578, 597, -412, 721, -404, -144, 816, -677, 1018, -45, 739, 131, 388, 71, -320, 478, -22, 774, -841, 1267, -634, 472, 408, -529, 681, -586, 1253, -618, 541, 20, -39, 282, -422, 730, -686, 374, -158, 614, -205, 23, 99, -491, 631, -1266, 599, -907, 104, -49, -465, -85, -1194, 512, -938, 266, -149, -393, -592, -226, 887, -392, 496, -779, 484, -858, -147, 538, -766, 677, -1082, 689, -770, 560, -96, -42, -25, -923, 361, -486, 761, -913, 791, 231, 14, 957, -402, 1538, -609, 542, -905, 175, 515, -380, 931, -430, 810, -513, 936, 37, 499, 558, -65, 484, -745, 1035, -796, 1156, -337, -518, 534, -874, 1017, -1563, 503, -305]
3330c05N48m07K06J75p42J230j661K032j843Q89o3l86J047j419J575j667J565
3347G74j023M54K66p38Q48j217J473j311J108r05J99K37o38J187j209J446j418
3364d67J051m83k59Q01j063J349j433J154q72N54m37J24O61j323J544j572J294
3381F23r66M04L37j017J277j614J601j344J139p74K47K65p12R54j176J548j596
3398h04J283j026K11N95j195J622j729J649j197M01K34l53P43j108J044j103J031
3415B98j091Q46l79O9N64j493J913j523J145q23K49K76r28J442j298J147q79P03
3433B38m41J46M17o73R19j062J378j558J206l14n04R63j413J566j436J163r26
3450c31N83P5n87R29j287J267j175J264q90N31j03m52J200j696J897j472J252
$$ y = [-305, 243, -164, 42, 217, -525, 705, -956, 1076, -767, 122, 59, -327, 720, -699, 876, -791, 774, -249, 205, 471, -267, 581, -636, 837, -474, 634, -271, -72, 165, -473, 714, -495, 951, -467, 584, 101, -158, 643, -420, 929, -504, 650, -222, 332, -105, 19, 680, -643, 901, -671, 623, -343, 61, 398, -619, 658, -956, 645, -699, 440, -334, -87, 178, -534, 420, -756, 792, -804, 479, -547, -336, 259, -936, 686, -1043, 606, -591, -190, 44, -309, 434, -674, 370, -733, 298, -793, 53, -326, -257, 307, -1186, 727, -796, 349, -474, -225, 51, -877, 565, -733, 414, -465, 238, -203, -57, 360, -313, 606, -456, 922, -636, 570, 256, -248, 715, -698, 868, -568, 595, -331, 252, 327, -260, 669, -618, 649, -526, 738, -152, 379, 276, -176, 1024, -672, 1225, -247, 1005]
3467A005o51N7M01j242R61q74J251j371J002q20P2N29j197J453j719J745j329
3484g27Q36N3n74J219j578J478j251R92p00J84K89l97P98j279J375j493J309j035
3502e01L94L12r57J346j621J745j338P45j32n39J058j128J377j107R42o43M69
3519D22m02J8O67j235J601j536J110r87K86N20p06R25j433J394j099O38m97L00
3537a4L53q73J274j551J655j227N31M2k84P70j367J421j381J147o64J50J19m03
3555c02O22r88J179j261J080p68N54k08m52J043j701J741j131P95n52J18L91o75
3573e15Q89j062J127r10R37o53J36N7n03J146j280J422j398R08k24m58R13j037
3591e05J181q90Q92p90L38J55m96O46q67J076j249J259j036L55K67p89J170j468
$$ y = [1005, 354, 411, 812, -430, 531, -343, 908, -463, 539, -281, -209, 320, -877, 576, -1143, 602, -727, 109, 162, -412, 807, -771, 707, -544, 448, -252, -68, 221, -176, 622, -657, 718, -775, 534, -501, -107, 205, -752, 594, -1027, 718, -620, 125, -7, -546, 512, -616, 761, -346, 596, -47, 422, 20, 38, 705, -530, 1071, -465, 645, -342, -56, 464, -242, 683, -750, 644, -455, 183, -314, -14, 339, -534, 740, -811, 844, -383, 148, 190, -94, 676, -691, 730, -651, 496, -168, -18, 101, -302, 320, -668, 511, -750, 330, -438, 116, -92, -544, 499, -1202, 539, -592, 203, -349, -231, 160, -515, 374, -688, 439, -471, 466, -187, -51, 6, -497, 649, -631, 791, -607, 301, 77, -381, 532, -505, 676, -214, 678, -112, 226, 381, -115, 531, -336, 740, -509, 750, -286, 69, 336, -453, 717, -751]
3609g51J415j142P97j4o96P33p15Q55r74J042j108O80l98J58N98j212J210j218
3627g40J297j233O64K33p13J169j411J088p98O29n55K69L39q38J046j143J230
3644E33j431J363o50L9N39j031J116j105J139p91L47j9k74M23n57J156j048O56
3662D05p57P00j53l40P31j296J355j262J103q19K41M94q31J296j205R43q97L81
3680H9l26K70M0m59J001j243J454j298P54n09J09N98j085J146j077Q24o25L72
3698C5j41k37O00r50J151j105Q94p20M06J62o54R93j140J185j207J006l79k03
3716c04M88p08R17r44J010p51O30m76J51L89j074J355j550J444r50K20L34m65
3734b84Q70r48R15n83P04o93L16m7j05O29j293J496j482J380q99N6M84p76J094
$$ y = [-751, 664, -478, 319, 305, -391, 342, -373, 482, -492, 550, -558, 122, -276, -118, 480, -732, 478, -740, 557, -676, -12, 221, -492, 677, -734, 354, -444, 185, -370, -101, 238, -600, 446, -697, 533, -898, 465, -185, -146, 393, -638, 478, -627, 512, -279, 68, 49, -225, 198, -359, 797, -251, 405, -352, 348, 195, -145, 586, -710, 645, -617, 486, -333, -92, 402, -429, 867, -338, 605, -292, 89, -237, 33, 73, -386, 615, -628, 826, -472, 282, -227, -118, 480, -605, 541, -536, 288, -337, 35, -106, -343, 257, -693, 458, -647, 247, -473, -67, 95, -559, 434, -706, 479, -728, 278, -101, -304, 184, -524, 393, -551, 459, -292, 338, -138, 13, 402, -672, 683, -867, 577, -373, -153, 181, -284, 586, -362, 553, -30, 674, -19, 297, 250, 145, 774, -519, 977, -505, 875, -24, 32, 516, -260, 834]
3753H34j145R48p75M33l9jM03q62Q00q47J004j061Q34j87o92J063j172J346j534
3772f50J065o39K21J21m15O57q99J134j352J062q37N69K22q83J158j249J119j129
3790g25P68k07k82N02r32J285j172J061o41L44n3j41K90n11R52j498J597j069
3808d32M76m3m42J008j316J122r08P77l80k2N97p05P54j127Q72o22P91p68N73
3827B05K08j008J035j023J209j002M71j6m89P98o58P49r58Q17n03J79K53j078
3845h11J043p37J038j642J637o30J26L67o83J63m59J545j493Q75m91L26J58l08
3863B4M39o30L63o44K80j85k11P03r76J281m18J568j757J92J83p59J738j663J485
3882A013j778J040n43N30M04j080R39j235J187q30Q82o75J51M36p84Q07q13R26
$$ y = [834, -311, 637, -138, 295, 256, 255, 658, -204, 596, -251, 753, -308, 526, 339, -353, 710, -462, 884, -650, 415, -224, -3, 118, -297, 360, -539, 595, -757, 305, -532, 37, 259, -624, 534, -715, 404, -725, 43, -164, -446, 56, -876, 409, -763, 298, -343, 1, -52, -193, 97, -414, 538, -960, 637, -432, 44, 1, -441, 567, -749, 373, -535, 242, -138, -160, 437, -268, 486, -641, 231, -391, 400, -368, 205, 413, -595, 440, -583, 626, -376, 95, 79, -410, 388, -270, 479, -479, 338, -165, 14, 267, -811, 232, -505, 533, -1109, 528, -102, 24, 391, -292, -129, -588, 957, -536, 339, -152, 174, 332, 24, 463, -167, 196, -448, -168, -353, -564, 139, -837, 444, 26, 1594, -163, 29, 212, -547, 1191, -472, 1013, -765, 275, -268, 262, 666, -414, 525, -710, 477, -353, 529, -146, 5, 441, -343, 464, -349, 577]
3900E77n99L44j85j4K37l85P49j251J313j005M56m7m36P90j049J073j208P54k60
3919a46K65L6m43P25j038J238j295J206r28L53L24j034J520j523J095q66O81j87
3937a7j34M56p87N24n55Q50o89K43k15J42M72p69J256j303R36p98K42L19m98O64
3957C39p03O34n75M58j16L7J05n78R27r85J062r85Q60k91l92L88o78J418j435
3976e10J073n42qJ45m37P50p64R37j207J187r66M52j7m20Q52j147J213j226P78
3995A43k74m7L06n41J107j320J020o98L48j47m3K80o50R51j151J528j442O47Q1
4014I8n76O34q41J143j105R11p93L19M5j96P53q82R46r79J083o33J82J3n27J107
4034G02j200J028j045Q85m89K40J80n09N95o25Q55r80O44l08m9N56q89R67j117
$$ y = [577, -22, 322, 137, 123, 360, -25, 724, -527, 786, -219, 237, 190, -246, 544, -505, 568, -640, 114, -146, 119, 155, -288, 437, -601, 637, -658, 548, -380, -27, 297, -737, 783, -740, 355, -511, 170, -17, -151, 305, -482, 42, -513, 337, -352, -109, -324, -182, 290, -479, 777, -526, 410, -388, -146, 173, -325, 339, -364, 270, -305, 153, 37, 74, 179, -399, 528, -457, 605, -380, 480, 189, -203, 185, -493, 925, -510, 563, 21, 13, 158, -279, 471, -293, 644, -563, 624, -342, 110, 93, -327, 525, -622, 591, -635, 143, -131, -178, 128, -413, 694, -626, 394, -304, 44, -103, -146, 134, -516, 435, -716, 812, -630, 17, 98, -478, 156, -685, 458, -647, 264, -529, -210, -165, -361, 392, -490, 456, -523, 560, -73, 109, 122, -405, 702, -498, 530, -515, 370, -119, 121, 301, -208, 387, -238, 617, -363, 281, -27, -76, 480, -409, 558, -559]
4053e59J393p91m2K13m78P03p50P63r26Q38m82m0L37m17P23j088J060r98Q24n50
4073b67N8P74j092J083j113R19p04J59L8m2N10p50R60j154P73o18L51J6l92Q81
4093C90r91J194j219P59k44K6L28q18J072r91Q60r28P63m82L08J97o86R25j049
4112e86J088p54N06k09k75N62p31Q06o36O66p01M37M9l05O43j136J344j024P49
4131D93n90m1L31p56J200j177R87o27M6oj27N96p60Q72q49Q34r81Q41l71q9J86
4152A2p77J301j184J137p93M35M9m44O42p70R87j365J080n31L36J14n69P95r89
4171e34J019j067R59o55N3O30q27J120j361J176q63M96k14n7N18n68P97r77Q38
4190D83o75M08M2k14L70r17J146q74O29m87K0J33j02N14o82Q21q22L62k92L20
$$ y = [-559, 834, 43, 1, 214, -264, 439, -311, 452, -474, 364, -118, -158, 179, -238, 485, -603, 457, -541, 283, -267, -209, 565, -527, 556, -557, 362, -342, -183, -145, -187, 323, -427, 533, -621, 152, -466, -115, -99, -491, 390, -601, 593, -626, 133, -111, -85, 243, -575, 497, -494, 366, -562, 201, -281, 27, 224, -462, 463, -586, 502, -252, 254, 45, -230, 332, -399, 407, -229, 437, -264, 173, 222, -83, 560, -576, 768, -256, 493, -97, -138, 193, -563, 637, -540, 447, -180, -134, -140, -267, 329, -431, 441, -408, 426, -555, 286, -85, -174, 12, -765, 536, -648, 489, -304, 131, 180, -264, 378, -392, 595, -770, 310, -221, 115, 229, -340, 455, -534, 485, -582, 377, -278, -225, 405, -422, 698, -663, 513, -350, 146, -68, -125, 393, -175, 622, -355, 483, -192, 216, 258, 44, 414, -503, 643, -231, 398, -89, -69, 64, -38, 476, -206, 615, -207, 155, -137, 183]
4210A83pn15J063j201J014r61Q14m83k59O10p41R56j058P81m77J23J51l36L70
4229B7m81J020j383J125o78N77k58p63K74k78J428j249Q96l29J24K34k28O85j268
4248e25R26o14M14k3k16K66n23R38j165J002j032O67J44n87P18q11P52p25Q34
4267D40o29O85m74k11N63p11J061q80Q20r28L83J85m65R12r80P53r07N51M5L5
4287B48K88q32O52o65Q93r64O63j33j31M53q89R06j119J025l97l28Q32j180P11
4306C3n04R18q68Q35p93L13L86q64Q56r16J054p66R60n71l05L50n81J144j198
4325e17P14o46P86l89M8L32n68N71r31R83q09N43j45k41P10j057J353j232P68
4344B73o45O34o6n16L76m57P26k38M20l45J45L34o58J037r57j48k07M56ll59P04
$$ y = [183, 176, -339, 724, -477, 537, -424, 390, -93, -352, 258, -483, 473, -585, 196, -281, -158, -7, -343, 27, -454, 566, -817, 308, -370, 207, -51, -814, -540, -818, 610, -639, 257, -72, 52, 286, 58, 743, -525, 401, -213, 201, 178, -38, 228, -295, 643, -522, 480, -552, 115, 259, -328, 390, -421, 331, -394, 440, -189, 496, 22, -189, 374, -337, 724, -156, 664, -264, 119, 304, -161, 751, -229, 524, -383, 168, 213, 248, 536, -296, 356, -309, 584, -380, 283, 150, 19, 472, -417, 489, -630, 395, -2, -330, 502, -678, 33, -471, 447, -421, 414, -379, -66, 320, -544, 312, -604, 450, -316, 644, 73, -232, 118, -463, 681, -517, 197, -449, 337, -52, -4, 328, -240, 331, -600, 383, -426, 117, -28, -269, 441, -616, 737, -495, 273, -372, 262, 196, -320, 56, -401, 325, 87, 507, 162, 307, 641, -17, 1020, 63, -85, -292, 164, 161, -198, 506]
4365E06q83R43j049Q26n64L83l3j76L03p33J137j017M99n98N49K12n94P45q85
4384d29P54n64M77k69J6K08p59P97p65R00q39P80k42l64O99r47J031r92Q37o35
4404c06J85L17m53L94m87O24o62R73o96K94K9k92N57q43Q98p11Q31p78K05K45
4424C24n42O56n32L40m65M55j48k12M37q26J234r24K07l50N62j98k25N40q86P56
4444B03o81N13m3l6j8j39L33o73R23r35P95m99J91K12o15P53p33P43o34M66j93
4465f7k52L74l16O15o82L52l81M46k1k36O64p55O41r60Q61l88K18Ol13P64r89
4486d19R62p24K53J3j88K51l52O45q49P99m16K62j73o6N26r15Q50q12R26q35N06
4507B44j73k54P12o42P11r96Q43m41K11j15l53Q62j217Q99n73L87k39k6M33n32
$$ y = [506, -377, 566, -483, 343, -221, 162, 129, -47, 256, -477, 660, -357, 142, -456, 93, 305, -289, 456, -429, 325, -239, 238, -31, -15, 193, -566, 231, -534, 366, -473, 307, 65, -299, 400, -547, 484, -508, 329, -306, -121, 196, -257, 137, -350, 274, -388, 585, -111, 183, 212, -80, 477, -366, 532, -179, 652, -126, 79, 324, -218, 438, -94, 246, -219, 236, 88, -124, 313, -513, 721, -203, 4, -346, 216, 18, -207, 333, -553, 203, -478, 35, -8, -44, -62, -201, 132, -541, 382, -553, 242, -257, -66, 146, -469, 284, -449, 294, -340, 126, -67, -319, 55, -261, 354, -328, 24, -357, 89, 68, -168, 496, -259, 382, -578, 283, -105, 113, 119, -194, 570, -419, 543, -181, 72, 85, -103, 148, -204, 441, -408, 391, -25, 237, 64, -2, 524, -391, 459, -353, 573, -262, 244, 71, -183, 529, -113, 598, -398, 445, 4, 215, 100, -253, 609, -608, 291, -282, 105, -134, -160, 273, -259]
4527b59N60q24P36m40N14k84k22M71n47O63q92J147j123M54km67P11o72Q72q79
4547d83Q13n32J93K81o09P17n21L94o73Q22o34M38j21l97Q41p90O27o06N03m70
4567b07R4M25m88N99n11N77p50M25j87J9K36l70N63p66O37o29M78o0m03R20j134
4588e32J044p31M27k17K30J76o58N69n62P93j077Q12l10KJ19l79P07p41P42n19
4608a05k5K01j86K80m78N75p85P08m59L38j7j58N84q90O47k97K06k00K39N6m75
4629b41N81n52N74n22M34l66K41Q3o39O06o02P28o70N70k93k14Q70q98P27q38
4649d21Q20n40Q6J07k23L80o83Q39o62P95o38K24jl64O12o05Q05p07M49l83p6
4670a86N33o55O08p67O68l13J04m4k77M80o49J045q66M96n39M05L0n14R82p44
$$ y = [-259, 301, -523, 213, -227, 287, 3, -219, 252, -295, 368, -524, 623, -500, -46, -48, -515, 196, -476, 396, -483, 330, -202, -9, 272, -337, 380, -141, 253, -420, 402, -232, 206, 85, -312, 529, -261, 366, -240, 263, -207, -113, 312, -176, 423, -88, 489, -261, 164, -23, -4, 232, -138, 425, -341, 296, -333, 145, 85, -318, 602, -532, 512, -219, 208, -9, 221, 397, -261, 308, -254, 539, -538, 274, -36, -34, 85, -294, 413, -328, 414, -105, -130, 71, -115, 165, -313, 262, -523, 185, -274, 64, 47, -111, 473, -417, 230, -67, 139, -61, 178, 234, -241, 340, -212, 362, -160, 274, -92, 149, 232, -407, 199, -403, 325, -345, 225, -68, -282, 588, -310, 417, -421, 399, -141, -55, 52, -171, 209, -474, 365, -297, 498, -140, 84, 83, -281, 331, -274, 531, -176, 273, -110, -186, 347, -308, 300, -467, 201, -112, -8, -52, -329, 151, -498, 547, -319, 177, -362, 43, 73, -441, 541, -203]
4690b03M11p36N06J8K10j6k80K75o43Q88p98P37o12L31Q9q58J173p48N70m73N50
4711C91k89J2p9l76Q07n63M72l34K79k27k88M61n09R37q80M84m62J90K40n12M26
4732A80o52R24p88M40m05J64K23l65Q64j025Q08n98L03p8j33L72o24P12n65L79
4752A36k16O5r5j09K77k69P54o36L99n62L83l23k82M84l92O84p13O39k16j52L33
4773A89m40N45p39P46n58L64jk1K05l91M00n21O98o85L31K46l30M53q50Q90p98
4794b67N29k72R1J69n78N99o46O78n73M56n26N88j04j72K88m81M80m94L82r6J89
4815B40k61k21M63l93K61j85L79m32nM02m79O16p29N18j78j66J14m61P95p33O79
4836B24o28O95m52Q8M61n34L60m32N33l15Oj18l7M55n21M23n44M88m25L84j34
$$ y = [-203, 208, -528, -22, -4, 206, 190, -90, 185, -458, 430, -368, 369, -243, 88, 177, -681, 492, -256, 314, -159, 391, 102, 114, 35, -341, 466, -97, 375, 41, 320, 93, -195, 266, -243, 694, -186, 298, -164, 26, 266, -246, 180, -472, 452, -336, 104, -301, -137, 86, -279, 585, -440, 368, -230, 73, -5, -138, 234, -390, 322, -243, 136, -80, -15, -110, -219, 58, -211, 543, -93, 306, -256, 127, -196, -478, 6, -386, 298, -415, 224, 8, -144, 189, -251, 294, -445, 301, -257, 107, 106, 85, 290, -101, 299, -222, 476, -209, 122, 368, 38, 491, -359, 531, -267, 262, -10, 81, 250, -328, 271, -375, 303, -270, 186, -340, 248, 144, -28, 260, -221, 259, -235, 147, 51, 240, -21, -242, 221, -172, 89, -96, 283, -149, -154, 248, -231, 385, -344, 174, -4, -170, -56, -517, 278, -455, 224, -404, 291, -161, -73, 388, -146, 214, -218, 315, 0, 6, -112, -149, 306, -215, 208, -336, 152, -273, 111, -23]
4857b3j92M41m44L46J1L27p11J81K75l37L93m38M47n65N59k69J52R5l31M34n48
4878a97O46o08L42j56J23n1m26Q45r96P77m63L87j67m30O70m11M32q10P69n28
4898b52R1L11l37J96m98P36r92P83k11l8N22o02O18n30L51n91P21k23k52L80n65
4919c82O58n33P21r74N04j88PN24q37R67r11O43n24M13q7l58N66m33P08p05N06
4940B85l27m3J88n03O27m80O16m11J67j17O3J33m46M49q24R10k60l4nj98M19n65
4962c56M83n10P64n79N36k08l86O68q26Q98q05K70k7Q0K37n08M58n08O43p33N92
4983A83l01o0L15n33N77p36R03n96M59k54p1K81n63O06n40O08l86J97q0k73L88
5004A24m38P14q50P10l86Q9K93l69N57o00N77o13K36r9n8J77j85N55m57O14n64
$$ y = [-23, -215, 226, -218, 128, 139, 466, -245, -64, 211, -126, 267, -171, 276, -289, 270, 1, 153, 248, -83, 351, -197, 449, -159, 183, 27, 150, 99, -327, 518, -478, 299, -164, 223, 56, -374, 296, -115, 317, -493, 276, -252, -161, 150, -187, 9, -489, 247, -745, 38, -173, -211, 311, -291, 327, -203, 148, -443, 278, 55, -197, 183, -382, 276, -257, 464, -510, -6, -194, -187, 337, -500, 467, -444, 199, -325, 88, 1, -357, 209, -224, 484, -221, 285, -42, -85, 103, -400, 227, -253, 363, -48, 119, 2, 65, 198, -248, 201, -623, 287, 27, -7, -12, -210, 209, -356, 127, -383, 381, -198, 338, 130, -256, 412, -414, 484, -321, -51, -78, 2, 239, -269, 189, -319, 324, -409, 183, -118, -178, 137, -396, 181, -555, 348, -248, 211, -43, -114, 167, -396, 210, -330, 278, -108, 89, 9, -264, 124, -314, 400, -450, 260, -126, -37, 256, -113, 444, -156, 421, -192, 44, -55, -113, 64, -121, 434, -23, 591, 27]
5025B7J050j262k66Q88q76R21k82N80j110M88O7l33L66l04L06m60N88k70j73J31
5045G6l13N48o11O51q15M77j38j95O81o53P20o83M23m43L64lmJ37o26P31o71N57
5067B10n22M53k18K26K15q80O62m52M95l99J98r6J18O0l51P36n47M37n14L83j11
5088A03K9J59o05O17m89L47j17q1L94l52L53m34M83k23n7J03n12N68n27N27n12
5109b26M80m46N20j45m42O51p06M31l80M26k35p4K97j81K80l95L24n48M93l51
5129b27J29j4j64N32p44N32l41L75p1o0J12l55O14p29P34l97Mp9p9N42n61P71
5151E24o05K98l37K9J17k05M62n29O35n46L12j22J63l5k47L21l84M78m94M20q1
5172A74r9L23p25O99n12K15j38rJ79k26L15l56L95n31M54k55K69k0n89P59n48
$$ y = [27, 1077, -185, -451, 437, -439, 482, 200, 780, -330, 158, 225, -108, 258, -46, 260, -200, 388, 118, -55, 76, -237, 311, -300, 351, -464, 13, -125, -320, 361, -292, 428, -255, 168, -275, 89, 86, 82, 219, -407, 324, -347, 210, -312, 141, -77, 149, 364, -516, 146, -306, 189, -210, -12, -108, 10, 70, -281, 455, -92, 345, -169, 214, 103, 132, 291, -314, 303, -186, 161, 44, -37, 357, 5, 358, -76, 407, 184, 127, 230, -282, 286, -241, 286, -226, 254, -192, 328, 183, -259, 392, -314, 117, -263, 163, -72, -146, 151, -30, 250, -145, 179, -369, 124, -227, -98, -112, -276, 256, -488, 44, -297, 78, 7, -53, 59, -296, 318, -411, 323, -74, -70, -149, -228, 314, -247, 524, -81, 217, -120, -91, 26, -179, 283, -246, 389, -157, 155, 33, 196, 161, -86, 235, -149, 329, -165, 255, 174, 75, 398, -327, 372, -140, 75, -63, -72, 107, -119, 196, -160, 235, -296, 158, -97, 172, 152, -437, 322, -226]
5193b26L95k64L13l58l9K32l36O93p17O68m14M85m33k69N50n11L86o37O02m45
5213c25M65l7l44K86k95L75m14L82k24J34R3l93M83l85L31k59L32q4rJ94m30M48
5235C24n65N58m10K33K1j43j6l35P43n17N27o94L11Jk10O43q07R91n90K89j38
5256B16l79J88j44L55m80O81m42L6k71J09M43n54N90p80O16l84L05k22J81K60
5276C24l84L29m13K06j75K40n4Q8j31l05N78m45K74j67k8j9j15J86l69N65n22
5297c37M38k72j09N41o39O22p34O89m28K35k34J59K88o39J001q07P06o52J79k01
5317a94j51N87k90J57l67N41l18J24j65J63K15n00M83m35M61j73k39K16q0J07
5337A42m44M93k82J79k94N1N4k20N16m69O06o44K09J51j63M03p17O07n31M80l00
$$ y = [-226, 169, -95, 218, -140, -179, 53, -283, 410, -307, 361, -53, 432, -1, -270, 280, -231, 155, -482, 120, -325, 140, 103, -241, 45, -250, 125, -289, 93, -131, 3, 96, -297, 186, -199, 132, -127, 205, 121, 112, 306, -124, 324, -241, 317, -93, 140, 161, 18, 2, -333, 410, -107, 420, -274, 37, 38, -172, 471, -336, 655, 65, 354, 216, -163, 25, -119, 236, -244, 437, -5, 31, -240, -131, 312, -242, 348, -432, 184, -200, 105, -117, 64, 324, -60, 269, -144, 62, -113, 127, 73, 161, 30, -275, 303, -142, 132, -35, -63, -82, -197, -11, -380, 185, -337, 101, -171, -280, 261, -378, 244, -490, 199, -229, 6, -228, -69, 219, -420, 581, -226, 480, -172, 7, -194, -345, 242, -48, 109, -258, 283, -35, 89, -76, 87, 302, -198, 285, -150, 311, 138, -101, 115, 35, 142, -302, 191, -91, 88, -206, -155, -101, -321, 195, -274, 332, -312, -103, 48, -115, 288, -429, 178, -353, 127, -173]
5358a73J76k30l7O22o43O27o67M76l57J09%k60M41m56P52m37J94L2j95J15k09
5379a20L94l67J92j13K11k47j48L72k64L77n05N37p55M05K42k46R0l95O61m05
5399h4L47j46k07K74l42N76p69O57k34Q7l23K58r6l27N65p18N80k22J86j95j18
5420b51M73n55N93m67N68m03o8J92m60M61m71Q13o24M77k69j26K20j94L43n34
5440b82N67l85R2k44J36J78j11K33n28N45n58N00k30P2J14m85P32q12P42l99q
5461a31J97j12K68n43O24n45K70k22J45J42j8K85p09Q73p36L65p2k56N69n79M04
5482B19n92M89k82L24j97N5K7j47K93n29L63L2NK1k92M89m21L92n00L80k15J25
5504C9P7j18j13k34P05o06K53j9m6J98k94L35m88N92k71J31j1k34K83o42P64n12
$$ y = [-173, 3, -227, -264, 358, -285, 342, -325, 151, -206, -97, -97, -357, 84, -372, 380, -57, 137, 169, -26, 89, -120, 274, -93, 99, -14, 197, -50, -198, 174, -90, 287, -218, 319, -436, -31, 211, -35, 55, -340, 321, -84, 263, 117, -90, 184, -158, 418, -351, 306, 72, 159, -164, 94, -2, -329, 236, -482, 98, -124, 62, -133, -251, 222, -333, 260, -207, 361, -42, -110, 82, -378, 83, -388, 425, -199, 278, 9, -117, 103, -91, 252, -282, 285, -100, -8, -252, -116, 62, -49, 184, -344, 201, -357, 143, -87, -15, 99, -386, 346, -466, 276, -123, -131, 66, -46, 222, -321, 303, -242, 28, -194, -49, 93, 75, 360, -349, 524, -212, 153, 81, -175, 394, -185, 219, -373, 116, -166, 158, -39, 16, 43, -104, 189, -340, 23, 55, 60, 81, -211, 278, -143, 249, -251, 129, -86, 39, 116, -2, -115, -349, 356, -250, 3, -16, -62, 136, -158, 177, -311, 281, 10, 141, 130, -104, 179, -463, 301, -211]
5526b11J24o8K67O5m44L43m26P51o79M09l9K2P3l38N20m70K30k80L76k73K7J27
5548A06j38L53j53J26j59k0j28o1J28l23O73n98L43k41RP0j42K79l64L65m28M06
5570A03k26J72J13n11L30k29N58o40P13m98J77K38o36N97n02L42n3J22Jk78L64
5591B57l54J59J9J1k93K02Q8l32K41k35L79m31L56m9J10n6k19K31m19O74m52K89
5613A76l03K44m5j65L58m99K45n31N75q9J0L21o45P04n33K25j42L37K4m70L52
5634A49l76M27n59Q73q07L42q8PK17k90K83k67K54l34J84kNk04k2L85m60J92J57
5657F6l43M31k12K50k82L54o26M60j34k42L92k52K02l87L89j37O5Q5J04K3l92
5678a86N20k62J63j88l4p4j29R3P2K78l22K89L5k50K69k70K09n56N38n98O15j41
$$ y = [-211, -87, -155, 112, 177, -267, 76, -350, 401, -278, 131, 92, 114, 187, -151, 369, -101, 129, -151, 225, -48, -21, 106, -32, 321, 168, 294, 135, 115, -13, -74, 54, -269, 404, -194, 149, -92, -83, -13, -155, 124, -240, 125, -303, 103, -123, 49, 162, -349, -19, -248, 310, -330, 383, -115, 62, 300, -336, 261, -241, 101, 48, 170, 171, -107, 257, -97, 62, 81, 92, -201, 1, 89, -243, -2, -237, 142, -289, 67, 18, 128, 72, -147, 84, -335, 339, -113, 176, -127, 117, 72, -93, 265, -234, 11, -520, 55, -34, -24, 297, -348, 356, -177, 48, -94, 243, 267, -203, 149, -227, 200, -359, 514, -293, 49, -39, -32, 185, -105, 178, -89, 165, -169, 15, 13, 18, -186, -208, 177, -283, -91, 66, -277, 154, -58, 192, -90, 264, -362, 98, -36, -278, 114, -138, 64, -323, 66, -71, -6, 79, 183, 206, -186, 334, 72, 235, 47, 13, -61, -190, -97, -25, 253, -69, 220, 255, 5, 274, 4, 213, -343, 195, -403, 212, 71]
5700G1k41P38q12L22p71J314o67K54k75m90O37l74n3l56J215j051O33J09m70M13
5720A46l38M38l77L46o88O55r5n6O49m06J11p10R5J04j11Q6l71O21j76O13n10
5741B6j43J86K03j74L93o6j023R87o97J47K34o27K62n7O83j132Q18l6o8L38l45
5762i1R72o56m6j36j31K05K82k72k55N19p58K18N60km12M5L7k07L55m68K03J16
5784G8l15L64n69O34o55J56J54N46j111J020p0O7j0k68O81p82j71n9L58Ql56L50
5806E0j01O1l60N78l59K65j19m29R49p07M37K5p7n42L70J00k30R1N5r9K8J10K66
5829C62n75k94Q7L97J97l0m11L8L70K36M0m44P41j100N64L52j054J098m00k92
5849a18K66K3n28L41P26o90L87j085J280p50n4M8N26n02m6K65k00j30j99l32K84
$$ y = [71, -170, 568, -244, 78, -693, 621, -46, 208, -67, -557, 80, -294, -347, -703, 512, -539, 94, 203, -267, 146, -192, 246, -131, 215, -473, 182, 87, 31, 680, 274, 385, -325, -230, -126, -237, -151, -522, 99, -77, 536, 26, -117, 69, 272, 98, 491, 425, -598, 389, -308, -161, 73, -554, -292, -349, 334, -798, 20, -16, -84, 254, -91, 881, 225, 179, 43, -88, 117, 399, 127, -128, 391, -367, -149, 411, 409, -3, 42, 79, -128, 227, -241, -38, 78, -237, 127, -442, 192, -463, -307, -153, 393, -718, 302, 232, 299, 289, 21, 702, -80, -251, -310, 48, 56, -300, 50, -51, 10, -350, 228, -131, 134, 15, -414, 535, -172, 265, 290, 213, -329, 41, 141, -89, 2, 57, -42, -14, 96, 362, -213, -507, -420, -23, 174, 144, -267, -229, 141, 377, 417, -27, 714, -386, 178, 530, -524, 574, 174, -118, 148, 171, -357, -16, 710, 20, 407, -678, 602, -148, -202, -154, 372, -130, -176, 89, -111, -241, -440, -772, -488]
5870d88P03m90k50N47j91n96R14j56Q62j549J373j133J198q90j7q93N80P41m18
5889a53M69n63Q33j000P75n15r7N69n83O09o29M28m95O38m09o6K93k77O42l17
5909A52Mj82K57m71J2N96m11L65n12J80j71M04p9j77L11l35J94j96J11j65M9j20
5931a84o3N66m56N39m68J48j19J82R2l79K70l58M18j74j43k4K47R9k53L66o06
5952c00O03k97p2J05k73L98m75M96l52L52l32K04O9k60L88m93L39k44P4l5m6N20
5974C69o74L82j03N4n5J68l70M5K82m53N86n77N44j21m1j55J08N2k94O78m83N6
5996bk2k03K91k18K52j70L64k53l0j27J4L91l98M09n19L62k54L34k26j50M54m76
6018a77O89n54K10j20k43L44l20K59q6K30m43M48m02J33J21k37K95l52M95l16
$$ y = [-488, 215, -275, -525, 22, -169, -765, 149, -7, 855, -694, 679, -454, 744, -146, -163, -1056, -476, 265, -153, 316, -247, 586, -414, 361, -154, -251, 318, -265, 344, -285, 143, -352, 286, -123, -189, 104, -173, 469, 152, 156, -26, 231, -240, -228, 368, -43, 322, -190, -10, -181, 223, 144, -33, 278, -57, 137, -59, 52, -113, -64, -184, -247, 319, -137, 402, -66, 82, -37, 145, 237, -142, 128, -230, 188, 14, -129, -153, 94, 193, -60, 306, -300, 303, 6, -66, 39, -234, 164, -311, 185, -167, 185, -147, 57, 126, -134, 254, -239, 100, -144, -70, -105, -151, 369, -305, 77, -26, 28, -27, 141, -229, -184, 98, -355, 231, -346, 198, 77, 36, -119, -11, 41, -253, 425, -58, -2, -24, -227, 64, -154, 98, -72, 292, 39, 9, -118, -104, 287, -111, 298, -221, 141, -113, 221, -5, -155, 299, -177, 512, -42, 168, 48, -195, 149, -171, 88, 2, 232, -211, 237, -165, -32, 89, -148, 147, -205, 290, -26]
6038b6L04m39J45k8k05M35l92L42k08j5k7j16O36o51M84j34o4j80J35R8j97O5
6060c8J9L14m51N70m52K61j77k93O99p88O65o02N69j19k36P0l03L56k27K63j79
6081g9K19l8n0N6k31J94k17L50m58N64j75j31Q3l10M78l33J73k24p2M17l92K90
6103A14m72L25j60L15k74j3M44m70O08o39M21m09J51j83L34J67o42N17j88K58
6123B04k94J69J58k85J47k39M62n31L26k33K38J41m85M75m06K72k51J6j17K76
6143D3M6k11L00l80P54n54J63r6k72J45k77O23k82J79l00L77j75j23J22l26M22
6164A78m74K96j48j6j27J87O1M9K13j99N0p1j24K33j81l0j35J83j50L91m14J24
6186a04l5j04M69n23Q12p15R0K29l25M77l83J38j97L96l09J61J95n76L63k23N30
$$ y = [-26, 278, -161, -16, -44, -249, 186, -206, 136, -72, -87, -114, -230, 406, -245, 239, 105, 41, -139, -4, 94, -103, -38, -19, 295, -156, 414, -38, 223, 46, -247, 452, -336, 329, -273, 296, 177, -59, 11, -292, 64, -163, 100, -79, 140, 102, 52, 108, -123, 71, -146, 204, -254, 310, 135, 4, 87, -223, 255, -78, 95, -129, -201, 216, -176, 114, -358, -33, -193, 122, -152, -165, 279, -191, 417, -222, 199, -210, -59, -242, 92, 259, -383, 134, -54, 204, -90, 79, 237, -48, 99, -140, 322, -209, 117, -116, 122, 263, -222, 253, -153, 119, -132, -116, -233, 43, 89, -122, 178, -202, 552, -2, 161, 65, -207, -62, -339, 284, 2, 181, -119, 258, 83, -40, 82, -244, 178, -296, 0, -148, -164, -291, -104, -43, 6, 219, 20, 70, -1, -125, 108, -73, -103, -238, -55, -205, 186, -228, -104, -139, -243, 226, -297, 515, -200, -110, 119, -206, 271, -112, 26, -171, 225, -84, 77, 272, -304, 59, -164, 366]
6207C66j22r2m13K31J90k78L97m77K56k71L84l07K32N6j61L01l75K12j80K19l67
6228a99K53P1j31J64k38L62k90r9L64l33Q0l98M79o47P60l47P7J21p3Q2k15N15
6250C58o46N21k47M2j44o5N17m18J78j91Kk1L8M02n42N53n27N01l54J12p7j97
6272b05J44J75o7j59J57L0k22J33p8L17m52L38j17J87j32Nrk42M06m45K05k4N6
6295Aj7r4J81j73M49n08J59P9J31J97n20K78m89P53o11K82k67K30k4j47J56k17
6317a71J72j49K60j41j86J18J88J56n08M45m96M89l38J08J19m46L90k8j3k02K07
6338b6K00p4j48j47K45m25L90l3j00j09p2L81m21O96m67R8K5k17N38l83K81l28
6360i6K02p4m2J15j51J86m26N19m46L92l82J94p9NJ62p4K07m35L95l5j80K30k12
$$ y = [366, 244, 152, -261, -30, 160, -118, 279, -198, 58, -213, 171, -136, 96, 152, -9, 292, -83, 129, -51, 168, -199, 54, 125, -6, 158, -80, 282, -8, -107, 257, -76, 4, -394, 85, -562, 198, -149, -72, 49, -24, 58, -157, 358, -288, 233, -14, 28, -116, -181, 336, -82, 96, -95, -93, -114, -76, 326, -216, 337, -190, 311, -43, 69, -8, -205, -61, 114, 47, -112, 45, 75, -147, -14, -92, 225, -227, 111, -6, 181, 49, 54, 45, -197, 209, -236, -31, -55, 1, -16, -110, 71, -102, 347, -161, -2, 77, 208, 405, -115, 163, -326, 427, -184, 98, -169, 61, 37, -110, 46, -171, 1, -148, 112, -29, -215, -97, 91, 247, -261, 184, -312, 177, -161, -53, 66, -380, 10, -18, -31, -233, -26, 174, 100, -48, -195, 50, -375, 15, -18, -118, -227, -299, 82, -339, 357, -110, -12, 13, -204, 334, -49, 232, -96, 106, 32, -10, 105, -46, 140, -286, 233, -213, 179, -203, -9, -88, -83, 79, 5, 212, -223, 172, 137, -43, 187, -25]
6383b5J72j94L49m79L61k52O2P7j01K45l32J85n6J36m08K15R5j25M89m79J4j25
6405a76L07k59L53N6m03K56l01K37Kj93K23k04K87k19L09l84J45j6L2J52l78M43
6427B69l26L75l19n7K33l82K46k7J59k08J32l11Q3K22j35J03j62K49j79J92l05
6448a48J53J04k90J46k5K7nK39l22J36L5j95L61m28K11k3K93k80M1J51l12k4p6
6471b31M88m83K63P0j04j8j79L46k96K33r2l50L31q8K59l18K52k59L40l15R3K7
6493c1P7K52l93J47j67K00j53L0R0k61L74k32J20j40K44j35J33j37o0L15o00N42
6515B15m8j53M6O0n8l34L01j93L97j39K0J68l87J47l4J10j4J03j65j45L44k21
6537B0J25l6k94K7O3q9r8k22Q00R5m53j77N95j40K91m56l1j25P34l62Q8n54j22
$$ y = [-25, 147, -47, 302, -177, 184, -68, -6, 71, -30, 215, -117, 68, 12, 148, -260, -45, 50, -75, 414, -65, -51, -176, 131, -128, 225, 281, -122, 134, -167, 70, 72, -121, 102, -102, 185, -34, 275, -109, 36, 20, 52, 204, -174, 269, -57, 318, -1, -58, 175, -207, 39, 12, 171, -37, 95, -216, -133, 89, -46, 57, -105, 144, -35, 157, -148, 5, 109, -181, -35, -60, -33, -38, 201, -121, 15, 50, -145, 216, -212, -1, -24, 269, -11, 30, 181, -131, -155, -231, 257, -226, 37, 107, 3, -15, -194, 152, -144, 89, -3, -353, -22, -110, 149, -169, 83, -176, 164, -151, -58, -31, 46, 298, -95, 52, -115, 85, -68, -38, 52, -209, 165, -67, 53, -87, 157, 22, 155, 18, -42, 273, -327, 215, 167, 14, 60, 120, 62, -272, 29, -164, 233, 94, 114, 282, -105, 42, 8, 118, 104, 207, 42, -103, 241, 20, 145, 109, -185, -158, -95, -184, -282, -504, 296, 391, -62, -239, 356, 216, 507, 51, 20, -105, 629, 267, 355, -199, -321]
6560c21N28q18K12N54l83L41J4J98p75L56K04O90j162r81J689K91n03k80K13l03
6580b36M36k36L00k87O9nn1Q7m7K79k49J9rQ6j20k58L98j59J38j09Np5J41kk30
6605a15J92j2j48K34ok85J19l4L3K33j32J22l68K58Q7k66J42k16K50k26K48r5
6627A5o1J76mP6m08L95k35J78%Qj04J03j89J59m1o6j53K43m00L20k41L45l59K00
6651d3k17L29k09J38L07n77M14l04L27k76J18O1K6J42m45J99QJ01m6n5K72l06
6673c6K77n19M79l09K54j89J12r3O2L45o50L83j84LJ28k21K17j80P9J0J32n4k6
6696B0j30P1K22l07K41r1K0m59N43N7j3k17k41M79k29K74k36O5Q0k88M09l12J11
6719F9j48J35N2M0R3n13N35k02L2m8j15P6J7KK2k6q7J75j11K07k35j09L27l68
$$ y = [-321, 207, -611, -399, 155, -228, 113, 127, 325, -450, -94, 110, 800, -362, -1343, 346, 637, 134, -146, 67, -236, 200, -36, 264, -23, 46, 41, -10, 77, 30, 309, 60, 79, 70, 156, 36, -222, 176, 17, 155, 46, 51, -24, 117, 115, -115, 77, 65, -83, 151, 145, -140, -21, -55, -22, 211, 79, 201, -167, 91, 178, -88, 54, -162, 88, -138, 110, 15, -46, 130, 126, 202, -206, 189, -46, 132, 132, 140, 36, 139, -50, 109, 68, 2, -151, 92, -308, 12, -229, 116, -243, -43, -260, 69, -140, -2, 305, -272, 142, -162, 165, -111, 7, 68, 94, 236, -209, -10, -2, 99, 53, -2, 270, -36, 241, -278, 201, -108, 146, -43, 69, -24, 38, 383, -267, 116, -68, -65, 63, -158, 59, -121, -42, -32, 100, 46, 20, -110, -39, 183, -124, 117, 26, 46, -413, 130, 187, 174, -43, -284, 195, -34, 240, 4, 69, 149, -139, 270, -42, 69, -79, 56, 108, 148, 241, -272, 263, 61, 93, 45, -70, 6, 23, 25, 47, 21, -66, 109, -2, 205, -30, -139, 188, -180]
6743a80J90k11M65M1j61k16j2J66l05K73j29J7O6p3J70k61M50l57J51j64R1O8
6765G9j97J82j80K2j60K12k03p4J90j24J50N2K11m60J85N0RK46j15L57m28R1j61
6788f6K63k23r0K67k67J04j70L25l3j28Kj39L36l07J36k64M38k75J03K90l66J55
6810I1k15J29o9O5j22J52J65k52J05j81m4J32R3j66J7J98j73k10K73L32k75R0
6832A35j08o7L1l04M74m98M66p8R2j50j64L23j03J47m26L31j25O5r0k0O7L1J65
6855A94k77L03k07m8o2j45M50l81J96m5L8k01R0J23j26Q8l51M76j57K48j6k20
6877c0K21l43J67m5J62j37j07J29Q4Q3l39M98m22K53k1n9m4j53J88j83J33R3m2
6900H6k36R3J63j30L01k84R4j27j01L66m68L80l06K75r9j56J90j00P5k40K84l28
$$ y = [-180, 10, -201, 264, 305, 144, -72, -84, 82, -223, 50, -79, -62, 4, -69, 101, -160, 290, -67, 84, -80, 11, 79, -118, 64, -116, -94, -254, -42, -245, -319, -129, -253, -103, -51, 160, -300, -115, -65, -56, 190, 75, 432, 4, 95, -66, 197, -26, -116, 151, -116, -12, -182, 143, 110, -18, -16, -155, 181, -126, 10, -254, 184, -91, 12, 302, -64, 91, -124, 5, -64, 1, -121, 31, 196, -56, 49, -132, -176, -44, 49, -117, -100, 98, -75, -285, -12, 320, 45, 135, 27, -40, -9, -313, 161, -337, 129, 51, 143, -7, -171, 152, 49, 196, -230, 101, -24, 41, -49, -69, -2, 29, 194, -83, 220, 13, -35, -97, -242, 208, -173, 23, -22, 16, -185, -95, 28, -98, -10, -361, 115, -42, 206, 190, -30, 191, -152, 15, -30, 132, -5, -112, 17, 101, 184, -155, 343, -79, 174, 153, 94, 50, -103, 85, -98, 35, 128, 86, -150, -57, 106, -24, 277, -7, 87, -40, -141, 225, -243, 137, -169, 106, 7, -149, 41, -59, 16, -224, 60, -268]
6922b68M27m12K33J35l14M05l27J95j30M12l87P7J65k91J93n21P09m15M3j57K85
6943E7l6j12L77k22K22l89L02l08J94j45K0N6oK00k10K32j18j82L91k27K8l82
6965b58K36N4K70l64P7K30k03J44j64r7OR3m6K16r2k61J15k44M24j43j37K54j69
6988e9L87m27K48j47%O1m7r8J69L6l59K21j96L67k10M7J03m87N17k48n6lK97j00
7012A6r4N4j01J25j04L87m13Q0J46l4J9j92K91o48M49M4j51J76j21m5J0L64l84
7035a26J33l4J59J74l10j01O0N1k6l02mL67J51j15P2n84L84O2j46J79o2Kp9K68
7059A73l84K74k69J40k6J02J9k85N17j03r4n6k92M78k08K41k39K31l37l6P1l57
7081d40P82n00Q8k6L25j05j58R9q3M7k65Q0K49l88J56j92M62k91Q5j73L67k35
$$ y = [-268, 159, -253, -20, 115, -199, 206, -121, 74, -56, 356, -31, 46, 211, -80, 113, -408, 301, -114, -71, -228, 57, 21, -91, 286, 64, 286, -103, 199, -109, 85, -60, -40, 16, 10, 210, 0, 232, 114, -68, 323, 96, 124, -258, -22, 32, 302, -62, 15, 245, 42, 186, 22, -75, -69, 24, -22, 194, 102, -159, -44, -288, 136, -7, -144, 110, -59, 328, -99, 149, 2, 2, 63, 16, -82, 87, 123, -236, -15, -211, 156, -54, -7, 96, -391, 126, -122, -178, -181, 116, 16, -78, -24, -125, 0, -104, 283, -130, -50, 96, 62, 81, -111, 180, -468, -19, 25, -126, 50, -71, -116, -106, 258, -126, 7, -27, 132, 306, -4, -105, -45, 6, -20, -322, -326, 41, 192, 77, 149, -435, -51, 11, -135, 44, -18, -16, -95, 173, -211, 63, -206, -66, -92, 10, 29, -256, 261, 158, 64, 8, -284, 194, -14, 227, -12, 219, -118, -154, -83, -440, 342, -158, -70, -96, 229, 124, -34, 65, -18, 29, -236, -156, 93, -295, -139, -331, 131, -160, -75, -248, 119, -116]
7103a16j8l4lN31p77O11k94M00o10O0P97q42O52o68P42o82L31p1J59J45k03J4
7125A24j79J50n7k2M9K76k28k50P3k9J63j60J56j21P7J01kL06l90M41p88L64j37
7148h3j72Q4J8K41j35K66m01R1K8m3L83l95J66j72M4R6J66j37j1O0k27M18k65
7171B0n3L24l02N8J09m1j53M9k72L35j49n8Q2o9nJ59K33l58L05k02l9j62M7L33
7195A91q5k6K02j62j04pJ11k3j99J60K14j47j37K3q7J74j78J61r0j23K16R8j89
7218gM5J03k87J63mr1M5J65k47K7J94l39L90k37K9J10j98R2J36M0l17J24Q0p9
7242f3J88j42K3p3J08m9j8J09j23K91l60Q0k89N94l66j03L05k22M84l94L39k73
7264D6M13p85L75J53m02K06j23J59j42K62k10o5R5J8L1k85P00n64J25m2j58L18
$$ y = [-116, -134, -168, -171, 360, -417, 194, -100, 300, -310, -250, 547, -295, 357, -311, 431, -251, 80, 9, 168, 313, 110, 124, -55, 95, 38, 16, 65, 341, 113, -137, -64, -93, 70, -90, 66, -55, 22, 123, 121, 427, 37, 478, -310, 54, -83, -255, -171, -153, 88, -47, 219, -182, -91, -63, -106, 277, -118, 48, -124, -80, 16, 182, 45, 34, 94, -133, 285, 20, -33, 291, -11, 47, 156, 115, -38, 11, -261, 74, -75, -133, -51, -120, -125, 34, 267, -91, 214, 12, -27, -189, -142, 191, 106, 80, 282, 120, 16, 9, 120, 97, -102, 58, 272, 125, -12, 11, -76, 98, -80, 81, -9, -132, 84, 182, -7, 38, 141, -146, 17, 13, -78, -33, 132, -115, -88, 106, -233, 157, -80, -51, 59, -139, -47, 89, 129, -188, -64, 16, -63, 125, -17, 6, -67, 41, -8, -26, 83, -40, 251, -109, -29, -318, 276, -90, -193, 112, -110, 374, -20, 319, 46, 459, -326, 49, 202, -200, 6, -117, 42, -100, 162, -48, -113, -18, 0, 31, -254, 446, -118, 7, -35, -193, 125]
7286A25p7K57l90J72k55j40L96j07J63m4Q2k05J68p5l6J9j78K61k93L28l39L34
7308A66l17M5L76n27K94oJ7k53K00mJ32O4m07N3P5R4P4m5P8j32L50k15l7k18K68
7333A25r1j01J22J2K1k1l6j08N0R3J28p8k50L91k96O9j01q0L11l22L23l8K7k78
7357a28J36P4m1M1j91K83k79K23j82o2J79Rj58O3J25l27L39k90K88j10p2K63l39
7380a56K08o9J00l81L62j34n3M26l47k2j81K98j61K20Q6l2jj65m2p1K01j29k7
7403g0Q7LK9j19K56k43K55l93J98J73j17r6N1R2j54J02JO5Q1j72L18l13K0k68
7427b14J82K16l01L92l02K92m84K66O9M2N7m14K24l02L75j82K4K04k07q0j0J37
7449a6jQ7k33L98l53K31Pj18J84k26m2R0J2K8nR4l40J37m1K60j52j90k9J97J52
$$ y = [125, 48, 305, -85, 87, -168, -308, 88, -19, 144, 100, 182, -23, 145, 70, 34, 53, -125, 136, -157, 171, -168, 166, -151, -106, 270, -257, 37, 31, 48, -205, -5, -9, 123, 187, -220, -167, -92, 2, 76, 31, 109, -23, 327, 112, 75, -143, 125, 34, -67, 55, 67, 88, 67, 31, -77, -27, 66, 194, 116, -134, 257, -39, 30, -71, -151, 160, -162, 161, 123, 150, -128, 8, 82, 41, 82, -109, 174, -105, 118, -64, -126, 53, 62, -96, -33, 92, -235, 104, -186, 102, -8, -80, 183, -156, 52, -17, 83, -298, 64, -70, -123, 303, -44, -66, -247, 51, -110, 110, 196, 164, 163, -2, -44, -115, 86, -43, -70, 17, 20, 49, -70, 186, -57, 198, -195, 3, 176, 59, -37, 14, 106, -48, 54, 55, 120, 201, 29, 347, 34, 54, -214, -32, 184, -117, 275, -27, 265, -219, 47, 116, 158, 215, -199, 25, -277, 98, -84, -60, 144, -63, -143, -153, -16, -17, 70, -163, 235, -118, 113, 120, 2, 186, -40, -82, 8, 20, 48, 43, 137, -203, -66, -107, 153, 1, -189, -218, -21, 131]
7474A31l91K05N2J24J5j04J19k21M73n40M08j90r1l9J04Mkj05J44N1l50R2j08
7497b19M81n37J14O0PP4l3J17J43j84j10J43J84k10J95l91M44k57j71J67P9k3
7519G3J64pj16k22P7N6o3k34K38J78j44N1o0J82k17K33j74Q9R3k05M4k37K12k2
7543a1K9m3Rj9M8l5J24L5k34j93R8J96J98j75j81J90J18l20K60l13K43J40k84
7566a20K04L9j94l58K48K70M6j99L8K95j20j65l5Q4J21l61J17J99J90o14L48o6
7588c3j0j1L9J63q6k86J10J03m2r0K69j71K01J33l01r7j5L0N7J07j48J24j04N8
7612@RN8k0j7J26k57J25j08J25j40N1R9q2l5o1J68lk0j27M0j02K17J07k00q0m4
7638a71K02O7r2J32n23P22l44m0P2%rJ58p2j24M8j45L10k30j09j18l0L28j79J31
$$ y = [131, -260, -55, -3, 121, 136, 32, 151, -70, 403, -137, 271, 81, -10, -49, 55, 59, 57, -48, 96, 147, -203, -111, -219, 262, -275, -161, -101, -94, -20, -53, 64, 207, 23, -87, 56, 240, 30, 225, -166, 278, 21, -150, 17, 96, 73, 237, 230, 114, -108, -31, 25, -38, -272, -34, 144, 0, 51, -9, 173, -44, 189, 15, 104, 197, -8, 36, -201, 11, -11, 18, -25, -16, -35, 13, -22, 102, 137, -97, -290, -192, 4, 202, 27, -154, 36, 154, -166, 94, -219, 24, 164, -120, 84, 123, -71, -429, -181, 89, 135, -64, -26, 269, 149, -16, -51, 33, 154, -207, -90, 109, 299, -315, 33, -33, -43, -54, -15, 148, 62, -224, -114, -11, -53, -143, 126, -45, 156, 289, -12, -109, -124, -94, -37, 70, -78, 46, -58, 0, 9, 67, 47, 30, 156, -101, 24, -84, 41, -99, -48, 51, -31, -66, -127, 41, 38, 18, -109, -69, -171, 46, 153, -47, -127, -171, 31, 98, 6, 138, -385, 337, -7, -47, 25, 25, 16, 174, 102, -22, 26, -119, 191, -39, -148, -266, -296, 32, -147, -16]
7662a6J51l9k78J50j23K25K73m14L63k34j62j07K85q3j72J72j67M30j31j26j82
7683a85J56K92l10R7k06K43j04Q0J11j51J18k99P6J87k4L3j02J25j47k0j78M18
7705B10j81n0K8j46P0k32L80j30J4N4J92k72K1r3P0J46p6N2j88L07j33p2Om8L14
7730B43l67K70k69J43J79j76n0m5k32K21K60k94J44j44Q8qQ1j60M6N8p1j13L45
7753A49j57j70N9L55l75L1J35j65R8O3k22q1M20k02J39o8q6K33j98K12k72J43
7775D1Q9K66p17K51J44j86L18k12L35j5l37J00j47J20l52L05j92J12k1j79L06
7796B9m76M00K52j18j39K03j07k37K16j71L01k67K17k10J00pq9L21j10j43l2J6
7818e1K43l04J14J58p5j56j16L33k38L00j55j72R0M3j88K61k33K62k84J61l2k2
$$ y = [-16, 135, 96, -182, -32, -155, 70, 343, -71, 292, 58, -104, -211, 74, -9, -181, -9, -176, 254, 123, -3, -185, -29, 263, -47, 50, -156, 87, -17, 63, 174, 23, 141, -158, -82, 105, 81, 114, 12, 137, -10, -30, -208, 210, 29, -21, 7, -139, -69, -301, 79, -51, -37, 17, 209, -63, -42, -135, -65, 81, 5, 57, -131, 176, 43, -29, -23, -71, 243, -124, 146, -123, 20, 199, 23, -27, -72, -304, -83, 177, -117, 27, -117, -29, -37, 44, -116, -70, -12, -83, -196, 149, -8, -178, -119, 236, -139, -108, 27, -138, -40, 23, -199, -280, 140, -62, 77, 9, -77, 156, -42, 170, -102, 41, 130, 396, -321, -70, 74, -112, 206, -6, 329, 314, -23, 77, -70, 50, -302, 3, -189, -77, -98, -277, 29, -447, -47, 205, 87, -52, 151, 44, -193, 23, -148, 153, -114, 103, -107, -7, -14, -103, 218, 108, -35, -67, -51, 192, -112, 2, 160, 85, -71, -187, 146, -92, 208, 53, -119, -29, 14, -174, 87, -146, 116, -168, -7, -39, -61]
7840f1K96j18N9j42k3N2j51P3j41J97P7j35l89M42r6L1k1J3K00l26J74J40j98
7863d7J65L6N5ml1R2k46k39L46j91L71J45p33J87N48P3J8k37L03q00k37N33k14
7886a07L4j4L27m83K31m1J21j33Q0l35O11l83L53p9l56J53M8J83j35l2l2J1j03
7909h1J02j39L2j06J79O6k00K24l3pkm9O8M7j69n4LO5K7R7k05R4j22R9M7k59L00
7936B4k4O4j36j20K16j60K58n5p2J26Q3q4j16R2j4q8r9P6j22J06j71N3J64l9k5
7961f3J09M4k07J83l1j92J81L6r4M2l9Q9P3l20J5K65k88K8J17l3J64q3p5M6J77
7986A44k07l8o5Q6K23k22K46k29R0o1M6NK12l69K50r5j65J40J56j15n8J15j17
8009b8K33o5k74J16j98K43N2k88M99n33J46j9L79n09L6J89kJ98q2j20j30O0O1
$$ y = [-61, 235, 117, 176, 34, 11, 63, -88, -15, -156, 41, 118, -17, -406, 36, -60, -29, -50, -37, 163, -163, 11, 151, -47, 118, 154, 209, 205, 174, 266, 20, -219, 127, -64, 307, 452, -281, -94, 454, 527, 545, 308, 611, -189, -426, 107, -107, -73, -87, 240, -243, -12, -53, 68, -65, 15, -320, 291, -92, 261, 182, -174, -21, 27, 210, 75, 43, 11, 22, -81, 21, -118, -86, -192, -13, 53, -147, 77, 44, 37, 35, -14, 54, 101, -68, -122, -119, -54, -27, 70, -135, -41, -163, -64, -17, -276, 24, 0, 64, -72, -192, 24, -136, 122, 67, -5, 121, 204, 120, 4, 96, 82, -6, -105, -29, -151, -45, -216, -163, 1, -38, -63, 46, 90, -117, 66, 35, -157, 24, 60, -34, 8, -31, 58, 131, -189, -174, 91, -197, -169, -52, -85, 79, -4, -79, -33, 144, -63, -101, -166, -80, 143, -79, 167, -62, 28, -33, 13, 18, 230, -139, 111, 16, -149, -9, 147, 32, -26, 89, -28, 205, 140, -134, -18, -216, 27, 79, -209, 290, -243, -97, -116, 263, -246, -210, -21, -23, 175, 93, -27, -157, -97, -36]
8032c6J61j9k07M2k18L64q2o4J90j19J46j76J95k58N43m19N2N2j77K49j86j2K7
8055D8O8j82J5J03j25K94m02J66k54M33l26M73l31Q6J95l20K20k13r0J27J08M0
8077A33k73J4O4L00m76M41j11n1m4J17q8J02k2J78l44J42n4L8q2j30j9J32J48
8100A15K46m01r7J62j22K27j69P2p3k02L72j09J36l85J89K04k08K56j49J49j51
8121F2j3j49L8m8N3j16J70J45k48N02n68J91j37P7Q7K88k47n6pk13L07M4l90L69
8145A41k62n5L61k32q4K31j44J48M0l01K94j39K0l7J14k0L6k4j05K65m38K45j10
8168e6n3N13n47J70K8J61l04K52Jk13L7J16j54j4J45j49K03p2m8p5l52M83j44
$$ y = [-36, 125, 106, -101, -59, -277, 87, 5, -59, 131, 12, 158, -18, 177, -81, 462, 43, 95, 147, -30, 219, 33, 21, 48, 116, -66, -51, 52, -73, 221, -181, -15, -269, 164, -162, 311, -20, 66, 261, -59, 161, -52, -142, -15, 93, 133, -140, -126, -62, 238, -238, 203, 92, 41, -3, 114, 26, 128, 106, 284, -60, 82, 28, 66, -16, -146, -165, -33, 115, 361, -40, -137, 25, -97, 130, -39, 33, -40, -242, 130, 21, 157, -228, -39, 165, -43, 213, 64, 213, 62, 49, -100, -62, -110, -57, -173, -3, 142, -106, 396, -172, 19, -118, -41, 46, 334, 87, 31, 24, -189, 118, 162, -228, 141, -121, -176, 185, -47, -131, 100, -44, 104, 144, -157, 137, -2, 18, -19, 95, 75, 111, 87, -18, 247, -191, 54, -56, -109, 404, -143, 27, 55, 216, -88, 164, 165, -48, -11, 105, -49, -63, 82, -67, 136, 64, 16, -59, -411, 72, -72]
8191g2
$$ Imaginary data points
##PAGE= N=2
##DATA TABLE= (X++(I..I)), XYDATA
0@%%%%%%%%%Nj3J6j6J6k4L2m0N4o8Q4j00J16j39J68j97K31k71L15l64M19m82N51
32B93o29P18q14R20j035J163j307J462j632J817k019K240k481K746l037L354l696
49a937M071m485M940n439N993o610P297q069Q944r944J1098j2452J4064j6021
63h550J8455k1576K5756l1693M0943n8265J48391k99203K93523L2412l67065M38525
75B11653k91368M0777K23355l55093J79458J09641l00164K68316j06152k0520
85d0097J24599k05479J62493Q719j53339J61634j2534j17198J30205p7063k9222
96d7282J68781k50246J51445Q9396k86339K28647j1989j86382K38723j58553j9132
107h2931K17893l20753K12384N7497k59473K81727j52291J1883J14872j94327
$$ y = [0, 0, 0, 0, 0, 0, 0, 0, 0, 0, 5, -8, 8, -8, 8, -16, 16, -24, 30, -38, 46, -54, 62, -77, 91, -106, 125, -146, 169, -195, 224, -258, 293, -336, 382, -432, 488, -547, 616, -691, 771, -861, 956, -1063, 1177, -1304, 1442, -1595, 1759, -1937, 2134, -2351, 2589, -2850, 3143, -3467, 3830, -4239, 4705, -5239, 5859, -6593, 7471, -8550, 9905, -11671, 14085, -17608, 23335, -34930, 113461, -185742, 107781, 140193, -226872, 211653, -79715, -38938, 184417, -170676, 8782, 118423, -181741, 86575, -19577, -40097, 84502, -120977, 41516, 50235, -103104, 58530, 45996, -71202, 59003, -18060, -47282, 121499, -128747, 22698, 112094, -174245, 54402, 42413, -143969, 94754, -63799, -82931, 134962, -185791, 26593, 84090, -175383, 106344, -45947, -34064, 80808, -113519]
117a13519J90212m0184j35171K04723j25184q520J15255j78159J69924o3278j08485
128i2386J95668j39640k87P5955o5484J3963K2643n2179M8356Q341q5318R9012
140B8644k7878m6379N5303j6095p054J6818l2022M0646L987p6280J10399p2868
152b2779Q309N0642r6323J23767q5900j5657J10991j13890L8068M7621q5995Q1498
164D0352l6279m1802J14456j23801N6287K9981p8809Q2238o9424L4868J5447n8827
176c5313N2100p150l4914L8803j7722j0347L9018n9913N1795n724l8105M5228
188A7756j5880p000N698J1527k5763L6260l6291R039L8378p1043O0587k0518j8977
201a6227L7685l7471J6723J8912m7769M2598K321n3816Q1630o7479K6393L1639
$$ y = [-113519, 76693, 36509, -98662, 106061, -19123, -27643, 87612, -90547, 79377, 16099, -92386, 103282, -36358, -36645, 39310, -26174, -12211, 10432, -41747, 6609, 14950, -70368, 28644, 766, -45613, 9690, -6405, -13459, 3359, -28663, 11983, 15970, -60310, 50089, -22779, -14470, 36172, -60151, 63616, -22284, -37941, 73050, -40840, -2772, 44849, -41146, 40352, 4073, -37729, 76727, -47074, 9213, 39194, -39615, 42623, -26801, 8067, 23514, -35313, 16787, 9637, -25277, 13526, -4196, -14543, 24475, -35438, 16357, 10633, -27472, 17756, 1876, -5124, 574, 12101, -13662, 22598, -13693, -4654, 33724, -37319, 23268, 2750, -16227, 21458, -16013, 710, 19622, -28147, 14451, 16772, -37044, 44586, -22893, 3500, 35139]
213C5139p6036Q6349m8411r138M9721m9745J8135J9957m4819L9087q201l8827
225b6789O5182o1447K3419J6472m5223M4293k6765L43J4022r895j1007K9592k8799
238a6602P416K4808m6641M8124k5281m462K7248k6791Q578J6029k6130J3236J8454
251A7986m8318N6778l6452l170M2153o1496N0518j6244k0855L6532k3221o000
263a1789L0771l5195J5925J9166n0968N9893l7889r55L4063m4571L3785j0518
275A718j0569J7946n438j7035L1264k3512p96K7483m1789L9352k0668m682K2675
288A5949k1476N050J0033j0438l946K2305l5092L3803j6066j4181L8063m2610
300a8606K4725j731j4413J5459n067j2542K3365j7625o405L3625m6404L7772j3450
$$ y = [35139, -40897, 45452, -2959, -12097, 37624, -12121, 6014, 25971, -18848, 20239, 12038, -26789, 38393, -23054, 365, 16837, -28386, 15907, -10858, -10515, 3507, -6388, -17395, 12197, -16602, -9186, 15622, -31019, 17105, -8176, -12638, 14610, -12181, -3603, 12426, -13704, -468, 17986, -30332, 26446, -10006, -13176, 28977, -32519, 17999, 1755, -19100, 17432, -5789, -11789, 18982, -16213, -288, 18878, -32090, 27803, -10086, -11041, 23022, -21549, 12236, 1718, -8851, 9095, 3657, -13378, 17886, -5626, -6422, 21061, -20728, 18624, -2044, -6726, 15949, -5527, -477, 9556, -882, -4828, 17477, -17615, 16188, 122, -14059, 24004, -18606, 6119, 4388, -10025, 5434, 367, -12175, 11190, -6435, -12840, 20785, -25619, 12153, -1297]
313a297j3460L3211l4946K0672J502j3323R469O636k0504K3972j3145p314K8027
326A9500l8590L1651j2322q466J7948j6600O744J347l288n287J7293k5359K1066
339E637m883j5034K8698k7869J7588k145o462P241K306j0939J2618j439j6228
352a0911L1763l4351K2361j753j8770K8314k5472J0160M293j0127J911J0334j9206
365a1454J7094m189j3611L0090l3873K4423m240j0301J7096j2835P122q80M63
378D905n519J5600k0815J2407K832j7257K0743k0472J1606l478n639J696N206
391A815j1414L041R696k2680K6368k3688J1604P108k2571K5374j3291J021M887
404b730j084k881J0604j5970J4537J902k0824L1077k5386J4672k137q439J7136
$$ y = [-1297, -14757, 18454, -16492, 4180, 5682, -7641, 1828, 8464, -12040, 11932, -1213, -8527, 19500, -19090, 12561, 239, -8227, 9721, -6879, -135, 1212, -2076, -7363, 9930, -15429, 5637, 754, -14280, 14418, -13451, 4137, 1992, -4470, 2771, 5077, -5862, 6756, 5317, -10911, 20852, -13499, 8862, 7109, -11661, 16653, -8819, 1341, 5634, -4493, -2582, 7752, -11454, 5640, 1451, -12160, 17930, -15943, 8480, 4240, -6061, 11035, -1800, 5322, 4442, 4905, -614, 14986, -5829, 6578, 9410, -7847, 12896, -7576, 4030, 552, -5087, -3391, 1815, -9599, -6558, 3138, -19542, 6826, -16862, -5258, 1850, -20721, 4653, -8638, -7617, -2730, -3814, -6695, 3909, -12061, 2476, 4378, -16446, 14631, -10755, 3917, 1780, -6659, 10477]
417A0477j5523N556J644L149j1675J3823q731K599L161j1460J7193j5306N872
430G79j961N634j0109M870L765j0040J4203j9941K2449j2901l246J4699j4473
443f272J1384p494L385L625k898p871J9302j6443J371J2601k1237K4916k4811
456a0442J2024N321j6795J3739p807O944p908N008j19L796p780P668L347p909
470i13J0750j0791J7074j5313O620L520n095M920j2338J8914k0053P569j061o903
484c100P993j3610O631K26o091l051J3908j7114J1273k660l175J6279k4213K7359
498A0655j2787J521R762j1710J7065j2709K719O797l737p273J1709j0598K932
511D346k6j0174J6587k1039J3299p227J999Q26r798J8477j7956J1221k887J174
$$ y = [10477, -5046, 510, 2154, 5303, -6372, 7451, -1280, 1319, 4480, -6980, 10213, -5093, 779, -1182, 4452, -5657, -787, 2978, -7062, 7141, -12800, 9649, -3252, -6498, 8201, -6272, 5112, -2382, 1003, 4628, 1730, -6141, 13161, -3282, -1911, 10690, -10547, 14369, -10442, 1582, 6903, -9892, 3847, -3960, 2984, -4924, 84, -35, 3761, -4019, 3649, 6996, -913, 9837, -954, 16120, 807, 7427, 10947, 5852, 10772, -1566, 17348, -2705, 4864, 3803, -3100, 4893, -8717, -2086, -1860, -7951, -11002, 2906, -14208, -2935, -5595, -8770, 7509, -16704, 10655, -2132, -611, 9151, -2559, 14506, 1797, 4516, 11313, 7576, 303, 12012, 1414, 4346, 4320, -5854, 10733, -10306, 2993, -4234, -2235, -1409, -11207, 7270, -10686, 535, -2352, -1178]
525a178L137m648N034N62j310l065R229j1962J0864j2481Q006k5j6335K3071k3788
540a4889J3562n672n947J3223j4640O924J657k471p24O625p060J1345r077N355
554a789P491j5047K0538j7462J3476m413n986J3997j4882J0186o204K931k496
567C40k23o37J700k916m51M996q957J1960j4796J4324p210k481J2375j7483J8885
582I426j5074P636J899q485R764o319J015K138q25l763R753j4299J3345n541m949
597d279J5641k0745K0476j3218L772N804j0927J1681q931M449j185P10l624M867
611D491n846L870p48n436J0158j3936J3622j2299P752q2r294J6212j7307J3368
625D525o404l31N790p013L830J157l040l91N419j0557J4086j4591Q076L060j4723
$$ y = [-1178, 1959, -2689, 2345, 2907, 1597, -1468, 7761, -4201, 6663, -5818, 2188, 2163, -14172, 8899, -14889, -1327, -6999, -12946, 277, -14363, -7439, -5782, -8253, -8977, -2352, -9412, 1933, -7144, -1789, 5702, -9345, 11193, -6269, 7207, 2794, -3192, 10805, -4077, 6109, -95, 2836, 340, 117, -520, 1180, -1736, -2187, 2809, -6148, 5812, -8984, 5340, -1870, -4351, 8024, -9459, 9426, -5648, 1988, 3887, -4598, 5166, -1153, -138, 2000, 1175, -2588, 7165, -7134, 6211, 670, -4279, 11362, -9383, 11093, -2125, 1647, 7451, -3476, 8205, -726, 3723, 2538, 3248, -376, 4491, -1355, 2515, 1767, -3669, 6489, -7447, 6175, -6124, 1628, 1546, -7748, 8464, -8843, 4525, -1879, -2210, 3580, -3433, 397, 1554, -1486, -1877, 3542, -7015, 7071, -7520, 556, 3616, -11107]
640a1107K0028j8641J2276l558m551R730q171L915j27J872l953O652o754P852
654E463n912J451N795j0421J2615j3670J3059p859j744Q231j1451J0832j0363
667c974O488j757l070K715J29k662J921Q48m652J0557j6065J5802o945m587J2830
682G578j6323J5881j1484L556L604n709L153n07P77k126L037n991J0021j1562
696f095P273K54n961R594j2537J3659j0808M478P81l421N914q610R036o185K551
711g7j829L155l345K175m75j371O245j2363J5664j2351N625K016q099J3199j3980
726e811R601k148j505J137L92q55N84J85l385Q893j3623J1935o965O37M608j0032
742f352J2912j2147P743l277R12Q23l153N214n044M651n126O787o141M332k515
$$ y = [-11107, 8921, -9720, 2556, -1002, -5553, 4177, -3994, -79, -206, 1666, -2287, 4365, -2389, 5463, -449, 1002, 6797, -3624, 8991, -4679, 8380, 521, -1223, 7008, -4443, 6389, -3974, 2514, 757, -2313, 402, 531, -2131, -210, 638, -4014, 6543, -9522, 6280, -665, -5252, 7578, -8745, 7136, -4348, -792, 2812, -2897, 256, -251, 526, -1600, 1437, -4554, 5467, -6095, 1178, 1432, -4529, 5065, -7472, 6187, -4621, -143, 638, -2783, 3131, -5479, 3557, -2628, -77, -1906, 1249, -2096, 79, -396, -1767, 4478, -7885, 7779, -4572, 1053, 3069, -5030, 8169, -5811, 3790, 1642, 137, 1274, 1666, 811, 1395, 1580, -1805, 7088, -6535, 5400, -1565, -928, 3680, -6352, 6560, -5587, 2156, -1121, -209, 614, -2539, 2675, -2369, 2282, -2844, 3943, -2198, 2134, -381]
757c81Q76K479q254J2591j2696R666n537o8N603j0231R836p227L740k789K281
772a11k245K332k584j8N048j0004J2574j1194P846j782l945R577j0493R187o297
787b109L838j866J003j9j044K299m687P035q903Q408o680L137L28n026Q499j0298
803f085R909q116N289j303j990N484o232O473n267N407m486M730l742K643O56
818C370n262R682j1903J1060q284K731K527p255Q428q434N204l884K848l582K853
833I9k049n15L387p554J0480j0294P893l834P6M368p389Q984p828O721m813K804
849E36n64j898L845m511N560o286O128n804M533l136L26M395q953J0519j0518
864e828Q446l895r14N415o711N412m060M519m376M859m648M734k279j778O966
$$ y = [-381, 495, 2974, -5280, 7311, -5385, 4281, -1256, -1324, 4279, -5952, 3884, -3343, 397, -2392, -111, -2356, -24, -2608, -2626, 2422, -7582, 4992, -6202, 1644, -138, -4083, 5494, -4999, 4188, -2109, 1729, -137, 866, 847, -197, 2102, -2585, 4450, -4453, 3955, -2725, 412, 740, -4286, 4213, -6085, 3824, -4292, 997, -306, -2296, 3188, -3044, 3429, -1838, 3569, -917, 3813, 71, 2714, 3370, -1892, 7790, -4113, 6947, -1337, 1394, 3921, -3334, 5094, -3340, 1864, -2020, 828, -2754, 99, -1950, -2465, 922, -6632, 3848, -6446, 1447, -2387, -2311, 2057, -5332, 3652, -4176, 2545, -2268, 536, -28, -1926, 1919, -2592, 2968, -3318, 2810, -2994, 1539, -1597, -1271, 3124, -5829, 4690, -5828, 2618, -1277, -2191, 3224, -3487, 1925, -2135, 2384, -1992, 2867, -1781, 2953, 674, -1104, 5862]
879E862r675J0787r523O069j404l209O762p593O365n976N151l700O72o22n38K005
895A433m399O428q257O939n182L354l28l802P935q784Q805p706N036L81k619M006
911C240m165O021m759L873n465N687n771K672N69n955Q207j0459J0038q608J772
926c103L087n726O116o228O352m575M437l716L753j200j063M761n478Q001r151
941c733Q750n070L44L486o670Q355r244O740m282P48m76j452L812m561L725l776
957c304N382o275O731m977J817M086p280J1090j0573Q223k724j803M176n160N580
972D989m602K489l251K785m609M220l582q36N139r760J0200r043O564j831k495
987c623N467p036P775n926N338k528Q80N66j521J787k323L743n885O733o949N480
$$ y = [5862, -3813, 6974, -2549, 3520, 2116, -1093, 5669, -1924, 4441, -1535, 3616, -84, 588, -34, -572, 1433, -2966, 3462, -4795, 2144, -3038, 316, -12, -3814, 4121, -4663, 4142, -3564, 1472, 1853, -766, 3240, -925, 5096, 337, 4210, -1255, 4432, -1339, 1333, 1902, -4053, 4154, -6305, 3733, -4875, -3103, -16, -5742, 374, -5854, 498, -4077, 360, -3356, 397, -803, -1866, 2895, -2583, 5418, -3733, 5017, -53, 291, 3777, -2893, 5462, -3782, 2958, -1324, -576, -1052, -2504, 1308, -3253, 472, -3304, 2078, -4197, 2534, -2443, -626, 3460, -3820, 7270, -3303, 4920, 2196, 393, 4569, -591, 4989, 387, 2876, -375, 2410, -2199, 2021, -1561, -2397, 2742, -7018, 3182, -5861, 703, -1128, -3623, 1844, -5192, 2583, -3343, 1995, -533, 347, 913, -608, 1179, -1144, 2599, -3286, 3447, -3502, 1978]
1003A978k976l247O923r699J0951q460M656n74k657M569l882L564j796K308m177
1018b519N694n381M221o73m185Q433j0684J0129p286K728J531m618O577o844N618
1033B741m126K933j402J459k265Q52J799m270P216q820Q162n988K870J653o423
1048c609R198j0037Q023m687Q99J181k987L195j973J582k683L706n759O652m684
1063a983J907K645p568J0880j1011P581k930j256M482n632M775l948K793l186
1077b451L748m200M214k977j47L866p695J0023r190P047k949j588N903p832P804
1092C576o256M706k259J70R69q76Q17j059K563m690O845q172O921l648j622P042
1108E027j0251J0205p786M106L57l171L647l662K698j907K668l921N482n893M218
$$ y = [1978, -998, -4245, 2678, -7021, 3930, -4530, 126, -448, -3105, 1464, -2418, 1146, -650, 1658, -2519, 3175, -2206, 2015, 1342, -2843, 5590, -5094, 5035, -2251, 477, 2008, -2610, 3967, -2877, 2741, -1385, 1548, 146, 1605, -660, 192, 1991, -2279, 4937, -3883, 4279, -1709, 1161, 2814, -3609, 5589, -4448, 3575, -1112, -213, 968, -2019, 1176, -797, 785, -1898, 1808, -3951, 2701, -1983, -76, 2569, -4999, 5881, -5130, 2451, -479, -1735, 2747, -2885, 1890, -2058, 735, -2451, 1297, -2903, 1311, -1666, -1813, 2053, -5642, 4381, -4809, 2238, -711, -2299, 3604, -4228, 3576, -2680, 2026, -233, -63, 906, 30, 847, -212, 2351, -2339, 4506, -3666, 3255, -393, -2015, 5027, -5224, 4981, -2805, 1301, 1658, -1513, 2134, -1528, 1170, -737, 1931, -1990, 3492, -2401, 1817]
1123A817n10m276P789r524R126o590K790J080m578N704n786N135l866K502j691
1138h78J729j147L13N47k873N081p078P936o339K896J340n622Q426r329P370m303
1154a931P70J525k006J533o59J442k580M564o094O828n036J135L707p243Q888
1169D843q679O489k600r86K957l865L936l915L419k884L138l362L194j631n52
1184d98L019o059Q066p507O326l115q14M129o463O954n878M316k108L91M6j72
1200F33J10j372K601n028O767p293N438k238k198N798p970P736o271L370o94j245
1216a856K077k214K317k327L319m300N230m592K709m5l120O057p444P639n876
1231b426K913j22j896L782m902M408l797L201k605K375k051J173Q68l070N605
$$ y = [1817, 1307, -2969, 4820, -4704, 4422, -2168, 622, 1702, -2876, 2828, -2958, 2177, -1689, 813, -878, 851, -296, 17, 564, -2309, 2772, -4306, 3630, -2709, 187, 1527, -4095, 4331, -4998, 2372, -1931, -1161, 364, -1642, -109, -768, 674, -1906, 2658, -3436, 3392, -1644, -509, 3198, -4045, 4843, -3836, 2653, 53, -933, 2024, -1841, 2095, -1820, 1599, -1285, 1853, -1509, 1685, 54, -498, 2521, -3538, 4528, -2979, 3347, 232, -582, 3547, -2916, 4038, -1840, 2476, 368, 759, 805, 633, 743, -629, 1972, -3056, 3711, -3582, 1856, -382, -2580, 3218, -4752, 2984, -3287, 83, -611, -1856, 221, -1993, 324, -2003, 1316, -2984, 2246, -2346, 363, 318, -2802, 3255, -4189, 3450, -2426, 487, 365, -1531, 2251, -2651, 1757, -2040, 1161, -1444, 931, -1120, 53, 921, -2149, 3456]
1246C456p445P634n189K104J214m263O528o480N351l544J791n83l07N63j092J869
1262A607l494N328o277N454l352J31K765n599P078p057N461l006J137Q88k422
1277a358L577l603L386l775M423m148L222j578p59L391n730O911p012M857k537
1292g33l11K758n099N192m596L551l041J937j220P63M4k173M125n619O270n555
1308c707M097j522j495M826o276O253m790L493j483L96P75j431K151k839M316
1323B764m659M592m033K222M17l224N515o308O314m867K774m41j647L128l320
1338g73L156l566K509k099K595j800Q01R77k953M520n994O159m749J372J610m561
1354b796N648n614M898l822K568j600K75k76j037K828l687M977m470L911k419
$$ y = [3456, -3989, 3645, -1544, 560, 1774, -2489, 4039, -2441, 2910, -634, 1157, 574, 267, 830, -262, 1607, -1887, 3441, -2836, 2618, -734, -603, 2162, -3437, 3641, -3416, 2045, -961, 176, 1064, -1358, 2219, -1384, 2002, -1773, 2650, -1498, 1724, 146, -613, 2778, -2952, 3959, -3053, 1804, -733, -1044, 1714, -3385, 1807, -2789, 762, -2279, -342, -1562, -799, -755, -2928, 1197, -4422, 1848, -3707, 390, -1132, -2627, 2199, -4077, 2176, -2614, 879, -604, -208, 567, -864, 1287, -1552, 2764, -1895, 2697, -1336, 886, 1303, -1921, 3594, -2714, 3600, -1267, 1507, 1066, -581, 2547, -773, 2383, -1183, 1326, -773, 1822, 22, 823, 1800, -1153, 3367, -2627, 3532, -1217, 155, 1765, -2796, 2852, -2762, 2136, -1686, 882, -718, -443, -719, -1756, 1072, -2615, 2362, -2108, 1803, -616]
1369f16J071K137n058N689n687N577k805K72J169j571J616j913K629l722M080
1384B868m134L137j384j280K782m869O459o588M472k747%L024m081L792l671L619
1400A399k511J535j074J350j38j390L914n369N647m828L610j909j746M518n477
1415b469N147n017L682o78P17n1j881K172k455L670m164L826m149K601l11k063
1431a423M101o241N865m214K257l68n53J956l761K810k701K230k537K648k270
1446b201P39Q76l157M948n997O328m436J982J269l307M612l619L669l446K139
1461C99p81J162o16j84J416k838M362n035N045k948L22K041m129N451n277M130
1477B520k492O18N60j703K446k801K365k508L021l247K895k293L89K173m359N564
$$ y = [-616, 455, 2592, -2466, 3223, -2464, 3113, 308, 580, 1749, 178, 1794, -119, 2510, -1212, 2868, -1266, 1871, 487, -793, 1989, -2880, 3579, -3009, 1463, -1284, -1284, 1740, -2341, 1451, -2220, 1399, -1112, 423, -651, 699, 561, -829, 3085, -2284, 3363, -1465, 2145, 236, -1510, 3008, -2469, 2678, -2339, 1343, 665, 1382, 1331, -550, 1622, -833, 2837, -1327, 2499, -1650, 951, 640, -1423, 2678, -3563, 2302, -1912, 345, -23, -576, 1380, -2381, 429, -2272, -42, -2579, 69, -2201, -1462, -586, -3743, 1205, -4792, 1536, -2900, -918, 351, -2956, 1656, -1963, 1706, -1740, 399, -382, 780, 164, -20, 1396, -1442, 2920, -2115, 2930, -18, 304, 2345, -1784, 3667, -1610, 2520, 28, 646, 1206, -497, 1949, -852, 1513, -995, 2026, -1221, 1674, -619, -230, 1943, -2416, 3148]
1493C148o272N080k328n22K458l570M170l621K534k077J891j789J558o54j015
1508a009L205m449N384n550L812j531j516L615n193N495l696K215j057j23L28
1523g0l47Q50j652K197l581M574m454L107j034k280M702n784N963m381K113O0
1539a7j519K568k699K296j944K530k282K289k273R59O27j982M074n156N486m073
1555a116J951J343l225M026m651L735k482J650j282J136m03k79R89k032L403m916
1571b153N393l829J005J425l669N036n608M996k769L18R06k005K078j484J397
1586A037k239L161l854L382k578J033J668m273N717o046M662k194o53K054l177
1601b300L686l129K233j438J588j707J164l43q99K297m049N299n007L553j171
$$ y = [3148, -3124, 1956, -372, -894, 1564, -2006, 2164, -1457, 1077, -1000, 891, -898, 660, 6, -1009, 2196, -2253, 3131, -2419, 1393, -138, -1654, 1961, -3232, 2263, -1433, 782, -275, -398, -70, -417, 433, -1219, 978, -2603, 1971, -2483, 624, -410, -2690, 2012, -3772, 2191, -2190, -77, -17, -1536, 1032, -1667, 629, -1315, 1215, -1067, 1222, -1051, -92, 535, -1447, 2627, -2529, 2957, -1116, 835, 2178, -1047, 2979, -1672, 2063, -419, 1231, -51, 1085, 682, 403, 1392, -640, 2763, -2153, 3240, -589, 416, 1841, -1828, 3208, -2400, 2596, -173, 145, 1051, -954, 1124, -360, 1037, -1202, 1959, -1895, 1487, -1091, -58, 1610, -2663, 3054, -2992, 1670, -524, -1177, 877, -2300, 1386, -1743, 490, -948, 640, -1067, 97, -246, -1145, 1152, -2897, 2402, -2605, 948, -223]
1616b23j191L503m197M525m305K871j107K01J097j563R35j463K647l415M010l974
1632a649K592l31j403L347n089N297m379K161m67r84K058k268K064j723J741k274
1648a307K508k564J531L34k376L943n265N020l778J625L55k018L266l710L430
1663I94k853J781j018O54l54Q0O72j812L269l491L899l619J619J490l460M200
1679B051m348L926k751R17J005j009J453k035K217l207M122l695L131j937n62
1694g22K291m501N024m375L808j960p30J587j502K322k230K008k166K124j984
1709a006J665j70p90K310l584M491m619L750j931l01K315l642M185l712K551j386
1725A26P38l61k35N67j637K050l176M091l673K454q98j490L154m314M631m107
$$ y = [-223, -1414, 2089, -2108, 2417, -1888, 983, -124, 77, 1174, -389, 546, -917, 1730, -1685, 2325, -1649, 943, 612, -791, 2556, -2533, 2764, -1615, 546, 79, -905, 1153, -1115, 949, -774, 967, -1307, 1201, -1363, 168, 502, -1874, 2069, -3196, 1824, -1954, -329, 26, -1992, 1274, -2436, 994, -1859, -78, -1096, -442, -796, -716, -44, -1856, 1413, -2078, 1821, -1798, -179, 1311, -2149, 2051, -2297, 1629, -1122, -205, 800, -209, 1244, -791, 1426, -1781, 2341, -1354, 1777, -160, -722, 1569, -2932, 2092, -2283, 1525, -435, -1165, 422, -1080, 1242, -988, 1020, -1146, 978, -1006, 659, 489, -301, 2009, -1575, 2916, -1703, 2047, 116, -185, 2130, -1512, 2673, -1039, 1512, 126, 864, 503, 268, 835, -802, 1248, -1928, 2163, -1510, 944, 46, -1444, 1710, -2604, 2027, -2080]
1741b080K349j034k43J132j910J917k453L005k971K403k003J262K59k179L821
1756A275m568M832l676K413l73j389K972l134L198k429K111j426J447q73L67Q76
1772A623k396L849m310M293l137J182P63k701L746m016L358k624J419n98n52Q43
1788G42j283J764k644L431m004L398j983%J900l331M467m488L664k168M07J192
1804A064j970K216k494K389k221K277k334J654p06n59K185l752M643m537L504
1819A359j641n68K376k963L403l202K615j909J129q49K14M57j793K773l615L695
1835A481l466K036n58j444K654l533L794l560K572j336L58P62j256J900j972K542
1851I74k678L041k449J769n8j724L506m149M198l384J965k42j362K226k433K511
$$ y = [-2080, 269, -765, -1008, 124, -1786, 131, -2322, 683, -2288, 115, -1888, -626, -367, -2546, 1275, -3293, 1539, -2137, 276, -97, -1486, 1486, -1648, 1550, -879, 1232, -194, 1253, 380, 747, 1623, -773, 3076, -1234, 3059, -78, 1104, 1867, -834, 2912, -1104, 2254, -370, 1049, 451, -101, 742, -541, 1223, -1421, 2010, -1994, 1404, -579, -579, 1321, -2010, 2457, -2031, 1633, -535, -128, 1064, -906, 1310, -1184, 1205, -1016, 1261, -1073, 581, -125, -684, 1501, -2251, 2392, -2145, 1359, -282, -850, 1526, -1437, 1966, -1236, 1379, -530, 599, -250, -36, 421, -1372, 1401, -2214, 1481, -1985, 51, -507, -1951, 703, -2830, 964, -2596, -24, -1360, -1002, -240, -1496, 404, -1568, 974, -1704, 1337, -1112, 657, 599, -1125, 2381, -1768, 2430, -954, 1011, 769, -593, 1633, -800, 1711]
1867A711k281K038j905J530r49R0Q99k535L777m264L939k959Q72Q01k557L272
1883A479l617K944k240J543j248M52L32j242K085k867L227l502L087j685M90J443
1899F81k992M227l979L489k119J050Q0j245K287k373K253k473K731k608J996j019
1915a4l82K069l764M344m430L609j512m9J434k603K992k610K051j830J578j275
1931c92N43M3j009K492l548L737l366K013p38q76K413l544L920l462K528j362
1947f08L38N33j145J640j850K484l080L429k892J743j1j489L126m496M556l755
1963a477K135m42q34J706k567K333j943J929k208J974j318N34P47k250L335m104
1979b450L875k598J189M57j915K923l099L088k395J700j011M41K26q67J867k419
$$ y = [1711, -570, 1468, -437, 1093, 144, 234, 1133, -1402, 2375, -1889, 2050, -909, -37, 764, -1793, 1479, -2138, 806, -1434, 109, -1139, -687, -355, -1597, 488, -2379, 848, -2654, 433, -1252, -762, 681, -2311, 1916, -2063, 1426, -693, 357, 437, -808, 1479, -894, 1359, -1114, 1617, -991, 1005, -14, -396, 1673, -2091, 2253, -2177, 1432, -80, -129, 1305, -1298, 1694, -916, 1135, -695, 883, -392, 151, 194, -815, 1677, -1871, 1866, -1500, 513, -225, -1101, 1312, -2232, 1688, -1774, 754, -608, -270, 263, -882, 758, -1092, 1392, -1688, 1741, -1151, 592, 581, -908, 2218, -2278, 2278, -1477, 658, 216, -618, 1088, -1479, 854, -1089, 840, -1368, 606, -712, -178, 569, -1681, 1654, -2450, 1425, -1173, 16, 473, -1442, 1481, -1618, 1470, -925, 775, -236, 205, 431, -436, 1431, -988]
1995i88L179l441L011j818M60J313k700L667l914L333k230P48L49r86J384j854
2011d87K038k260K345k381J950j190M1J776l344M198m213L076j558O2J448k675
2027a174K849k708K487k263J559j358N50K18j189K072l066L411l624K476j064
2042h24o64K464l583L626l498K709j446L90M76r39J474j643K285k906L046k507
2058a540J425k65j244L045m135M124l348K005m86q52J781k082K549k537K371k037
2074a226K175j602O28P19k055L317l580L424k628J645j38j592K875l369L266k755
2090h96J975j098L32L5o63J317k239K801l156K870k319R72O49k464L652m031L311
2107A048j820Q53J47q55J712k182K440k286K471k364K111j026q7J504k977M033
$$ y = [-988, 2191, -1250, 1761, -57, 403, 1716, -984, 2683, -1231, 2102, -128, 620, 969, -17, 1367, -487, 1551, -709, 1636, -745, 1205, 15, 56, 1832, -1512, 2686, -1527, 1549, -9, 53, 1501, -1174, 1675, -1033, 1454, -809, 750, -608, -58, 160, -1029, 1043, -2023, 1388, -2236, 240, -824, -1488, 976, -2607, 1019, -2479, 230, -1216, -826, -350, -1289, 185, -1458, 827, -2079, 967, -1540, -115, -380, -1624, 1421, -2714, 1410, -1938, 67, -419, -1271, 510, -1572, 977, -1560, 811, -1226, 949, -653, -25, 694, -1361, 1956, -1624, 1800, -828, 817, 679, -913, 1962, -1407, 1859, -896, 1079, -19, 313, 348, -315, 1002, -1237, 1564, -1592, 1278, -1041, -69, 580, -1884, 1768, -2263, 1048, -772, 81, 228, -627, 1085, -1097, 1343, -943, 1528, -836, 1275, 249, 162, 1666, -1311, 2722]
2123B722m289L172k072O12P83k224K736k934K386j849J532j467P42rn96J954l334
2140b135L899l257K644j238m25J911k753L284l133K685j567N42m9p79J042j411
2156g40K079k595L015k700J725m58j316K661l476L754l062K123o30l10J185j786
2172e31K180k217K019j894J758j730J032L46j947K692l765L726l010J556j57j725
2188a667K380k634K586k459J498r95O29m3l74J406j918K543l119L300k368J164
2204g1O47k285L527l658L567k142R67l12m46J059j234J804k048K293k547K053
2220A174j446K63J109k531L456l448K740j839P38O17j603K055k291K089j744J711
2236A050j521R13l24l84J618k915L697l875K634j266k26J520k601L039k946K277
$$ y = [2722, -1567, 1605, -467, 145, 928, -1296, 1440, -1494, 892, -957, 575, -892, -150, -159, -755, 1199, -2135, 1764, -1493, 1151, -87, -512, 1399, -1354, 1930, -1203, 1482, -85, 457, 408, -371, 671, -740, 1339, -1256, 1759, -941, 784, 326, -990, 1671, -1805, 1949, -1113, 1010, 380, 70, 1255, -531, 1649, -568, 1451, -443, 1315, -415, 617, 963, -984, 1708, -2057, 1669, -1341, 215, 58, -1667, 713, -1921, 665, -1794, -296, -1291, -662, -705, -1079, 327, -1591, 952, -2167, 1133, -1235, -71, 576, -1709, 1818, -1840, 1727, -415, 552, 240, -206, 853, -381, 1423, -625, 1668, -879, 1174, -272, -9, 1100, -1431, 2025, -1423, 1317, -522, 216, 833, -770, 1285, -1006, 1083, -661, 1050, -471, 442, 118, -266, 1352, -1563, 2134, -1741, 893, -373, -599, 921, -1680, 1359, -1587, 690]
2252F90j523R06k69N5M31j319K328k854K942k516J984o30p54K289l229L214k832
2269a087K066j140j74O80j125J254k055K054k116J805j331O63J23j270K642l279
2285b290L654k796J457J23j322K099k354K579k195J868j373R67n32k8Q83j847
2301a107K864l287L052k267J118N45j835K959l236K919j999J476o36k52P68j153
2317g1J646k251K266k424J969j312K18P90k591L338l434K614j865N31N35j207
2333a248J915j953K019k225K171j578R80j46o22J658k590L271l296K543j406p0
2349e77J263k202K565k625K282j621Q01l97PN45j239K269k480L004k735K001q70
2366in25K068k772L227k868J934j106J34N79j111J412j828J712k070K148j529
$$ y = [690, -833, 73, -196, -141, 290, -1029, 1299, -1555, 1387, -1129, 855, 225, -529, 1760, -1469, 1745, -1087, 979, -161, -335, 345, -780, 474, -1581, 473, -1643, 162, -1169, -506, -383, -1653, 989, -2290, 1364, -1432, 25, 148, -1174, 925, -1429, 1150, -1045, 823, -550, 417, -115, -143, 740, -1107, 1757, -1530, 1522, -745, 373, 918, -917, 2042, -1194, 1725, -274, 1202, 566, 314, 1082, -71, 1575, -676, 1590, -834, 1135, -177, 41, 831, -1760, 1578, -1856, 758, -1107, -576, -41, -1248, 667, -1286, 733, -1492, 679, -899, 81, -65, -687, 971, -1619, 1652, -1644, 899, -507, -577, 686, -1516, 1049, -1576, 706, -915, -114, -511, -504, 41, -1198, 1071, -1409, 1595, -1140, 861, -9, -534, 1534, -1238, 1989, -879, 1055, -51, 83, 662, -449, 963, -865, 847, -1223, 925, -604]
2382f04P49K27j578K694l039K879k286J549r8o29J568j976J899j794J594j266
2398a11J067p47n0R29j767K481k954K526k133J066J22j470K152k359K233k164
2414a179J617n10J14K88r12J380k109K389k419K324j507L50Q18k104K830k796
2430a426K331j518P66K36q71J271j715J924j851J731j482J114m54o56J365k184
2446a419K895k807J995j038Q3P82j709K327k167J820j181Q24m70K50L35j019J767
2463A268k198K301k239J964j223j27J243k364K704k984K408j461L52K00p05J324
2479D63j696J877j890J605j599J239j95j187K422k831K755k273J569l03n05J127
2495E78j962K077j709J640j523J014q58K93N34j354K390k786K659k129J075J53
$$ y = [-604, 145, 372, -1206, 1488, -1551, 1328, -958, 591, 493, -136, 1432, -544, 1355, -439, 1155, -111, 956, 209, 159, 1088, -679, 1802, -1152, 1374, -759, 307, 429, -1041, 1111, -1248, 985, -1179, 438, -72, 42, 330, -582, 798, -1311, 1078, -1341, 983, -524, -174, 644, -1460, 1370, -1426, 905, -613, 153, 389, -482, 789, -926, 998, -853, 878, -604, 510, 56, -600, 765, -1419, 1476, -1331, 664, -374, -291, 491, -1218, 1109, -1058, 762, -419, 405, -65, 185, 520, -499, 1268, -930, 1371, -868, 1096, -127, -254, 989, -1375, 1329, -1655, 753, -708, -356, -156, -861, 463, -1233, 644, -1246, 359, -1240, -1, -196, -1383, 1039, -1792, 963, -1310, 259, -44, -549, 578, -1384, 693, -1016, 624, -899, 115, -743, -450, 84, -1270, 1120, -1666, 993, -1136, -61, 92]
2511I2j099K055k360K513j849J307q41L33J95o40J349j766K206j944J934j439
2527D6M5R04k003L024k708K296k183Q83M12j043J251j518J524j799J775j602J218
2544E22o62k69J337k212K895k662J808j023L52J083j845K159k152K205j890R94
2560F40p45L69L52q76R42j771K675l179J904r97m20J697k128K665k655J646j032
2577i13N90L25m09P82j090J905j620J770k021J049J89r02J374k835L071k027J378
2594F16p25o99J298j817J988j575J270j193O97j09J87N21j100K074k632K695k021
2611e25J734o00o08J537k350K149j617R68n78K78k3q04Q55j443J822k247K114
2628F62j303M09N83j301K777l243K511k285J836n17j202J016M89K46k199K305
$$ y = [92, -1007, 1048, -1312, 1201, -648, 659, -182, 151, 346, -294, 1055, -711, 1495, -449, 1485, 46, 91, 995, -1008, 2016, -692, 1604, -579, 304, 716, -327, 924, -594, 930, -869, 906, -696, 522, -140, -409, 928, -1284, 1611, -1051, 757, -266, 86, 1169, -676, 1483, -669, 1536, -354, 640, -105, 264, 616, -260, 682, -1089, 1586, -1593, 311, -686, -1106, 591, -1537, 1128, -1527, 119, -913, -323, 2, -407, 375, -715, 1190, -430, 1340, -681, 368, 557, -345, 1029, -1806, 1265, -762, 616, -109, -808, 490, -1327, 661, -914, 356, -837, -140, -249, -62, 459, -641, 1433, -1199, 1496, -525, 1209, 609, 1, 1538, -812, 1337, -280, 688, 110, 388, 365, -439, 416, -1027, 795, -1452, 662, -641, -232, 351, -950, 1827, -1416, 1095, -1190, 646, 129, -1073, -57, 432, 678, -1521, 784]
2644G84j927J431o73k27K45j241K553j960J805j460P26k1p55J279j369J754j681
2661g37J234o73N2K77j078J829j906K296j982J751j170j88J312k045K592k049
2677d85J357j021O13j14p29R66j218J632j957J772j569J226l79r52K004k298K293
2694A141j985J424o81k2P00j110J516j539J344j402J264j129P08M28j407J846
2710A096k380K540k251J220j56r90J592j846J836j847J718j023L99j18j42O52
2726C00j360J931k178J988j247O58J56j359J953k118K026j779J338m31k90P88
2742C76q60J219j691J784j559J517q94O3Q84j418K080k158K076j424N79J32j135
2759d29J551j800J561j501J178r51N87k70n86J605k260K291j889J797j144N1R32
$$ y = [784, -1143, 288, -385, -612, -367, -1608, 945, -1015, 790, -670, 56, 35, -720, 559, -810, 944, -737, 497, -176, -124, 153, -925, 904, -1002, 1294, -688, 1063, -107, -295, 1017, -1028, 1564, -485, 872, -149, 464, 350, -379, 587, -631, 1001, -956, 816, -753, 473, 94, -858, 1146, -1152, 1141, -844, 580, -101, -123, 577, -533, 983, -556, 788, -614, 650, -479, 229, 657, -750, 1096, -1284, 1256, -995, 225, 69, -921, 671, -1175, 661, -1186, 532, -491, -92, -210, -352, 300, -1060, 871, -1307, 681, -566, 92, 248, -1111, 842, -1276, 750, -1029, 309, -122, -412, 376, -484, 735, -956, 828, -731, 786, -108, -45, 839, -579, 1501, -657, 1419, -5, 574, 706, -429, 1122, -678, 883, -618, 560, -391, 196, -74, -660, 945, -1315, 976, -913, 884, -260, -209, 723]
2776G23j531J821j894J857j137P97m00l56N87j191J457j980J913j702J157n73
2792d52o24J813k352K593k536J893o50M3P10j254J488j499J716j512J219o89J74
2809H1K09j101J888k456K256j946J338j21o51J271j909J885j478J361j152P34
2825B09Lm79Q82j233K104k562K381j418O63J44j172J879k154K000j675J303q86
2842a1q0N98o59J161j815J790j892J504r17P6Q26j520K311k594J865j238P79L87
2860E71j302J400j619J739j735J587j219Q28k25n88J311k008K423k431J951j041
2876c58J00O71j477J932k014J994j626Q11m10mO31j105J643j808K076j882J092
2893B66j91l72J554k284K229k010J795r61J14N32q85R95j369J788j821J518j408
$$ y = [723, -808, 1013, -881, 976, -161, 636, 236, -120, 467, -724, 733, -1247, 666, -1036, 121, -452, -1076, 737, -1615, 978, -1558, 335, -315, -272, 438, -816, 672, -827, 889, -623, 596, -93, 81, 290, -811, 1077, -1379, 877, -1069, 269, 148, -503, 768, -1141, 744, -734, 627, -525, 209, 212, -267, 615, -618, 1486, -1076, 1305, -113, 550, 694, -478, 1401, -753, 1247, -428, 875, -11, -91, 507, -152, 1009, -806, 984, -908, 596, -321, -245, 581, -939, 1372, -1222, 643, -595, 184, 571, -731, 669, -950, 789, -946, 641, -578, 250, 25, -563, 748, -1260, 1163, -1268, 683, -358, -258, 413, -1064, 868, -1146, 848, -778, 33, -377, -381, 250, -855, 788, -1020, 1056, -826, 266, 75, -297, 1257, -1027, 1202, -808, 987, 26, 140, 672, -213, 782, -587, 1201, -620, 898, -510]
2910e10Q66J8r13J636k374K316k064J416k79n05J334j709J571j387J491j318R52
2927E41n99j8P75j394J997k371K076j929J120l40m38J391k320K180j530O78j45
2944c26l86R46q17J186j158J105k066K152j016m8Q86j607K183k228J965j257N76
2961I0J31r27J616j662J127j108R52m92L57K01j97N28j292J675j752J547q92K1
2979g7N48j118J600j607J422p20L57L28j7L13k479K051p25R53j849K162j374n76
2997h08K349k755K489l132K982j244l29M00j70O22j270J616k220J615p29J010
3013D26m13j348K137j720J717k017K192j003l63P90r98J576j891J959j111R28
3029H61j187L3M52j369K159k429K519j538J78P55j101J288j285J916k123J391
$$ y = [-510, 356, 374, -539, 1097, -1277, 1039, -1025, 391, 112, -393, 941, -768, 803, -584, 907, -411, 541, -58, -76, 699, -695, 1302, -1069, 1007, -922, 198, -142, -580, 811, -1509, 671, -859, -181, -326, -712, 234, -583, 603, -555, 550, -1516, 636, -380, -428, 458, -1149, 1034, -1194, 771, -486, 90, 221, -706, 910, -752, 375, -733, 219, -273, 84, 285, 88, 616, -676, 999, -753, 794, -98, -77, 471, -647, 953, -654, 768, 48, 405, 733, 716, 1029, -1450, 601, -124, 829, -1020, 1142, -232, -808, 1541, -1214, 1275, -1857, 1125, -119, -448, -48, -218, 404, -866, 750, -1470, 145, -584, 426, 13, -1335, 802, -918, 799, -1218, 974, -29, -392, 398, -600, 976, -915, 1044, -67, 861, -326, -293, 159, -1210, 949, -1480, 1039, -499, -321, 434, -667, 621, -664, 1252, -871, 520]
3045E20j312J215J13p13P08r09J742j762J438j203L89M78j452J820k107J938j300
3062c97Q38m53j66O15j399J672j498J359j019R29n24j09R12j509K427k472J807
3079A013j216L64j9r35J274j860J806j412J071n54O53m12j53J415j930J358j587
3096a124J110m05l58K007k723K171j913J621q05N35J31p87J216j223J333j476
3112f90J450j145P34j30q42J524k017K268j930J491p12k84P79j058J479j607J382
3129F92q87R52p31m1L53q67J774k085J795j632J040Rq73J180j467J585j420J051
3147D28p94K37M54q02J017j549J819j564J412j012L64M41j332J543j598J638j371
3164f69Q87k72k27M84q60J247j588J485j193Q93k91m90J172j259J621k001J717
$$ y = [520, -792, 423, 536, -177, 531, -378, 1364, -398, 1040, -163, 226, 704, -748, 1072, -1035, 903, -397, 441, -12, -178, 437, -962, 710, -788, 571, -448, 481, -43, -152, 760, -749, 1678, -794, 1013, -203, 161, 142, -793, 481, -1379, 427, -985, 86, -468, 185, -227, -380, 1035, -895, 463, -1124, -14, -419, -777, 1230, -1493, 678, -1235, 386, -419, 116, 247, -540, 676, -547, 786, -690, 760, -385, 349, 219, -623, 901, -1116, 1152, -778, 713, 1, -283, 496, -562, 917, -690, 692, -195, 757, 26, -15, 338, -529, 1245, -840, 955, -677, 363, 372, -501, 679, -788, 797, -623, 428, -366, -129, 325, -477, 540, -1009, 810, -754, 658, -354, 10, 451, -881, 662, -936, 702, -669, 218, -54, -281, 203, -657, 590, -998, 487, -706, 187, -104, -594, 578, -681, 940, -1061, 656]
3181F56j154L30N36j002J287j519J214r57J076p47P00k1r29J277j477J525j592
3198g97J393r17K60N42j636J614j190J050j114N42J85NJ190j793J388j017J435
3215A140j633J138L15j313p2o05J915j654J541j093L52P7j031J180q22R97r56
3232e24K48o46M38Qn64J148j491J665j056N63K53n98Q86j502J994j676J202q82
3250e34J33L50n37R18r95J336j577J513j530P94M21r12J324j285J507j003K39
3267A62K80j117J693j083R28j657J692j315Q43o61K90P71j656K080k080J552p42
3284b0J27L26n51O49j097J556j524R00r54J081m91J0Q58j704K133k374J947j119
3302b47P29j10q91J455j663J374j054M27J38k89J39m78J843j963J177j696J494
$$ y = [656, -498, -168, 368, -634, 653, -866, 348, -609, 467, -280, 420, 399, -530, 747, -730, 795, -797, 596, -321, -61, 481, -1155, 459, -731, 319, -795, -253, -68, -63, 1127, -666, 722, -295, 1140, -493, 645, 960, -353, -425, -1030, 885, -769, 772, -321, 31, 108, -923, 257, -565, 432, -524, -276, -922, -484, -476, -1040, 108, -1383, 282, -774, -211, 42, -556, 330, -1172, 822, -854, 348, -534, -401, -51, -588, 330, -665, 671, -906, 607, -923, -129, 292, -620, 704, -581, 926, -77, 162, 442, -675, 1018, -65, 863, -794, 898, -417, 426, -235, 55, 826, -830, 1250, -830, 722, -20, 107, 433, -118, 531, -566, 990, -534, 366, -588, 493, 2, 12, 870, -834, 1299, -1075, 872, -247, 482, 372, -519, 936, -727, 647, -407, 20, 158, -131, 8, -470, 1373, -590, 587, -1109, 385]
3319C85n35J57M44j163J081j471J862r80j2J46m24J220j486J546j370R49o01J64
3337h8N08j113J659j830J753j505J151k82n07R80j453J352j361J138p01O82m06
3354b3k83P92j185J574j705J669j114L70J36j076J673j607J427j508J112n01M2
3371b07L66o65J011j269J533j635J098o54J54M68j162J666j705J603j036L97M1
3388Dn64Q71j204J163j284J377r03M27J16o20J062j232J204j399J467q53Q5O47
3406C64r98J546j752J406q11N74r3l99M20p43J192j460J364j131R90l59m51R69
3424F28j165J615j398J258q87M49P8p37J025j041J033j192J266q41L00L1n39J175
3442A058j921K004j835J131m02l19P92j374J462j261J039n52N60l25j09K37n92
$$ y = [385, -150, 7, 451, -712, 369, -1102, 760, -220, -232, -86, -510, 710, -776, 770, -600, 349, -252, -88, 420, -693, 966, -864, 889, -616, 535, 253, -254, 726, -727, 625, -736, 402, -299, 383, -23, -306, 486, -699, 875, -830, 839, -275, 95, 231, -845, 828, -779, 648, -860, 252, -249, -207, 159, -506, 505, -764, 769, -866, 232, -422, -268, 200, -962, 704, -1001, 602, -434, -37, 4, -560, 311, -893, 270, -1014, 363, -540, -113, 3, -617, 445, -787, 417, -982, 485, -368, -283, 364, -634, 912, -840, 566, -245, 329, 236, -163, 257, -486, 706, -754, 610, -521, 469, 110, -341, 628, -537, 1078, -320, 938, 51, 500, 578, -159, 866, -175, 858, -334, 932, 91, 391, 422, -117, 1058, -863, 1141, -694, 437, 35, -284, 508, -866, 596, -665, 374, -178, 382, 57, -52, 185, -407]
3459d07J520j808J502j323Q43j52o60J012j469J718j744J102n19M3L64n62O32
3476I2r45J330j344J092o43J45O60j083J564j659J517j216O94rn40Q46j063J030
3494D68j103R88q10O88k39n93J098j139J514j764J392p07K87K55p20J432j548
3511e01J393j279O64m99J87N14n94P96j406J327j102Q40m17k84Q87j250J042q93
3529e75Q89o34L08p8k79Q56j233J302j177J004p16K40R5n38R61j225J314j274
3547g60R17l29k09N66j026J407j273J054q65Q08k93l03P15q49J069j337J526r80
3565a62M22j09m43R47j356J364j159Q96n35K08L15n43M08p12J126j161J082o54
3583f6J31L61r44J249j262J306j076O65k82R3K17j016J252j182Q55r10J040n29
$$ y = [-407, 1113, -695, 807, -516, 327, 175, -485, 527, -942, 776, -968, 134, -385, -342, 22, -540, 92, -853, 477, -867, 225, -418, -273, 387, -696, 868, -791, 726, -490, 204, 195, -345, 501, -562, 468, -635, 353, -457, 231, -8, -601, 497, -642, 872, -892, 500, -207, 80, 335, -385, 1047, -501, 892, -387, 277, -222, -35, 479, -115, 681, -725, 602, -500, 340, -77, -361, 526, -724, 318, -575, 314, -320, -12, -90, -369, 487, -746, 556, -621, 383, -333, -93, 2, -536, 425, -800, 514, -760, 157, -172, -381, 185, -841, 566, -707, 347, -518, 290, -3, -306, 409, -440, 629, -708, 818, -162, 260, 151, -292, 655, -701, 663, -496, 400, -135, 73, 388, -155, 253, -459, 667, -494, 588, -66, 65, 426, -518, 731, -531, 775, -301, 364, 82, 175, 392, -624, 628, -554, 301, -609, 431, -98]
3601i8q5O27j119J638j614J171r00K98L95q39J042j342J219j095P92l65K10K86
3619B21q57J101j072J320j521J111n51j76R41j280J587j397R79p66M53J24m15
3636a98O71q80P88j043J283r88M76k35k16Q81j099J361j227J092m79l37N23p69
3654c96R38r44J010r22P50n25L15J83p72J088j353J284r61O22j07n57Q03j006
3672e50R77p57N23m24O6L39m95Q50j042J008j179J109q12K71L60q70R16j211J429
3691E08j136P73j11n00P50n36P20j027J026r78O37j62l35N87r50J730j417J053
3709F32o00J7L12n78J026j323J065q80M83l6j70K81n58J041j320J522j315J071
3727F70p29J09O11j030J296j378Q14o22N61j65l14N19o27J073j097J072j209J071
$$ y = [-98, -183, 444, -675, 963, -651, 520, -380, -82, 313, -526, 516, -826, 393, -702, 90, -275, -65, 221, -636, 465, -607, 713, -808, 303, -248, -424, 517, -763, 824, -573, 406, -360, 93, 217, -198, 473, -407, 381, -662, 621, -367, 109, -126, -342, 539, -560, 801, -426, 666, 187, -150, 373, -396, 542, -402, 608, -314, 436, -89, 226, 409, -363, 725, -628, 656, -305, 317, 210, -347, 456, -550, 427, -330, 193, -231, -165, 174, -321, 529, -513, 495, -684, 425, -387, -116, 244, -626, 290, -921, 508, -628, 145, 34, -466, 284, -252, 468, -559, 467, -511, 126, -36, -371, 216, -734, 996, -421, 632, 32, 49, 361, -217, 809, -514, 551, -329, 154, 118, -52, 229, -329, 712, -608, 914, -401, 670, -59, 50, 661, -369, 927, -451, 363, -259, 302, 137, -177, 342, -285, 788, -309, 763, -446, 625]
3745F25n44k05O24j139J446j428J108n33j64M49q78J203r75P32q05Q70q65L16
3763a63M31r61Q94r56J186q24L71k93r4P87j205J454j266J011o45J35R5k32N65
3782B90r54J183j234R23n93L95K6o91J119j246J364j244Q14j88j38R33j313R29
3800C75p31J001r87O27n09J23N33q36J256j606J091o12L33n8m55J123j205J047
3818E10r31Q33o18K74K88p61J017j093J092j097R61l98N9L56j120J142j174J049
3836C89p93O10l43PL01q58J232j118R57j205J057m7j044J055j085J652q20M11
3854C58m39J35N05l86K75j421J106p6K22o12k12P16j056J835j069J713j341P06
3872I59j326q49J777q31J142j274J225j254J102l55o84R13j267J152q45J078r15
$$ y = [625, 81, -124, 500, -639, 807, -621, 487, -46, -210, 239, -639, 564, -411, 321, -484, 386, -479, -163, 268, -693, 201, -755, 431, -393, -22, -315, -409, 378, -827, 627, -639, 372, -273, -138, -43, -275, 290, -664, 519, -715, 208, -385, 10, 36, -655, 464, -782, 582, -662, 152, -36, -174, 759, -554, 375, -356, 645, -342, 285, -224, -101, 432, -404, 852, -754, 337, -275, 58, 0, -455, 668, -537, 510, -421, 412, -206, 68, 356, -405, 612, -481, 611, -486, 475, 77, 136, 492, -628, 514, -660, 389, -404, 206, -137, -130, 171, -687, 545, -573, 384, -821, 236, 189, -855, 200, -885, 767, -53, 358, -81, 54, 559, 173, 448, -973, 133, 57, 279, -333, -545, 171, -885, 950, -119, 1594, 253, 959, -367, -1216, 561, -270, 872, -402, 823, -431, 671, 316, -368, 545, -722, 430, -415, 663, -252]
3889b52J37K57o38J058j135J057q21O83l57j93K99l79P19r71J039j175Q90m51
3907b33n0M77r13J419j413J111p16K63L0n77N45n69J080j177Q54m47K70J59l00
3926a87N40j048J186j115J079o77K41K07r11J176j033J102r03N27j33r2J38n92
3944d95J293j167R54q23O01k62j63O62j001R60j254J163n48Q5L55n18Q10j086
3962d34J060j075P04o16M16N6l08R50j583J494q85N72m32RM20r19J194j392J162
3981C93r24O60m40kM42p35J242j393J181r53L72J52n20J088j048J038j158P03
3999I8j34n8n2j97O50q11J126j121N78m2k34M41j048J383j090R26o19J36J6p3
4019a25N84j133J109j051J130o47K16j31N7N96j033J308j152O47o85L02L60o47
$$ y = [-252, -115, 142, -496, 562, -573, 484, -337, 346, -11, -204, 95, -284, 435, -536, 503, -672, 218, -233, -283, 194, -719, 700, -713, 398, -318, -55, -25, -602, -57, -626, 454, -723, 131, -316, -46, 113, -187, 353, -695, 491, -624, 455, -222, 19, 226, -685, 491, -542, 560, -343, 184, 51, -41, 97, -495, 798, -369, 585, -238, 363, 101, -62, 600, -401, 559, -695, 468, -80, 5, 360, -158, 652, -434, 626, -449, 255, -361, 55, 111, -197, 753, -830, 664, -221, 351, -81, -72, 348, -571, 623, -769, 393, -531, 129, -311, -313, 129, -606, 636, -757, 424, -529, -157, -5, -525, 563, -485, 553, -605, 98, -36, -94, -146, -343, 307, -504, 622, -499, 79, 37, -197, 244, -804, 579, -511, 415, -204, -68, -52, -125, 459, -674, 435, -616, 514, -133, 83, -48, 9, 605, -428, 880, -272, 375, -310, -8, 352, -295]
4037b95J138j287P98q79J246j097J58J95n77P64p40Q68p70O55j37o1L28r47J109
4056D69r32Q77m01j7J85n36R05j146J001p82Q49o22J88R8n96P51j091J432j259
4075f27Q33l69O3K34n48N97q76J122r55O81l72p5N15m34P52j137J126p60M78k3
4095B25n75Q26r29J065r69O24m23K98K96r92J195j225J387j262Q66o84L41L77
4113D41o39P20q21P79p08N12q2m63N89q05P14p37Q76o29M78o3m03L07o31R16j095
4134g44J190r07M13L11q38Q37r01J172q97M79j10k0J3n3M63j145R93n66P15o49
4154b44%O25j129J334j192R27o87L38K16l45M13p93R88j050J313p75L18j38m37
4173c18O04p52J100r14O58n10J81K51p16J000q10Q32p88K76j86K16K02n99R85
$$ y = [-295, 843, -444, 354, -525, 721, -376, -218, -23, -600, 164, -576, 292, -478, 177, 40, -21, 307, -640, 469, -463, 414, 13, -4, 181, -355, 550, -596, 405, -377, 472, -150, 38, 136, -460, 291, -800, 632, -627, 206, -163, -100, 134, -414, 183, -693, 429, -526, 155, -217, -292, 223, -211, 541, -596, 530, -230, 248, 225, -350, 476, -453, 612, -357, 267, -156, 142, 438, -554, 641, -584, 803, -459, 407, -277, 64, 441, -198, 522, -299, 480, -228, 284, 202, -261, 328, -477, 237, -500, 376, -253, 225, 162, -241, 66, -565, 351, -744, 446, -461, -48, 263, -575, 262, -639, 533, -364, 115, 5, -15, -2, -55, 408, -737, 256, -310, 405, -244, -244, 381, -748, 586, -606, 321, -366, -28, 188, -157, 256, -537, 451, -599, 714, -61, 257, 119, -318, 286, -466, 634, -280, 378, -132, 49, 300, -416, 584, -226, 606, -182, 94, -92, 124, 326, -273, 712]
4192G12j247J140r04L50k50L3M71q00Q89r25R71q65M54j16m73Q95o52K80n66P34
4212A31o13N14J80o86R89j157J047p81N43l67q1M94o38Q54j058J037r72M28L19
4231A83j21L43o50j40n50J553p22O15n16O7M25j027J98J77J54Q2k99J48o4R17
4251G73j191R27r64P66k65J53L63p67O97p62Q20p79O30l30J63K66q90P77p95Q64
4271D56n79J70m2k92P46r64R82p15O72q55M26K77p11P42j090J280o76K58m18J81
4291a52J99p31Q52r05J148j173Q68l4j39M77o03M88j019J440j223O34k06j26N05
4310C00q87J040q19Q15o52M45q6l94P43q18Q70j011P42l39J66Q6l13P13o68N10
4330D43p12O64m57J47L91r23R46j080J147p59L71l06L8O12p64Q34j198O31k19
$$ y = [712, -535, 605, -299, 51, -199, -166, 305, -495, 394, -531, 440, -425, 29, -87, -560, 335, -317, -37, -603, 131, -482, 32, 212, -474, 515, -642, 405, -376, 167, -200, -281, 213, -425, 429, -629, 408, -564, -136, 183, 62, 405, -245, -385, -935, 618, -104, 511, -5, 62, 487, -540, -342, -165, -11, 71, -228, -80, -144, 773, -418, 509, -455, 311, 46, 199, 562, -205, 492, -270, 550, -229, 401, 71, 234, 500, -390, 387, -408, 456, -123, 47, 5, -287, 459, -505, 477, -238, 434, -421, 5, 282, -429, 313, -777, 503, -173, 85, -333, -152, 47, -684, 168, -737, 411, -762, 106, 72, -67, 410, -193, 295, -724, 716, -507, 127, -79, -205, 300, -587, 453, -366, 449, -203, 242, 156, -238, 505, -313, 557, -454, 288, -51, 115, 201, -112, 601, -67, 443, -269, 395, -62, 85, 476, -447, 499, -581, 566, -193, 178, -128, -90, 522, -242, 592, -606, 25, -194]
4349a94L07n42K73N95j108J066o65N73J69j07Q4j033L39m00R20p05L10j57K18
4368e7K14n07P37q81O81m07M58k83m11J178j365Q31p60P56l61J12L50m84N65o04
4388b38Q41r80P00n15O4L51m44O12q61J074q27N07l08K28J85p07P63r18J043p79
4408b09K62Pn4N08q07O71p00P38o89M11p8k24O86q29P60n97M18m48R4j0o7M07
4430B50n02O88r54L34J51k05M97m56N68q37Q38r82O03r3l96R34p74P30r94Q55
4450B55p02L34l9j19M47n55R38j063Q43o33L39M7l99O92q16Q95o37N09o86K94
4470e6M39m06O72j032P19m94P70l31m34M14p11R45q90Q21l05NM7o50R50o68M47
4491B52m36O94p60L18K9j92M89r20Q52o64N86m12j09K91l92Q01q73O81m84K07
$$ y = [-194, 113, -429, -156, 439, -669, 397, -268, 305, 474, 367, 451, -582, -243, -643, 277, -428, -118, -275, -57, 157, -350, 387, -494, 187, -220, 238, -45, -456, 722, -643, 188, -572, 184, -177, -65, 285, -199, 366, -238, 603, -377, 323, -192, -128, 223, -221, 391, -470, 604, -223, 284, -24, 204, 389, -318, 445, -473, 570, -209, 53, 60, 6, 514, -293, 378, -322, 416, -273, 138, 60, -164, 522, -307, 453, -144, 274, -174, -80, -90, -157, 250, -252, 436, -518, -184, -33, -238, 259, -197, 371, -466, 372, -610, -7, -100, -496, 438, -336, 394, -600, 255, -447, -113, -152, -271, 176, -379, 559, -504, 339, -294, 45, 92, -307, 385, -431, 464, -173, 336, -350, -56, 383, -23, 649, -383, 336, -158, 612, 281, -153, 261, -450, 495, -395, 426, 121, 126, 173, -477, 473, -195, 252, -184, 510, -250, 68, 97, -95, 394, -526, 326, -338, 248, -164, -273, 18, -374, 427, -446, 235, -249, -42]
4511d2k08o0K30k71M42q75J101n34K97P3n98P76q83Q74o42L87l28K51M8l80R25
4532E83r31O78p48Q05m24RK95q08J092p52N80p08O92k64j13K63m20O32o64N73
4552C70m98J36l9R2M59q28P57n96N08m78J3O03q24O07o56O20p56Q73m70J58q9
4573c8m1L91o23M16m71L24n4k2L17o26R20r15O09n21K25N4l53O56o59P31r59R19
4595B80l74K22k5o05P30n80R31q69M61m89K02J01k75P73j019Q85n43K04k3N3K57
4616B97o14P09q33P66o25O09k06j37L03p31J083r19N20l94R4J55k84P66p14M83
4636C28p05Q63o04K1J00k17O07p49N73n26P19m51K0K38n50Q64j134Q71l80K88
4656A76m55QN10m81N92p14N59l89J04K6k86N69n29P72r75O02n7j24O1r9L27n52
$$ y = [-42, -250, -310, -80, -351, 91, -784, 317, -217, 80, 153, -445, 331, -552, 322, -320, 67, -261, -10, 38, -342, 583, -348, 330, -418, 387, -37, -28, 267, -541, 551, -201, 379, -329, 363, 99, -14, 249, -171, 461, -203, 370, -128, 8, -31, 61, 520, -308, 449, -147, 361, -117, -104, 499, -325, 282, -374, 246, -510, 363, -107, 51, -38, -79, 312, -311, 105, -366, -42, -96, -118, 199, -427, 493, -422, 187, -334, -109, -55, -408, 248, -411, 320, -639, 280, -94, 128, 103, -502, 228, -352, 579, -290, 171, -318, -116, -15, -290, 483, -536, 349, -194, 10, -13, 40, 297, -317, 392, -441, 325, -300, 309, 103, -34, 269, -462, 621, -298, 222, -172, -78, 77, -207, 559, -155, 328, -377, 486, -118, -97, 3, -214, 393, -356, 217, -309, 410, -41, -21, 217, -333, 531, -603, 268, -112, 176, -279, -271, 239, -242, 350, -364, 195, -194, -90, -64, -350, 219, -310, 462, -513, 89, 32, -92, -31, -130, 197, -355]
4678c55N96p73O89l41%L68m30Q21r47M47k88K87k1r0J99n36P11o00L89l65L83
4699A44Q7o16P39p18R30n93M93l86j38J78l39O26n64N15o29O49k86j22J01j49
4719g8N79q21P90p75L18j66n4M02n38O34o55M28n9OO5k86M87o69Q97r28L84K2
4741a7k40M21n69Q40q98P32q37O65m15J73L56m52N59q79Q77n25K75j06j67M16
4761B09l62P49r81O74n17L71j12k07M57o77Q40o71M67k38J17J34m89N42m91O25
4781D40q38L97m5L0K06k85M73q04O81o57N89J5k24K95n93M93n42N34n49L83J46
4802A45m78M19n82P08p06O07l36J40L36n51Q08q83O05p42P63l76L3k7l31O92n72
4823c28M89k60J61l88K53L95n44Q19j086Q06m90L02q1j96M52q76J019p18M91m17
$$ y = [-355, 241, -532, 157, -184, -184, 184, -246, 575, -372, 75, -213, 74, 53, -37, 162, -374, 337, -263, 126, -239, 144, 231, -385, 354, -364, 566, -27, 466, 80, -58, 120, -219, 407, -157, 358, -271, 378, 92, -30, 71, -78, 501, -320, 470, -305, 13, -153, -207, 195, -343, 291, -364, 64, 5, 11, 76, -210, 277, -392, 505, -423, -39, -17, -257, 164, -405, 435, -463, 269, -568, 97, -318, -145, 211, -241, 318, -561, 316, -209, 66, -40, -207, 209, -153, 596, -385, 289, -228, 143, 31, -176, 281, -396, 444, -227, 240, 2, 119, 253, -236, 306, -185, 440, -398, -1, -46, -16, 190, -95, 378, -426, 255, -402, 187, 202, -22, 273, -320, 173, -369, 165, -384, -1, 145, -333, 86, -496, 212, -494, 113, -223, -83, 253, -298, 510, -373, 232, -510, 253, -123, -90, -117, -448, 244, -328, 161, -99, 62, -326, -73, 322, -222, 597, -489, 317, -173, 129, 48, -148, 304, -572, 447, -271, 220, -197]
4843a97L93l0l34M04l91M57n99L89j81q6L64k87N96p46M08k71J69o5n3L75m51
4864a36N51r54J073q01L10L3l87O18o64O25n89M11l05M59J37o06M53n90O07p48
4884e03N68j85k62O14o91P26o75P36m62J64k69k1M24o42P29q50Q39m03K40O5o06
4905d64N70k46P12r40P45m34K75j16m04N13o54R31q87L75p6J02J69m02O96n82
$$ y = [-197, 196, 166, -168, 236, -155, 302, -297, 92, -89, -175, 189, -98, 498, -248, 160, -111, 58, -7, -60, 315, -136, 415, -539, 534, -267, 43, 76, -311, 307, -357, 268, -321, 90, -215, 244, 381, -225, 228, -362, 245, -503, 65, -120, -382, 232, -459, 267, -408, 328, -134, 30, -239, -260, 164, -478, 251, -599, 240, -163, 77, 142, -464, 106, -140, 572, -368, 377, -57, 218, 102, -302, 211, -443, 488, -399, -24, -100, 2, 171, -231, 465, -117]
$$ [...]
8191B6
##END NTUPLES=NMR FID
##END=
