##TITLE=1H_69-2026
 200.13Hz, CDCl3.
 8 sc
4.8.2026
##JCAMPDX= 6.0         $$ Bruker NMR JCAMP-DX V2.0
##DATA TYPE= NMR FID
##DATA CLASS= NTUPLES
##ORIGIN= UXNMR, Bruker Analytische Messtechnik GmbH
##OWNER= pz
$$ XWIN-NMR		Version 3.5
$$ Tue Aug  4 13:43:56 2026 Russian Standard Time (UT+4h)  she@DPX200
##.OBSERVE FREQUENCY= 200.1313
##.OBSERVE NUCLEUS= ^1H
##.DELAY= (6, 6)
##.ACQUISITION MODE= SIMULTANEOUS
##.ACQUISITION SCHEME= undefined
##.AVERAGES= 8
##.DIGITISER RES= 18
##SPECTROMETER/DATA SYSTEM= spect
##.PULSE SEQUENCE= zg30
##.SOLVENT NAME= CDCl3
##.SHIFT REFERENCE= (INTERNAL, CDCl3, 0, 14.3821)
##AUDIT TRAIL= $$ (NUMBER, WHEN, WHO, WHERE, WHAT)
$$ ##TITLE= Audit trail, XWIN-NMR		Version 3.5
$$ ##JCAMPDX= 5.01
$$ ##ORIGIN= Bruker BioSpin GmbH
$$ ##OWNER= she
$$ F:/spectra/data/she/nmr/H-C/1/audita.txt
$$ ##AUDIT TRAIL=  $$ (NUMBER, WHEN, WHO, WHERE, WHAT)
(   1,<2026-08-04 13:42:36.14 +0400>,<she>,<DPX200>,
      <created by zg, POWCHK disabled, PULCHK disabled
       configuration hash MD5:
       00 E9 B6 7A A2 85 ED C7 34 08 36 98 17 FE 4E 26
       data hash MD5: 16K
       BB 5F 7A CE 2D AB 1E 26 9A F4 DE 48 55 AF 18 7B>)
$$ ##END=
$$ 
$$ hash MD5
$$ BC 2E 66 84 DA 10 BC CD BF B6 AA 39 26 FA 36 AF
##$RELAX= 
##$RELAX= 
##$RELAX= 
##$RELAX= 
##$RELAX= 
##$RELAX= 
$$ Bruker specific parameters
$$ --------------------------
##$DU= <F:/spectra>
##$EXPNO= 1
##$NAME= <H-C>
##$PROCNO= 1
##$TYPE= <nmr>
##$USER= <she>
##$AMP= (0..31)
100 100 100 100 100 100 100 100 100 100 100 100 100 100 100 100 100 100 
100 100 100 100 100 100 100 100 100 100 100 100 100 100 
##$AQSEQ= 0
##$AQ_mod= 1
##$AUNM= <au_zg>
##$AUTOPOS= <>
##$BF1= 200.13
##$BF2= 200.13
##$BF3= 200.13
##$BF4= 200.13
##$BF5= 200.13
##$BF6= 200.13
##$BF7= 200.13
##$BF8= 200.13
##$BYTORDA= 1
##$CFDGTYP= 0
##$CFRGTYP= 5
##$CHEMSTR= <none>
##$CNST= (0..31)
1 1 145 1 1 1 1 1 1 1 1 1 1 1 1 1 1 1 1 1 1 1 1 1 1 1 1 1 1 1 1 1 
##$CPDPRG= <>
##$CPDPRG1= <>
##$CPDPRG2= <>
##$CPDPRG3= <>
##$CPDPRG4= <mlev>
##$CPDPRG5= <mlev>
##$CPDPRG6= <mlev>
##$CPDPRG7= <mlev>
##$CPDPRG8= <mlev>
##$CPDPRGB= <>
##$CPDPRGT= <>
##$D= (0..31)
0 0.7 0 0 0 0 0 0 0 0 0 0.03 0 0 0 0 0 0 0 0 0 0 0 0 0 0 0 0 0 0 0 0 
##$DATE= 1785836555
##$DBL= (0..7)
120 120 120 120 120 120 120 120 
##$DBP= (0..7)
150 150 150 150 150 150 150 150 
##$DBP07= 0
##$DBPNAM0= <>
##$DBPNAM1= <>
##$DBPNAM2= <>
##$DBPNAM3= <>
##$DBPNAM4= <>
##$DBPNAM5= <>
##$DBPNAM6= <>
##$DBPNAM7= <>
##$DBPOAL= (0..7)
0.5 0.5 0.5 0.5 0.5 0.5 0.5 0.5 
##$DBPOFFS= (0..7)
0 0 0 0 0 0 0 0 
##$DE= 6
##$DECBNUC= <off>
##$DECIM= 32
##$DECNUC= <off>
##$DECSTAT= 4
##$DIGMOD= 1
##$DIGTYP= 9
##$DL= (0..7)
0 120 120 120 120 120 120 120 
##$DP= (0..7)
150 150 150 150 150 150 150 150 
##$DP07= 0
##$DPNAME0= <>
##$DPNAME1= <>
##$DPNAME2= <>
##$DPNAME3= <>
##$DPNAME4= <>
##$DPNAME5= <>
##$DPNAME6= <>
##$DPNAME7= <>
##$DPOAL= (0..7)
0.5 0.5 0.5 0.5 0.5 0.5 0.5 0.5 
##$DPOFFS= (0..7)
0 0 0 0 0 0 0 0 
##$DQDMODE= 0
##$DR= 18
##$DS= 0
##$DSLIST= <SSSSSSSSSSSSSSS>
##$DSPFIRM= 0
$$ [...]
##$SUBNAM0= <"">
##$SUBNAM1= <"">
##$SUBNAM2= <"">
##$SUBNAM3= <"">
##$SUBNAM4= <"">
##$SUBNAM5= <"">
##$SUBNAM6= <"">
##$SUBNAM7= <"">
##$SUBNAM8= <"">
##$SUBNAM9= <"">
##$SW= 18.0517328524113
##$SWIBOX= (0..15)
0 0 2 0 0 0 0 0 0 0 0 0 0 0 0 0 
##$SW_h= 3612.71676300578
##$TD= 16384
##$TD0= 1
##$TE= 0
##$TE2= 300
##$TE3= 300
##$TEG= 300
##$TL= (0..7)
0 120 120 120 120 120 120 120 
##$TP= (0..7)
150 150 150 150 150 150 150 150 
##$TP07= 0
##$TPNAME0= <>
##$TPNAME1= <>
##$TPNAME2= <>
##$TPNAME3= <>
##$TPNAME4= <>
##$TPNAME5= <>
##$TPNAME6= <>
##$TPNAME7= <>
##$TPOAL= (0..7)
0.5 0.5 0.5 0.5 0.5 0.5 0.5 0.5 
##$TPOFFS= (0..7)
0 0 0 0 0 0 0 0 
##$TUNHIN= 0
##$TUNHOUT= 0
##$TUNXOUT= 0
##$USERA1= <user>
##$USERA2= <user>
##$USERA3= <user>
##$USERA4= <user>
##$USERA5= <user>
##$V9= 5
##$VALIST= <valist>
##$VCLIST= <CCCCCCCCCCCCCCC>
##$VD= 0
##$VDLIST= <DDDDDDDDDDDDDDD>
##$VPLIST= <PPPPPPPPPPPPPPP>
##$VTLIST= <TTTTTTTTTTTTTTT>
##$WBST= 1024
##$WBSW= 4
##$XGAIN= (0..3)
0 0 0 0 
##$XL= 0
##$YL= 0
##$YMAX_a= 817263
##$YMIN_a= -834408
##$ZGOPTNS= <>
##$ZL1= 120
##$ZL2= 120
##$ZL3= 120
##$ZL4= 120
##$ABSF1= 10
##$ABSF2= 0
##$ABSG= 5
##$ABSL= 3
##$ALPHA= 0
##$AQORDER= 0
##$ASSFAC= 0
##$ASSFACI= 0
##$ASSFACX= 0
##$ASSWID= 0
##$AUNMP= <proc_1d>
##$AZFE= 0.1
##$AZFW= 0.1
##$BCFW= 1
##$BC_mod= 2
##$BYTORDP= 1
##$COROFFS= 0
##$CY= -3
##$DATMOD= 1
##$DC= 2
##$DFILT= <>
##$DTYPP= 0
##$F1P= 0
##$F2P= 0
##$FCOR= 0.5
##$FTSIZE= 0
##$FT_mod= 4
##$GAMMA= 1
##$GB= 0.15
##$INTBC= 1
##$INTSCL= 1
##$ISEN= 128
##$LB= 0.25
##$LEV0= 0
##$LPBIN= 0
##$MAXI= 10000
##$MC2= 0
##$MEAN= 0
##$ME_mod= 0
##$MI= 1.114404
##$NCOEF= 0
##$NC_proc= 0
##$NLEV= 6
##$NOISF1= 3.799351
##$NOISF2= 2.8
##$NSP= 1
##$NTH_PI= 0
##$NZP= 0
##$OFFSET= 14.38212
##$PC= 1
##$PHC0= -4220.123
##$PHC1= 10.9923
##$PH_mod= 1
##$PKNL= yes
##$PPARMOD= 0
##$PSCAL= 0
##$PSIGN= 0
##$REVERSE= no
##$SF= 200.129724274929
##$SI= 16384
##$SIGF1= 3
##$SIGF2= 2
##$SINO= 400
##$SIOLD= 16384
##$SREGLST= <1H.CDCl3>
##$SSB= 0
##$STSI= 0
##$STSR= 0
##$SW_p= 3205.1282051282
##$SYMM= 0
##$S_DEV= 0
##$TDeff= 0
##$TDoff= 0
##$TI= <>
##$TILT= no
##$TM1= 0
##$TM2= 0
##$TOPLEV= 0
##$USERP1= <user>
##$USERP2= <user>
##$USERP3= <user>
##$USERP4= <user>
##$USERP5= <user>
##$WDW= 1
##$XDIM= 8192
##$YMAX_p= 0
##$YMIN_p= 0
$$ End of Bruker specific parameters
$$ ---------------------------------
##NTUPLES= NMR FID
##VAR_NAME=  TIME,          FID/REAL,        FID/IMAG
##SYMBOL=    X,             R,               I
##VAR_TYPE=  INDEPENDENT,   DEPENDENT,       DEPENDENT
##VAR_FORM=  AFFN,          ASDF,            ASDF
##VAR_DIM=   8192,          8192,            8192
##UNITS=     SECONDS,       ARBITRARY UNITS, ARBITRARY UNITS
##FACTOR=    0.0002768,     1,               1
##FIRST=     0,             0,               0
##LAST=      2.2672688,     0,               0
##MIN=       0,             -834408,         0
##MAX=       2.2672688,     817263,          0
$$ Real data points
##PAGE= N=1
##DATA TABLE= (X++(R..R)), XYDATA
0@%%%%%%%%%%%%Qj6J6j7K5m0M8n6O9q2J01j22J42j68K00k32K67l08L55m08M68
33B50n33O03o81P69q68R73j088J218j360J513j677J858k059K280k518K774l058
50a604L370l711M088m501M957n471O045o688P420q262R241j0385J1747j3403J5458
65H301j8059K1387k5545K9164j5557Q17572p13330p65207J095757p4669j046488
76f86674N65173Q06532r13282l31911J002822l8339q43390L57601M05006n89963
86b66425l7692P14908j06696n83248J41672L53531l07303k11368M59057R6328
96B52764m84711J82473M42106m54891l35801N48625L9248n38655L38378M70596
106D60132o07713j94444P19746k60301o41696O76622L17933q56558J48573P31106
$$ plain form
0 0 0 0 0 0 0 0 0 0 0 0 0 0 8 -8 8 -9 16 -24 24 -32 37 -45 56 -66 76 -92 108 -124 143 -165 190 -218 250
33 250 -283 320 -361 408 -460 513 -575 643 -717 796 -881 977 -1082 1198 -1320 1454 -1604
50 -1604 1766 -1945 2143 -2358 2599 -2872 3173 -3515 3905 -4357 4884 -5501 6246 -7157 8301
65 8301 -9758 11629 -13916 15248 -309 817263 103933 -661274 434483 359814 -686674
76 -686674 -121501 685031 -228251 -560162 442660 404321 -439069 -81468 323538 -266425
86 -266425 -304117 410791 304095 -279153 -137481 216050 -91253 -302621 156436 252764
96 252764 -231947 -49474 392632 -62259 -398060 150565 189813 -348842 -10464 460132
106 460132 -147581 -342025 377721 117420 -524276 152346 470279 -386279 -237706 493400
116D93400n80736l80711Q32689l9681q43572M16463O22505o70854k26839P45382
126C68046k16389o25865N39136L72920o55737j15327N94596o4364m19295K47021
136B4742K52238m70373j79733N76729Q1276n16650J36083M20025l44390k95674
146c15727M65654M9698n76022K48216O20351m45871l95792N40206o3768n68690
156d41745M51506M46918n87642j20792N74472k40933m85244M33027K11236m99881
166b59078J81332N12342m07765l34140M11847l1561l72476K90257L05865l07138
176a0515j18721K87032q6070l26449J69818K73150k03571r7127K79085l9634l21709
187a94711Q5549K50459j81477j50330L53398Q6802m23877N5912L25598l10353
$$ plain form
116 493400 -87336 -468047 364642 324961 -518611 -102148 520357 -150497 -377336 368046
126 368046 151657 -474208 64928 437848 -217889 -333216 261380 197016 -222279 24742
136 24742 276980 -193393 -373126 203603 284879 -231771 -95688 324337 -20053 -315727
146 -315727 149927 199625 -376397 -128181 492170 46299 -349493 190713 126945 -441745
156 -441745 9761 456679 -130963 -251755 322717 81784 -403460 29567 240803 -259078
166 -259078 -77746 434596 26831 -307309 104538 72977 -299499 -9242 296623 -10515
176 -10515 -129236 157796 71726 -254723 -84905 188245 -15326 -112453 166632 126998 -194711
187 -194711 -109162 141297 -40180 -190510 162888 249690 -174187 -118275 207323 -103030
197a03030j65743M82004r763m44441K22692L01635l97266j30847M38240j05122
207H8359l69851L51142K23216m65801q653L98850k05317k24062L30654M5692l43236
218a79007Q7101K83517j77442j76654K38735L8842k58916Q8133K09222j67590
228a4059j15923K05337M5540k13012j248J84035r8720j46295K38751J02235k81676
239i5035J9036K18585j94418j50165K79889O8102k48190R4191K11865k57174j68472
250b21786K97455K560k50309K21136J86773l02916o7722K29881j16815j70588
260a92331K34830J45824k12725k0343J77070j57623j81975K07807R9200j54437
270e4703P0736J46422j45752j51137J01442O3591j16890M5312J94978q0466j63827
$$ plain form
197 -103030 -268773 213231 203468 -240973 -18281 283354 -113912 -244759 193481 88359
207 88359 -281492 69650 292866 -172935 -181588 217262 11945 -212117 118537 164229 -179007
218 -179007 -91906 191611 14169 -162485 76250 115092 -143824 -55691 153531 -14059
228 -14059 -129982 75355 120895 -92117 -93365 90670 -8050 -154345 84406 186641 -95035
239 -95035 -75999 142586 -51832 -201997 77892 145994 -102196 -8005 203860 -53314 -221786
250 -221786 75669 78229 -172080 49056 235829 -67087 -134809 95072 -21743 -192331
260 -192331 42499 188323 -24402 -44745 132325 -25298 -207273 534 99734 -54703
270 -54703 16033 162455 16703 -134434 -32992 30599 -86291 -40979 153999 73533 -90294
281i0294J09164K5416j79960N7003J97951o1789j09713J16316J9300k08711K0787
292a04530K00636r6954r3605K07290k630k19941O8103J17555j45629l0393J95256
303I5158p757j67625P6491J01316j64968k6713J86169n7188j25337J24707M7280
314H1533j39022M177J15709m3306r2499Q5211N9716j25490k432J33070n5726q7125
326f6184R2016K3576j09040O466J07451k0892p8726Q0689M6443j46560j3275J27715
338D9679n9359n6803J34960K0698j30508M903P2020p9863n5407J40794M9982j15624
350b4528L9206O5784j44051m3479J32327j593n1742Q4200L8332j11037n7480O3661
362a0400j2071n0856J05603P5999r4856k8731L8447o6168m8382P3651O7787k0860
$$ plain form
281 -90294 18870 44286 -135674 -78671 119280 57491 -52222 64094 83394 -125317 -104530
292 -104530 96106 -848 -94453 112837 110207 -109734 -41631 75924 -69705 -100098 95158
303 95158 87401 -80224 -3733 97583 -67385 -94098 92071 34883 -90454 34253 81533
314 81533 -57489 -53312 62397 19091 -73408 11803 71519 -53971 -56403 76667 20941 -66184
326 -66184 25832 49408 -59632 -53166 54285 33393 -45333 35356 81799 -64761 -78036 49679
338 49679 -9680 -66483 68477 89175 -41333 -36430 35590 -44273 -99680 41114 91096 -24528
350 -24528 14678 80462 -63589 -107068 25259 23666 -28076 56124 94456 -16581 -74061 -10400
362 -10400 -22471 -73327 32276 108275 13419 -15312 23135 -43033 -91415 -17764 50023 29163
374B9163j1041M7934m7881j11685M4905P1182m7968L1620Q7626n8718q4905L1464
386a8304J7956o0593K1787J09597k2638p3317N9978j0575j13107M8305Q7111m8985
398b785l543O6429l0553p4531J9472M3740m0917o216P7939j8854o7518M0292J8331
411B1286n0360R980L7736q707k4530J2881L0648l6197k9961O3380O151o1373K5036
424d030K2452m9309J1179O7568j0718o7208R652L7650n1226q24Q3709l4867m8719
437c4691P9372k843r2784J1722L6104j8159K8995O4272k2941q3051k520L1783
449d741l1447J6325O2972j8889j8145K6138k8424m9938r663K9210N1571J5240
461D0209M36K400o2945m7434M1714K2739q980L8852L7503l5847n2347R434o098
$$ plain form
374 29163 18122 66056 18175 -93510 -48605 22577 -25391 6229 93855 35137 -49768 -18304
386 -18304 -348 -60941 -39154 70443 47805 -25512 34466 23891 -89216 -40911 46200 -2785
398 -2785 -6328 60101 29548 -44983 -25511 18229 -22688 -28904 49035 30181 -37337 2955 21286
411 21286 -29074 -19094 18642 9935 -14595 -1714 28934 -7263 -37224 26156 32307 -29066 -4030
424 -4030 18422 -30887 -19708 47860 37142 -30066 -20414 17236 -33990 -34814 48895 14028 -34691
437 -34691 44681 41838 -50946 -39224 -3120 -21279 7716 71988 49047 -34004 -36524 -4741
449 -4741 -36188 -19863 43109 24220 6075 32213 3789 -46149 -55812 -26602 24969 40209
461 40209 40645 43045 -19900 -67334 -25620 -2881 -11861 26991 64494 28647 -23700 -14266 -20364
474b0364m9154N6332Q2604n0704j5984M7973p0368n9699O3623K3169j7517M8039
486C7950K9610o5768m9379L4728M406k4217N0879K2820m7475J7309J8782n2142
498b2497j6255J5886J4219L5406Q358k1586k0536k6968J2337M1647k941k5281
510h211J090J5391k443n056J7888k5641m0341O0485L3464o9155P306L3891m9546
523c0878K2099O8159n0997o0545L9206K5513k6046K4821L7249n4849k8682N8503
535B3553k0374n0298M9008J9526k3759L3493q76n2436j2816P873J3378K6342J3484
548B6098K677j0702k6146k2866l135K3217J5549J3671L2278k6909n2047K3087
560e228r264m2986N7313M3403l3756K0999J1722p9185l3369N3630K3362n291M1927
$$ plain form
474 -20364 -69518 -13186 69418 18714 2730 50703 -19665 -79364 -15741 7428 -10089 37950
486 37950 67560 1792 -47587 -12859 -8453 -32670 18209 41029 -6446 10863 29645 -22497
498 -22497 -38752 -22866 -8647 26759 35117 13531 -7005 -33973 -21636 20011 17070 -8211
510 -8211 -7121 8270 5827 771 18659 -6982 -47323 13162 46626 -22529 -15223 18668 -30878
523 -30878 -8779 59380 8383 -52162 -12956 12557 -13489 11332 48581 -6268 -34950 23553
535 23553 3179 -47119 1889 21415 -2344 31149 30273 -22163 -34979 -27106 -13728 12614 26098
548 26098 28775 18073 -8073 -30939 -34074 -10857 4692 18363 50641 23732 -28315 -5228
560 -5228 -14492 -57478 -165 43238 9482 30481 42203 -36982 -70351 -16721 6641 1350 43277
573D3277R210p4445p035M4561m6921j3304P2520j937j5948L6887l6577o4784J3452
586d1044L3067J5881J8876M292k4962k3708P043J125r175J6689O313M631K8528
599C7556k5764l9906K1212p609r018N5389j902m9275J8673J3289l3496P698L2613
612A9460j9944k2423L8473M719m9376K5600L2902m7976R888M1523m6897j2542
624b6593M6148j4379j5239K9316l598l0467o68J1926r003N847L3540p077k3610
637c857P023j9870j4940L3375K406m75L2062j9048k8738J0774k0731j5134M1211
650D058K4555j0635J938k549m0802k2615L6506J1463j2055M6461Q390n9318L728
663a0875P088m2844K5112N2891r512l269J0320l1029l5874R263K3280N20J9964
$$ plain form
573 43277 52487 -21958 -28993 15568 -31353 -44657 27863 25926 9978 46865 10288 -54496 -41044
586 -41044 -7977 7904 26780 31072 6110 -17598 -10555 -9430 -18605 -1916 4397 9028 37556
599 37556 11792 -28114 -6902 -14511 -23529 31860 29958 -19317 -644 12645 -20851 -13153 19460
612 19460 -484 -22907 15566 20285 -29091 -3491 29411 -18565 -8677 32846 -14051 -26593
624 -26593 19555 5176 -10063 19253 15655 -14812 -15480 -3554 -12557 -6710 26830 19753 -3857
637 -3857 3166 -16704 -31644 1731 4137 3662 35724 16676 -12062 -1288 -22019 -37153 4058
650 4058 28613 17978 19916 17367 -23435 -46050 -9544 1919 -10136 36325 44715 -14603 -10875
663 -10875 -3787 -46631 -21519 31372 21860 18591 28911 -2118 -37992 -28729 -5449 -4929 15035
676A5035K9098l0144k8600Q055k3103k541M3599M095j758J6247k6459k3910O964
689a3422m854P066K6656R240j1526r029m225j9575o207L1161K166j1332K8853
702B4972j2341l8375K2729N628k3702K6507J5153k4891J715J3477j2628j1219
714a2975J5457P420j7642R362J3148k9933K264K9008j5861j329J4870k7224p360
727b0795K3764J17K725P995r403q887o66J102n679K94K0674M882m982N911k8233
742a1181k4093K5209Q099L771K8751j2630k7335N391p328j3089J3891J9276Q508
755A7240J711L197j9412l5195P826K0271k023K7883J6554l4367j0216k83k4362
768c1176Q826K7982P153O791J439j5116k1354r572J1293O765J1310K5117p813
$$ plain form
676 15035 44133 13989 -14611 -6556 -29659 -32200 11399 15494 13736 29983 3524 -20386 -13422
689 -13422 -18276 -11210 15446 24686 13160 4131 -94 -19669 -25876 5285 7451 -3881 24972
702 24972 12631 -25744 -3015 2613 -21089 5418 20571 -4320 -2605 10872 -1756 -12975
714 -12975 2482 9902 -7740 1622 14770 -15163 -12899 16109 248 -1081 13789 -13435 -20795
727 -20795 2969 3086 5811 13806 4403 -4484 -5150 -4048 -9727 -9433 11241 16123 11141 17052 -11181
742 -11181 -35274 -10065 -1966 1805 30556 17926 -9409 -4018 -11346 -24435 -10544 8732 17240
755 17240 18951 22148 2736 -32459 -24633 -4362 -6385 21498 38052 3685 -6531 -6814 -31176
768 -31176 -22350 5632 12785 19576 21015 5899 -15455 -25027 -13734 -6969 4341 29458 21645
781B1645j9406k162k2320o550K9640P549M158R785j9453j4514L297m158J921R684
795h84J0287N248o005k880j3039j6978J9311J5188p533J2268n646k4829J2222
808c270Q231j1990O579L491n949L688L123k705r353K567J4603o380m653P762j6524
823a0780j69K3943n274m576N281j6092m765R285L58O095N292n14k267j1688m776
838a0647q39j541J8694J0323o103M624j4770k1084R867L143L880K4550J342j4214
852G225n967j4001q199N981J3949J4850K30O91m010k7680o001J2771j802K0038
866H075K2553j5520j1498o829j7901K297J3930J1260J0079l82m400j3273j9223
879b0832L870P148N650K2238J042j4907j256j4536q110J5275L670P015J2582q952
$$ plain form
781 21645 2239 77 -22243 -28793 847 8396 12554 22339 2886 -11628 -8331 -12489 -10568 -884
795 -884 9403 14651 8646 5766 -7273 -24251 -4940 10248 2715 14983 9337 -15492 -3270
808 -3270 4961 -7029 -450 3041 -2908 780 3903 1198 -8155 -5588 9015 2635 -2018 5744 -10780
823 -10780 -10949 12994 7720 3144 8425 -7667 -12432 -3147 -2789 3306 8598 8084 5817 -5871 -10647
838 -10647 -11486 -13027 5667 15990 9887 14511 -259 -21343 -11476 -8333 -4453 20097 21439 7225
852 7225 1258 -12743 -20942 -14961 -1012 13838 14068 14759 10749 -16931 -22932 -10161 -11963 8075
866 8075 30628 15108 3610 -3219 -21120 -18823 -4893 6367 16446 16064 11664 -1609 -20832
879 -20832 -16962 -9814 -4164 18074 19116 4209 2953 -11583 -19693 -4418 -748 6267 18849 9897
893I897r704n210q031L582P331R202N024r900L4k122j5242R737R823r707J1493
908F207N284j6336J681L835m714M845L437n06m032m008O017k351l145J2211n492
923B933q924P745q645l020J5317j074K20M057j2277l755K526k213Q051O324K238
938I503J512j0688o543n596m787J8150J1211n150O569j0792k0755P860K088k728
952a0146J6735Q858k875l841j1722j0850o180J0145K2825K371j869j83k2528q833
966a8093J1002l651P897J7419k422j458o266j8028m240M731J1488J5620J638l723
980A1914r805j4205K394J011J253J8100J294p115N215j4857j2921J1562K306L045
994h09J2717k203p871n355l173Q34j132J0006R651j0562j16J994j4569O332J0766
$$ plain form
893 9897 193 -5017 -13048 -9466 -2135 7067 12091 2191 2225 103 -15139 -5402 4421 -5286 6207
908 6207 11491 -4845 -3164 671 -4043 802 4239 3733 -299 -4307 1710 -641 -3786 8425 2933
923 2933 -5991 1754 -6891 -9911 5406 4332 4552 8609 -3668 -7423 -4897 -7110 941 7265 9503
938 9503 11015 327 -6216 -11812 -16599 1551 12762 7612 14181 3389 -17366 -9506 -7418 -10146
952 -10146 6589 15447 12572 8731 -2991 -13841 -20021 -9876 12949 15320 13451 13268 -9260 -18093
966 -18093 -7091 -10742 -2845 14574 12152 10694 4428 -13600 -17840 -13109 -1621 13999 15637 11914
980 11914 2109 -12096 -9702 -8691 -7438 10662 11956 4841 10056 -4801 -17722 -6160 -3854 -809
994 -809 11908 9705 1834 -3521 -6694 -5860 -6992 3014 12665 2103 1987 3981 -10588 -4256 6510
1009F510r265L306M684q332K683Q58m605L415R94L211k99p656J279j42K216J2494
1025A1351n097r036L597r284N74J5090n182j047P954p609n568l04n111K243Q419
1040I90J0584K097j2339m443m983q984J5463J1095n594R129k034j7435o84k223
1054i361l278J3165R682K926k866j1874p267o502K592J5517M476L767M926j5994
1068i1r328K238p353R927J6626k463O99k104j5080n065J500M375Q908N567N076
1083A3432p087j4186J040k288k226J8117L638p277N649p692j1156N595L29J952
1097b160Q440P68j644n725n668J673j926N227Q257o907O02K568j0527M497O324
1112C799p161O004L049q867K539J189l147M255J282r2l084m585L781k665j26J1566
$$ plain form
1009 6510 -2755 551 5235 -3097 -414 444 -4161 -746 248 3459 3160 -4496 -3217 -3359 -1143 11351
1025 11351 6254 -2782 815 -8469 -7895 7195 2013 966 8920 1311 -4257 -4561 -9672 -7429 990
1040 990 11574 13671 1332 -3111 -8094 -17078 -1615 9480 3886 13015 10981 -6454 -7138 -9361
1054 -9361 -12639 526 10208 13134 10268 -1606 -8873 -15375 -12783 2734 7210 10977 15903 -91
1068 -91 -9419 -7181 -14534 -4607 12019 9556 10255 8151 -6929 -11994 -10494 -6119 2789 8356 13432
1083 13432 6345 -7841 -6801 -9089 -11315 6802 10440 3163 8812 1120 -10036 -4441 -4112 -2160
1097 -2160 6280 7048 5404 -321 -5989 -4316 -6242 -1015 7242 335 937 3505 -7022 -2525 3799
1112 3799 -3362 2642 5691 -3176 -637 552 -2595 1660 2942 2850 -234 -4819 -1038 -3703 -3829 7737
1128G737l516n748N529r353n203J1239k6K318P413n576n695l976l364L530L283
1143a408P355N486p731l004l775j1260O796Q624l81J0903P2j2960j997n719l753
1158a2752J1101P832M133Q17p953o007p248j169R937J876N190R000j0806q059
1172d108r7r991M231J5295J787K498j490j0523m338j310K633O712J426N828O07
1187I160j0058j421m045n160J1666N732k023M196p730p569M097o58K057N637q78
1202C003R07j938m031J043l194K490P043m650O27K184r062K537N620m949M100
1217A730K057o607R96k65k43M575R2J760k014o674K929M5j864Q882p33m215M175
1234D626o606n531M354j198N294P904l185k957o103n842L775L193N299N997m502
$$ plain form
1128 7737 4221 -1527 4002 -5351 -10554 685 659 2977 10390 4814 -881 -4857 -8221 -4691 -1408
1143 -1408 5947 11433 3702 698 -3077 -14337 -7541 1083 702 11605 11677 -1283 -3280 -8999 -12752
1158 -12752 -1651 6181 10314 11131 3178 -2829 -10077 -11246 -1309 567 5757 14757 3951 -4108
1172 -4108 -4205 -14196 -9965 5330 7117 9615 8125 -2398 -6736 -8046 -5413 1299 2725 8553 9160
1187 9160 -898 -2319 -6364 -11524 142 5874 3851 8047 317 -7252 -3155 -3813 -1756 3881 3003
1202 3003 3910 1972 -2059 -1016 -4210 -1720 5323 673 1300 3484 -5578 -3041 2579 -2370 1730
1217 1730 3787 -2820 -1824 -2089 -2332 2243 2335 4095 2081 -4593 -1664 -1619 -3483 5399 4666 451 4626
1234 4626 -1980 -7511 -3157 -4355 939 8843 5658 2701 -3402 -9244 -5469 -2276 3023 9020 4518
1249D518r85j716j0036J244L786K64J1057L377q178l603p215m290P387N155N345
1264F110K573n158j570o199n792N618K357M249J0387n212o883k287q091J766Q191
1279E9K214M924j47o401k347n090r28O537J474N110K447p126q42k745m598O623
1295h36L268q71N192l800n681R42k750J821M966q96J503j816l921K699k035k23
1311b438O041l315Q1L025n799M58L395k240L627M83m571K98k273M16M904r44J396
1328B544N68o167Q38m61k049O433K367j345K765n758m769J909j260M335O000j442
1344D508ml809o266O69m08L181P688p38k93j415r064p42L024R4P745L794l138
1361D826j237o352m120K122J169O085N023l165n53m868o983K618K210K714P548
$$ plain form
1249 4518 3533 1817 -8219 -6975 -3189 -2925 8132 11509 3331 -272 -7487 -11777 -4390 765 6110
1264 6110 8683 3525 1955 -4244 -10036 -4418 -2061 2188 12575 7363 480 -1807 -9898 -8132 59
1279 59 2273 7197 7050 649 -1698 -6788 -7716 -1179 295 5405 7852 726 -116 -2861 -7459 -836
1295 -836 2432 1561 6753 2953 -2728 -1786 -4536 -2715 2251 1355 2858 1042 -2879 -180 -2215 -2438
1311 -2438 3603 288 369 3394 -2405 -1947 1448 -792 2835 3318 -1253 -955 -3228 -2812 2092 1148 2544
1328 2544 3112 -3055 -2217 -2678 -4727 1706 4073 2728 5493 -265 -5034 -3125 -4385 -50 5950 4508
1344 4508 4504 695 -5571 -4902 -5310 -2129 5559 4821 4528 3113 -5951 -6693 -3669 -3575 4170 7964 4826
1361 4826 3589 -2763 -6883 -4761 -3592 2493 7516 4351 3798 -1070 -8053 -5435 -3225 -511 7037
1376G037j265l258j722o796J62L971J089N503J381l831l52n074k709L483Q30M350
1392B799L457m822j526j914m108M800K371q98L716k083k274R96l047N59K710n88
1408A48L316q77m652J657j483j01N066j746j785J104l612J202K478j633L171l60
1424A893k643J555k804j372M197j42K253J776m764j278j495k171M844K311j3K882
1440E029m339m190N48j908K963M911L9J945k175n209p5k276P47O721J189J160
1456E080L08p782k758L32J96O445K754j427Q11m496l485J038j890L406N935M2
1472D509O91k823o764l46O93K652N959o79j461l62n375l42J264q76M524K467j138
1489B593L92m351k945K100K43L273L476l163p76q45l167J808J019k60L024j412
$$ plain form
1376 7037 5772 2514 792 -6004 -5842 -1871 -782 4721 6102 2271 1919 -3155 -5864 -2381 -1551 2799
1392 2799 6256 1434 -92 -2006 -6114 -1314 1057 159 3875 1792 -482 514 -2533 -1974 736 148
1408 148 3464 2587 -2065 -408 -1891 -1992 3074 1328 -457 647 -2965 -1763 715 -918 2253 1893
1424 1893 -750 805 -1999 -3371 826 684 2937 4713 -51 -1329 -2824 -4995 -151 2160 2147 5029
1440 5029 690 -3500 -2952 -4860 -1897 3014 3053 4998 2823 -2386 -2461 -4737 -3990 2731 3920 5080
1456 5080 5388 -2394 -5152 -4820 -4624 1821 4575 3148 3959 -537 -4022 -2984 -4874 -1468 4467 4509
1472 4509 5200 2377 -4387 -4733 -4040 -1388 4571 3892 2431 2069 -3306 -3648 -2384 -3260 1264 3731 2593
1489 2593 2985 -1366 -4311 -2211 -1968 1305 4781 1618 842 -3 -3170 -1362 -343 -603 2421 1009
1505A009j116P23l513J222K313j216K102O90l555Q67l66n65L251m57k52L64l735
1522b234O45J460j041L367J12k764P20j830j647K759P2J532K767k695q28j715
1538a320l225L113K285J117K955k941k897p19k885K069L359m42L279M4m759m64
1554a431k529q24M491K447J558R01m128k166j432j354M327J982M84K638l470l634
1570b140J2k203J491M566N35J421j035m336p86j018M91M800O05L53N98m233j056
1587a935L57j405L655J670j032J461k775k788J449o39J026L237j115J07q88k214
1603a829J208k87M66L068j792j034J531l249M48K413j227J391M50k562J83m22
1619a244p8K335p13O90L56k912M32O20j358L334J120j814Q72k401k267K175j0
$$ plain form
1505 1009 -107 616 -2897 -1675 638 -578 1524 2214 -1341 -474 -840 -1405 1846 1389 1137 1501 -2234
1522 -2234 -1589 -129 -1170 2197 2309 -455 265 -1565 -3212 -453 -381 1151 3918 1223 395 -1320
1538 -1320 -4545 -1432 853 1970 4925 1984 -913 -1632 -4517 -2448 911 469 3748 3792 -967 -1431
1554 -1431 -3960 -4784 -293 2154 3712 4613 485 -1681 -3113 -4467 -140 1842 2326 4964 1494 -2140
1570 -2140 -2128 -4331 -2840 1726 2261 3682 2647 -1689 -2475 -3493 -3002 1798 2403 2756 3354 -879 -1935
1587 -1935 -1578 -2983 672 2342 1310 2771 -4 -2792 -1343 -1982 -956 2281 1166 1273 385 -1829
1603 -1829 -621 -908 -442 2626 834 -200 1331 -1918 -1470 943 -284 1107 1557 -1005 -822 -1244
1619 -1244 -1322 1013 300 990 1346 -1566 -1134 -514 -1872 1462 2582 768 1640 -761 -3028 -853 -863
1636h63J096K722j676o12j183k411R85O62J601K996j280q69q31m077Q15K997m22
1653c50K927J449l338q54j739j874K059J661K296J113k018j138j911k578K729
1668a566J610O74L277j484k738j67k732L14L354M88J476K18k972o37j201l66J970
1685d82N66J599J415l253p42k55k301L081K258j163J421q45k892J014k02N2J262
1702E33J80M87o77j921J331j192oK910q96r94J103j940k34K240j017Q07P28j663
1720b21K9m03m88J588k76Q08L81k265p4Q3j317K888Q46j420J832j841k621J504
1738i67M5L40K649J9l64j561j890L03m21R48L000p48j90L93l447r51K012q47K767
1757A090K182j748o57j479k037R71P54J796J594j012J02j500k896J224N83J97
$$ plain form
1636 -863 233 2955 1279 667 -516 -2927 -1942 -1280 321 3317 2037 1168 337 -3740 -2925 72 -350
1653 -350 2577 4026 688 -166 -1905 -3779 -1720 -59 2237 3350 1332 194 -1717 -4295 -1566
1668 -1566 44 718 3995 2511 -227 -394 -3126 -2812 542 1030 2506 2724 -248 -885 -2086 -2452 -482
1685 -482 84 1683 3098 -155 -897 -1152 -3453 -372 1886 723 2144 1299 -1593 -579 -781 -729 533
1702 533 713 1200 523 -1398 -67 -1259 -1265 1645 749 -245 858 -1082 -1316 924 -93 714 1442 -221
1720 -221 -192 -595 -1083 505 229 1037 1418 -847 -921 -838 -2155 733 1579 159 1991 150 -2471 -967
1738 -967 -922 -582 2067 2086 1722 161 -1729 -1426 -1847 -899 2101 1353 1163 1556 -1891 -2842 -830 -1677 1090
1757 1090 3272 1524 867 -612 -2649 -1678 -924 872 2466 1454 1556 56 -2840 -1616 -1033 -836
1773h36L274n20j895K62k221o45K052O16J125J028j141n80j632p11J479j88J503
1790I70J565k354k10J2k430J294J752q07J316L56k247K75k51J22J215q9R38o49
1808G78j687Q94n37o16K412n10j107J433j829q05J733l94O62N72r72n2p55k16
1826i96J143l13J225P37j992j48m6j723J782J350q87J530o30k286L09m76N3J886
1844E18N07Q55q83j605n58n28K59K594j4m7R56k465j463J171j011J026K214k65
1862A261L7j145j505l40m2J743J542l53M42o77k580N20L46m42K251P07j191O65
1880A239j439j738Q92L09J025J016m68j0j423j031J174n89J277J776j335n53M85
1897F07k169Q13J374j038P37O42p40l04r40J32Q14l2J231m26j446L84j28o80K156
$$ plain form
1773 -836 2438 1918 23 285 -1936 -2581 -529 87 1212 2240 1099 519 -1113 -1824 -345 -533 970
1790 970 2535 181 -29 -17 -2447 -1153 599 -208 1108 1464 -783 -508 -759 -637 578 489 1427 778
1808 778 -909 -15 -552 -1168 1244 734 -373 1060 -769 -1574 159 -235 427 999 27 -25 -780 -996
1826 -996 147 -166 1059 1796 -196 -344 -390 -2113 -331 1019 132 1662 1032 -1254 -945 -1421 -1368 518
1844 518 1025 1880 997 -608 -1166 -1694 -1435 1159 1145 1098 2054 -411 -1874 -703 -1714 -688 1526 1261
1862 1261 1298 153 -1352 -1692 -1734 9 1551 1198 1640 963 -1617 -1097 -751 -1193 1058 1765 574 1239
1880 1239 -200 -1938 -1046 -737 288 1304 836 826 -597 -1628 -454 -1043 234 2010 675 122 607
1897 607 -1562 -749 625 -413 324 966 226 -78 -1018 -886 -72 -104 1127 701 -745 -361 -489 -1169 987
1916I87j02j372J323j026q53J247o16J54R75k25o1j044p50Q95j64J266J010j700
1934e6K7q0j650J119J383r83J502J68j540l16n88j96Q90P19R04k45j128J99j629
1953a500o61K220M38N6J615j654j501N12r30N45J678Q2N63m33j271m76j114O78
1971a153J887m00J198k15k333J58j32p07J917J297j224Q62p10j329K91l00O93
1988b00J046p8M58j317j138R75q88M78J870r21o41J278j673j00J177q54P27P13
2006I12l53k92p59n7O77l86Q78M37j799O66J1j362J682K30n68J053q01j110R19
2025b2k58Q0Q46k9J08p70p60L51l31N84J741j081l6K10k042J61J296q55J294J087
2045A574j179l53p69l42N37J88J276N33r65R9r81j411J513L38n73K250o08j472
$$ plain form
1916 987 885 -487 836 -190 -1043 204 -412 -258 717 492 431 -613 -1363 -468 -632 634 1644 -56
1934 -56 -29 -109 -1759 -640 743 -240 1262 1430 -110 -426 -1014 -1210 -320 399 1303 1058 -70 129 -1500
1953 -1500 -2161 59 497 553 2168 514 -987 -475 -1405 -860 818 900 1463 1030 -241 -717 -1831 -1153
1971 -1153 734 334 1532 1317 -1016 -858 -990 -1697 220 1517 293 1155 445 -884 -593 -893 -200
1988 -200 846 768 1226 -91 -1229 -254 -1142 -664 1206 285 -356 922 -751 -851 326 -528 199 912
2006 912 559 267 -492 -549 128 -258 620 1057 -742 -76 -65 -1427 255 485 -83 970 169 -941 -22
2025 -22 -280 -200 646 617 725 -45 -805 -454 -785 -201 1540 459 423 633 -1409 -1248 48 -807 487 1574
2045 1574 395 42 -727 -1069 -532 -344 932 1465 500 599 -382 -1793 -280 58 -515 1735 1127 -345
2063c45L21j208j81J344L93O61J90q27m14j273K59J155k36J076P74j771j72K23
2081c1j450R96Q48j78P57l52q98j87l62O17L40Q8R79r13q18Q96r05n07J974n76
2101C18l98J083j509m03J068n22K95N62j13j47n81j80P72n91P00N61j381O60K37
2120D31j541J281N34j115J238m02r99J22r1O0P33J92N37q31r15P79q75j1J947
2139A074o11m5Q07j833k80Q20m41P10R16l31k22q67m06j28q5J196P90q69P81p17
2159B59j773J119J7n23K267j31j136K22n90q28M44O42M67K41j40r3j473rJ159
2178A41q94P91J771j738k12P49j784M20J060l35P62J10p71j81p15M00L65j90R58
2197G07k32j054Q21m96r25J761j25p02J339q46j030O28l7K45L81P1q9p72l6L37
$$ plain form
2063 -345 -24 -1232 -1413 -69 324 985 1175 348 -66 -1339 -1080 75 -161 915 1689 -82 -254 -31
2081 -31 -1481 -485 363 185 942 590 -308 -495 -857 -240 100 188 1167 254 -564 332 -573 -1080 894 318
2101 318 -80 1003 -506 -909 159 -363 -68 494 381 234 -347 -527 245 -346 354 915 -466 194 431
2120 431 -1110 171 705 -410 828 426 -573 -451 -542 -482 251 443 980 149 -766 13 -862 -873 1074
2139 1074 463 418 1225 -608 -888 -68 -509 201 1117 786 564 -303 -709 -837 -922 274 1064 195 976 259
2159 259 -1514 -395 -378 -901 1366 1235 99 321 -269 -1097 -653 -11 456 697 557 464 -1009 -1018 141
2178 141 -753 38 1809 71 -141 608 -1176 -756 304 -31 731 841 70 -111 -826 -426 -61 -251 707
2197 707 475 -579 242 -254 -1179 582 457 -245 1094 248 -782 -154 -191 54 435 506 417 -355 -391 -54
2217e4p97J227P21j780O51M89j691O83J112q83Q90K83j195K67m17J94L07L23P76
2236A106p99o75N14j019m89J995k71m19J225j211n74O01p48L37J362j52J36n55
2254C64p04q8o19R27R07o95Q96q4k076P27J09r99J836P22q68J88l13q80p3M39
2274b84Q48k5k1L68r55p93R22p87K55J824j091m00P91j454m7P03j93O35N43l79
2294D60k73q34O16n5l21R00K36j327R74m75j048J392R7p16J086m28p53M16k32
2313b85L7L07L66K32r12J66M31q42L44J307j292L01N41j587K14R30o14N98M72
2332G14p16l6n61L28J52o8J107k73q60Q86q94r45J252J56k09J039n81r35K38n99
2352h05q1J084M23J1m25j50r0j223Q35R77o01R38K86j694j49N24q23R54P22n32
$$ plain form
2217 -54 -851 376 1097 -683 -32 457 -1234 -551 561 -322 568 851 -344 -77 -494 -300 7 330 1106
2236 1106 307 -368 146 -873 -1362 633 362 -57 1168 -43 -617 -16 -764 -427 935 783 919 364
2254 364 -340 -428 -1047 -120 787 92 988 904 -1172 -445 -336 -1335 501 1223 355 543 230 -650 -723 -284
2274 -284 564 539 518 886 -69 -862 60 -727 -472 1352 261 -139 652 -802 -849 -146 -339 296 839 460
2294 460 187 -647 -31 -86 -407 493 729 -598 376 -99 -1147 245 342 -374 712 284 -469 -53 -285
2313 -285 -248 59 425 657 -255 -89 342 -500 -156 1151 -141 160 701 -886 -672 258 -356 242 714
2332 714 -2 -38 -599 -271 -119 -187 920 647 -213 673 -221 -1166 86 242 33 1072 491 -444 -206 -805
2352 -805 -886 198 621 632 207 57 -33 -1256 -421 556 -45 893 1179 -515 -664 -140 -963 -9 713 181
2372A81L06k23n77l42j2O41M28j54R66j340o28Q11n57k19J689o67m11R95j312
2391d25k50N86j89N06K8m6l2p02R5M14o00Q75M59j267R20p2j217R61M57q84R26
2412E43j63m93k80K81K9L08m53P91o93m79J081j134J34J308q76K65O91j516M4
2431f12P37l84N39J96j49j65p93M35k73p0Q87L89r10P95j090q78J096J45q8J248
2451A055m12o77O1n84J76J15N02Q19p86P9r6j319J92J096o80P25P88j193j13L35
2471H3q56M91O59oL05k03k33n52o49Q25pK7R53o14q34O01p01m00J449J25k95M49
2493F17o76l67J45J8M66q7L13J36r90K49M30r52O63P53j226O82J68j145O05M08
2513B10m18N14j79k44k17J60K65P1k76R01n97o52Q34j034j45J377l15l42O84r61
$$ plain form
2372 181 487 264 -313 -655 -667 -26 402 248 1214 -126 -754 57 -500 -719 970 303 -108 887 -425
2391 -425 -675 -89 -278 228 256 210 178 -524 -429 -15 -615 260 719 -548 372 300 -917 44 501 -383 543
2412 543 380 -113 -393 -112 -83 225 -228 563 -130 -609 472 -662 -528 780 -96 169 860 -656 -612
2431 -612 125 -259 280 476 327 162 -631 -196 -469 -539 348 737 -173 622 -468 -1346 -250 -105 -193 1055
2451 1055 643 -34 27 -557 -381 -266 236 1055 269 348 252 -1067 -875 221 -459 266 1054 -139 -252 83
2471 83 -773 -282 377 371 676 473 240 -312 -961 -136 -143 -116 837 223 -611 -10 -711 -1111 338 463 168 617
2493 617 -59 -426 -281 -263 203 116 429 565 -425 -176 254 -698 -35 718 -508 174 342 -803 -198 210
2513 210 -208 306 127 -117 -334 -174 91 162 -114 787 190 -462 372 -662 -807 570 255 -87 597 -364
2533c64k70O84m08J12O65k29J29l81k11k0l91J060L55q69R16m79j318P92l5j77
2553d39J088J6m99Q5o41k8k6p7J322m33M8M59j493OP87o15N04J013q64l35L82
2574B60j345N79M25J48N14l06J05m45m40M38j10PQ64j15r39N82n39o31J206j0
2594B48j87M28m87m97L72k90M48O2K35K05p54P2L11o72M63Q39j163N32L75j169
2614f29M79L21m28O23j13k64J01o17K71J10P8P18k76q39Q03p01n88J458k57m25
2634a75P17k68n15j74r2K11N51J61o1m48j17j40o87J001O98p69P31l3j256O71
2654Fk36q4P17K03k11k18m13j92l46L39P69k56k21J035j341l40R84o83O0J217
2674G89n89O8L3r24J61L94J07L75j73L00n66p79O90ol76J000j05p15N97j46q09
$$ plain form
2533 -364 -634 50 -358 -246 419 190 319 -62 -273 -293 -684 376 731 -138 778 299 -1019 -227 -262 -439
2553 -439 649 665 166 251 -390 -418 -444 -521 801 368 416 875 -618 -612 175 -440 64 1077 213 -122 260
2574 260 -1085 -506 -81 67 581 275 380 -65 -505 -67 -177 -170 694 579 -360 222 -317 -948 258 248
2594 248 61 489 2 -495 -123 -413 35 97 332 537 -217 -145 166 -506 -43 796 -367 165 540 -629
2614 -629 -150 171 -257 366 253 -11 90 -527 -256 -146 -68 650 374 -465 338 -363 -951 507 250 -175
2634 -175 542 274 -241 -415 -507 -296 255 416 355 -93 -210 -350 -1037 -36 662 -107 624 591 -665 6
2654 6 -230 -314 403 606 395 177 -236 -428 -774 -435 334 78 -143 892 -449 -789 195 -488 -428 789
2674 789 200 268 301 -623 -462 -68 39 414 241 541 -25 -804 -114 -120 -496 504 399 -316 281 135 -674
2695f74P10N9j14N17l80k28j40k5K77k65N52J46p71m6N41q51M37Q26q53L24N80
2716F22q83M7K62k95M21Q2M0k25k86K55j37k84R09k61o29Q67q26l71Q38j86r0
2737a30P73l95m26m5K0n5L76J54L76p14K6P4r73P52P29p90R54p0j106J85J32m27
2759e80Q17K00k1o0k35k02n27k9J091l26k90Q61r08l15N35n74K51R12l85k34K58
2780B39m88o2K0L40J78j14L46k52n79K16k4l88J043j10n91M88j64r77R41o6n1
2801e5K42P1j77l24J96L9k17L67N02o37j18L05p87L11P96p59K81K95p11J03K31
2822d6n8K5K45J85j18o34N32k13j79N94n7l61Q11o76p05O79q6l09J021l33n44
2843b27J93l70J96k19N54N03o86K36J36j082N98M20o27O23M42o49J16j79o58L36
$$ plain form
2695 -674 36 95 -19 498 118 -110 -250 -275 2 -263 289 435 -336 -382 159 -692 -255 571 -282 42 622
2716 622 -261 -214 48 -247 174 256 296 71 -215 40 -97 -381 528 267 -362 505 -321 -692 146 -40 -130
2737 -130 643 248 -178 -223 -203 -258 118 272 648 -66 -40 34 -939 -187 542 -248 706 636 -470 -285 -153 -580
2759 -580 237 437 416 356 121 -81 -608 -637 454 128 -162 699 -209 -524 11 -563 -312 600 215 -19 239
2780 239 -249 -311 -291 49 227 113 459 207 -372 -156 -180 -568 475 365 -226 262 98 -879 62 -4 -55
2801 -55 187 258 81 -243 -47 -8 -225 142 644 7 -111 194 -593 -282 514 -245 36 331 -380 -277 -46
2822 -46 -104 -79 166 351 233 -401 131 -82 -261 333 276 -85 726 50 -655 24 -62 -371 650 317 -227
2843 -227 -34 -404 -208 -427 127 630 -56 180 316 -766 -168 252 -375 248 690 41 157 -22 -680 -344
2863c44O42M4n6l66L52l62o05P97k46j80R49l78p02O34p92K20Q24k23P6J8k40
2884F2l24o1J73m5J63J22L46p76L33J71p92R67K36q11M15q2m93L76K38k77L09
2905B50k04K26n01j99N81j48k42P92n08l63N90n79k05J139o71K4N61o09k74J45
2925a95M1L19j56L77j07p64M78j58m12P02M95r90N93j43o79O11pj75L49J26j64
2946A41P5m84K70j78k5N73l54P8L64q83k41R37o23L93O29o43L2j99k94K11K96
2967G5O8K56n34M05k45o19O40mn07R38j77o05O35n02m07Q96k04J9P1j57r1l35
2989c84N65J09m88M10N51r67J94N4n48L18K86l96M24j17m44L81O9j88K97M5j62
3010Ill20M05j86k3N81l41l76M26m09O8M17j63j70M92m86j27J6OK32j53L38K52
$$ plain form
2863 -344 298 342 286 -80 272 -90 -695 102 -144 -324 625 247 -455 179 -613 -393 431 208 284 302 62
2884 62 -262 -323 -150 -195 -32 90 436 -340 -7 164 -628 339 575 -236 179 97 -396 -20 218 -59 250
2905 250 46 272 -229 -428 153 5 -237 555 47 -316 274 -305 -510 629 -42 -18 543 -66 -340 -195
2925 -195 -154 165 9 386 279 -485 -7 -165 -577 125 620 -370 223 80 -599 12 5 -170 179 305 141
2946 141 216 -268 2 -176 -201 372 18 96 460 -423 -664 273 -350 43 672 29 61 -138 -432 -221 75
2967 75 143 399 -135 270 25 -594 46 42 -465 473 296 -309 326 -176 -583 313 109 128 199 42 -49 -384
2989 -384 181 290 -198 212 763 -204 -10 44 -504 -186 100 -296 128 11 -433 -52 17 -171 126 171 9
3010 9 6 -314 91 -95 -118 463 122 -254 172 -237 -169 248 85 -85 407 -79 -206 -190 -184 48 -105 233 485
3033D85o63K23k5m61N15K17k67M27m02n05M16j58j39N01Jp0R9m87M92n20jO55
3055C33m07L29K34p60j22O86n02K34M17m12m5J80m86l6J96K0M52l80M13l77m91
3076e24M54N4j65P70j31o01M25m79l58O76j43L3Q5l54K24k46j05L08j95M20N09
3097F57p57j40N20o35K26N70m46K59J7m29J24j24N0J19j64M68j91n22M93k60j96
3118c61M74j04j50M22l03k45L26o8j6L74l22n3o8l89M69m17P24K29n99J04O8m96
3140d01J60L05J2J8K55n62J44j19N0R5k3K57p1l33M20p22R6N32k22J58M90n22
3162A7j88K44m26L59M38k65j3O6k88n2k70O0O20l66M06q7q24N38J1m30P52Pn22
3185b13L82l09k89K52K32n1J94j71K65k81m07N78k90J2N78o61M5L24o11L11K69
$$ plain form
3033 485 -178 45 20 -441 74 291 24 451 49 -456 -40 -198 -337 164 165 95 194 -293 199 -321 -322 333
3055 333 -74 255 489 -271 -393 293 -209 25 442 30 -15 165 -321 -357 -161 -141 311 -69 344 -33 -524
3076 -524 -70 -16 -181 589 458 -143 282 -197 -555 121 -22 11 96 -258 -34 -280 -385 -77 -272 148 657
3097 657 -100 -240 280 -355 -129 441 -5 254 271 -158 -34 -158 -108 11 -153 315 124 -398 95 -165 -361
3118 -361 113 9 -141 281 -22 -267 59 -9 -25 349 27 -26 -94 -483 -14 -431 293 522 -77 27 95 -401
3140 -401 -241 64 76 94 349 -213 -69 -188 -138 -43 -66 191 120 -213 207 -515 -419 113 -109 49 539 17
3162 17 -171 73 -353 6 444 179 166 232 -56 -108 -378 -318 302 -64 342 255 -569 -31 -20 -450 302 309 -213
3185 -213 169 -140 -429 -177 55 4 198 27 292 11 -396 182 -108 -96 482 -179 -134 190 -421 -110 159
3206A59j63L18J44m12J0J2k21L02l77P03j32n27L69l59j57M53j06k0K63k83m00
3227d24N17k37l1N76l02Q7l25k4J63m18K99O28o16K60J65p01K43J46l19M31J48
3248B66n14K73k13p9K09k9M65k00j70L24l46m15M59k1k77R25n11l53J27l90K76
3269a94M27k22J32J06l43K41o40K98L20j67K88J73p10J98J13j85K42Q7j29J22
3289A57m2m79M51k90J34P9k36M18k29l37N89n42L86K42l61j47M47m71K58L3K8
3310H8Q6k04k20K19j45j72N17j86K10R6l62O2r7k00N43j57l3K90k67l57K23k44
3332c10K39J67m8p0k0k30K83j77j44P32n04J75K01n25K8N44o34K68M16k90j34
3353c3j43k30J54M5K29M23o00N64m45m66N74n0l28P79l35Qn4l08J23K32l27M15
$$ plain form
3206 159 -4 314 458 46 56 68 -153 149 -228 475 343 -184 185 -174 -331 122 16 -4 259 -24 -424
3227 -424 93 -144 -175 401 99 186 -139 -163 0 -418 -119 509 -107 153 318 -383 -140 6 -313 118 266
3248 266 -248 25 -188 -267 -58 -87 378 178 8 332 -14 -429 30 9 -268 657 146 -207 -80 -470 -194
3269 -194 233 11 143 249 -94 147 -493 -195 125 -42 246 419 -291 -93 20 -165 77 164 35 157
3289 157 115 -364 87 -203 -69 10 -226 192 -37 -374 215 -327 59 301 -60 -207 240 -231 27 60 88
3310 88 174 -30 -250 -31 -176 -348 169 -17 193 289 -73 -11 -108 -308 235 78 45 335 68 -289 -66 -310
3332 -310 -71 96 48 -22 -42 -272 11 -166 -310 422 -82 93 294 -231 -203 341 -293 -25 391 101 -33
3353 -33 -176 -406 -252 -207 22 445 -155 409 -36 -502 72 22 -306 473 138 146 92 -216 -93 139 -188 227
3375B27j57r0Q4k89j26L92m55O37K95o73J79K0j54O4J40k2J26k27K8j08J13q7
3397h3L78k22K21j63n63N79l82L6O49m35k80L79k94K72j5j32L11j25j8j02p9j75
3419b43L86k69K07K6l10J54r2k60L77K36j47L69k98l81L11k32K2J83j25M61k50
3440A25r4J07k32q7M08k86K26K8l52j05L22j28Q5L98l77K14p5k80J13p0J79l2
3462H7l5o2J52o39M92N7k60N57k59j4R0j59j24j1m4K93J48j84K16o10J17J73k65
3485b84J46L33l06kJ96m31J03K07J03J03j15Q6k15j17K08K05k38K87k29l63O61
3506C38m71q5M35j29l72O00o30q4M00j32j4J22J25K3k41l1K3J8K25K14j82J6P1
3529B39o42K92K9R5J08j93r1Q3p3o3L54j45J08j07J11J13k19k96M11q2m2M18o39
$$ plain form
3375 227 70 -20 64 -225 -351 41 -414 223 518 -155 24 44 -110 -46 94 72 198 -29 -1 -109 4 -83
3397 -83 295 73 294 131 -432 147 -235 -199 450 15 -265 114 -180 92 77 -55 256 131 113 11 -68 -243
3419 -243 143 -126 81 107 -203 -49 -141 -401 -24 212 65 434 136 -245 66 -166 -144 39 -86 375 125
3440 125 31 138 -94 -181 227 -59 167 195 -157 -262 60 -68 17 415 38 252 177 -103 10 -60 119 87
3462 87 52 -10 142 -497 -5 52 -208 349 90 76 166 7 -117 -128 -172 121 269 85 301 -309 -192 -19 -284
3485 -284 -138 195 -111 -113 83 -348 -245 -38 65 168 53 139 -76 -193 15 220 -18 269 40 -323 338
3506 338 -133 -218 217 88 -284 316 -314 -398 2 -130 -144 -22 103 126 -115 -146 -123 -105 120 334 152 168 239
3529 239 -403 -111 -82 13 121 -72 -163 -80 -153 -216 138 -7 101 -6 105 218 -1 -297 114 32 -10 408 -231
3552b31J73P9l80L50P3j13J41j86j27J2l0k5L97k32K95O1l25m7M3k67M89K13m90
3575a27K78m61J52K12m72N57J0m15M99k20k72L30l09O5M98l77R1K21m05J28nk1
3597d3J73J3J1k57j30K24m0j37M51l3m87L11j79j20N16k23j8K30k90k37J81l06
3619c90M92l9J28J31m58m3J65k21M10P7k41J20Q6o29K71K32k35M97j91j03K08
3640B67l86k6MJ62M41l46k13J53k48j84N22j10q1K77k68l9J94j25p4L91l47M90
3662D54k68n10M52n04RN66m36M08p9m57K76p4j06L98N0j03r3j1j37L53l53J71
3684FL21j76Q2l48q4K76j60j65N53l48P7J12n07K31Q8l8L58j11q0J13k69J02J15
3707A48k61L32J6o36N17k68K4K98k92j98M49p7k07K21j64N8J39k81N59k41k29
$$ plain form
3552 -231 -58 21 -359 -9 64 -49 92 -94 -221 -209 -239 -264 133 -99 196 257 -68 -115 -72 -339 150 363 -127
3575 -127 151 -310 -158 54 -418 139 149 -266 233 13 -259 71 -238 -173 325 -52 39 260 -145 -17 -22 -43
3597 -43 130 143 154 -103 -233 -9 -49 -186 265 232 -255 56 -123 -243 273 50 32 262 -28 -265 -84 -390
3619 -390 102 63 191 322 -136 -179 -14 -235 175 252 11 131 217 -412 -141 91 -144 353 162 59 267
3640 267 -119 -145 -141 21 462 116 -97 56 -192 -376 146 36 -45 232 -36 -75 119 -6 -80 311 -36 454
3662 454 186 -324 128 -376 -367 199 -237 171 92 -365 -89 -163 -269 129 179 76 -17 -28 -165 188 -165 6
3684 6 327 151 233 -115 -199 77 -83 -248 305 -43 34 146 -361 -130 -42 -80 278 167 87 200 -69 33 148
3707 148 -113 219 235 -401 116 -152 -128 170 -122 -320 129 52 -155 66 -98 -40 99 -182 377 136 -93
3728i3K79m14Q6N29l27O5J24m26N8Q0l3K53Qj22L0k78J62J1M5K31j3k43J90j03
3752I9o44N67n3r6M25k66j83J65j71L3J57OK31j3m06M42m89K20J61k68J69P7k06
3775d3J60j34l05M03j56J12L9l95L37l2r4L08m0l52M40j17l56N32k59j05K47k34
3797d4P4J31l67K55k03LM72k55L8J38n77L54m6K5K57l20j29K80O2m62M61q9o8
3820a0K23k94K4o6k94L93J3o1M02l30j21L23m22R7M68k29q3L36o97J63K42j78
3842a01K01o7j44J67l60n7K79m04O55m2j68J30q9l19K52l1r9L58k78K20n0l69
3864c16K68lJ2L51l47l8K15j84j4R4n03L69L55k15O2K8m34L87M5o7J25l17J53
3887B6L2l69M40j80r3K96N1m98J45j25Q0M93k23N3p2j70P2L31m27L18j11j08L63
$$ plain form
3728 -93 186 -228 -142 387 60 125 249 -177 -119 -39 -72 181 189 67 97 -181 -19 -8 37 268 255 12 202 99
3752 99 -545 22 -31 -127 298 32 -151 14 -157 -124 33 39 270 257 -149 293 -196 24 185 -83 86 163 -43
3775 -43 117 -17 -322 81 -75 37 76 -319 18 -14 -108 200 160 -192 248 131 -225 307 48 -57 190 -44
3797 -44 30 161 -206 49 -154 -151 321 66 104 242 -335 19 -27 -2 255 -65 -194 86 148 -314 147 58 -10
3820 -10 213 -81 -57 -123 -417 -24 -11 -72 330 0 -121 202 -220 -123 345 116 33 369 -328 -165 77 -101
3842 -101 100 33 -111 56 -304 -361 -82 -486 169 127 -41 89 0 -319 -67 -98 -197 161 -117 103 53 -316
3864 -316 -48 -51 -39 312 -35 -73 142 -42 -56 38 -465 -96 259 44 106 134 -300 87 132 65 190 -127 26
3887 26 58 -311 129 -51 -144 152 203 -295 -150 -275 -195 298 75 128 56 -114 -42 289 -138 180 69 -39 324
3910C24m17j13K42l36L25K14j76l7R6n30L24j10P7M70l76J99j15j47K00j93J28
3931D9J10L1n38K52k84J02L74j68K25%j72r4J08l10N68k67j24M53m52N3L84m16
3953a16K99r3j62L74l02j47J40j57J30L07m74K12J42m03P9j4M3M30q4j57L12n58
3975a99J6J21J5J48K74m55Q9J38n26M19j25o4M49n46J25K10m77N90j70j03N13
3996D42n79n4K66k31PK14l0J52o8k61j9J90l13M08j60j2K04j47k5J8j7K34j30
4019H9l10L79l30p9J05j9k2L02l23J78k4k59J11N2J12O06m64q5J03l06J02K45
4041A63k88K30K64m16%q8k41K88K05k15M80m75j04J82m11L98K62k24K65j80l8
4062E7P0l17Q5M56k69K0K20m35J87k79o1M73k33O7K54n08J08J40j31J80L05n88
$$ plain form
3910 324 -93 -206 36 -300 25 239 63 26 122 -408 -84 -194 -117 353 -23 176 61 -86 114 -79 49
3931 49 159 190 -348 -96 -380 -278 96 -72 153 153 -19 -113 -5 -315 253 -14 -138 315 -137 -84 300 -116
3953 -116 183 90 -72 302 0 -147 -7 -164 -34 273 -201 11 153 -250 -171 -185 -142 288 204 47 359 -199
3975 -199 -183 -62 -47 101 375 -80 9 147 -379 40 -85 -149 300 -246 -121 89 -388 202 32 -71 442
3996 442 -137 -191 75 -156 -149 65 35 187 119 -142 -161 29 -284 124 -36 -48 156 9 -16 2 -15 219 89
4019 89 -221 158 -172 -251 -146 -165 -187 115 -208 -30 -54 -313 -202 -150 -38 568 104 19 122 -184 -82 163
4041 163 -125 105 369 -47 -47 -135 -376 -88 117 -98 382 -93 -197 -15 -426 -28 234 10 275 95 57
4062 57 127 -190 -105 351 82 102 322 -113 74 -205 -266 207 -26 41 295 -213 -105 35 -96 84 389 -199
4084a99O06l83l91N15k79J38M58n99J64J15n41K61J53k3L76k74l62K92j59K9L21
4105B18l41K20n0j16L18k08k53M02l27j7L65k87k03K14j03J90P6k10N56l86k69
4126b11L45k92L9M62l69Q4R4l22J60Pk06N98l69K16j4n47J08L69m65L83J51k39
4148a8J49q9k23L98l33J76K18l10L56l25j59J58J76m24L87j29l98M93j07j89K12
4169A9j69K12j00pL6K8j44K16r7K15pm7m53M36k65J89J87l24J39lk42L19k73J50
4193A5J73j91J82o2n44J82L74k52M38l14k17M79n01J37J94j83L23O0m83K81k6
4214F5k84N84m52J66L40n19r6L83m76L25J61l70K33k15o6Q5j54K38L97n26L83
4235B02l4l52K26q3L0L37k35j08M38o31R9Mk37M23J98m11Q8k9l68N81j77M5L25
$$ plain form
4084 -199 407 24 -367 148 -131 7 465 -134 30 145 -396 -135 18 -5 371 97 -265 27 -132 -103 218
4105 218 -123 97 47 -69 249 41 -212 190 -137 -154 211 -76 -279 -65 -168 22 98 -112 444 58 -211
4126 -211 134 -158 -119 343 -26 58 152 -170 -10 -3 -209 389 20 236 222 -325 -217 152 -313 70 221 -18
4148 -18 131 42 -181 217 -116 60 278 -32 324 -1 -160 -2 174 -250 137 8 -390 103 -4 -193 19
4169 19 -150 62 -38 -45 -9 19 -125 91 -6 209 202 155 -298 138 -127 62 249 -75 64 61 -181 138 -135 15
4193 15 188 -3 179 117 -427 -245 129 -123 315 1 -216 263 -238 -101 93 -90 233 293 -190 91 65
4214 65 -219 365 -87 79 419 -100 -196 187 -289 36 197 -173 60 -155 -221 -136 -290 -52 345 -181 202
4235 202 168 -184 42 -41 -11 326 91 -17 421 -210 -111 -107 -344 79 277 -134 -46 -75 -443 138 -39 6 331
4258C31k97k65N31m81J62L4j70K91m1k38K09k87%K20j21J65K34m60M97j30l10
4279a26L07n8j57L30k82K2K07m55J97J2j93L16J1k64J36j73k3M11k44R6J41l35
4301a24J59r1k15N25l61Q2J45l12K8L49n19L40K90n49L42l39j1L22r4k12L87l55
4323b13K47n6l67N00l8k06M38p0k03K06j40j27P3j59K91m6j30J4j25k6M34k87
4345A0r8K47k82K5J63l26L82j8k00L14j51k26J08M2j00L16j65N9J28l66j10J49
4367i9jK02L0j57K16k97q4M49n15J84K38l03K40j00j85L18j86k03L73l29J34L94
4389C19n45K64J92l19L75l20l10N43j51j9L09k28j00J29l34J32J28k79N47j77
4409A56m16O11l79PJ17n08L87P1k39K12J26m06L69k02j02K78k2o0j61j17K68J10
$$ plain form
4258 331 34 -231 300 -181 -19 15 -155 136 95 -143 66 -221 -221 -1 -122 43 277 -183 314 184 -126
4279 -126 181 123 -34 296 14 36 243 -212 -15 -3 -196 120 131 -133 3 -170 -193 218 -26 70 211 -124
4301 -124 35 -56 -271 254 -107 -25 120 -192 -164 185 -334 6 296 -253 89 -250 -261 61 -33 -245 142 -213
4323 -213 34 -22 -389 111 73 -133 305 235 32 238 98 -29 44 -115 176 130 0 14 -111 -137 297 10
4345 10 -88 159 -123 -98 65 -261 121 103 -97 217 66 -160 -52 -10 -110 206 41 100 228 -138 -248 -99
4367 -99 -100 102 132 -25 191 -106 -190 259 -256 -72 166 -137 103 3 -182 136 -50 -253 120 -209 -75 319
4389 319 -226 38 230 -89 286 -34 -344 199 48 29 338 110 10 139 -195 -63 65 -214 333 156
4409 156 -260 351 -28 -21 96 -412 -25 46 -193 19 145 -261 108 -94 -196 82 60 0 -161 -278 -10 100
4431A00k70N07j99k12K42k67p6K56j50K35J60o55K96j93l0L46j12J54N0k08j12
4452a38K31k59J74J32l75N04k85q0J71k55j79N03l33Q5M63n34J24j31k7K21J39
4473A51l57L38l86K66J62k99m0K99k00K1J26j22R6k09K90p9n6L1L89q94L11K08
4495D6l0J75k69k31K36N1l14M01j22J20K09k80K15k57q8K97j44L7L39l89l2P8
4517D8k22K76J20l18L25j20m70L83R1k41J06O2M7j41k08K92P9k00J46r1r0K96
4539A70m44K25K35k82J23L72m67J41l00J7K01l4P6L03m75J04Q7k50J22J74k54
4560a56L30J31j80j43j55p0L75j84L7J03j90K21l5k03M62l57l4L53l62p8L14l74
4582a95K34K21l42P4l6k92L76Q3j67M50m62Q3M9j51J68p3k33K07q2K1J87j95o2
$$ plain form
4431 100 -170 337 138 -74 168 -99 -175 81 -69 166 326 -329 -33 -226 -256 90 -22 132 182 -26 -138
4452 -138 93 -166 8 140 -235 269 -16 -96 75 -180 -359 144 -189 -104 359 -175 -51 -182 -209 12 151
4473 151 -206 132 -254 12 174 -125 -165 134 -66 -45 81 -41 55 -154 136 57 1 32 421 -473 -162 46
4495 46 16 191 -78 -309 -73 -22 -336 65 -57 63 272 -8 207 -50 -138 159 15 52 391 2 -30 48
4517 48 -174 102 222 -96 229 109 -361 22 113 -128 -22 40 87 -54 -262 30 109 -91 55 -36 -126 170
4539 170 -274 -49 186 -96 27 399 -68 73 -227 -210 -9 -43 33 336 -139 -35 52 -198 -76 98 -156
4560 -156 174 305 125 -18 -173 -243 132 -52 -15 88 -102 119 84 -119 343 -14 -48 305 -57 -135 179 -195
4582 -195 39 260 -82 -8 -44 -336 40 123 -44 406 -56 27 76 -75 93 20 -213 -6 -88 -67 120 -75 -137
4605a37J25j02J62N8m31M35m9l88L49o6J99J42m79J52J65m07K47K26k63K43k63
4626h2j24K89j96r5K41L3r3P4j12L5o8j28N21o3l45L46k20j42L29k88K2J94o4
4649F4J54j92l40M10k91J99J18k82P4N15o49L26J94m35J74M0j33n7J17N0J3k24
4671a55J4L27m08J19J25l70M65Kj43K40j75m4K93m36L98k15M2K75l89J79j6l01
4693a73J73J89j82M4J26l91K63m0j96M56k02l18K47Oj70J69J03m3P3k24L80l59
4715f9k76N84l44P3K15k74j29K22k61J45J65j55L50j93J25k79J18L7r3k36L16
4736D1N8m92O08k71k23L86k7j54L37j66k02K43l27K03L43k40k6R0k57q8J41J70
4758A47J84j26k96K38k15p3K68j87L17n1l51K07o0j00J75O0j05J57m11K91k5j61
$$ plain form
4605 -137 -12 -114 48 106 -325 110 61 -327 22 -44 155 297 -182 -30 135 -272 -25 201 -62 181 -82
4626 -82 -206 83 -113 -208 33 66 -27 47 -65 -30 -98 -226 295 232 -113 233 13 -129 200 -88 -66 128 64
4649 64 218 26 -314 96 -195 4 122 -160 -86 429 -220 106 300 -135 39 79 -54 -111 6 56 69 -155
4671 -155 -141 186 -222 -103 22 -348 117 119 -24 216 41 -3 290 -146 252 37 79 354 -35 144 128 -173
4693 -173 0 189 7 51 177 -214 49 9 -187 269 67 -251 -4 2 -168 1 104 61 134 -90 290 -69
4715 -69 -345 239 -105 -32 183 -91 -220 2 -259 -114 51 -104 246 53 178 -101 17 54 -39 -275 41
4736 41 99 -393 215 -56 -279 107 80 -74 263 97 -105 138 -189 14 357 117 91 181 -76 -164 -23 147
4758 147 331 205 -91 147 -68 -141 127 -60 257 206 -145 62 2 -98 77 137 32 189 -222 69 44 -117
4780a17L52k59j00K62k41r6M71m15K06j14j50J78M7R3k77M9o2L67k26K8K66o36
4802c74M39J13l43K70k94J79J20j53j43K75M6K1n2l43L46j24j3J43n7j51N01m76
4824g0K33l9l27K14j14mJ18mK17j63j55k1K38r5J17O1k58J29j27J9J39J4j50K28
4848B00j76j13J7k6J64J35n24M52j53j32N44m47J05K24l59J7K99m24Q0L43k97
4869g1J84j5r4L6k29K24j7j39J23R8k52J09Q9l02K63K62n59N17j63j41J92k13
4891i8n2K92l02J08L07k26J20j09j87K43l18L29J52l62J70J28k69pJ33K6j39p5
4913a36M4J36j16M16p3k02N0n2l28L12k2o0J44k42k45M46j34J35J22k10J68j42
4935A1L28l89r4L7P4K17j41M8l65L95j45j0J67k42nK23j18k33L17J8j17J06j43
$$ plain form
4780 -117 235 -24 -124 138 -103 -199 272 -143 63 -51 -201 -23 24 117 -160 -111 -173 194 -32 -4 262 -374
4802 -374 65 178 -165 105 -189 -10 110 -43 -186 89 135 156 104 -239 107 -17 -30 113 56 -95 406 -70
4824 -70 163 124 -203 11 -103 -107 11 7 224 61 -94 -115 123 28 145 206 -52 77 -50 -31 108 122 -28 200
4848 200 24 -89 -72 -98 66 201 -323 129 -24 -156 388 -59 46 270 -89 -72 227 -197 -117 226 -71
4869 -71 113 98 4 40 -189 35 18 -121 2 100 -152 -43 46 -256 7 269 -290 227 64 -77 115 -98
4891 -98 -150 142 -160 -52 255 29 149 40 -147 96 -222 107 259 -103 67 195 -74 -81 52 78 -61 -136
4913 -136 -92 44 -72 344 271 69 119 67 -261 51 29 -31 113 -129 -374 72 -62 73 195 -15 153 11
4935 11 339 -50 -144 -107 -33 184 43 91 -274 121 -24 -34 133 -109 -114 109 -9 -242 75 93 -24 82 -61
4958f1J49j52l8R5p6n5K80j72k8M13n43K8L79m93L36K5k74M58l47K32o9j43K35
4981A79Q3j82J01r6k69L79j47k69L81k03m4K32k55R9J61j76L55k98j07J13j12
5002g5o2K57k24J03K61n71J79L04k04k9R8j58L02j60j45J89k90R8J75j45K44o0
5024H7k59L97n34M3J54J54j11L33m49K15n2j62J97k91M71m7k02K05p3K0M0j63
5046b7O4J80J6m94L06R6l33M05l2k35L7j12R2K88k98K9K21k77J18k39P2L01R5
5069B73m78K91j98K5J76l64J74K97m64K99N0j66K18r2M9P4k34J07Lk62M31j15
5091I4n3J65j16j9Lj25K3K21k60K59k58L0L63k61k01L39l39J38K57m79P7K83k15
5114g4K41j48K1Q0k81L1K82l16k7M30l83L32j49l67M47l0j56L39l2l60M47m71
$$ plain form
4958 -61 88 -64 -102 -7 -83 -138 142 -30 -58 355 -188 -160 219 -274 62 87 -187 271 -76 156 87 -56 179
4981 179 262 80 181 85 -184 195 48 -221 160 -43 -87 145 -110 -11 150 -26 329 31 -76 37 -75
5002 -75 -137 120 -104 -1 260 -311 -132 172 -32 -61 37 -121 181 21 -124 65 -225 -127 48 -97 147 87
5024 87 -172 225 -309 -266 -112 42 -69 264 -185 30 -22 -184 13 -278 193 146 -56 149 76 96 136 -27
5046 -27 37 217 233 -261 45 141 -192 213 181 -54 -17 -129 -37 251 -47 -18 203 -74 44 -195 -123 178 273
5069 273 -205 86 -112 -87 89 -275 -101 196 -268 31 81 -85 133 41 90 164 -70 37 40 -222 209 94
5091 94 41 206 90 71 74 -51 -28 193 -67 192 -66 -36 327 66 -135 204 -135 3 260 -219 -142 141 -74
5114 -74 167 19 40 120 -161 -130 152 -164 -191 239 -144 188 39 -328 119 89 -67 272 240 -120 327 -144
5136a44J0J88l43K04J38n4o2O2rJ12k36O4K67m02K21J17l16K62Jj55K8O8k62M89
5160B48l94L16r8l15L16J63m26K41r9m01N78l99K85J5n4J11P5l65J96J47k60L31
5182B11j10j92L92n40J01L40k96J51J62l22J01M1m53L88rj29K93l96M46q8j71
5203h0J40M6j04k6J85j85J83l61K70o3k49L74J03m46K56q6K57k22M9m0J67m61
5225b93L05K15l88L53j98o2N0M4j59L53k51m7K08j64N1P2k76M26J8l36J91k57
5247a45KJ58k06J64J36k33K94N0k40P0m9l48L66q1L1J79l96K49jl38L62Q4k20
5270a12L17l38R0J67j95j34L97j78Q7k29r8K31p8j1K90l82L8L29m29K35K8l18
5292b93L44l9j25J3J72l12K46k3J62j07j23j61M78m14K38J86l49M68m02K3K05
$$ plain form
5136 -144 -134 54 -289 -85 53 -1 -63 -1 -10 102 -134 -70 197 -205 16 133 -183 79 80 -75 -47 21 -241 248
5160 248 -146 170 72 -243 73 236 -190 51 -48 -449 129 -270 15 30 -24 87 162 -203 -7 140 -120 211
5182 211 101 -91 301 -239 -138 202 -94 57 219 -103 -2 39 -414 -26 -35 -164 129 -267 179 91 -80
5203 -80 60 106 2 -24 161 -24 159 -202 68 5 -244 130 233 -213 43 -43 214 -8 41 1 168 -293
5225 -293 12 227 -161 192 -6 -68 -18 26 -133 220 -31 -78 130 -34 17 89 -187 239 257 -79 112 -145
5247 -145 -143 15 -191 -27 109 -124 170 220 -20 50 1 -347 19 -62 -31 148 -248 1 0 -338 24 108 -112
5270 -112 205 -133 -43 124 -71 -205 192 14 101 -128 -226 5 -73 -84 206 -176 -138 191 -238 -3 25 -293
5292 -293 51 12 -113 -100 72 -240 6 -17 145 38 -85 -246 232 -182 56 242 -107 361 -41 -18 187
5313A87k10m3R5j81J08K85n44K20J11k77M71m50J94K56l83o5L24l03M18j15k18
5334a20K47j21j54M50k24l85O35m07J97j45j45L40k02m7J78q5j80J30o7J72K41
5355C08l31O8jl3J49K4k17J11j81K39L1n02M62k15j53L07J24l40M64j18m81N35
5377B50l94N5J77k39R9K71m05MK42j90L21j81N8p2j35p0J63m5J49P8l70M60q2
5400A44l33N29k68K2p0rJ09j68j29M59l80M4M6j83L87j23j38J0J23k10J70L0j11
5423d9M9P3o6k2j08PL26l08O7J26l67M13P2l66K94rj03J8k34J03n4J53j16K69
5447A68l96J64K20n82P15k53k7J95k79R2R7j8PJ42m31L19q4k45K29k18L44m0k40
5470a21j07M04m24M71m7k28J82k26j7K05j64M7Q1l20L8L46j21R2j54q2L35l90
$$ plain form
5313 187 -23 -66 29 -152 -44 241 -303 -83 28 -249 222 -228 -34 222 -161 -226 98 -205 213 98 -120
5334 -120 127 6 -148 302 78 -307 328 -79 118 -27 -172 168 -34 -81 97 12 -168 -38 -105 67 308
5355 308 -23 45 44 11 160 184 -33 78 -103 136 167 -335 127 -88 -241 66 190 -150 314 196 -285 250
5377 250 -144 -89 88 -151 -52 219 -186 -182 60 -130 191 10 68 -4 -139 -209 -46 -91 58 136 -234 226 144
5400 144 -189 340 72 94 24 15 124 -44 -173 286 -94 -50 -4 -187 200 77 -61 -51 72 -138 32 62 -49
5423 -49 0 73 7 -15 -123 -116 210 -98 -31 95 -272 141 213 -153 141 132 29 47 -187 -84 -138 15 -101 168
5447 168 -228 -64 156 -426 289 36 9 204 -75 17 114 96 103 245 -186 133 49 -196 33 -185 159 119 -121
5470 -121 -228 176 -248 223 176 -52 130 -96 -113 92 -72 -25 56 -264 -226 120 -1 91 -63 -145 190 -200
5492b00K39K28l32O1K14k47P5K29l20J24l2j99L37l40L0M39m28K37j76r4L02q2
5514F5j34M26l71l63O54l96L6L86o19K72pk1K43l16j3M08k78P8J24j58k3J98l06
5537a15J75o0j87J28J14m9J17q6j15J37j1J8M3l91M53l19J12K94j97j40L11k92
5559f0K53q0j66J76j22M1oq9Q6J38j68J42q9l4J29p5k43M94q3l86L19n1k46L8
5583h2P0J07K14k93J44n5l87L83j91J70l9j85K04K67m14J80J51q0Jo1k50L18k76
5606a04j51K97j64K15r2l69M31q1l32L04M5J22J84k14j31O2N3k08P3J3J29J81
5628B63k29j20J06j12K26k8p7J83k47M9J17l59K26P3k41J77q5L7O2k40K30O8k40
5651a61J1L10j67OR0l04L90k73j5J48j0L0J19k63J37lK5j9O5j84K37N6o9r8K1
$$ plain form
5492 -200 39 267 -65 -4 210 -37 38 267 -53 71 39 -160 177 -163 -133 306 -122 115 -61 -155 147 65
5514 65 -69 357 -14 -377 277 -119 -83 303 -316 -44 -51 -72 171 -145 -158 250 -28 50 174 16 -7 191 -115
5537 -115 60 0 -187 -59 55 6 123 37 -78 59 48 66 109 -282 171 -148 -36 258 61 -79 232 -60
5559 -60 193 113 -53 123 1 42 36 -53 33 171 3 145 56 22 151 76 -167 327 244 -142 177 126 -120 -82
5583 -82 -12 95 309 16 160 105 -282 101 -90 80 41 -144 60 327 -87 93 244 164 165 104 -146 172 -104
5606 -104 -255 42 -122 93 1 -368 63 -18 -350 -46 -1 121 305 91 -40 22 75 -133 -60 -47 82 263
5628 263 34 -86 20 -92 134 106 29 212 -35 14 131 -228 -2 71 -170 7 -78 -41 21 -219 11 79 -161
5651 -161 -150 160 -7 -1 89 -215 175 -98 -113 35 25 55 174 -89 48 45 70 51 116 -68 169 225 156 58 79
5676G9nNm04M27nl95L75n4j95K90j45KJ99l58K52r4J73P7k83j24K19K76k48K0
5700H4l10J82P7j96L6K11k86L64k83M5R3M9oJ95k28J24j71j95K63P9j41K48k30
5723Dj94K23J3j52J32j6j92J04O1R6j85J28K5k85J66J32k92M61j50n5K54m12p4
5746b08L13ok73NJ46m7J5M6MJ66k36K30l2m40N56k44J1K45k88O8j03O4J13L7k78
5771a36K30o5l6K25l84L49j83r2N2L33n51J58L68k28J69j44m42O16l22m5K87m90
5793c31K85J51k98K10j01j41K89N3j96K28k78N1J79l61J79P3n2J72j84L14k45
5814co8j00M23l56J42Q9j85r8J13q0OO9k3K95k31j65M04m66l3L52j38K71k55j00
5838a37K73j1j9J11k86J08J28k18r2J80j48J19Q9q3lk92N00o2l05P6J35j64M05
$$ plain form
5676 79 74 79 -325 102 97 -298 77 23 -172 118 -27 -25 174 -184 68 -26 147 224 -59 -183 36 312 64 84
5700 84 -226 -44 33 -163 -127 84 -202 162 -121 -76 17 66 60 255 27 151 -20 -215 48 127 -14 234 4
5723 4 -190 33 46 -106 26 10 -182 -78 -17 79 -106 22 47 -238 -72 60 -232 229 79 24 278 -134 -208
5746 -208 105 99 -174 -169 -23 -70 -55 -9 -5 161 -75 155 123 -317 239 -5 6 251 -37 31 -72 -8 105 142 -136
5771 -136 94 29 -7 218 -166 183 0 -92 -40 293 -258 -100 268 40 209 65 -377 239 -83 -128 159 -331
5793 -331 -46 105 -193 17 -84 -225 64 117 -79 149 -129 -78 101 -260 -81 -8 -60 112 -72 242 -3
5814 -3 -71 -171 252 -104 38 127 -58 -156 -43 -123 -117 -48 -71 224 -7 -172 232 -234 -267 85 -53 218 -37 -137
5838 -137 136 125 106 217 -69 39 167 -51 -143 37 -111 8 97 14 11 -281 219 157 -148 -72 63 -101 304
5861C04l20j72M12l96K28j19j88L04J23r2k17K28l14L34l5l1J08k92J42J12k69
5882a50J51J01q0R3O5r4M3pl64L00k25K3L25o3j74K21j28N0n1l16O28m40P4J21
5906A03j08J83j60k73K77J43j50K43p4j42J03l17P0K63m60K45O4j32K15j64j12
5927a83J37Q4J18q3q6j9L8k0J76j07r5K14l54K03P2k40J34K82m14L28j21k85P8
5950a43K84k26KK36k92J48n0J14k06O8K87k73O4j5k51J79L15k41j72L78m74K90
5972B2J59j47m6J07j02J70l39J62J42k97J13K45j37j9K78m40j7L75k38R6J03m11
5994b21L24l07N4K90k41J73Qj83L26k51p8K09j44r8J11k5O3J23m35L23k07Q4M03
6017C01m67J22K25l78K46J50m01M18Q1l37K86l4k48J00j01j06J81o4k8J43q3J53
$$ plain form
5861 304 -16 -188 224 -172 56 -63 -251 53 176 84 -133 95 -219 115 80 49 157 -135 7 119 -150
5882 -150 1 102 22 115 180 86 129 122 -242 58 -167 -144 181 118 -56 165 37 87 36 -280 348 -92 -18 103
5906 103 -5 178 18 -255 22 165 15 258 184 42 145 -172 -102 161 -299 -54 10 -122 93 -71 -183
5927 -183 -46 38 156 73 -13 -32 6 -14 162 55 -40 174 -180 23 95 -145 -11 271 -143 185 64 -221 -143
5950 -143 141 -85 -83 153 -139 9 -41 73 -133 -65 222 -51 13 -2 -253 -74 241 0 -172 206 -268 22
5972 22 181 34 -12 95 -7 163 -176 -14 128 -169 -56 189 52 33 311 -129 -146 229 -9 87 190 -221
5994 -221 103 -204 -150 140 -101 72 80 -103 223 -28 -106 103 -41 -139 -28 -53 10 133 -302 21 -186 -102 301
6017 301 -166 -44 181 -197 49 199 -202 216 297 -40 246 212 -36 64 -37 -143 38 -26 -54 89 6 159
6039A59k04j65K30k09O4K45j89R7j29j56K41j9o2J01K01k25L4Q6pJ7l20K12J26
6062A28l10R6J63j59J04M7k57J29j27P1N99l73j18M8n3P5j06PJ70j24o5j6o1k3
6086a55K61j65J21j39q1K62r1j84K85j56O7K50k45p9J75j95O5J87l15O6p5K28
6108H7j24m5K07o2j30J05o4k77K04L11k43J11O8k46L29k99Q2J3Kj61J29j66Q4
6131h5L87m69J79J91j96O7j7k61L80k39J45P6l38L0J82l19L24J65k55M00m10J37
6153G4q3k64K58n6o3J60p6O3L2L0l3n4j9J45k1m08M72j6j47M6K9j51l6j13J83
6178d8l2O8j56K52N9j1k04j18L23k49K39J5l10K40k0r0J11R1l27J56j74N0K35
6201A00k09K5J93j15P4p4r0M1m9J04J39k34k17L61m4r3J36r9M5N8l97M41L8k22
$$ plain form
6039 159 -45 -210 20 -189 -125 120 -69 28 -101 -257 -16 -35 -97 4 205 -20 14 100 93 110 -210 2 128
6062 128 -182 -86 77 -82 22 69 -188 -59 -186 -115 484 111 -7 41 -12 63 -43 -36 134 10 -55 -71 -132 -155
6086 -155 106 -59 62 -77 -158 104 13 -171 114 -42 25 275 30 -49 126 -69 -4 183 -132 -66 -141 87
6108 87 -37 -82 125 63 -67 38 -26 -303 -99 212 -31 80 148 -98 231 -68 14 27 29 -132 -3 -169 -85
6131 -85 302 -167 12 203 7 74 57 -204 176 -63 82 158 -180 -150 32 -287 37 202 -53 347 -63 74
6153 74 -9 -273 -15 -71 -134 26 -50 13 45 75 42 -12 -31 114 93 -315 157 141 -6 40 69 -82 -118 -231 -48
6178 -48 -80 -12 -168 84 143 132 -72 -190 133 -116 123 138 -172 68 48 -42 69 160 -167 -11 -185 -135 100
6201 100 -109 -84 109 -6 68 -6 -96 -55 -104 0 139 -95 -312 49 5 -88 48 -51 -6 52 -345 96 134 -88
6225h8K34p8o1oL1K49j30l55J92L9L6k03R1q4L44k43K12p0m05N01p4j40J34j37
6249a1m7L13k37k9J65j10p9Q8j29L19k51l56L97no4K11l38K45nm4p3K72k01n8
6273b7J26J6k1n3j71J26J8o2L6q4J87k21j1M14l39l6J56j30O4Q3k07J89K06n39
6297b80K19K09k72K13%j28Q9p5O0j8k18J94J6M4r7J04n9j38L37k63L22m39m5K14
6321a1j67K52Q3M1k61P9N0J71j45j43j26n8K10J82l48J27K07l17J73Q6m06M12
6343I1J1K9J4m30L10j19P8L07l89k0K87m16K22J76k18p1K75l02L5K54k09L16l64
6366a33Q8K12j02j43J90j93Q9R9j45q6L3K4J4n7L1mm5K63j22j37K33j01j16L38
6390B30j94R7k66K26j33j03m4R0K75l25K17l5j13Q3N4j14K61k90J68q0k6L5Q3
$$ plain form
6225 -88 146 68 7 1 32 281 151 -204 -12 27 63 -140 -49 -133 211 -32 180 110 -295 206 132 -8 126 -11
6249 -11 -58 255 18 -11 154 44 -35 53 -76 243 -8 -364 33 28 -36 175 -163 82 77 33 -40 232 31 -27
6273 -27 99 115 94 41 -130 -4 14 -48 -12 -96 91 -130 -141 273 -66 -102 54 -76 -12 71 -136 53 259 -280
6297 -280 -61 148 -124 89 89 -39 50 -25 35 17 -201 -7 9 53 -44 60 1 -137 200 -63 259 -180 -225 -11
6321 -11 -178 74 157 198 -63 16 66 237 92 -51 -177 -235 -25 157 -191 -64 143 -174 -1 85 -321 91
6343 91 102 131 145 -285 25 -94 -16 291 -98 -118 169 -247 -25 151 -67 -138 137 -165 -130 124 -85 231 -133
6366 -133 -45 167 65 -78 112 -81 8 107 -38 -124 -91 -67 -53 -110 -79 -83 -128 135 13 -124 109 8 -108 230
6390 230 36 133 -133 93 -40 -143 -187 -97 178 -147 70 35 -78 5 59 -55 206 -84 84 4 -22 13 96
6413I6k48J73J00q8J25J42j42k4j08mJ47m9m8R7k08K28k16j47L19k89o9N09k24
6436G2j77j40J47J97j34R8q4K4j78L08Rk77L50o1m0P7j81R8j69M9k2J15o3N4k50
6461a78Q5N3J6j67K03%j4j69N7R0K22j46R7k76K29l55J44L76j25j7o2K1r6J85
6485A73j06k22M14l38J81p1k63kJ42J41j47k23L85J43n1J87k91j60M9J27k48L61
6507A81r4k29L21l63J62J23n5k1k27J35Q6j39L28j22j16M4J13j10j6J85l84K23
6529B5r8J02J60m7n4K01j17n1k02M7K06j59K19M2l27L1P9l64Q2L18M2Qn1k64J72
6554@J24j92L2KK7J39l48J96L7j51L25j04mj16p2l6J00M4P3o3o5J04J14l05K03
6579F4l4j03J69k49K11R7j8j38M5k01K43J75l52J92J9k31J52k42jK84l13KL18
$$ plain form
6413 96 -152 21 121 33 158 300 158 134 26 22 169 120 72 169 -39 189 -27 -174 145 -144 -213 296 72
6436 72 -105 -245 -98 99 -35 63 -21 3 -175 133 142 -135 215 154 114 191 10 108 -61 -12 -34 81 18 72 -178
6461 -178 -93 -40 -24 -191 12 12 -2 -171 -114 -24 198 52 149 -127 102 -253 -109 267 142 125 63 84 -12 173
6485 173 67 -155 259 -79 102 31 -232 -234 -92 49 -98 -321 64 207 156 343 52 -108 -59 68 -180 181
6507 181 87 -142 179 -184 -22 101 46 25 -202 -67 19 -120 208 86 -30 14 127 17 1 186 -198 25
6529 25 -73 29 189 142 88 289 172 121 -81 -34 172 13 232 274 -53 -22 57 -307 -225 93 135 143 92 -172 0
6554 0 124 -68 -36 -34 -7 132 -216 -20 17 -134 191 87 83 -33 -105 -141 -41 3 76 13 -52 52 166 -139 64
6579 64 30 -73 96 -153 58 155 137 -1 44 -157 86 261 -91 101 120 -111 41 -201 -202 82 -231 -229 89
6602H9k77L8K04n59O07o6j9O7rM8k7l5J67l01j27K24J12k09J41j71l7P4R2j8L0
6627C8j06J83Mj92r4K3J06K44k25L84k25k1k40J10Pk17K73k7J82j55Q0Q6q7r6
6651C5l8m6J14J91l52K9J45j01Jj7J58lj97J39k1l66M31n5j92O1N8j67O6K57k30
6676a00J00n8oK53j28J18o0k19j57K50J7P4J24oj81j13N6J53j46K18j24j22J72
6699A15j58j1K66k11m9J26l4j55K31k02K64o4l47K06k29M8L86k06J24j46o3J31
6721B2k29j6K72K22l56k23M92k06O7k71J91j24J32Pp0K02k08K50k80J31J02k4
6743H3L7l34K69O2j49n5M6j02J82r9k01K03J3k0J53j31J71r9l77L50L6P3J00k82
6767g1R3J87l09J18l0L8J0j91O3N5nQ6lj07K03n9j90Q1qj98L73p8q2J26l18K84
$$ plain form
6602 89 -188 -150 54 -505 102 36 17 84 75 123 96 61 228 -73 -200 24 136 -73 68 -103 -140 -66 26 8 38
6627 38 -68 115 119 -73 -167 -144 -38 206 -19 365 140 119 -121 -11 -4 -221 52 25 207 52 132 218 131 35
6651 35 -3 -49 65 256 -96 -67 78 -23 -22 -39 119 116 -81 58 37 -329 102 47 -145 -84 -26 -193 -127 130 -100
6676 -100 0 -58 -64 189 61 179 119 -100 -257 -7 10 84 208 202 21 -92 -36 117 -29 189 65 -57 115
6699 115 -43 -54 212 1 -48 78 44 -111 120 -82 182 118 -229 -23 -252 -204 182 -24 100 -46 -109 22
6721 22 -207 -223 49 271 -85 -308 184 -22 45 -226 -35 -159 -27 -20 -90 112 -96 154 -126 5 107 83
6743 83 120 -214 55 117 -32 -87 -41 -143 39 -60 -261 -58 -45 -65 88 -43 128 29 -348 2 38 111 211 -71
6767 -71 22 209 -100 18 -12 26 36 -155 -92 -37 -42 44 41 -66 137 78 -112 -31 -39 -237 136 58 -24 102 -216 68
6793F8j39M6r2L9K59j75mj57J61O2r6r7J10j82J00J9K48k45J06j3mJ0p6j01J05
6818d8J15j93K00L5R5r4J3m21J22J39J7N3r5N8K98l30j04L90l85k3J37k41K36
6841b6J01k3J32m67K35K1J36k64L38j87n1J09j93M07k51O4j1k66K18Q0m8R4k45
6864i7P5R5J28l24J87Q6k28K82k79O8j3m6N1J18n1K5k81J87K13k69K8o2p6P0J8
6889i5J09nQ1Rj16J7j38P6j9j0J81j50K01Mk22J65J52k91J73J47l51J37n3J35
6913A37j24j46J66p9o0K11j72N1k9q5P2N8K4p5l6R2q7O0K2LN3Pj6j90J11N0p4
6940e6K79j12m8K21j98q4k80L34r9K50k86k4N0K5J69k59J27jl40M31j06j68K58
6963H3m9k07K79j34k02K16J47m39N04k59r3J53k2r5j8j55M46p7o6K16k98L8N6
$$ plain form
6793 68 -71 -25 -117 -78 181 6 2 -155 6 68 -28 -125 -15 -197 -97 -78 170 -75 31 18 14 24 -52 -153 -48
6818 -48 67 -126 74 109 204 110 123 -298 -176 -37 -20 33 -62 -4 294 -36 -140 250 -135 -158 -21 -262 -26
6841 -26 75 52 184 -283 -48 -27 109 -155 183 -4 -55 54 -139 268 17 81 70 -196 22 102 54 148 -97
6864 -97 -22 73 201 -123 64 150 -78 204 -75 -7 -20 -66 -15 103 52 77 -204 -17 196 -73 -45 -107 -183 -113 -95
6889 -95 14 9 90 99 -17 0 -138 -62 -81 -91 90 -60 141 145 -77 88 240 -51 122 269 -82 55 2 137
6913 137 13 -133 33 -46 -106 105 -67 -16 -45 -130 -58 0 24 -51 -87 5 -82 -22 0 3 56 63 47 -143 -32 18 -56
6940 -56 223 111 63 284 86 2 -278 56 -43 207 -79 -103 -53 -28 141 -118 9 8 -332 99 -7 -175 83
6963 83 34 -173 106 -28 -230 -14 133 -306 198 -61 -154 -1 -23 -118 -136 -291 155 78 12 228 -70 -32 24
6986B4r6K28m5j67O3J46k7k0l7j75J24p1n6K68j59j35K91l63K94m1k90L39m5m5
7010ER5j10K1jk97L92j80j13J62M1M3Q6k07L4L8j01J50O6k68J26J04j38J52ko9
7035B9j92nK31Q4k47m3N0qM3J60l70K68q2P0K66k81J49K3j49nP1l6M7Q1k39J29
7061D4m9j74L55j08k6o9o3Q9j5j20J20J11j96J00KM5r0O4M5o3N0J24k76J10j3
7086co6J18P6r3j97M73k15j99K86j10J1J23k47J22k71K4K54q9k03K80j60k4J77
7109F7j89K87l82K63N1o2k26L77j83L8r7k1L32j58j40J89k96k4L66j10j29J05
7131E8j37K86j97K4K27l56K51j84J40l26M04l01Q5j5K6J52N1j65J17k39R5J30
7153A26n3k70J9J59P4J4Qm5Mq7l2k4K0K24o7K4rj26J19J66m28K46O6j61J67k44
$$ plain form
6986 24 -72 156 111 -56 7 153 126 106 69 -106 18 -53 -109 159 0 -135 156 -207 87 46 -244 95 50 5
7010 5 100 -10 11 10 -287 105 -75 -188 -26 15 58 144 -63 -29 9 -92 58 124 -144 -18 86 -52 100 98 29
7035 29 -163 -168 63 147 -100 -143 -93 -101 -58 102 -268 0 -82 -12 254 -27 122 145 -4 -9 62 26 73 154 -85 44
7061 44 -5 -179 176 68 42 -27 -90 -1 -16 -136 -16 95 -101 -1 1 46 -44 20 65 2 52 176 -100 10 -3
7086 -3 -69 49 125 32 -165 308 93 -106 180 70 81 204 -43 79 -192 -168 86 -3 -206 74 -86 -110 67
7109 67 -122 165 -217 46 97 35 -191 186 3 41 -56 -77 255 97 -43 146 -150 -174 192 82 -47 58
7131 58 -79 207 10 34 261 -95 156 -28 112 -214 190 -111 -26 -41 -15 137 188 23 140 -99 -4 126
7153 126 73 -197 -178 -19 55 69 77 32 36 -51 -83 -107 -87 137 70 94 85 -41 78 244 -184 62 128 -33 134 -110
7179a10o5K10P4m9m0%M4J15l58K18r5nL34l49Q1J6r0k0m4kK59j72j38K38n8j73
7205a79J99J8j05M3k79J61N7n7J53J04j83K63m01K54j83l1K26J27k73K3k4j7K61
7228A57o7j12Q2j66J66K04k95L0Q0k22R9J42k7q1o2J11M0j25R7j63PK43j65r6
7252a23Q7nJ24p9J25p4J07k36O0K6k58M75k55J25J21k56J08k42J67R0M0k40O5
7275d8L53j29l17p2J68mk33Q9K09j0k2J2rJ11l64K48n9J29p0qL7m3Mm5K38o9k1
7302G5L7k26K7J86j76K05Mq8r9J41j20o7m6L71r2j93J49k96J80J06p1j46L29m61
7326b71K76J52j90j05L05k13K13j50L8r1j28M1L35k7k37KQ2r6K68j68q0j81J79
7349d6K30o4j75O2p4N4L60k08l09K22j53jK37q3j13J1J4j12K20N8j81J8j4m4j66
$$ plain form
7179 -110 -175 35 109 60 20 20 64 179 -179 39 -56 -61 273 -76 5 21 -69 -89 -133 -135 124 -48 -186 52 -6 -179
7205 -179 20 38 -67 -24 -303 -142 -85 -142 11 115 -68 195 -206 48 -135 -166 60 187 -86 -63 -87 -104 157
7228 157 90 -22 60 -106 60 264 -31 -1 79 -143 -44 98 71 -10 -72 39 79 -46 51 -112 -105 138 -27 -123
7252 -123 -36 -41 83 4 129 55 162 -74 -14 12 -246 229 -26 99 220 -36 72 -170 -3 87 127 -113 -48
7275 -48 305 176 -141 -213 -45 -49 -282 -193 16 6 -16 -4 -13 98 -266 -18 -77 52 -18 -26 11 -32 -28 -73 165 96 75
7302 75 112 -114 -87 99 -77 128 132 44 -55 86 -34 -101 -147 224 132 -61 88 -208 -28 78 7 -139 190 -271
7326 -271 5 157 -33 -138 167 -46 167 17 55 -36 -164 -123 212 185 -52 -50 32 -64 204 36 -44 -225 -46
7349 -46 184 120 -55 7 -67 -13 347 139 -170 52 -101 -102 135 52 -61 -50 -36 -148 72 130 -51 -33 -47 -91 -257
7374b57J66J30q5J8l16L70j13L6J5K01j84P0J09j50P7q3J48j83k6qJ45k12J11
7397b1j29J8L28p7o9M7j09j43L13q6j8j25K60l43K17Q3j10LJO4j39Q8K7J07k77
7422i0M1k1K55k85N1KJ22j22M5N9L2K5m19L56l7p2K26J1l03L46j56k17J18k5J28
7447G0r9M1j25K03k59P6K07j22J86k87L4J56L3J01k72R4J05j5l39K93J31j89J05
7470A28j73j48R8OJ94jj51J64J6K1j68j7k47M24j83J41K1k51J89P9r4q3K6p0J44
7495F5o5k04J58K2P4J54l25K05J21j51q5K5k02M55l68K8K77l17K00o6j7P2J31
7518A87j74Q6j75Q5q2n5J40J66j15K61l79j57K14p1P9K0Q7J17r7j42J15ok29K35
7542A10N2l21J61K9l5j8l2Q2R4r4O8J30l14J40K05k93NK1%L00l32L1J9r1J80j17
$$ plain form
7374 -257 -91 39 -46 -28 -344 26 -87 -51 -36 165 -19 51 160 10 87 4 152 -31 -57 -65 80 -132 -21
7397 -21 -150 -132 196 119 50 97 -12 -155 158 72 54 -71 189 -154 63 146 36 39 40 104 -35 53 80 187 -90
7422 -90 -49 -70 185 -100 -49 -47 75 -47 -2 57 89 114 -305 51 14 -58 168 179 -124 222 66 -151 -33 -58 70
7447 70 -29 12 -113 90 -169 -93 114 -8 178 -109 -75 81 114 215 -57 37 142 127 -212 81 212 23 128
7470 128 -45 -193 -95 -89 105 104 -47 117 133 154 -14 -31 -278 146 -37 104 125 -126 63 142 48 -35 -9 -79 65
7495 65 0 -204 -46 -24 50 204 -121 84 205 54 -31 -6 -208 247 -121 -93 184 -133 67 1 -16 56 187
7518 187 13 99 -76 9 -73 -128 12 178 63 324 -55 -212 2 -69 10 30 117 234 137 -5 110 104 -125 110
7542 110 162 -159 2 31 -4 -22 -54 28 122 28 96 226 -88 52 257 -36 -31 -10 -10 290 -42 -11 8 -83 97 -20
7568b0j6J28J17m37K17J51k06Mq2L04j20n8J11p7k66K20J2j3J44j82l7Q5k04J79
7592d6Pn9K99o7k10K34k50J21j42j15L43q3q1j53L97j04J53k28j1M4k3K1J68l03
7616h8O8J3q2K5J31J92k09j22K11Q2k95J32q1J1J4K3k4k8M3n6PK03k14N1R9p7
7642B9o5OJ5Ok6R1j16o2M02l79P6q1J26K3Q8J2l31J79R5KMj3j08j12J65K2j44
7669i6K02nj99J64j79K6J20nj28L46j98m8j14MJ76L5M6j63MP6K25k94k6j56Q3
7694a04J6J94j7j85L3p3K25n6j09l7O0K06j96J05nJ22k62J19M0k16K03N1j65k4
7718g5P8k5Rq6M16l67n9J46p0j36K22p7m0O1k6lK7K4j82L98k33O4j94J15o6J83
7744A04j66K98l72L33k12J2R8r9j0j00L21n1j38j19K5O8j15K53J18k01J7j40L0
$$ plain form
7568 -20 -36 92 209 -228 -11 140 -66 -62 -144 160 40 -18 93 16 -250 -30 -18 -31 113 -69 -106 -21 -225 -46
7592 -46 -39 -98 201 134 -76 158 -92 29 -113 -228 115 32 -49 -202 195 91 244 16 5 49 26 47 215 -88
7616 -88 -20 -7 -89 -64 67 259 50 -72 139 221 -74 58 -23 -12 2 25 1 -27 16 -40 -33 170 -44 7 106 29
7642 29 -36 -30 -15 -9 -35 56 -60 -122 280 -99 -23 -104 22 45 133 145 -186 -7 88 90 94 81 -27 -139 26 48 -96
7669 -96 106 101 -98 66 -113 -87 33 28 -100 246 48 0 -114 -110 66 101 147 -16 -12 64 289 -5 -31 -187 -104
7694 -104 -88 106 89 -96 -63 -136 89 33 -76 -113 -53 153 -43 62 57 179 -83 36 76 -140 63 114 -51 -75
7718 -75 3 -22 -13 -99 317 -50 -109 37 -33 -169 53 -24 -64 -3 -29 -32 -5 19 -163 235 2 66 -128 -13 -79 104
7744 104 -62 236 -136 197 -15 -3 95 -4 -14 -114 207 156 18 -101 -76 -8 -123 130 248 47 64 -76 -46
7767d6MK5j84K02j58K3J53m0J79p2Jk6L2k02M6o4J41k41K47J73l89J00p6L16j74
7792c0k1L6q5O7M9m0M1r7M0l6Q9K42j62P5j78J12j64L2nJ81p4Jj75L90j64k5k46
7819a47J01J06qm3K02m6o4j66J64r4No5J60l01K42m5%o6J98k30R1o5K06k42J67
7844F0j68k0O1M5J13M1l0j16q0J50k29O2P8j31J40J33j0NJ1L8q3k85J04j7J76
7869D8k35L71r4j54K0M0j2k2J99j7l22J07K67k69L0MQ4q4o2N3J63j75N8Q1K28
7894C07o00K83P5j54J19M0j52L47j12q2p8j0J59n3Ko8k43J33J62j87M1j9M9J91
7918A50j01o2L4j07J52r4j35K15n7Q5n5J15o6L3k73J17P8j58N3K02n7j00J92l93
7942b32L48k40ql0J38J98j85K38j71J16k82P6l1Q0j00J59Ok5k7j52J50R5L4m9
$$ plain form
7767 -46 -42 -17 -201 1 -157 -134 19 -21 158 86 87 61 93 -109 -63 -127 14 -227 20 193 -196 -96 -172 144 -30
7792 -30 -51 -15 -100 -33 16 -24 17 -80 -40 -76 13 255 93 168 -10 102 -62 -30 -35 146 72 73 -102 288 124 99 -147
7819 -147 -46 60 52 9 211 165 101 -65 99 5 10 -55 105 -196 46 1 1 -65 133 -97 -6 -71 135 -107 60
7844 60 -108 -128 -67 -22 91 132 102 -14 -94 56 -173 -111 -33 -164 -24 109 99 104 115 153 70 -215 -111 -128 48
7869 48 -187 184 90 -64 -44 -4 -16 -38 161 144 -178 -71 196 -73 -43 -39 45 -39 -101 -48 115 -60 -2 79 307
7894 307 -293 -10 65 -89 30 70 -82 265 153 71 -7 -17 142 89 91 23 -220 -87 75 -112 -71 -90 -41 150
7918 150 49 -13 21 -86 66 -28 -163 52 -5 80 25 140 74 107 -166 -49 29 -129 -76 126 69 -31 161 -232
7942 -232 116 -124 -132 -162 -24 174 -11 227 56 172 -110 -34 -65 15 -85 74 80 55 28 -124 26 121 155 106
7966A06K2j71k0qJ03R7ml2J8j46L1J1K8o4K0J57k62J58j0m8k1n9J09k62K52k7
7992b2K6j33jOj4O6P3O3r0J59k07k1j01R2J77J6j82J07o5J46j33K58j55k05k6
8017a66L27k19K26l15J54q9l2J34r0l0K28n5Q1j55j62J26P9n6q7K52j56M3K7J22
8041A87p6l1j71J14K5L4J55l85L16o4p3j57K29n5j92K85l07K70j37J76l50R3Q0
8064c4L2k7o2M8Q4j50RO5o0K63j72j38L47k60M2l3j3Q9j24L07k16L8O7k10J9k
8090i1J94J15l56J19Q2R2k94J44Qj0j6jr9J18M0j93J99K3p0K09k18m9J61j30J71
8115A48l20M39k23q2k61L50L92n90l8J21K10l6k23J48J07j89m0K26k94J63q8K4
8137e6L37k13j45K50j98J17j65K77l11K60k28K59j81N0N0j4j04j41l7J95P1j31
$$ plain form
7966 106 128 -43 -63 -71 32 129 125 93 111 -35 -4 7 35 -29 -9 148 -114 44 34 -14 -35 -94 15 -247 5 -22
7992 -22 4 -129 -130 -124 -138 -72 1 64 -26 133 -74 -95 -196 -104 73 89 -93 14 -51 95 -38 220 65 -140 -166
8017 -166 161 -58 168 -147 7 -82 -114 20 -70 -100 128 73 154 -1 -163 -37 42 -14 -101 151 -5 38 65 187
8041 187 111 80 -91 23 48 82 237 -148 168 104 31 -126 103 48 -144 141 -166 104 -33 143 -207 -114 -34
8064 -34 -2 -29 -91 -43 41 -109 -100 -35 -95 168 -4 -142 205 -55 -13 -46 -59 30 -94 213 -3 35 102 -108 -89 -91
8090 -91 103 218 -138 -19 63 155 -139 5 13 3 -13 -14 -113 5 45 -148 51 74 4 213 -5 -54 107 -23 148
8115 148 -172 267 44 -38 -299 51 443 -147 -185 -64 146 110 -113 35 142 -47 -87 139 -155 8 -80 -56
8137 -56 281 68 -77 173 -25 92 -73 204 -107 153 -75 184 3 53 103 89 -15 -156 -193 2 73 -58
8159e8N8l1k6m1r0J70M6j84L7P2N8P7J63r6q0j62J15p1m6J95j82J23l1j62J76
8184C0j63K40j59J83n2N7k20
$$ plain form
8159 -58 0 -31 -57 -98 -188 -18 28 -156 -119 -47 11 88 251 155 75 -87 28 -43 -89 106 -76 47 16 -146 30
8184 30 -133 107 -52 131 79 136 -84
8191h4
$$ Imaginary data points
##PAGE= N=2
##DATA TABLE= (X++(I..I)), XYDATA
0@%%%%%%qJ6j6J6j6K4m0N6o4Q0j04J28j60J92k28K76l28L84m48N23o11P07q15
29d36R37j075J227j393J578j785K014k264K536k834L164l526L919m346M815n330
45b799N893o505P170p901Q707r592J0565j1642J2842j4188J5698j7408J9369k1640
59a1431K4312k7499L1375l6221M2476n0895O2881q1407J14005j87486O29403q2463
71D27050j261458J010702K26574j033015L27166J034808p76633n33222R54502
80C76474J43978j001368K13512O17590m64183k02202P02009o5419o62129J06975
90b34763M68728k25433k64988L88633J74955m88628L3437M62459l33543m13369
100d32512N25180K07067n45047J51810N23069m93934l60823O83690j9310p09452
$$ plain form
0 0 0 0 0 0 0 0 -8 8 -8 8 -8 16 -24 32 -32 48 -56 72 -88 104 -124 152 -176 208 -240 283 -328 379 -436
29 -436 501 -574 653 -740 838 -947 1067 -1197 1339 -1495 1669 -1857 2062 -2284 2531 -2799
45 -2799 3094 -3411 3759 -4142 4565 -5027 5538 -6104 6738 -7450 8248 -9160 10209 -11431
59 -11431 12881 -14618 16757 -19464 23012 -27883 34998 -46409 67596 -119890 509513 427050
71 427050 -834408 176294 402868 -630147 -302981 731827 -44806 -578028 376474
80 376474 520452 -480916 -267404 350186 -113997 -316199 385810 320391 -341738 -234763
90 -234763 233965 8532 -256456 132177 307132 -181496 -148059 314400 -19143 -432512
100 -432512 92668 299735 -245312 -93502 429567 -64367 -425190 258500 239190 -470262
110d70262M89325N06307q04319r2515Q31231l79391n73129P33798J69530q70772
120d60197K37542P58917n62847m40470P32890k16p08397M02057N10468o21394
130a51647k35115O45082J7551n15206J47974L25745l60512k07570N47243J43697
140C57242n61500J6065M66631k51759l69026M11306J88316n19555J04345O21005
150D63070l63057n47720N02047J78684n64575K86346N35036n48879l03994N89240
160B26198p3517n45478L60848L75216m73377j2845N17253l28721m56303M26821
170A6095J59974l89552J93441L51071l19102k25661K88663O766l06198J43446
180h1057L19689j83877j92206K36910J3922l13635O6031K97562j20118j95843
$$ plain form
110 -470262 19063 525370 -278949 -371464 459767 80376 -492753 241045 410575 -460197
120 -460197 -222655 536262 -26585 -467055 265835 265619 -442778 -40721 469747 -151647
130 -151647 -386762 258320 275871 -239335 -91361 234384 -126128 -333698 213545 357242
140 357242 -204258 -188193 278438 26679 -342347 68959 257275 -262280 -157935 463070
150 463070 100013 -447707 54340 233024 -331551 -45205 489831 -59048 -363042 226198
160 226198 152681 -392797 -31949 343267 -130110 -142955 374298 45577 -410726 16095
170 16095 176069 -213483 -20042 331029 11927 -213734 74929 81695 -224503 -81057
180 -81057 238632 54755 -137451 99459 113381 -200254 -134223 163339 43221 -152622
190a52622K66899J18291m11199l3095L90654j77662k46182M21422Q3151m85482
200b25825J13871L77403l22624k21999M35021K1306m15186K35678L05209m32322
210a29468j22501M52000j05108l18137K82736J30515l48479K7673L20705j36001
220E3935k34527K12309J10381k56031K9366K43247j34335j64460J89694P4481
230A24060k14566k5665K02125l9324j64294J72107J29065k77879n4134K56971
240A08466j07796j80861K56261J17440k71518M197K25954j85866j99238K94294
250F1333J02684k78588J14493K20144k88131j39024K74987k2496j90638J93587
260D8351J63077k35686r9319J88224p4322j79890K04807J58438j82825j4172J41274
$$ plain form
190 -152622 114277 232568 -178631 -211726 178928 1266 -244916 176506 259657 -225825
200 -225825 -111954 265449 -57175 -279174 155847 177153 -238033 -2355 302854 -129468
210 -129468 -251969 200031 94923 -223214 59522 190037 -158442 -130769 189936 53935
220 53935 -180592 31717 142098 -113933 -84567 158680 24345 -140115 49579 124060
230 124060 -90506 -116171 85954 46630 -117664 54443 183508 -94371 -148505 108466
240 108466 670 -180191 76070 193510 -78008 -73811 152143 -33723 -232961 61333
250 61333 164017 -114571 -78 220066 -68065 -207089 67898 45402 -145236 48351
260 48351 211428 -24258 -123577 64647 -9675 -189565 15242 173680 -9145 -23317 117957
271A17957j29454j56491J27212J18271r4953l156J58260p1117k00342Q8777R7854
282E2818j42779L0015K03574o0490j62305P8905N7917j66499L327K22649m9972
293F7160j52686J55432L9158k32637L5127J75474j06649o6074J78192R891j89978
304h7590L5300J36297j23735o4618J88692j4106j62204R6563Q4744j38512j8061
315f7230J28861k3967j04215O3078P8825j07829l4252J35283k9208j16088P6547
326a95N3341j01762k997J11922j0585r4984M4908O2107j19328l2236J49579j7302
338D2468r2161J02086L2532j45356j3012J00536l7740n6917J18835N8872j37815
349b7672j6425Q8380r9666n2284J55778K8244q9773M3762L3419j09403n3337R0110
$$ plain form
271 117957 -11497 -167988 -40776 77495 -17458 -20614 137646 66529 -133813 -45036 52818
282 52818 -89961 -59946 143628 83138 -79167 -262 57655 -108844 -105517 117132 67160
293 67160 -85526 69906 109064 -123573 -88446 87028 -19621 -85695 92497 102388 -87590
304 -87590 -52290 84007 -39728 -104346 84346 70240 -91964 4599 89343 -49169 -67230
315 -67230 61631 37664 -66551 -3473 75352 -32477 -66729 68554 39346 -76742 -195
326 -195 53146 -48616 -51613 60309 49724 -45260 -352 61755 -57573 -89809 59770 42468
338 42468 -49693 52393 84925 -60431 -73443 27093 -10647 -67564 51271 110143 -27672
349 -27672 -44097 44283 -55383 -107667 48111 76355 -13418 30344 63763 -45640 -98977 -8867
361h867L4935m8118O5884O5194j15093o5486O1977k2538l4822Q4679O5415m4265
373C8895m7157K1517k5099q5002N2468J08018m0080j6933O7003n8366r6658M3100
385c8294N4129l7075Q738R0395k2537j04414L3985L0131r1183L7388J13120m8269
397B6114m4934N6047k2443p4470K5584O2968k4125k2880O1636p276q0799K8867
409a5711M3096m8117R2M5873j1338k9294Q300K6138k2090l3026N1666K1073o6880
422c0218J0331M5192l7480j698N9486j4524p1491N842N5100k6939j9232P3579
434D7948j6152p4710N6740J9206r3893J2481P1958r665K806L8987l4233q2310
446f0837N668O3662p280j852N4801k1520m9460J8373j4005m0131J8339M6527L9119
$$ plain form
361 -8867 26068 -22050 43834 109028 -6065 -71551 -9574 -32112 -66934 17745 83160 38895
373 38895 -8262 13255 -11844 -96846 -44378 63640 23560 6627 73630 15264 -81394 -38294
385 -38294 15835 -21240 -12502 77893 55356 -49058 -15073 15058 -76125 -38737 74383 26114
397 26114 -18820 37227 14784 -59686 -34102 28866 4741 -18139 43497 36221 -44578 -15711
409 -15711 27385 -20732 -20640 25233 13895 -15399 -7099 19039 -3051 -36077 15589 36662 -30218
422 -30218 -19887 25305 -12175 -13873 45613 31089 -40402 -34560 20540 -6399 -25631 47948
434 47948 31796 -42914 13826 33032 -60861 -48380 23578 13913 16719 55706 21473 -60837
446 -60837 -55169 8493 1213 -639 54162 32642 -16818 1555 -12450 -52581 -34242 12285 51404
459E1404l743l6209j6071l8881k8364O1687M6473j8779J2358J7796m6697n3778
471e2804J7744K9584k1868L8466P5401n8988o1538M5101l5164n6174P8889N0128
483D8777l7014J3915J6319o6407m4670N1684L5060k4653K8763K7231n6742p423
495a5160L1069m1430j4819M1859J7424J4260m575l7824j7797m007J7769M0859
507B7628o452l4395K064J9203k04j1769Q429p365l0492M4299M2281p0244j5799
520c2816N5817l0646o002O1724m2419o8074M8548M5920k9565J98L0476m3521l8118
533d8478N9052P563n5714M2001L9152m1065O910O240n1527l700L4964J7543J6499
546B9440r75j8091j8694k0675o423J5927L0366J8011n286M646k4742n2312K3887
$$ plain form
459 51404 47661 11452 -4619 -43500 -71864 -10177 36296 17517 29875 47671 974 -52804
471 -52804 -35060 -5476 -27344 11122 86523 27535 -34003 11098 -24066 -80240 -1351 48777
483 48777 11763 25678 41997 -24410 -69080 -17396 17664 -6989 21774 49005 -7737 -15160
495 -15160 15909 -25521 -40340 1519 18943 33203 28628 -9196 -26993 -31000 -13231 27628
507 27628 21176 -13219 -11155 8048 7844 -3925 4504 -2861 -33353 10946 53227 -17017 -32816
520 -32816 23001 -7645 -13647 48077 5658 -62416 -13868 32052 2487 2685 33161 -10360 -48478
533 -48478 10574 18137 -37577 4424 43576 2511 9421 15661 -35866 -39566 -4602 12941 29440
546 29440 28465 10374 -8320 -28995 -35418 -19491 10875 28886 23600 28246 3504 -48808 -24921
559b4921K8090l0293M2276N0660n2176j7949J6173n8955k0470P5775L6608k5129
571A9689O672J451o7172j4445O4341j5762k5254P0549O427n1168J6598j7936n6361
584f2371L2528N6344O193m569j0930k9145j8831J4427J5628n609J2061J1926r071
597H581R113j8122m0917K6591K1867j4480L7067L979n9117R428L1409k7932j71
610a2704L4274j3996k8540K8557J4568m6290R034M5437l9390j3545M9303l1081
622d373k7705N2256j877l1673K3586K236l2427K496K2691q02j614K2071q570l5662
636a9367N202K395j1649L3741J3495j9532J5695j3775l7902J6299O018r517L9378
649B0481K2370k8629j6371k780k4198r719M4440K5189k3571J6470P193o3106o517
$$ plain form
559 -24921 3169 -27124 15152 65812 13636 -4313 11860 -47095 -67565 8210 44818 19689
571 19689 26361 27812 -39360 -53805 10536 -5226 -30480 40069 46496 -4672 11926 -6010 -62371
584 -62371 -29843 26501 32694 28125 17195 -11950 -30781 -16354 -726 -6335 5726 17652 8581
597 8581 17694 -428 -41345 -14754 7113 -7367 29700 33679 -25438 -16010 15399 -12533 -12704
610 -12704 21570 7574 -20966 7591 22159 -24131 -15097 30340 -9050 -22595 26708 -4373
622 -4373 -32078 20178 18301 -13372 10214 12450 -19977 -17481 5210 4408 2794 24865 16295 -19367
636 -19367 -14165 -11770 -23419 10322 23817 4285 19980 6205 -31697 -15398 -9380 -18897 20481
649 20481 42851 14222 -2149 -4929 -29127 -38846 5594 30783 7212 23682 30875 -32231 -38748
662c8748L6961k2097J6474N6614j9550l2364M902k0690k3824K4603L6799J667
674B0747q81J2255l1837l7647J9414M894k628M2199M862k6838M163j9048k4568
687c4913K0403J3252M590K0762K12k2500j3498L39m007J24L0245Q466k4363J2260
701A1372k256l9832J8648K4950k4162J3860K0777k9101o383J8761q501j1057J4981
714B057J0562j6148l08J7083k0724o530L2860j0687j8017J6699j5851j1283K9780
727I493L650j0565M000r758r682M371N618R65J377J5509L365j7836k416j2876
741a4785j6985L2713K1431j1124J1344j2668l5190Q003R822o799J6874J9073k323
754A9386j0910q764j3863k0675J6209L5960j145M563Q687l9136j8553J7338o756
$$ plain form
662 -38748 -1787 -23884 -7410 49204 29654 -2710 2192 -18498 -42322 -17719 19080 20747
674 20747 19866 32121 284 -37363 -17949 -13055 -15683 26516 31378 4540 8703 -10345 -34913
687 -34913 -14510 -1258 3332 24094 24306 1806 -11692 -11353 -15360 -15236 15009 23475 -888 11372
701 11372 9116 -30716 -12068 12882 -11280 2580 23357 -5744 -12127 6634 -1867 -12924 2057
714 2057 12619 -3529 -3837 13246 -7478 -14008 18852 8165 -9852 6847 -9004 -20287 9493
727 9493 13143 2578 6578 -3180 -12862 -8491 -2873 -1908 -531 14978 18343 507 -1909 -14785
741 -14785 -31770 943 22374 11250 22594 9926 -25264 -17261 -7439 -14238 2636 21709 19386
754 19386 8476 -288 -14151 -34826 -18617 17343 16198 20761 29448 -9688 -28241 -10903 -17659
767a7659J0065L2345r47j1493p758j7278j3217L435K0474J4568J707J0173j2360
780A2055k9626J528j142n18L3221J0245j4384j1j7196j6181J2773N737K155J0274
794H930L979k551j1195q098l258p219J9537K1143j4802j999N59k2377R863J8654
808A1166j3371J056Q193p781P08L315m293n477J826J3016m507j1647Q343n922
822e375l807K3509l331j6526O027p897m886J6491K858n45L220o655n572p479k647
837a2615Q443L625J1806P618j6283n691n905j5476J6054J6470j210J4050l558
850A7328k4788n590j794m7J5176J4074O708q227j2575n255j7233j609K5852N771
864G791N794J3691k3206k1774L217m196Q942K1471O368m66q777j2524q599r584
$$ plain form
767 -17659 -7594 24751 23804 12311 4553 -12725 -25942 -22507 -2033 12535 14242 24415 12055
780 12055 -17571 -16043 -17185 -17703 15518 25763 11379 11368 -5828 -22009 -9236 -3499 -1344 8930
794 8930 12909 10358 -837 -8935 -12193 -19412 125 21268 6466 4467 5026 -17351 -7488 11166
808 11166 -2205 -1149 7044 -737 -29 3286 -1007 -6484 -4658 8358 3851 -7796 547 -5375
822 -5375 -9182 14327 10996 -5530 497 -7400 -12286 4205 7063 6518 9738 3083 -2489 -9968 -12615
837 -12615 -4172 -547 11259 18877 2594 -3097 -9002 -24478 -8424 8046 6836 20886 17328
850 17328 -7460 -13050 -14844 -14891 285 14359 21067 12840 265 -4990 -22223 -23832 2020 7791
864 7791 13585 27276 4070 -17704 -14487 -18683 -9741 11730 18098 17632 8855 -3669 -12268 -21852
878b1852J1172J8027K849R235l888k4476l592p58l347K0006Q560l543N306j1495
892B204j4095J779L36P393J0893L274n70j1885n741M001q881P008J5589j0475
906H30O16P825j7028j555J1307m044K556M519l600k917k703N619K270n966Q193
921E922j274j3100P601L49n906J4586M05r687K589q707m661R811J608N164N633
936A0333m503l459r131n401M838K474J4859J0780j4839m740m841j7564J0916J4574
950D296l620J0305N486j3310q688p462l740O201J3695J8562l392j6112l511j3600
964a4890n824K0525N198R57J2928q537j3174m013j1607K993J5269J0319P972o067
978A2049j3765p597p531P151J1707J143J0884M61j6216J58n424j0636J6346R869
$$ plain form
878 -21852 -10680 7347 10196 19431 15543 -8933 -12525 -13283 -16630 3376 11936 8393 13699 2204
892 2204 -11891 -10112 -9776 -2383 8510 11784 11214 -671 -6412 -2411 -11292 -4284 11305 830
906 830 1446 9271 -7757 -9312 1995 -2049 507 5026 1426 -1491 -4194 1425 3695 -2271 5922
921 5922 4648 -8452 -851 -502 -6408 8178 8583 -1104 1485 -7222 -11883 -2072 -464 4700 10333
936 10333 5830 2371 -6760 -12161 -7323 -4849 10010 20790 5951 1211 -3630 -21194 -10278 4296
950 4296 676 10981 16467 3157 -5531 -12993 -16733 -10532 3163 21725 18333 2221 -1290 -14890
964 -14890 -20714 -189 5009 5966 18894 10357 -2817 -6830 -18437 -15444 -175 10144 18116 12049
978 12049 -1716 -9313 -16844 -9693 2014 3157 14041 14502 -1714 -1556 -6980 -17616 -1270 8599
992H599l855O436m996j2797k370Q65M582L596N415O609j1659p017P136q109K496
1007e069J5581q592l755P744p909o07M684m580K261K774j219l24o673R70N699
1022I85RP131m040j3264N212M28j218J5063k667r213O836o068p995M816J98L333
1038d54Q523L220l403j4859n985M875j405J3263J3445j2103j852L38j6810J225
1052a1982R514j85J1868P188p339q365j1221l306M145P202J4066K514q198j271
1066D630j3132r751J1781K589O516J5852p657j0351j461j1280r72J0911O737O310
1080A0722L60m303q097j2924L748Q000o56J3190L878j5475L71j749j0032Q897
1094d070P510r60O064j818o580m123l331M625L126J766O487p146n725N089o474
$$ plain form
992 8599 4744 11180 6184 -6613 -8983 -8118 -3536 60 5475 12084 425 -6592 544 -7565 -5069
1007 -5069 10512 1920 -1835 5909 -2000 -2607 2077 -2503 -242 2532 1313 989 -5684 -4714 985
1022 985 994 8125 4085 -9179 -3967 -3539 -4757 10306 7639 -1574 5262 -806 -8801 -3985 -3787 -454
1038 -454 8069 11289 7886 -6973 -12958 -8083 -9488 3775 17220 5117 3265 3603 -13207 -11982
1052 -11982 -2468 -2653 9215 16403 9064 699 -10522 -13828 -9683 -2481 11585 14099 5901 4630
1066 4630 -8502 -18253 -6472 -3883 2633 18485 10828 477 -984 -12264 -13236 -2325 4412 10722
1080 10722 11082 6779 -1318 -14242 -10494 -2494 -3150 10040 13918 -1557 -1186 -2935 -12967 -4070
1094 -4070 3440 2480 8544 6726 146 -3977 -7308 -2683 443 2209 8696 1550 -4175 914 -5560
1109e560P81J0479o636J87O061r072L49N916l246K439J912k957j659l328L700
1124f34K305k449P778k075j1140M932k605n859J3000L527m576L849o015q079J671
1139f370J074O137N410J852J006r667o880J841l891P045J2765l964J038j216j5453
1154i273j630M152P1J1790P211l851m391q958n261J173L620J1345L756l176L107
1169I685j0795j1483N754m56M217J5530j450p517l350r229j461N581M775P114
1183F915pj598q91j0257j917M155j745J0282O852q538j247m282q020O769M388
1198H59n19M752k282l165m29l594K015J308P26O661l664m611L935n683J71Q636
1214E116m484j050L903o928m02L872p96L511l14k043p85n704K925N018k293N464
$$ plain form
1109 -5560 -4779 5700 -936 -749 5312 -3760 -3411 2505 -741 1698 3610 653 -1006 -4334 -634
1124 -634 1671 -778 7000 4925 -6215 -1283 -3888 -9747 3253 6780 2204 6053 38 -8041 -6370
1139 -6370 -5296 841 6251 8103 9109 -558 -7438 -5597 -9488 -2443 10322 6358 7396 6180 -9273
1154 -9273 -10903 -6751 -6680 5110 12321 8470 4079 -4879 -10140 -8967 -5347 5998 9754 6578 9685
1169 9685 -1110 -12593 -6839 -7295 -3078 12452 11002 3485 135 -9094 -10555 -4974 -199 6915
1183 6915 6908 5310 4419 -5838 -7755 -3600 -5345 4937 11789 3251 2004 -2278 -10298 -3529 859
1198 859 340 5092 2810 -355 -784 -4378 -2363 -1055 -329 6332 2668 -1943 1992 -3691 -3520 5116
1214 5116 632 -418 3485 -3443 -3845 27 -769 2742 2428 385 -400 -6104 -3179 1839 -454 5010
1230E010R82q268K032j525n825P232L093Q70N304o122p378k063k163O574O650
1245D403R70K224o078n698J371n686K535R862L96M520J080j2814m683j66P2R923
1261B231O139p64j939p566l867p74k259Q254O217n50M447o127j0865Q90m49L175
1277c807J0864P15j852k190p996j884N28J099P773J814o77J82p891k950K855j969
1293e386O529N438m351J522k708p010L211J420Q88N209j806j914j018m194K924
1308a246J349j833M696j315l814L282l160j236N729j462J35J406n185L84J722
1323e48j39M666j004k529N50m969r7M138j701M298L052n377l0l077m527N366K553
1340F25J960M899m220l913j631m607L072M466K011N140k684n778j392n903O78
$$ plain form
1230 5010 5992 -2276 -244 -1769 -7594 -362 2731 3601 8905 2783 -4595 -6658 -8821 -2247 4403
1245 4403 5373 7597 1519 -4179 -2808 -8494 -5959 3903 4299 8819 9899 -2915 -7598 -7764 -7692 2231
1261 2231 8370 7606 5667 -1899 -5766 -6540 -8799 -545 5672 5122 9569 3442 -7423 -6533 -6982 -3807
1277 -3807 7057 7772 5920 3730 -4266 -6150 -5622 -4523 3250 5064 4387 4569 -3322 -6272 -3417 -5386
1293 -5386 1143 6581 2230 3752 1044 -5966 -2755 -1335 -447 4762 2956 1042 24 -4170 -1246
1308 -1246 103 -1730 2966 1651 -2163 1119 -2041 -3277 2452 990 1125 2531 -2654 -2270 -548
1323 -548 -687 3979 2975 446 996 -3973 -4070 68 -1633 2665 5717 340 310 -2767 -7294 -1928 625
1340 625 2585 7484 3264 -649 -2280 -6887 -3815 651 2662 7802 5118 -660 -2052 -7955 -7277
1355g277Q186J406L402J998p531l305k298k132O435M130K532K818o197m517j516
1370c866m486N396O317P7L734k701p750p44k348J228P469J114J436K06o398j605
1386b921q84j451N937K716L27K081o189l449J256j900M411M053k988J025j061
1401I63m422K185n29M6M250j151M70J34n020J390K060r57M140j226m290J755j710
1418a912K93L936k003M68N96l719Q39K84j638M650J177j412J221m716j942K321
1434a557n70M477K670k903j04l194m878L132J387K172M633j765k503j797m859
1449e659J505K733P23O130M33l838j330n477k092N153K354M072J616m896j962
1464e35k787k798M002J275K094M792k210l326k201m785J944M956K153L532j735
$$ plain form
1355 -7277 909 2315 5717 7715 184 -3121 -5419 -7551 -1116 3014 5546 8364 2167 -2350 -3866
1370 -3866 -8352 -2956 3361 3438 7172 4471 -3279 -4023 -6371 -5143 2326 3440 4876 5082 -1316 -2921
1386 -2921 -3805 -5256 681 3397 3724 5805 -384 -3833 -2577 -4477 -66 3987 999 2024 963
1401 963 -3459 -1274 -1803 -1757 2493 1342 1812 1946 -3074 -1684 376 -581 3559 2333 -1957 -202 -1912
1418 -1912 -1619 2317 314 782 1378 -2341 -1502 -1218 -2856 1794 2971 1559 2780 -1936 -3878 -1557
1434 -1557 -2127 2350 5020 2117 2013 -1181 -6059 -2927 -1540 632 5265 3500 997 -800 -5659
1449 -5659 -4154 -1421 -698 5432 5865 2027 697 -4780 -6872 -1719 635 4707 6323 1427 -535
1464 -535 -3322 -6120 -2118 -843 1251 6043 3833 507 -1694 -6479 -4535 421 2574 6106 4371
1479D371n227l51k768J63M271N6K060J989l812j572k221k538M504K748L35K401
1495D409l747k928J058j596K067L019j325J512j194k802J335j605K76L542j545
1510D76j59J288l832N11J556o49K598j98j914O34k335L30L426r70J150M75m073
1527a686K17N91j604L254Q48o01J619l177k084K81j213L482L732j055L89k763
1543B30m036J556J83J816M189j357m26j79n161n49J233M8M862K192k025j011m168
1560b603k106K138P89L765K867k797J91k739m329K029J436J227M599r92k179j061
1576B35m268m1K541J058L602L46k540k80l323j003K803L23K348K213l080l05j028
1593c99l285K614J193K48K272j254k328j59j237J292J681m58J904j004k593J812
$$ plain form
1479 4371 -856 -1207 -3975 -3812 459 515 2575 4564 752 -820 -3041 -5579 -1075 1673 2008 4409
1495 4409 662 -2266 -1208 -2804 -737 2282 957 2469 1275 -1527 -192 -1797 -1521 2021 476
1510 476 317 1605 -2227 -1716 -160 -809 1789 1591 -323 311 -2024 -1694 1732 762 1912 2387 -1686
1527 -1686 -1469 -878 -2482 772 1620 1019 2638 -539 -2623 -2342 -3555 -73 3659 2604 2993 230
1543 230 -3806 -2250 -2067 -251 3938 2581 2155 1976 -3185 -3734 -2501 -2453 2409 4601 2576 1565 -2603
1560 -2603 -4709 -2571 -1782 1983 4850 2053 2244 -495 -4824 -2795 -1359 -132 4467 3475 1296 235
1576 235 -4033 -4074 -1533 -475 3127 3473 933 653 -2670 -3673 -870 -547 1801 4014 934 629 -399
1593 -399 -3684 -1070 123 371 2643 1389 -939 -1098 -2335 -1043 638 180 2084 1080 -1513 299
1609B99j389l92L282p65q55J047k342k86J442m93J633n7j449N98k073j55K366
1626D11q77J756J267k875m1p23k002L182J700m33J537k132k405L67j438J517K304
1643A115P64J324k121k847n1j505R26M740m43J20J074m240j398O40l25K591K289
1660B653K07l2l242k043J57p48K958K721j107R79j385m034N71J93P41L944K45
1677B778q11m17l262p88J023N26K470O01p33L63k966j198J305p95K048L035k596
1694E83l45J33k800J121J448J95J119m73n10k23j860J127N33n85K329l48k868
1711a424J262o58r02K858o00o62R14j632l20J034l61J485K96q77P38k210m57J460
1729e6p82J891J348k416j27k31k645J852J694k38J790n37j912n54j232Q96J544
$$ plain form
1609 299 -1090 -1482 1800 1035 180 1227 -1115 -1401 41 -452 1181 1124 -325 273 -1800 -1955 411
1626 411 -466 1290 2557 -318 -359 -1082 -3084 98 1798 1365 2902 770 -1635 -1268 -2706 -1189 1115
1643 1115 1879 3203 1082 -1765 -1816 -3321 -2395 2345 1902 2022 3096 -1144 -2542 -1902 -2227 364 2653
1660 2653 2860 2828 -414 -2457 -2300 -3048 -90 2631 1524 2503 1118 -2916 -2345 -2152 -1411 2533 2778
1677 2778 1967 1550 -1712 -2500 -1477 -951 1519 2120 1387 1750 -1216 -2414 -1109 -1904 144 3179 583
1694 583 238 371 -2429 -1308 140 335 1454 981 471 248 -1612 -485 48 -537 1792 1444 -1424
1711 -1424 -162 -820 -1722 1136 536 -126 788 -844 -1164 -130 -491 994 1290 413 1151 -1059 -1516 -56
1729 -56 -838 1053 2401 -15 -142 -373 -3018 -1166 528 290 2080 1543 -369 -923 -2155 -1259 285
1746B85M82K175j037k456M48k036q15L725R0M05J698k723j872m22o42J936J787
1763A028M69R00j797j376k01j671J725K375m17J581o46l340R8m62l97K854J209
1780A932p06M29j958j011k85k29K483M54O0R53k279j351J280j184J054K216j320
1797E38l45O40k027j61J013O5J161l83j40j91j545Q08R05q80J700q9j788J121
1815D02n67j357K222k2p15R43j378m58K14m2J030L11j2N24j721q84J165o48J208
1834B15K170j826j43J51k511P18R22J35J413K67p91o10j894m1Q58L60K734k42
1852A885j938O01j558j587K487L20K72J781q35j575n00j349N68J201R00J350j094
1869I29r13j86k117Q85J840n04J620Q51k765j7k64j546J982J047L86K98j116q18
$$ plain form
1746 285 767 2942 1905 -551 -103 -2139 -2954 771 861 1266 2964 241 -1631 -2053 -2695 -759 1028
1763 1028 1497 2397 600 -776 -977 -2648 -923 1452 1035 2616 1970 -1370 -1272 -1734 -2131 723 1932
1780 1932 1226 1655 -303 -1314 -1599 -1828 655 1109 1169 2122 -157 -1508 -228 -1412 -358 1858 538
1797 538 193 833 -1194 -1355 -342 -277 884 501 361 170 -1375 -567 338 -542 1158 1069 -719 402
1815 402 -165 -1522 700 678 -37 906 -472 -930 -716 -758 272 583 571 1095 -626 -1510 -345 -993 215
1834 215 2385 559 416 567 -1944 -1226 -304 -169 1244 1511 720 110 -1784 -1825 -967 -607 2127 1885
1852 1885 -53 548 -1010 -2597 -110 210 482 2263 1428 -147 -647 -1996 -1428 -227 673 2023 929
1869 929 16 -170 -2287 -1402 438 -66 1554 2405 -360 -377 -641 -2187 -205 842 1228 1526 410 -408
1887d08n94r10J749N77j25J605j707j573J594j316J41J909n39l00J038j303k66
1904d28J15q0Q35j17K37Qj591N63N81r03J586J62j869Q86O7j235J486J3l26Q67
1924H57n17p45j87m57J055M81J02J103k178p89J048j235P12K179j256K15P59k150
1942a003k76N48J42J468K88K38o11k072K55J0l11K233O78j185P26j218k112J403
1960g99J33L76J748m6n68r88j008K69J55M27J853m22n94J12k432M57J333q93J401
1979E14J278j682l03K17j548O24Q37L82P17l73j45p83j315J328M48l73J528p35
1997F16j485J029p85n83J713m17J48N26p58o7m65m9J059j21J19L48j603K30R02
2016C57j017J077P84j725O01K59j482J037L48n26J142m96l11l20p72J135n9J96
$$ plain form
1887 -408 -1002 -1912 -163 414 289 1894 187 -1386 208 -1108 -967 942 403 103 1141 -162 -428
1904 -428 -313 -393 442 325 562 570 -1021 -458 123 -780 806 968 -901 -15 52 -1183 303 316 -10 857
1924 857 340 -405 -592 -1049 6 487 589 1692 -486 -1275 -227 -1462 -750 1429 173 388 1147 -1003
1942 -1003 -1279 -731 -589 879 1167 1405 794 -1278 -1023 -1013 -1324 909 1587 402 1128 -90 -2202 -799
1960 -799 -666 -290 1458 1412 844 -144 -1152 -883 -728 -301 1552 1130 536 648 -1784 -1327 6 -887 514
1979 514 1792 110 -193 24 -1524 -900 -63 319 1036 663 518 -265 -1580 -252 196 -177 1351 616
1997 616 -869 160 -625 -1208 505 88 236 762 4 -63 -528 -577 482 361 480 828 -775 -545 357
2016 357 -660 417 1201 -524 77 336 -1146 -109 239 -287 855 359 48 -272 -1044 91 32 228
2034B28J669j286j304Q07j243j18K106k09j62Q92j755o68L21k36R03M86N89Jj498
2053d77k77J80j016J510J524r36R09n06k103M61K35m81J687M55m21j61j148k24
2071g89m32M34J532J15l55J057k037q59J403q02N74J612r61k79M2j178J05K61
2089e57O65N83m27L26n82j190R01L63q07J531M72j600Q85p36r72J409j1j62N67
2108F58o55k89j50k42R66k12J02J069j822l7J190j389P75J350j349L94K26j493
2126i08K30O60J0P66k49k07m85j040R42N4l60J800o37j089R83j116q63J796J42
2145D29l9R83q13r45j87l56M73L60P39P75j524k91M06j737R65J382o84J099K01
2164A236j852J21n4n96J354P54j42j47o22j24r22k27J705m21K65J112j570j072
$$ plain form
2034 228 1897 611 -693 114 -1129 -1247 859 650 488 1380 -375 -1043 -722 -958 -55 431 1020 1021 -477
2053 -477 -754 -574 -1590 -80 1444 508 1417 911 -1192 -731 -496 -977 710 1165 744 583 -565 -789
2071 -789 -1221 -787 745 860 505 1562 -475 -1334 69 -733 -159 1453 492 213 255 -923 -818 -557
2089 -557 108 691 264 590 8 -1182 -281 82 -725 806 1278 -322 563 -173 -1145 264 253 91 658
2108 658 3 -286 -436 -678 288 76 178 1247 -575 -612 578 -811 -36 1314 -35 359 585 -908
2126 -908 -678 -18 -8 758 509 302 -183 -1223 -281 -227 -587 1213 576 -513 470 -646 -1509 287 429
2145 429 390 1373 560 -385 -572 -928 -455 -95 644 1419 -105 -396 10 -1727 -762 620 -64 1035 1236
2164 1236 -616 -495 -549 -1145 209 963 821 674 52 -72 -994 -1221 484 63 328 1440 -130 -1202
2182a202J130r14K84J723m83l0J42q34l52J68L88O25n27N41j37j544P62L64j177
2201a073J448M55j480R80l18j176J067M65k79L82m18q8j63l11R75n48K01J026
2219A145j547j84R37j235M53J232p46Q4N55j087o15O71K56L83J74Rl46j017P23
2238a55j28o00J756K22j403R24m92j492J137j04J95J086l59n32n32k98L33l6P10
2257B32R91q06k82J76j484Q7J379p89J170O52j465j37l9q69O90O58N50J34n75
2276B73O0q24o57J246Q6k59J558r97j258Q27r03L0J443k86q5K43m89n52k01K33
$$ plain form
2182 -1202 -72 -986 -702 1021 538 508 650 -184 -536 -368 20 645 118 659 522 -1022 -260 104 -1073
2201 -1073 375 830 -650 330 12 -1164 -97 368 89 471 53 -35 -198 -509 466 -82 119 1145
2219 1145 -402 -586 351 -884 -431 801 55 139 694 -393 -1008 -337 -81 302 476 485 139 -878 -155
2238 -155 -283 -883 873 1095 -308 616 124 -1368 -231 -335 -140 946 587 55 -477 -775 -442 -478 232
2257 232 1223 417 135 311 -1173 -1086 293 -496 674 1326 -139 -276 -315 -1184 -494 164 714 848 273
2276 273 333 -491 -1148 98 184 -75 1483 486 -772 55 -848 -818 625 339 254 497 8 -544 -745 -512
$$ [...]
8191B9
##END NTUPLES=NMR FID
##END=
