##TITLE=1H_69-2024
 CDCl3
 8 sc, 
 3.9.2024
##JCAMPDX= 6.0         $$ Bruker NMR JCAMP-DX V2.0
##DATA TYPE= NMR FID
##DATA CLASS= NTUPLES
##ORIGIN= UXNMR, Bruker Analytische Messtechnik GmbH
##OWNER= root
$$ XWIN-NMR		Version 3.5
$$ Tue Sep  3 14:18:10 2024 Russian Standard Time (UT+4h)  she@DPX200
##.OBSERVE FREQUENCY= 200.1318
##.OBSERVE NUCLEUS= ^1H
##.DELAY= (6, 6)
##.ACQUISITION MODE= SIMULTANEOUS
##.ACQUISITION SCHEME= undefined
##.AVERAGES= 8
##.DIGITISER RES= 18
##SPECTROMETER/DATA SYSTEM= spect
##.PULSE SEQUENCE= zg30
##.SOLVENT NAME= DMSO
##.SHIFT REFERENCE= (INTERNAL, DMSO, 0, 15.7039)
##AUDIT TRAIL= $$ (NUMBER, WHEN, WHO, WHERE, WHAT)
$$ ##TITLE= Audit trail, XWIN-NMR		Version 3.5
$$ ##JCAMPDX= 5.01
$$ ##ORIGIN= Bruker BioSpin GmbH
$$ ##OWNER= she
$$ F:/spectra/data/she/nmr/H-F/1/audita.txt
$$ ##AUDIT TRAIL=  $$ (NUMBER, WHEN, WHO, WHERE, WHAT)
(   1,<2024-09-03 14:16:33.82 +0400>,<she>,<DPX200>,
      <created by zg, POWCHK disabled, PULCHK disabled
       configuration hash MD5:
       00 E9 B6 7A A2 85 ED C7 34 08 36 98 17 FE 4E 26
       data hash MD5: 16K
       70 38 34 5E 0D FB FF 03 C7 02 FE 84 C4 54 02 23>)
$$ ##END=
$$ 
$$ hash MD5
$$ C9 44 A4 8C 82 8D 8A 0A E7 32 F0 20 30 D9 A0 71
##$RELAX= 
##$RELAX= 
##$RELAX= 
##$RELAX= 
##$RELAX= 
##$RELAX= 
$$ Bruker specific parameters
$$ --------------------------
##$DU= <F:/spectra>
##$EXPNO= 1
##$NAME= <H-F>
##$PROCNO= 1
##$TYPE= <nmr>
##$USER= <she>
##$AMP= (0..31)
100 100 100 100 100 100 100 100 100 100 100 100 100 100 100 100 100 100 
100 100 100 100 100 100 100 100 100 100 100 100 100 100 
##$AQSEQ= 0
##$AQ_mod= 1
##$AUNM= <au_zg>
##$AUTOPOS= <>
##$BF1= 200.13
##$BF2= 200.13
##$BF3= 200.13
##$BF4= 200.13
##$BF5= 200.13
##$BF6= 200.13
##$BF7= 200.13
##$BF8= 200.13
##$BYTORDA= 1
##$CFDGTYP= 0
##$CFRGTYP= 5
##$CHEMSTR= <none>
##$CNST= (0..31)
1 1 145 1 1 1 1 1 1 1 1 1 1 1 1 1 1 1 1 1 1 1 1 1 1 1 1 1 1 1 1 1 
##$CPDPRG= <>
##$CPDPRG1= <>
##$CPDPRG2= <>
##$CPDPRG3= <>
##$CPDPRG4= <mlev>
##$CPDPRG5= <mlev>
##$CPDPRG6= <mlev>
##$CPDPRG7= <mlev>
##$CPDPRG8= <mlev>
##$CPDPRGB= <>
##$CPDPRGT= <>
##$D= (0..31)
0 1.2 0 0 0 0 0 0 0 0.06 0 0.03 0 0 0 0 0.0002 0 0 0 0 0 0 0 0 0 0 0 0 
0 0 0 
##$DATE= 1725358593
##$DBL= (0..7)
120 120 120 120 120 120 120 120 
##$DBP= (0..7)
150 150 150 150 150 150 150 150 
##$DBP07= 0
##$DBPNAM0= <>
##$DBPNAM1= <>
##$DBPNAM2= <>
##$DBPNAM3= <>
##$DBPNAM4= <>
##$DBPNAM5= <>
##$DBPNAM6= <>
##$DBPNAM7= <>
##$DBPOAL= (0..7)
0.5 0.5 0.5 0.5 0.5 0.5 0.5 0.5 
##$DBPOFFS= (0..7)
0 0 0 0 0 0 0 0 
##$DE= 6
##$DECBNUC= <off>
##$DECIM= 24
##$DECNUC= <off>
##$DECSTAT= 4
##$DIGMOD= 1
##$DIGTYP= 9
##$DL= (0..7)
0 120 120 120 120 120 120 120 
##$DP= (0..7)
150 150 150 150 150 150 150 150 
##$DP07= 0
##$DPNAME0= <>
##$DPNAME1= <>
##$DPNAME2= <>
##$DPNAME3= <>
##$DPNAME4= <>
##$DPNAME5= <>
##$DPNAME6= <>
##$DPNAME7= <>
##$DPOAL= (0..7)
0.5 0.5 0.5 0.5 0.5 0.5 0.5 0.5 
##$DPOFFS= (0..7)
0 0 0 0 0 0 0 0 
##$DQDMODE= 0
##$DR= 18
##$DS= 0
##$DSLIST= <SSSSSSSSSSSSSSS>
##$DSPFIRM= 0
$$ [...]
##$SUBNAM2= <"">
##$SUBNAM3= <"">
##$SUBNAM4= <"">
##$SUBNAM5= <"">
##$SUBNAM6= <"">
##$SUBNAM7= <"">
##$SUBNAM8= <"">
##$SUBNAM9= <"">
##$SW= 24.0689170037331
##$SWIBOX= (0..15)
0 0 2 0 0 0 0 0 0 0 0 0 0 0 0 0 
##$SW_h= 4816.95568400771
##$TD= 16384
##$TD0= 1
##$TE= 0
##$TE2= 300
##$TE3= 300
##$TEG= 300
##$TL= (0..7)
0 120 120 120 120 120 120 120 
##$TP= (0..7)
150 150 150 150 150 150 150 150 
##$TP07= 0
##$TPNAME0= <>
##$TPNAME1= <>
##$TPNAME2= <>
##$TPNAME3= <>
##$TPNAME4= <>
##$TPNAME5= <>
##$TPNAME6= <>
##$TPNAME7= <>
##$TPOAL= (0..7)
0.5 0.5 0.5 0.5 0.5 0.5 0.5 0.5 
##$TPOFFS= (0..7)
0 0 0 0 0 0 0 0 
##$TUNHIN= 0
##$TUNHOUT= 0
##$TUNXOUT= 0
##$USERA1= <user>
##$USERA2= <user>
##$USERA3= <user>
##$USERA4= <user>
##$USERA5= <user>
##$V9= 5
##$VALIST= <valist>
##$VCLIST= <CCCCCCCCCCCCCCC>
##$VD= 0
##$VDLIST= <DDDDDDDDDDDDDDD>
##$VPLIST= <PPPPPPPPPPPPPPP>
##$VTLIST= <TTTTTTTTTTTTTTT>
##$WBST= 1024
##$WBSW= 4
##$XGAIN= (0..3)
0 0 0 0 
##$XL= 0
##$YL= 0
##$YMAX_a= 502672
##$YMIN_a= -269299
##$ZGOPTNS= <>
##$ZL1= 120
##$ZL2= 120
##$ZL3= 120
##$ZL4= 120
##$ABSF1= 10
##$ABSF2= 0
##$ABSG= 5
##$ABSL= 3
##$ALPHA= 0
##$AQORDER= 0
##$ASSFAC= 0
##$ASSFACI= 0
##$ASSFACX= 0
##$ASSWID= 0
##$AUNMP= <proc_1d>
##$AZFE= 0.1
##$AZFW= 0.1
##$BCFW= 1
##$BC_mod= 2
##$BYTORDP= 1
##$COROFFS= 0
##$CY= 11.3945322036743
##$DATMOD= 1
##$DC= 2
##$DFILT= <>
##$DTYPP= 0
##$F1P= 15.6554695791079
##$F2P= 12.8336369535428
##$FCOR= 0.5
##$FTSIZE= 0
##$FT_mod= 4
##$GAMMA= 1
##$GB= 0.15
##$INTBC= 1
##$INTSCL= 1
##$ISEN= 128
##$LB= 0.24
##$LEV0= 0
##$LPBIN= 0
##$MAXI= 10000
##$MC2= 0
##$MEAN= 0
##$ME_mod= 0
##$MI= 1.114404
##$NCOEF= 0
##$NC_proc= 0
##$NLEV= 6
##$NOISF1= 3.799351
##$NOISF2= 2.8
##$NSP= 1
##$NTH_PI= 0
##$NZP= 0
##$OFFSET= 15.70392
##$PC= 1
##$PHC0= -25997.58
##$PHC1= 16.78748
##$PH_mod= 1
##$PKNL= yes
##$PPARMOD= 0
##$PSCAL= 0
##$PSIGN= 0
##$REVERSE= no
##$SF= 200.130013532006
##$SI= 16384
##$SIGF1= 3
##$SIGF2= 2
##$SINO= 400
##$SIOLD= 16384
##$SREGLST= <1H.CDCl3>
##$SSB= 0
##$STSI= 0
##$STSR= 0
##$SW_p= 3612.71676300578
##$SYMM= 0
##$S_DEV= 0
##$TDeff= 0
##$TDoff= 0
##$TI= <>
##$TILT= no
##$TM1= 0
##$TM2= 0
##$TOPLEV= 0
##$USERP1= <user>
##$USERP2= <user>
##$USERP3= <user>
##$USERP4= <user>
##$USERP5= <user>
##$WDW= 1
##$XDIM= 8192
##$YMAX_p= 0
##$YMIN_p= 0
$$ End of Bruker specific parameters
$$ ---------------------------------
##NTUPLES= NMR FID
##VAR_NAME=  TIME,          FID/REAL,        FID/IMAG
##SYMBOL=    X,             R,               I
##VAR_TYPE=  INDEPENDENT,   DEPENDENT,       DEPENDENT
##VAR_FORM=  AFFN,          ASDF,            ASDF
##VAR_DIM=   8192,          8192,            8192
##UNITS=     SECONDS,       ARBITRARY UNITS, ARBITRARY UNITS
##FACTOR=    0.0002076,     1,               1
##FIRST=     0,             0,               0
##LAST=      1.7004516,     0,               0
##MIN=       0,             -269299,         0
##MAX=       1.7004516,     502672,          0
$$ Real data points
##PAGE= N=1
##DATA TABLE= (X++(R..R)), XYDATA
$$ [...]
2299B570k07k453q3j495m21O92r45J036J004r9K694l22j90J323j670O84m23j858
$$ 2570 2363 -90 -173 -1668 -2089 -1397 -2342 -1306 -302 -401 2293 1971 1781 3104 1434 2118 1695 -163
2317a63O44q36r12J554o79J109J049k60J196K73j115P56j559q88j79k331R6n03
$$ -163 481 -355 -1267 287 -392 717 1766 1506 2702 2975 1860 2616 1057 169 -10 -2341 -2245 -2748
2335b748o56J347j28M72J933n95J560M37p76P07p98r31K8j330N72K94j084J508
$$ -2748 -3404 -2057 -2185 -1713 220 -375 1185 1622 846 1553 755 -176 -148 -1478 -906 -612 -1696 -188
2353a88j23q0J813m96N8L85j812K63j024j474R23j622j93Q40p37J498J86o8K030
$$ -188 -311 -391 1422 926 984 1369 -443 -180 -1204 -2678 -1755 -3377 -3570 -2730 -3467 -1969 -1783 -1851 179
2372A79l71J86R22q54N87Nj801J065n07l83Q12q64O99K99m66R17o24n23J122j762
$$ 179 -192 -6 916 62 649 654 -1147 -82 -589 -972 -160 -1024 -325 -26 -492 425 -199 -722 400 -1362
2392a362k72O27j240P01j18j082J706o05L15J496q63J225J21o81J364m75j47J071
$$ -1362 -1634 -1007 -2247 -1546 -1664 -2746 -1040 -1645 -1330 166 -697 528 649 -32 1332 857 710 1781
2410A781j069N60L14j202R12p33q96J098j198N7M4j007J322m38n83J485n92J60
$$ 1781 712 1272 1586 384 1296 563 -333 765 -433 -376 -332 -1339 -17 -455 -1038 447 -145 15
2428A5J083j493J016k82r61J312m30J67R22q50J241P05l76J119p49k74N14k049
$$ 15 1098 -395 621 339 -622 690 260 427 1349 499 1740 2445 2069 3188 2439 2165 2679 630
2446F30M08m05j729J114n67p14J255o49R22P28m59R78m56o73N93j392L20L24j124
$$ 630 1038 633 -1096 18 -549 -1263 -8 -657 265 993 534 1512 1056 383 976 -416 -96 228 -896
2465h96J503k25j01K014n15L21R96j324P78m69j917P38j553m83M67j101P76L69
$$ -896 607 382 281 2295 1780 2101 3097 1773 2551 2082 165 903 -650 -1133 -666 -1767 -991 -622
2483f22o40J230l62j33J373j461K09O83j618P64J09p52J450n87N03J154j340J353
$$ -622 -1262 -32 -394 -527 846 -615 -406 277 -1341 -577 -468 -1220 230 -357 146 1300 -40 1313
2501A313m42j057R94j378j95M20j211N63r2o15J118o16l48J025j247K14K24k71
$$ 1313 871 -186 808 -570 -765 -345 -1556 -993 -1085 -1700 -582 -1198 -1546 -521 -1768 -1554 -1330 -1601
2519a601R43p32Q8J123p11J042O39j103J176n89j050R23p49l19L57o30R52K77
$$ -1601 -658 -1390 -1302 -179 -890 152 791 -312 864 275 -775 148 -601 -920 -563 -1193 -241 36
2537C6p68P75n33J65L10j481K78L49j400J395q53n5J595l53P27O74p57R61k02
$$ 36 -732 43 -490 -325 -15 -1496 -1218 -869 -2269 -874 -1727 -1782 -187 -540 187 861 104 1065 863
2556H63p57O61j173l1P13r87J047N8n61J306k48m77P15j206K58m40q63O43q94
$$ 863 106 767 -406 -437 276 -711 336 394 -167 1139 891 414 1129 -77 181 -259 -1122 -479 -1373
2575a373N38O26l54J449J81r47J729o32k69L57j373K32J8o50J036J27j86J711
$$ -1373 -835 -209 -563 886 1067 120 1849 1217 948 1305 -68 164 182 -468 568 695 509 2220
2593B220p16J22N62j251N45j111o64N51j638L08J376j004J125P15l25J270o74
$$ 2220 1504 1626 2188 937 1482 371 -293 258 -1380 -1072 304 -700 425 1140 815 2085 1411
2610A411k38K25j193j19n39o03R80l88r2J775p11R62Q75j049N26r31r32L55j664
$$ 1411 1173 1398 205 86 -453 -1056 -76 -464 -556 1219 508 1470 2345 1296 1822 891 -41 314 -1350
2629a350J48K29p27J088K77J63J190n27N83N19j515L73n24j056N23j082J94Q93
$$ -1350 -1202 -973 -1700 -612 -335 -172 1018 491 1074 1593 78 451 -73 -1129 -606 -1688 -1494 -601
2647f01n4P83M26m13J257m37n89Q8j629K86l65p56P19K52n51J619k56M93P79j174
$$ -601 -655 128 554 141 1398 961 372 460 -1169 -883 -1248 -2004 -1285 -1033 -1584 35 -221 272 1051 -123
2667a23P08l64j338N59p23l64J174r92P54N18o52J541m36o07J097j346M06l71
$$ -123 585 221 -1117 -558 -1281 -1645 -471 -1463 -709 -191 -843 698 262 -345 752 -594 -188 -559
2685e59j188Q71l01j64J436p10Q50L65n46P58q38k71Q55j098j53Q10j130R96r3
$$ -559 -1747 -876 -1177 -1341 95 -615 235 600 54 812 -26 -297 558 -540 -693 117 -1013 -17 -110
2704a10m57J176n66l46O22r07J80J8l68J135r97M45R53q29Q07K78j082R08k94
$$ -110 -567 609 43 -303 319 -588 -408 -390 -758 377 -620 -175 778 -51 756 1034 -48 860 566
2723E66p78N50q83N21N06n33J292l80m57J317j391J9O7j530O52m39o83J141m46
$$ 566 -212 338 -545 -24 482 -51 1241 861 404 1721 330 349 416 -1114 -462 -901 -1584 -443 -889
2742h89O44P56K02R61l4q11R44o83r03M48j601N76k93m67J493K10J25J493j004
$$ -889 -245 511 713 1674 1640 829 1773 1090 187 635 -966 -390 -683 -1150 343 553 678 2171 1167
2761A167N01L31j218k5j527o58K49j066J09J136o65J697N61o2J731r82j01N71
$$ 1167 1668 1999 781 756 -771 -1429 -1180 -2246 -2137 -1001 -1666 31 592 530 2261 1279 1178 1749
2779A749j496J31n27j155P34o31K19R19O7P38O67n19P10o16o26j76j095j62q2
$$ 1749 253 384 -143 -1298 -564 -1195 -976 -57 10 748 1415 896 1606 990 364 188 -907 -1069 -1151
2798a151j283J175j60j57J502k32N78J030q64Q72k51r42Q23j111J13L99j087O54
$$ -1151 -2434 -1259 -1419 -1576 -74 -306 272 1302 438 1310 1059 117 940 -171 -58 341 -746 -92
2816i2L55q27J287n44l73J268j018J46lj275P74n75k88M71j102N57K92k59J021
$$ -92 263 -564 723 179 -194 1074 56 202 199 -1076 -302 -877 -1165 -694 -1796 -1239 -947 -1206 -185
2835a85Q0L59R81n83J44N62q24O45l21p81M14j067J87Q30q15M91J92p80Q62m35
$$ -185 -105 254 1235 652 796 1358 534 1179 858 77 491 -576 -389 441 -374 117 309 -471 391 -44
2855d4j29N26j498N19N2q33K90j05R1J165n16O59J031o93J019k68m63O41j061
$$ -44 -173 353 -1145 -626 -574 -1407 -1117 -1222 -1131 34 -482 177 1208 515 1534 1266 803 1444 383
2874C83M4K34j043M46j15m01O30l45J26M30j035Q07l62j097N78l58j6O44n90N49
$$ 383 427 661 -382 64 -51 -452 178 -167 -41 389 -646 161 -201 -1298 -720 -1078 -1094 -450 -1040 -491
2894d91N87o22J154J1k90J154j080O1L41r79Q32m19l98Q99n25M36J44r64O55q04
$$ -491 96 -526 628 639 349 1503 423 484 825 -154 678 259 -139 760 235 671 815 -149 506 -298
2914b98m76M56q42m76Q55q96P22R12o92J274k46O60K90o52L19r6r38M05M4o60
$$ -298 -774 -318 -1160 -1636 -781 -1677 -955 -43 -735 539 293 953 1243 591 910 814 -124 281 325 -335
2934c35R79j038N86O27o89Q37l23n35L16r44n29R6q80O70j11n15J408m05P18O88
$$ -335 644 -394 192 819 130 967 644 109 425 -519 -1048 -952 -1832 -1162 -1273 -1788 -380 -785 -67 621
2954F21j75Q08k7q66P38l91m20M27q60J25M71l91R57l29j59R55q76j13k46q79
$$ 621 446 1254 1227 361 1099 708 288 715 -145 -20 451 60 1017 688 529 1484 608 495 249 -630
2974f30M70o90q03P27j94J9M61l4R82M27j91Q48n52k16Q43j485O98J5r99O68j90
$$ -630 -160 -850 -1653 -926 -1120 -1101 -640 -674 308 735 544 1392 840 624 1467 -18 680 695 -304 364 174
2995A74L66M02n55J96J08p99P28o29l54K11q95j70N22p88Q13n3k12J493m65J89
$$ 174 540 942 387 583 691 -108 620 -9 -363 -152 -1047 -1217 -695 -1483 -670 -723 -935 558 93 282
3015B82J029p09M52p47k90P68j116O4N54p40Q85O0n81Q13k45k97M92q30j09j80
$$ 282 1311 602 1054 307 17 785 -331 -267 287 -453 432 492 -89 724 479 182 674 -156 -265 -445
3035d45j058M38k27j47O87j67J51J111o70J022j87j22M70p12k00N05j022LN14
$$ -445 -1503 -1065 -1292 -1439 -752 -919 -768 343 -327 695 508 386 856 144 -56 449 -573 -570 -56
3054e6n29O98p9J62L85q12N56m69o02K05n59pJ74m85Q2P10m80R90K80J39L26n82
$$ -56 -585 113 34 196 581 -231 325 -144 -746 -541 -1100 -1107 -933 -1418 -1336 -626 -1106 -116 164 303 629 47
3076D7O4M21o10N42m15j10O94q23K29L06n07N14K6k25L29o79m91P45q23L43J50
$$ 47 111 532 -78 464 49 -61 633 -190 39 345 -162 352 378 153 482 -197 -688 57 -766 -423 -273
3097b73n05Q49q35L44O57p99P22L74o28P65O1j03N23n18J81J68r95O57o80j83
$$ -273 -778 71 -764 -420 237 -562 160 534 -94 671 732 629 1152 634 815 983 -12 645 -35 -218
3117b18O17o68L61M01o97P31K93r79P58o25k67P94r08J76N79q38Q18m13L30J014
$$ -218 399 -269 92 493 -204 527 820 -159 599 -26 -293 501 -407 -231 348 -490 328 -85 245 1259
3137A259q20O43K78o37M81p05l43N71j211J44L56m36P32J49m68P65k40k43M90
$$ 1259 439 1082 1360 723 1204 499 156 727 -484 -340 16 -420 312 461 -7 758 518 275 765
3156G65j038L99k95l29P1m71O43M44l45M60R23p91O63o22n32M42r56K79j01o30
$$ 765 -273 126 -169 -498 -427 -898 -255 189 -156 304 1227 436 1099 477 -55 387 -569 -290 -391 -1021
3176a021J173l39j65R07o30J88O30r12j90J27q10O63r40K71Q18n18R00K54m27
$$ -1021 152 -187 -352 555 -75 113 743 -169 -359 -232 -1042 -379 -1319 -1048 -230 -748 152 406 -21
3195b1M66j10l29K85r19ll16m65R73l96j31J127k05N13J4m86J26m11o26M70n77
$$ -21 445 335 6 291 -628 -631 -947 -1412 -439 -835 -966 161 -44 469 483 -3 123 -288 -914 -444 -1021
3216a021j93M36q3N72Q31q79J439r22j91N58q71m01k07k80O17k38J46J016m49
$$ -1021 -1214 -778 -861 -289 542 -337 1102 180 -11 547 -324 -725 -932 -1212 -595 -833 -687 329 -120
3235a20P23J34q35Q62l62n93M51j068M6L90m06P29K47k50J098k23J65J74q19K25
$$ -120 603 737 -98 764 402 -191 260 -808 -762 -372 -778 -49 198 -52 1046 823 988 1162 343 568
3255E68o33n57P72q66K28J076o34M22P36o24O45n09k28K56q67J67k97n04J091
$$ 568 -65 -622 150 -716 -488 588 -46 376 1112 488 1133 624 396 652 -215 -48 -345 -849 242
3274B42l99M26R54n69M09L05n90J0l61p54M71n65J54M15q99J119N87m26Q84o84
$$ 242 -157 269 1223 654 1063 1368 778 788 427 -327 144 -421 -267 148 -751 368 955 529 1413 729
3294G29k63M07r67L3l84m51J110n82K54O25n07O41L80m83M28o87l1N86j288k1
$$ 729 466 873 -94 -61 -445 -896 214 -368 -114 511 4 645 1025 542 970 283 252 838 -450 -471
3314d71N23m89J17K43r7N26l62J00q1l28O1K8m29K21J76J81L11j89M71Q3q06O07
$$ -471 52 -437 -320 -77 -174 352 -10 90 9 -319 -258 -230 -659 -438 -262 -81 230 41 512 595 -211 396
3336C96l13o26L51n95M30P0o59J009n71L66O74o17P3k75q56L19q6n98N56k57K96
$$ 396 83 -543 -192 -787 -357 -287 -946 63 -508 -142 532 -85 -12 -287 -1143 -824 -910 -1508 -952 -1209 -913
3357i13Q33k73P79K59k52L08n93l51q4p73p1L76l01M66J88M84O25j39J04J03q77
$$ -913 -80 -353 426 685 433 741 148 -203 -287 -1060 -1131 -755 -1056 -590 -402 82 707 568 672 775 -102
3378a02K35r95k34J76p97J15Q26m13J307L58r9J429r11K17J58q76O4n27r85M62
$$ -102 133 -862 -1096 -920 -1717 -1602 -776 -1189 118 476 377 1806 895 1112 1270 394 458 -69 -1054 -592
3398e92k98K26P32k5O99L53m34P41p15k28j32r61k16L73o04M26M0j16J230p1J94
$$ -592 -890 -664 68 43 742 1095 661 1402 687 459 327 -634 -850 -477 -1081 -655 -615 -731 499 428 622
3419F22Q18m06L43m15l35M00r14l57N64p65Q02l22J39L90k68p2N71n15K95mo90
$$ 622 1440 1034 1377 962 627 1027 113 -244 320 -445 357 35 174 564 296 224 795 280 575 571 -119
3440a19L36l24k71L31n22K16K2l12J240k23mR20p81K71N61p09N1l15k63j77o11
$$ -119 217 -107 -378 -47 -569 -353 -331 -643 597 374 370 1290 509 780 1341 632 683 368 105 -72 -683
3461f83J94L64q00Q06N16n44O43k09J8j33p21M94m73m67L09r7j90P15k60O29M47
$$ -683 -489 -125 -925 -119 397 -147 496 287 305 172 -549 -55 -528 -995 -686 -783 -973 -258 -518 111 558
3482E58j24O59k28Ok99n00l24j07q27L61L36p94J091j50Q7L62l28K99P3o93K66
$$ 558 434 1093 865 871 572 72 -252 -359 -1186 -825 -489 -1283 -192 -342 -255 107 -221 78 151 -542 -276
3503b76m38n21O56n12N36J87n7P92j0l1P80n85o8J63o91R6m49l31L96p29M87L91
$$ -276 -714 -1235 -579 -1091 -555 -368 -425 367 357 326 1106 521 453 616 -75 21 -428 -759 -363 -1092 -605 -214
3525b14m56M58M4K09L73o49l6J92p52N23j43j73K93O47j89L24k46N37P4p14N74
$$ -214 -670 -212 -168 41 414 -235 -271 -79 -831 -308 -451 -624 -331 316 127 451 205 742 816 102 676
3546F76m16k26K24m79p9p1j87N41k10k03M28k14K89K92q80P17m72k04N98n37M51
$$ 676 260 34 258 -221 -300 -371 -558 -17 -227 -430 -2 -216 73 365 -515 202 -270 -474 124 -413 38
3567C8J98k10N94k02m2K87l80K64K7p2K9j06l05N14n86M8K95l40J66j98n45R02
$$ 38 236 26 620 418 376 663 283 547 574 502 531 425 120 634 48 96 391 51 217 19 -526 376
3589C76m64o9K88k5k74J57J04M22q3m31N40l80O3L33n35M09R9n02O43n40j65P11
$$ 376 -88 -157 131 106 -168 -11 93 515 432 1 541 161 224 557 22 431 530 28 671 131 -34 677
3611F77o30J37j35k37j8k45M02M9l91J25M01n47N46l41k15J059r21L60L05l41
$$ 677 47 184 49 -188 -206 -451 -49 0 -391 -266 135 -412 134 -207 -422 637 -284 76 381 40
3631D0M06m66j28K53k29P2J38l82M80J1p55O59j87j80K63m35qK88m14J95j55J23
$$ 40 446 -20 -148 105 -124 -52 86 -296 184 195 -560 99 -88 -268 -5 -440 -448 -160 -574 -379 -534 -411
3653d11K12m6M03Q4l84L98N7k11N08p15k3J80n36L30J16m90K42q7P00L43q89L86
$$ -411 -199 -245 158 242 -142 256 313 102 610 -105 -128 52 -484 -154 -38 -528 -286 -373 327 670 -219 167
3675A67k6k77J62n79j9K22m88M39K17j03M14p5J90M26l25O1K91o76K42j37n85
$$ 167 141 -136 26 -553 -572 -350 -838 -399 -182 -285 129 54 244 670 345 406 697 21 263 126 -459
3696d59M55j96l42P06n32P62K71n19K76j58j74Om94J68p3l08R8L18J03L72k42
$$ -459 -4 -200 -542 164 -368 394 665 146 422 264 90 96 -398 -230 -303 -611 -513 -195 -92 280 38
3717C8L27j22O2M98j47J6j53q12L89K60l74j7pk61L41k76K45L89m30N64L5n90
$$ 38 365 243 305 803 656 672 519 -293 96 356 -18 -35 -42 -303 38 -238 7 396 -34 530 565 -25
3739b5N11q41L10j34j33J87m9p2M27J87M9J83m68K59L89l84J71o32m56L68j34
$$ -25 486 -355 -45 -179 -312 -125 -174 -246 181 368 417 600 132 391 780 396 567 -65 -521 -153 -287
3760b87J22Q3j06L69m0j41O51k01k50J55m18p2Q5n03L31l2J40K37j81J75L96m33
$$ -287 -165 -82 -188 181 141 0 651 450 200 355 -63 -135 -50 -553 -222 -254 -114 123 -58 117 513 80
3782H0O44n68q8L17n71J6J04m20L80n06K65O03j48J10K78o49L74j44n70K63j33
$$ 80 724 156 68 385 -186 -170 -66 -486 -106 -612 -347 256 108 218 496 -153 221 77 -493 -230 -363
3803c63j95M60o7j49N89l38P5q6Q6j07o9J98ql56L48n77K49M96m17M70J68n97
$$ -363 -558 -98 -165 -314 275 -63 12 -74 12 -95 -164 34 26 -330 18 -559 -310 186 -231 239 407 -190
3825a90K03J42m38L4l24L86K87n30N02l92J01N36l81K15N1K1J08n10l70N01p18
$$ -190 13 155 -283 -249 -573 -187 100 -430 72 -320 -219 317 -64 151 202 223 331 -179 -549 -48 -766
3846g66O39J39j22K99J27l41L02j91QJ95n04L3J16k87O22r0k09N01j82K65M6n71
$$ -766 -127 12 -110 189 316 -25 277 86 94 289 -215 -182 -66 -353 269 179 -30 471 289 554 600 29
3868B9j8j88l35P12m77l7N29n19O48M4K9L23k91m32L03p60K72J40m42M27q8M34
$$ 29 11 -177 -512 200 -277 -314 215 -304 344 388 417 740 449 17 320 -440 -168 -28 -470 -43 -131 303
3890C03J70j70nK24l45n8m26K76m4k25Q3K76l21K79L84k20L66j98j75n6l37O6
$$ 303 473 303 298 522 177 119 -307 -31 -75 -300 -217 59 -262 17 401 181 547 349 174 118 -219 -153
3912a53P7k83N81n58N6O79o6K0j0n18K48J2o47N45o80M15K06k02J13J87NJ81k11
$$ -153 -76 -359 222 -336 -280 399 333 353 343 -175 73 85 -562 -17 -697 -282 -76 -278 -165 22 27 208 -3
3935cN5K30o30O83n50j50L00L3J12J82j58J60J48k34L44n02J05J6m80J26l48L58
$$ -3 52 282 -348 335 -215 -365 -65 -32 80 262 104 264 412 178 522 20 125 141 -339 -213 -561 -203
3957b03P6K09P6J46j67O0J72p45M28l63k59R9j96N40L22m30M81L27k76M33l51
$$ -203 -127 82 158 304 137 197 369 -376 52 -311 -570 -471 -667 -127 195 -235 246 573 297 730 379
3978C79m14M93q09J52j25n12N83mJ77J10L60q2k40N07l96l7p07O08p62J87K75
$$ 379 -35 458 -351 -199 -324 -836 -253 -257 -80 30 390 308 68 575 179 142 -565 43 -719 -532 -257
3999b57n86R36o0J00L27l9k25L58l55J89k69m99L57k90K04j51m3N11p7j83L71
$$ -257 -843 93 33 133 460 421 196 554 199 388 119 -380 -23 -313 -109 -260 -303 208 131 -52 319
4020C19k08J78m02j26nK42l75L56l7l05K90j99N2M82j49J43m76K24N89m78q2M40
$$ 319 111 289 -113 -239 -244 -2 -377 -21 -58 -363 -73 -272 -220 262 113 256 -220 4 593 115 33 473
4042D73k94O7k85j59K20l62j04M28m33M83J74k73L31l00j18K59m21K11Q8l71M63
$$ 473 179 246 -39 -198 22 -340 -444 -16 -449 34 208 -65 266 -34 -152 107 -314 -103 -15 -386 77
4063G7j49K6K21o58P57J08j9mj51j31R5p6l40o2m03N09J48l57J72K03q4O60o18
$$ 77 -72 -46 175 -483 274 382 363 359 208 77 172 96 -244 -306 -709 -200 -52 -409 -237 -34 -118 542 -76
4086g6N17l15k96K81J6n25O30p81L57L40k14M01J32l86L83m67Q5M07m30l27L9
$$ -76 441 126 -170 111 127 -398 232 -549 -192 148 -66 335 467 81 464 -3 82 489 59 -268 -229
4107b29k98L38j46K02L56l17M53J29l99K44k99r1q7pK08o4M8K84m20J16L73l04
$$ -229 -527 -189 -335 -133 223 -94 359 488 89 333 34 -57 -144 -151 57 -7 41 325 -95 21 394 90
4129I0K81n45M8J46p2j25L55k58L8om5M31o27O7L17m04l2N37l71K46j51k52L46
$$ 90 371 -174 -126 20 -52 -177 178 -80 -42 -48 -93 338 -289 -222 95 -309 -341 196 -175 71 -80 -332 14
4152A4j72M42J99k40J56l38qJ45k18k27K10m79L11J00k24K69J5J33j79J37J59
$$ 14 -158 284 483 243 399 61 53 198 -20 -247 -37 -516 -205 -105 -329 -60 -45 88 -91 46 205
4173B05j21k78P4j03q1k9J1L46Q9k99J23L62k81K16kk36M80n95M4N4l50K61J77
$$ 205 84 -194 -120 -223 -304 -333 -322 24 113 -186 -63 299 18 234 232 -4 476 -119 -75 -21 -371 -110 67
4196F7m11L24j54K40J8m55N12L7k16J24l28m4M30n65P10l3l37M90m20j2K23l31
$$ 67 -344 -20 -174 66 84 -371 141 178 -38 86 -242 -286 144 -421 289 256 -81 409 -11 -23 200 -131
4218a31L97J18l90K86j38k93Q9j55n9L93m84N53k46j83J53j12J75J12k69K69j66
$$ -131 266 384 -6 280 142 -151 -62 -217 -276 117 -367 186 -60 -243 -90 -202 -27 85 -184 85 -81
4239h1j77K89l41Q6J50N9M27j50m02L80oj32rl85L19R4j64R6Jq1k0m1m0J27O9
$$ -81 -258 31 -310 -224 -74 -15 412 262 -140 240 234 102 93 -292 27 121 -43 53 54 -27 -47 -88 -128 -1 68
4264F8k55L24j79j03P9K73m9j76R9j39J16K90l80K25l00J80jR3l63M25k61P0k32
$$ 68 -187 137 -42 -145 -66 207 158 -18 81 -58 58 348 -32 193 -107 73 72 165 -198 227 -34 36 -196
4287a96K64M7K44n06J52qq5L51m88J38j08k38N66j87j14J56j80K33J60o4J2k05
$$ -196 68 115 359 -147 5 -3 -88 263 -225 -87 -195 -433 133 -54 -168 -12 -192 41 201 137 149 -56
4309e6j80K92j92p3N5J57J27n0l71L49J3n4l8j25L75j00n47K93R2j29K77n17M22
$$ -56 -236 56 -136 -209 -154 3 130 80 -291 58 71 17 -21 -146 229 129 -418 -125 -33 -162 115 -402 20
4332B0N0l21L10K3j77P2j05n1K49j98J75j78l45N25q0P6J81m56O15j63m85K55
$$ 20 70 -251 59 82 -95 -23 -128 -179 70 -128 47 -131 -476 49 -31 45 226 -230 385 222 -263 -8
4354hk0N2Q1k63L1K64m63L22j76J36J81k94L54j42k62K96M2m31O42m64l4K07k75
$$ -8 -28 24 105 -158 -127 137 -326 -4 -180 -44 137 -157 197 55 -207 89 131 -300 342 -122 -156 51 -224
4377b24J94J60k20J0m6O8K13m41O55k35j12r5l4n0L23k2k84J27l38L62K47n4L2
$$ -224 -30 130 -90 -80 -126 -58 155 -286 369 134 22 -73 -107 -157 166 144 -140 -13 -351 11 258 204 236
4400B36k56L1m7J81Rk85L02j78j68J3J39J54L02m49L46o2l51k01O12l96J73k6
$$ 236 -20 11 -36 145 154 -131 171 -7 -175 -162 -23 131 433 -16 330 268 -83 -284 328 -68 105 79
4422G9m78N86n2m7J85q2j63L8m83O35j76j16K14P7q4K41m57j50L20l35L78j56
$$ 79 -399 187 135 88 273 191 28 66 -417 218 42 -74 140 217 133 374 -83 -233 87 -248 130 -26
4444b6k39M62j94J70j29j22O65o06j70K91o47N82N8k88J52O2n75O96qr2L26l49
$$ -26 -265 197 3 173 44 -78 587 -19 -189 102 -545 37 95 -193 -41 21 -554 142 134 42 368 19
4466A9J19o2j98L94o07N16m00J33R5jj03N21k96K78n6l93l2L42o54M18%j76K28
$$ 19 138 76 -122 272 -335 181 -219 -86 9 8 -95 426 130 408 352 -41 -73 269 -385 33 33 -143 85
4489H5j42j92L97q6K92n5l61K73k14j74L70o13L24M12n59M27k77M00Q4k13K94
$$ 85 -57 -249 148 62 354 299 -62 211 -3 -177 193 -420 -96 316 -243 184 -93 307 391 178 472
4510D72k62m18N43k71Q0J61m17K27J03l41R5p4j26M56l88K40J87m09L83j95k7
$$ 472 210 -208 335 64 144 305 -112 115 218 -123 -28 -102 -228 228 -160 80 267 -142 241 46 19
4531A9o1k05L41j19l66O69l58k85M05p0m6K02l97N95R0j76k89k44K40K34k47M8
$$ 19 -42 -247 94 -25 -391 278 -80 -365 40 -30 -76 126 -271 324 414 238 -51 -295 -55 179 -68 -20
4553b0L6l58L74j00j78M86j37J56J90k69J40j93l36J10j89O2J9K76o7J53O4L02
$$ -20 16 -342 32 -68 -246 240 103 259 449 180 320 127 -209 -99 -288 -226 -207 69 2 155 219 521
4575E21k90r9K69l37J2j54l56L43k49j07N70n08K35L83k35J55J85j89L19o35K8
$$ 521 231 132 401 64 76 -78 -434 -91 -340 -447 123 -385 -150 233 -2 153 338 149 468 -167 -139
4596a39L32o60R6K34m2L12n71O76n5m04P00j65n61L26j98k15rJ4k59K07K32j7
$$ -139 193 -467 -371 -137 -179 133 -438 238 183 -221 479 314 -247 79 -119 -334 -343 -329 -588 -381 -149 -166
4618a66R0j31N58j74J88m34J93n6j94j76L41l99M5M60m94P15k93j1m3J72k71J78
$$ -166 -76 -207 351 177 365 -69 124 68 -126 -302 39 -360 -315 145 -349 366 73 62 19 191 -80 98
4640I8j29J55J17m57J20j69N4L84l79R4J9m1K36K19m44N58N0l86J23l76M2j19
$$ 98 -31 124 241 -216 -96 -265 -211 173 -206 -112 -93 -134 102 321 -123 435 485 99 222 -154 -112 -231
4662b31j75K2J76j67M10l91Q45j63j86N00m88J6Nm98N81m99r2M50l98mK95p1L66
$$ -231 -406 -384 -208 -375 35 -356 489 326 140 640 152 168 173 -325 256 -243 -335 115 -283 -287 8 -63 303
4685C03k01M8K49q1J03j19k08k51K11p76L20O5P4M35k18L35J13k61M79n01l91
$$ 303 102 150 399 318 421 302 94 -157 54 -722 -402 -337 -263 172 -46 289 402 141 620 119 -272
4706b72K71k84M8K98k55K40l61j06N24j64L75K91p28K71lk67K13j36j76K90n33
$$ -272 -1 -285 -237 61 -194 46 -315 -421 103 -61 314 605 -123 148 145 -122 91 -45 -221 69 -464
4727d64J71K08p2N51l90L25j6k14K7J56n21J20K93m15K85m28R2M41m36L04K59
$$ -464 -293 -85 -157 394 4 329 313 99 126 282 -239 -119 174 -241 44 -384 -292 149 -287 17 276
4748B76l62k29M51j65K05l74K50ko21M70m3K04j9l61k01N12k77K96L8m2j7j67
$$ 276 -86 -315 136 -29 176 -198 52 50 -571 -101 -144 60 41 -320 -521 -9 -286 10 48 6 -11 -178
4770a78K45m8k19K47k38PJ14L30l38L12m31L13K88o40N56k53J33J97n56L07R5
$$ -178 67 19 -200 47 -191 -184 -70 260 -78 234 -197 116 404 -236 320 67 200 397 -159 148 243
4791B43j07k81J86j32R1k03K13L83m83K07l8l71K87o0rJ86l56J49j68P3K93l6
$$ 243 136 -145 41 -91 0 -203 10 393 -90 117 79 -292 -5 -65 -74 112 -244 -95 -263 -190 103 67
4813F7J09n7l90L45nJ22J96j96j52k99j2N7M63k74J41J63l23K28k65L05k79k90
$$ 67 176 119 -271 74 69 191 387 191 39 -260 -272 -215 248 -26 115 278 -45 183 -82 223 -56 -346
4835c46L80k49K88k99J59jlj14J80L40k63rJ74j71L08k34k43M99o70M30o01M05
$$ -346 34 -215 73 -226 -67 -68 -71 -185 -5 335 72 63 237 66 374 140 -103 396 -274 156 -445 -40
4857d0K17m90L07m4r1L86j75k49j25J04K05l16R5J93n8O2q3J14j34M16l59j95
$$ -40 177 -313 -6 -50 -141 245 70 -179 -304 -200 5 -311 -216 -23 -81 -19 -102 12 -122 294 -65 -260
4879b60R2m4J88O6l42M90m58P6N52o36M17n2m88N46k10n5L19k65o6lJ66K16l07
$$ -260 -168 -212 -24 42 -300 190 -268 -192 360 -276 141 89 -399 147 -63 -118 201 -64 -130 -133 33 249 -58
4902e8L9Q9l02J54P1M1K31k05j14J89n6l27J46l41N42o1l61L81l16L05K91n69
$$ -58 -19 70 -232 -78 -7 34 265 60 -54 135 79 -248 -102 -443 99 38 -323 58 -258 47 338 -231
4924b31L29j45l11M58k38JN04n04K95j83K3P2k53j70L69l27N23L8l17J53j81L0
$$ -231 98 -47 -358 100 -138 -137 367 -137 158 -25 -2 70 -183 -353 16 -311 212 250 -67 86 -95 -65
4946f5j84J37J50j41nM10j16m00K49ln3o8J10N52m08m27N22j42k06K31j43J76
$$ -65 -249 -112 38 -103 -108 302 186 -214 35 32 -21 -89 21 573 165 -262 260 118 -88 143 0 176
4968A76m28K39K59l80L9K22j13r0j45K27J59m19J10J26k48O33o3m34M65m52J17
$$ 176 -252 -13 246 -134 -95 127 14 -76 -221 6 165 -254 -144 -18 -266 367 304 -130 335 -117 0
4989@K0J35J13j40l89L94j76J86K71p11O08K8o67M70N6l47M57m39K50m0l55K12
$$ 0 20 155 268 128 -261 133 -43 143 414 -297 311 339 -328 142 198 -149 308 -131 119 79 -276 -64
5011f4K14J88j04m14k1L46k58Q8j12j5J79k64J16k40K00J24K6j88L92k69j09J69
$$ -64 150 338 234 -180 -201 145 -113 -25 -137 -152 27 -237 -121 -361 -161 -37 -11 -199 193 -76 -185 -16
5033a6Q0J75j14j36j46N8K9L28j48J03N6k86k71N03j72K68n94k1M95l29J26K61
$$ -16 64 239 125 -11 -157 -99 -70 258 110 213 269 -17 -288 215 43 311 -283 -304 191 -138 -12 249
5055B49m01L55j53m89N15l6R4j17k45K89J55o19L31J69l3K66l39J1J60k90K84
$$ 249 -152 203 50 -439 76 40 134 17 -228 61 216 -403 -72 97 64 330 -9 2 162 -128 156
5076A56Q8j03L32m96k54L98m34L54k40k7R5L34k92K74k96J24nr5P4Q1j68L66n37
$$ 156 244 141 473 -23 -277 121 -313 41 -199 -226 -131 203 -89 185 -111 13 8 -87 -13 68 -100 266 -271
5099b71M76j46J6n6j06j24K97j85J06L14m25N7J71l26R0mJ23J23n52O14l19K25
$$ -271 205 59 75 19 -87 -211 86 -99 7 321 -104 -47 124 -202 -112 -116 7 130 -422 192 -127 98
5121I8J23n56M93l3NP2j94j15N00n8l88K32l22o8P0P7p1N07m81K31j86L04j02
$$ 98 221 -335 158 125 130 202 8 -107 393 335 -53 179 -143 -211 -141 -64 -135 372 -109 122 -64 240 138
5144A38l32N21l61j26M24o11J51K53l26N92o62M21J68m54L37j58K47M1k42l89
$$ 138 -194 327 -34 -160 264 -347 -196 57 -269 323 -339 82 250 -204 133 -25 222 263 21 -368
5164c68N17l31pL28n5p2j9P1J96k31K15L7m38L18k80P3M7N2j68Q8M1o6R4j76L37
$$ -368 149 -182 -189 139 84 12 -7 64 260 29 244 281 -157 161 -119 -46 1 53 -115 -27 14 -52 42 -134 203
5189B03K0J07J09n60J8m4j0J28j23m3M64l55K27L1l82M96k26L7N6P6j83j05n7
$$ 203 223 330 439 -121 -103 -147 -157 -29 -152 -195 269 -86 141 172 -210 286 60 97 153 229 46 -59 -116
5212a16J58j26m50L56Q7j17K94l21M38k24J44j6P2Q2k64m08K59K8l59L87k8l39
$$ -116 42 -84 -534 -178 -91 -208 86 -235 203 -21 123 107 179 261 -3 -411 -152 -124 -483 -96 -124 -463
5234d63N97l80L28K24l77M83m75NJ84o7k98L72l89J99K48k66p0L15j55M93n83
$$ -463 134 -246 82 306 -71 412 -63 -58 126 59 -239 133 -256 -57 191 -75 -145 170 15 508 -75
5255g5j4J80k54L19k10jK38l44J35j73n9K9J62k98N77R3l23O6N4O4N3n15K18j11
$$ -75 -89 91 -163 156 -54 -55 183 -161 -26 -199 -258 -229 -67 -365 212 305 -18 48 102 166 219 -296 -78 -189
5279a89j36L74k94N30k42k84N39l66K94k03j51Q8j08k8j19J7r9L86j97M12j42
$$ -189 -325 49 -245 285 43 -241 298 -68 226 23 -128 -40 -148 -176 -295 -278 -377 9 -188 224 82
5300H2P3J5K51l50K49J0n96N47n10J78L9k49M95j65J51J01j95K0p3K28p0m72P4
$$ 82 155 170 421 71 320 330 -266 281 -229 -51 -12 -261 234 69 220 321 126 146 73 301 231 -241 -167
5323a67K74m89J70N6r5L02m07L26K91o40M98P5k77L09l93J80j48O6k8K40k39L14
$$ -167 107 -382 -212 -156 -251 51 -356 -30 261 -379 119 194 -83 226 -167 13 -135 -69 -97 143 -96 218
5345B18l4m31L88k66J32K53j56K2J72k64m0j77NJ8K53J67j96j19K08M2j77K70
$$ 218 184 -247 141 -125 7 260 104 126 298 34 -6 -183 -178 -160 93 260 64 -55 153 195 18 288
5367B88k05J5kk78L48k31k20L75J0k6l61J71J95k8r7M0k78J25J79j00K13N2k27
$$ 288 83 98 96 -182 166 -65 -285 90 100 74 -287 -116 79 51 -46 -6 -284 -159 20 -80 133 185 -42
5390d2K47k22m9J25k32K77R6p8Q8k02J1M93n93q2J74j56M7r6j1K02l72J53M72
$$ -42 205 -17 -66 59 -173 104 200 122 210 8 19 512 -81 -163 11 -145 -98 -194 -205 -3 -375 -222 250
5413B50k73J15j09j76K88k69m9L02o35P48k22JK13j89k1J6k15K75K48m70K91j89
$$ 250 -23 92 -17 -193 95 -174 -223 79 -556 192 -30 -29 184 -5 -26 -10 -225 50 298 -172 119 -70
5435g0k45K28k07K60N1o23P11k41j40J52J02k3Q3M8j20J42m03M43l55L85j44n58
$$ -70 -315 -87 -294 -34 17 -606 105 -136 -276 -124 -22 -45 38 86 -34 108 -295 148 -207 178 34 -524
5457e24O08k1p1K25m3l39J40j01K26n4l26L47N3k63L06k56J22R3l0J8K4k36K99
$$ -524 84 63 -8 217 174 -165 -25 -126 100 46 -280 67 120 -143 163 -93 29 122 92 110 134 -102 197
5480A97l77J0P39p23J58R1j97M25j99m0p3p2K51l21oK84L1l76K79k01K01K8l39
$$ 197 -180 -170 569 -154 4 95 -102 323 124 84 11 -61 190 -131 -137 147 178 -198 81 -120 81 109 -230
5503b30L71k87J28K7k17J61RK05K23m58J46J15j25Oj32R0o6Q9j21M11l78j30J92
$$ -230 141 -146 -18 9 -208 -47 -38 167 390 -68 78 193 68 74 -58 32 -34 55 -66 345 -33 -163 29
5526B9J19K37n51J7K35k16J57k38J08K43k10J42J14k35r2L51o17N82k07k30M30
$$ 29 148 385 -166 -149 86 -130 27 -211 -103 140 -70 72 186 -49 -141 210 -407 175 -32 -262 168
5547A68k95k61M76j31N4J18j00p7J58j76K34k65J30K52o35J5M55j74j19p8J94
$$ 168 -127 -388 88 -43 11 129 29 -48 110 -66 168 -97 33 285 -350 -335 120 -54 -173 -251 -57
5568e7j0j02N31k89l10K58R8k30K25k27o8K95n61K91P2o3K16J51j20j15p9k33
$$ -57 -67 -169 362 73 -237 21 119 -111 114 -113 -181 114 -447 -156 -84 -147 69 220 100 -15 -94 -327
5590c27M34l87L88l60mL58m96N77m19R0L93o26K19L6j07J9O06l33p5n5N3J17k33
$$ -327 107 -280 108 -252 -256 102 -394 183 -236 -146 247 -379 -160 -124 -231 -212 394 61 -14 -69 -16 101 -132
5613a32L24k10j19P4L41l97L96j58k11M32l10J23k69J26L16l08L05n9l18l9N5
$$ -132 192 -18 -137 -63 278 -119 277 119 -92 340 30 153 -116 10 326 18 323 264 -54 -93 -38
5634c8p2N4m9o7M16j7l59K48j21J10P1l17J84o2j19J57j69K69P7k54K19J08k95
$$ -38 -110 -56 -105 -172 244 227 -132 116 -5 105 176 -141 43 -19 -138 19 -150 119 196 -58 161 269 -26
5657b6M10l42j59J25L7J10m27L48j37n1J47j36K62J27l89K50K02k82m28M05n8
$$ -26 384 42 -117 8 45 155 -272 76 -61 -112 35 -101 161 288 -101 149 351 69 -359 46 -12
5678a2J23J15n51M74j40p2L47l51L40nl89J67R2k25L17o07K94K88j74m0j21J61
$$ -12 111 226 -325 149 9 -63 284 -67 273 268 -121 46 138 -87 230 -377 -83 205 31 -9 -130 31
5700C1j91K68J24k67j56L56m39L83Pn64L26r1L88j77M12l02J12l18Q2j91J60J28
$$ 31 -160 108 232 -35 -191 165 -274 109 116 -448 -122 -213 175 -2 410 108 220 -98 -16 -207 -47 81
5722H1k34j23L69l53K80J3j86j44J37j93M85m24Q7Q2r6M01j70j10K51Kl41K49
$$ 81 -153 -276 93 -260 20 33 -153 -297 -160 -353 132 -292 -205 -123 -219 182 12 -98 153 155 -186 63
5744F3K66l53kjJ0k03l2L79l30K06K3q2P5M0j44J35j41lR2O5m0L4j22o0N0K3K32
$$ 63 329 -24 -26 -27 -17 -220 -252 127 -203 3 26 -56 19 59 -85 50 -91 -94 -2 63 23 57 -65 -125 -75 -52 180
5771A80k02k0l8n4M25k34k28M01k43j49K09k25K63JJ12k68K6N1J90m43N14k72
$$ 180 -22 -42 -80 -134 291 57 -171 230 -13 -162 47 -178 85 86 198 -70 -44 7 197 -246 268 -4
5793dl33K75K26n1m3p0L60n8l76K93j23r1L67n32L65j11j42j88L43R6n5k29J4
$$ -4 -337 -62 164 113 70 0 360 302 -74 219 96 5 372 -160 205 94 -48 -236 107 203 148 -81 -67
5816f7P0j69M28l39j34M46j90K7J28J00o5j9n03K04Nj26j8l1R9J50J05J18j02
$$ -67 3 -166 262 -77 -211 235 45 72 200 300 235 216 -287 -83 -78 -204 -222 -253 -154 -4 101 219 117
5839A17r9K33j37k89J38l84M26j51k4K74n10M77j2L7O2Mk39M38n90L19l51pN3
$$ 117 18 251 114 -175 -37 -421 5 -146 -170 104 -406 71 59 96 158 162 -77 361 -229 90 -261 -268 -215
5862b15L87m50K78k06j92M34M60k93L6k30Q2p0l87L59l55K36j94J3M15J89l17
$$ -215 172 -278 0 -206 -398 36 496 203 239 9 91 21 -366 -7 -362 -126 -320 -307 108 297 -20
5883b0M6m0J1k09Q9k7L08n16L22l89N35L0l71R3m7K53J56l52j07kJ00P1j10j0
$$ -20 26 -14 -3 -212 -123 -150 158 -358 -36 -425 110 140 -231 -138 -185 68 224 -128 -235 -237 -137 -66 -176 -186
5907a86K43N0n99N17m38K59J83l14J14Q2q7N95k69k76N62l55J18m27L71k60q9
$$ -186 57 107 -492 25 -413 -154 29 -285 -171 -89 -176 419 150 -126 436 81 199 -228 143 -117 -206
5928b06p6K32o1L8J01j36M00k16K40o2l17Oj90K1K50J1m74L96K68J0N04j007M88
$$ -206 -282 -50 -111 -73 28 -108 292 76 316 254 -63 -57 -247 -226 24 35 -439 -43 225 235 739 -268 220
5951B20J45k23K01o70K35L24m11j03m7K42L31n20M38K64j97Nk15j54J84j33K50
$$ 220 365 142 343 -327 -92 232 -179 -282 -329 -87 244 -276 162 426 229 234 19 -135 49 -84 166
5972A66Pm95K70O0j71L66L8m70K66L53l51O6o2K1Ok8j35j64q2O09p14M16M1K5
$$ 166 173 -322 -52 8 -163 203 241 -229 37 390 39 105 43 64 70 42 -93 -257 -339 270 -444 -28 13 38
5996C8jR1k72L17k30J95rj17R3q6P1k97nl6L50l40M59M5l56N87o00J35J34k36
$$ 38 37 128 -144 173 -57 138 129 12 105 19 90 -207 -212 -248 102 -238 221 266 -90 497 -103 32 166 -70
6020g0P9m0J17q8j62J9J94n4p2j67K77K40l23n5L26p93N99K74n22M38k20l48L65
$$ -70 9 -31 86 -2 -164 -145 49 -5 -77 -244 33 273 -50 -105 221 -572 27 301 -221 217 -3 -351 14
6043A4J2j98M47l63J17O6l40L88l26M46N8p86K72K24l53N47k76p5L15k42K7J06
$$ 14 26 -172 275 -88 29 95 -245 143 -183 263 321 -465 -193 31 -322 225 -51 -126 189 -53 -26 80
6065H0m29M84r1m39M97o8M1N2l24L19k6k00K10k48R1O6l88M54r6j38L28n24M85
$$ 80 -349 135 44 -395 102 34 75 127 -197 122 96 -104 106 -142 -51 15 -373 81 -15 -153 175 -349 136
6088A36J11k27L0N6j72L61m90J48J37k84K73k70K4L40k44J25j00J21m5k48k83
$$ 136 247 20 50 106 -66 295 -195 -47 90 -194 79 -191 -167 173 -71 54 -46 75 30 -218 -501
6109e01O67J93l74N8j58N8J13l0J33o8k62M6J24k86M00q0K66m3m73K35Q3l55N24
$$ -501 166 359 -15 43 -115 -57 56 26 159 91 -171 -125 -1 -287 113 33 299 256 -217 18 101 -254 270
6132B70l68K74k97p3J19J45k76L58J06j72M7l37M78l28l6K85k56K25o1j27M41
$$ 270 -98 176 -121 -194 -75 70 -206 152 258 86 133 -204 274 -54 -90 195 -61 164 103 -24 417
6153D17o97M29j58L8j02J64l32O2M92o47M12j13J95J69m28J73R8k01L06r7k44
$$ 417 -280 149 -9 29 -73 91 -241 -179 313 -334 78 -35 160 329 -99 74 172 -29 277 180 -64
6174f4J83k96NL11n50L16j40N3M09k79K38m68K75K2j4j36M18k32N8P1o09O94l59
$$ -64 119 -177 -172 139 -411 -95 -235 -182 227 -52 186 -282 -7 15 1 -135 283 51 109 180 -429 265 -94
6197i4J03Pp6j92N69o49O32N8n04L79l01l4L47k57J55K34l35J55M4l89K23k27
$$ -94 9 16 -60 -252 317 -332 300 358 -146 233 -68 -102 245 -12 143 377 42 197 241 -148 75 -152
6219a52L19%k59L87j33k79N87k41j72j60QK48m2l58L66j93N1R0P0K9k11l6M88
$$ -152 167 167 -92 295 162 -117 470 229 57 -103 -95 153 111 -247 119 -74 -23 67 137 166 -45 -81 407
6242D07p02J51J44r2K19k5k58Q7K66k60J72m62L90L8n7J92r0N7P9j42J9q2j7J95
$$ 407 -295 -144 0 -92 127 102 -156 -69 197 -63 109 -353 37 75 18 210 120 177 256 114 133 51 34 229
6266B29K13n97N54m23l0J48j03J61l2m07N48m47j26L35J32j18n8J14N9L4m02N98
$$ 229 442 -155 399 -24 -54 94 -9 152 120 -287 261 -186 -312 23 155 37 -21 93 152 186 -216 382
6288C82m89K04J3o75P66k9m30L19j70n1N92o65J62L7j15l4K51j62K44l07p1J67
$$ 382 -107 97 110 -565 201 172 -258 61 -109 -160 432 -233 -71 -34 -149 -183 68 -94 150 -157 -228 -61
6310f1j82K81N7k42L71j03j45P8k76J04k86k0O01Q0l74J17J0K24l88K12J88k88
$$ -61 -243 38 95 -147 224 121 -24 54 -222 -118 -404 -424 177 257 -117 0 10 234 -154 58 246 -42
6332d2k81L95j84K68m13j47L24O1J90J22o04L11J37l68N96l55J87k96j74M11k24
$$ -42 -323 72 -112 156 -257 -404 -80 -19 171 293 -311 0 137 -231 365 10 197 -99 -273 138 -86
6353h6N5M04k31j81R9K3l14L04j68Q7m05L7N34O3m00K94J00k09p7K8J60k60J4
$$ -86 -31 373 142 -39 60 83 -231 73 -95 -8 -413 -376 158 221 -179 115 215 6 -71 -43 117 -143 -129
6376a29J20l23M63j30l01M00q1k21M12j46k5j45m6M29p4j98K7j62q2Q2j35L24
$$ -129 -9 -332 131 1 -300 100 19 -202 210 64 39 -106 -152 277 203 5 32 -130 -212 -130 -265 59
6398E9J1j37L35m59L20M5l48K1K70l59M88k54k2L65m19L48l94k3O5k07M50r0k32
$$ 59 70 -67 268 -191 129 174 -174 -153 117 -242 246 -8 -30 335 -84 264 -130 -153 -88 -295 155 65 -167
6421a67Q8J3n3J91Kl05L52m76K12K87l97L42j66j62N05m90L49J81k49M29m63K11
$$ -167 -79 -66 -119 72 74 -231 121 -355 -143 144 -253 89 -77 -239 266 -224 125 306 57 486 23 234
6443B34l14j51p5K13k14M28j53j86O01j25m38O24l00j47J79l68J18q1J86p4n05
$$ 234 -80 -231 -306 -93 -307 121 -32 -218 383 258 -180 444 144 -3 176 -192 -74 -155 31 -43 -548
6464e48N10L14m7j88K5k22L89Lj46N5j77J54l64O0L07P9JQ4j34l90M00k13K55
$$ -548 -38 276 229 41 66 -156 233 236 90 145 -32 122 -242 -182 125 204 205 289 155 -235 165 -48 207
6487B07l99k83N16n50M28P6j23J85m7J00L31l49N3l44K8K88k69k33M52l48K15
$$ 207 -192 -475 41 -509 -81 -5 -128 57 10 110 441 92 145 -199 -171 117 -152 -385 67 -281 -66
6508f6L76j48j89K53l22M6k5QJ00o7K48j19k15L03J9m01L30l00K24k5q3K31n72
$$ -66 310 162 -27 226 -96 -50 -75 -67 33 -34 214 95 -120 183 202 -199 131 -169 55 30 -53 178 -394
6531c94M91L55n88J04R9k50L86m53K38j62J5Q7J93k96O3L4lM37k61k6j8k31K00
$$ -394 97 452 -136 -32 67 -183 203 -250 -12 -174 -159 -72 121 -175 -112 -78 -81 356 95 69 51 -180 20
6554B0J61m6j17k25J36p5J12PJ8K13J60l96J40n8j64L0j25r4K07J1m16L95j17
$$ 20 181 135 18 -207 -71 -146 -34 -27 -9 204 364 -32 108 50 -114 -84 -209 -303 -96 -85 -501 -106 -223
6577b23P3K67qk30L02o65O05k17K6r4J2J99j42J19J49k98k18P54o60L96k85p4
$$ -223 -150 117 109 -121 181 -484 121 -96 -70 -164 -152 47 -95 24 173 -125 -343 411 -249 147 -138 -212
6599b12K83j97j43N48m28J71lr2J78n2k43M27l35J26l3m24O91l50Q5J28k33J53
$$ -212 71 -126 -269 279 -149 22 19 -73 105 53 -190 237 -98 28 -5 -429 262 -88 -3 125 -108 45
6621D5K80n14K36M4j53K26k05k52O22k45k48L27l57J41j56j3N22o17J80K63l69
$$ 45 325 -189 47 91 -62 164 -41 -293 329 84 -164 163 -194 -53 -209 -222 300 -317 -137 126 -243
6642b43K45j69J27J8p3M84l00k22j9J1n2L07j74K2L06j85K4r8N8J71k34j03N99
$$ -243 2 -167 -40 -22 -95 389 89 -133 -152 -141 -193 114 -60 -38 268 83 107 9 67 238 4 -99 500
6665E00l02l33J44jp6j38J09K04l97K97K58n36K45L01l78L98k26j11J8k90J80
$$ 500 198 -135 9 8 -68 -206 -97 107 -290 7 265 -271 -26 275 -103 295 69 -42 -24 -314 -134
6686a34K87k04R6o0K5J80m33K06J33n64K61k6l67Q26m08J05J87l96N23m96J0M21
$$ -134 153 -51 45 -15 10 190 -243 -37 96 -468 -207 -233 -600 226 -182 -77 110 -286 237 -259 -249 172
6708A72n20J02K66m31L50J90n69L78p4J16L4p6q3j14K43K51m19K87%l08k2J24
$$ 172 -348 -246 20 -411 -61 129 -440 -62 -136 -20 14 -62 -145 -259 -16 235 -184 103 103 -205 -227 -103
6730a03R8Q9l60J35J39k70K19L07o97L89J97l65NjJ16J01J0J62j95r6L4o2k52
$$ -103 -5 84 -276 -141 -2 -272 -53 254 -443 -54 143 -222 -217 -218 -102 -1 9 171 -24 -120 -86 -148 -400
6753d00M19M8J84k23j64M99p77K60K3J6M04j44j22L70m13N4M10m68j01J24k17
$$ -400 19 67 251 28 -136 363 -414 -154 -131 -115 289 145 23 393 -20 34 444 -24 -125 -1 -218
6774b18J54L55l97J9Q0K70o9N9k02k70K53J58l10R2Mj3l5L00k46P8K55j93J83
$$ -218 -64 291 -106 -87 -7 263 194 253 51 -219 34 192 -118 -26 -22 -35 -70 230 -16 62 317 124 307
6797C07r11O11q7J13N2kk62L15k69K34K38n00N03k30J0J86k46l0J16m73M9L17
$$ 307 -604 7 -80 33 85 83 -179 136 -133 101 339 -161 342 112 122 308 62 32 148 -325 -276 41
6819D1P7Q0k48k1J11oN1L1Q5j42L14m42N15m96j12M24n26L21j70K24l8j63j14
$$ 41 118 198 -50 -71 40 34 85 116 201 59 373 -69 446 -50 -162 262 -264 57 -113 111 73 -90 -204
6842b04Q1Q6J61l82kJ07J8J31K20m69J82r2j22O02l31j77J28k36J83r9o9N20l27
$$ -204 -123 -37 124 -258 -260 -153 -135 -4 216 -253 -71 -163 -285 317 -14 -191 -63 -299 -116 -215 -284 236 -91
6865i1LJ95k66P0J90j24K91l70j29K67m2q3K07l07O6J4p1K66j63K71m1m29K60
$$ -91 -88 107 -159 -89 101 -23 268 -102 -231 36 -6 -89 118 -189 -123 -109 -180 86 -77 194 153 -276 -16
6888a6L23j46J25n58K69K6J52l97M26m35L02j97J33M46o52K04j58r9L35pJ59j82
$$ -16 307 161 286 -272 -3 23 175 -222 204 -231 71 -126 7 453 -199 5 -153 -252 83 76 235 53
6910E3m83N73j44q0K5Q0m04N65o3L7J81j87j9j02j04K75k92r0J98j76L93L2k51
$$ 53 -430 143 -1 -81 -56 24 -380 185 122 159 340 153 134 32 -72 203 -89 -179 19 -157 236 268 17
6933A7J66j40K5J47n26K00K14k70L69j23o9Qk03K32Qj32L78k0m62M04M9o32Q66
$$ 17 183 43 68 215 -311 -111 103 -167 202 79 10 18 -185 47 55 -77 301 281 -181 223 272 -360 506
6956E06o42R7O1p3L10l89K22M4rr4Nj17K08k32K27L0j90J11rN3j42k00J28J30
$$ 506 -136 -39 22 -51 259 -130 92 136 127 33 38 -79 129 -103 124 154 -36 75 66 119 -23 -223 -95 35
6980C5o5j7j31k7M53k64k74M02j62j6J66j12j08K68r9J80k62J85n3k56R1J26j90
$$ 35 -30 -47 -178 -205 248 -16 -290 112 -50 -66 100 -12 -120 148 49 229 -33 152 99 -157 -66 60 -130
7003a30L59n13J35L70l04k27K79m7J20J17l32N14m64qK86Lk66J02n3j02J27L4
$$ -130 229 -284 -149 221 -83 -310 -31 -78 42 159 -173 341 -123 -131 155 158 -108 -6 -59 -161 -34 0
7025@L83m10m11O78l45K72n48J72K74j33K18n2m39O73o16P1K81l55Q4K93k26L51
$$ 0 383 -27 -438 240 -105 167 -381 -209 65 -68 150 98 -341 332 -284 -213 68 -287 -203 90 -136 215
7047B15P8j34j3j9r7J41k41L25M4p56L62q9N5L96j81r5K6N2J3Q7l1L4l75L32l23
$$ 215 293 159 146 127 30 171 -70 255 299 -457 -95 -184 -129 267 86 -9 17 69 82 169 138 172 -203 129 -194
7072a94n7L29l39J00M08k05P0N2j45L00k74K1M5k80J92j17oJ53j47q9L46r2j26
$$ -194 -251 78 -261 -161 247 42 112 164 19 319 45 66 111 -169 23 -94 -100 53 -94 -183 163 71 -55
7095e5L43n03J38K12n52O55j66k92K52k99K89N2J92K1m10L7K81l03O6K91m40L68
$$ -55 288 -215 -77 135 -417 238 72 -220 32 -267 22 74 266 287 -123 -86 195 -108 -42 249 -191 177
7117A77k54J33K38m49L67J07l21J58k42j66K92l29O11j52k90K94k12l4K53j83
$$ 177 -77 56 294 -155 212 319 -2 156 -86 -252 40 -289 322 170 -120 174 -38 -72 181 -2
7137bn8J41j39J82q9k87N58n21J97J8l96N41J15j61o6j60P3J19o66N02N4o3K48
$$ -2 -60 81 -58 124 35 -252 306 -215 -18 0 -396 145 260 99 33 -127 -54 65 -601 -99 -45 -108 140
7160A40j34K40l60R2M67k10m94L30L7m18P9k86O05r9k12J94n8L17J77l09K49l3
$$ 140 6 246 -114 -22 445 235 -259 71 108 -310 -231 -517 88 -11 -223 -29 -87 230 407 98 347 314
7182C14l29N4j5m60L24N7Qj54K51O3M6j62KK2j82K22K7j76J04j60%J05j77N81
$$ 314 -15 39 24 -436 -112 -55 -47 -201 50 113 159 -3 -1 21 -161 61 88 -88 16 -144 -144 -39 -216 365
7206C65l52j72K32n2M4%r4K87m26kM0j17M34Lk75N86n72K26r5j35K5J84j90o0
$$ 365 13 -159 73 21 65 65 -29 258 -168 -170 -130 -247 187 190 -85 501 -71 155 60 -75 -50 134 -56 -116
7230a16L2j24K25l5L6L32n40M79J5m91L47m02K3L48m40K82J01j60N19l77l1j45
$$ -116 -84 -208 17 -18 18 350 -190 289 304 -187 160 -242 -219 129 -311 -29 72 -88 431 54 23 -122
7252a22j97M14m09K61m72L87J59J77j25L4L2j39L2Q7m19O59o63N8K99l06K42j0
$$ -122 -319 95 -314 -53 -525 -138 21 198 73 107 139 0 32 119 -300 359 -304 -246 53 -253 -11 -21
7274b1l19M15k99N1N14o19L16J23n54L50K87k71L65n77K91k22o2M94m9l70m2P4
$$ -21 -340 75 -224 -173 341 -278 38 161 -393 -43 244 -27 338 -239 52 -170 -232 262 213 -157 -199 -125
7296a25K87j7j15q7J95m22K94J48m6L42o78M90k52j16L09k97R4j28j51L7L24j91
$$ -125 162 145 30 -57 138 -284 10 158 112 454 -224 266 14 -102 207 -90 4 -124 -275 -238 86 -105
7318a05K18j45l35N05m60J92L4k39M29k98k67M45j84j61M62k21L48j95J67j22
$$ -105 113 -32 -367 138 -322 -130 -96 -335 94 -204 -471 -26 -210 -371 91 -130 218 23 190 68
7338F8J37m41M16l66K30J54m97N11k26pL2k5J76oj60q7N4L07k71j12J6N16m29
$$ 68 205 -236 180 -186 44 198 -299 212 -14 -21 11 -14 162 156 -4 -91 -37 270 -1 -113 -97 419 -10
7361a0nJ61l00K13j56j85N05o24M58J47l34K58k84M44j60j38l31K55K62k85M0
$$ -10 -15 146 -154 59 -97 -282 223 -401 57 204 -130 128 -156 288 128 -10 -341 -86 176 -109 -69
7382f9k43O07m00M3J12j65o2K10K93qq26O12r6k69L87k20k46O59n04L18J61m49
$$ -69 -312 295 -105 -62 50 -115 -177 33 326 318 -508 104 8 -261 126 -94 -340 319 -185 133 294 -155
7404a55L34k83o4K70k10j77L73j23k3K0N0J69j83k82L93l44L89k84j3J30j74Q6
$$ -155 179 -104 -168 102 -108 -285 88 -35 -58 -38 12 181 -2 -284 109 -235 154 -130 -143 -13 -187 -101
7426a01O09n63R1J11k86J46J70k83J64j6k70J41rL92k51r1M84n20j41j23K89n8
$$ -101 508 -55 36 147 -139 7 177 -106 58 42 -228 -87 -96 296 45 -46 438 -82 -223 -346 -57 -115
7448a15K35j5k97j45M34M5k34R2L10q98N31N5k68N40k63K5K64l51K94l4l63J38
$$ -115 120 105 -192 -337 97 142 -92 0 310 -588 -57 -2 -270 270 7 32 296 -55 239 205 -158 -20
7470b0k56k0O15n47J86P1J95l22K12l28L51k46J37j31J18k6K4k18K60l28K34l6
$$ -20 -276 -296 319 -228 -42 29 224 -98 114 -214 137 -109 28 -103 15 -11 13 -205 55 -273 -39 -75
7492g5J06M84o11rM43l07j08m3J08j71L96k37M8j44n0K49k38K15K2k87L90k20
$$ -75 31 515 -96 -105 338 31 -77 -120 -12 -183 213 -24 24 -120 -170 79 -159 56 78 -209 181 -39
7514c9r2K57k33J40p6k2K98k28k8K9K6K20q3l55K27j79o9L98l25K05J53k21r5
$$ -39 -131 126 -107 33 -43 -65 233 5 -23 6 32 252 169 -186 41 -138 -207 191 -134 71 224 3 -92
7537i2Rq2N44k41l21K96k73R2J87k85J18m01K98L66n54N05J77n40L68n20N76J16
$$ -92 -83 -165 379 138 -183 113 -160 -68 119 -166 -48 -449 -151 215 -339 166 343 -197 171 -349 227 343
7559C43j33l92N81p50M32J67m96K29l5n5K61j96QL48j82j80j0J82O7l55j37L94
$$ 343 210 -182 399 -351 81 248 -248 -19 -54 -109 152 -44 -36 312 130 -50 -60 122 189 -166 -303 91
7581I1j18K70l82J40K14k69K93n2l32N67o09K64K10m06L04l08P4O58n01l66M80
$$ 91 -27 243 -139 1 215 -54 239 187 -145 422 -187 77 287 -119 185 -123 -49 609 108 -258 222
7602B22l32l8K42k75Q0J77J0Q5l33J76K06k92O7l1j69K73j40L8K05p6p4J29j09
$$ 222 -110 -148 94 -181 -101 76 86 171 -162 14 220 -72 -5 -36 -205 68 -72 -34 171 95 21 150 41
7625D1rM80l85l9m43O16j20m27J72J21m00M32j86j4J29j98L47l47k21N18j09k
$$ 41 32 512 127 88 -355 261 141 -286 -114 7 -393 39 -147 -161 -32 -230 117 -230 -451 67 -42 -44
7647d4O14p95L13J38n95O65l05J31K72l84k45M62l92N10k39r6J65p3R0l49J9j74
$$ -44 570 -225 88 226 -369 296 -9 122 394 10 -235 227 -165 345 106 10 175 102 192 -157 -138 -312
7669c12R9L22n9l20L83l8m32J96L70k91N36m63l12N38j70N2l89k16N22l6P4J77
$$ -312 -213 109 50 -270 113 75 -357 -161 209 -82 454 -9 -321 217 47 99 -290 -506 16 -20 54 231
7691B31l8n6l09L2J21M5k71L04O7l1J86n11N00l31j19K19mj41K95k14Q1k8m01
$$ 231 193 137 -172 -140 -19 26 -245 59 126 95 281 -230 270 -61 -180 39 35 -106 189 -25 56 28 -373
7714c73L57K21k60%J81K50l50k29K26j3j01J59n75L93M98o78K63k75m7N66k10
$$ -373 -16 205 -55 -55 126 376 26 -203 23 10 -91 68 -507 -114 384 -294 -31 -306 -353 213 3
7735CN3j01l05L01j94lM19k2k60L20m05M03j48k39L37l82M08R0q1j11M4k43o3
$$ 3 56 -45 -350 -49 -243 -246 173 151 -109 211 -194 209 61 -178 159 -223 185 275 194 83 127 -116 -179
7758a79r0J79L10j37L25l20j63q7Q0q2N69n15J6Q2k87K37R9m7J45l29Q0K4K04
$$ -179 -269 -90 220 83 408 88 -75 -162 -82 -164 405 -110 -94 -12 -299 -62 37 -10 135 -194 -114 -90 114
7781A14j26J02k06J43m53M14J94m76J79K88l3j26J7k27L07k68J63j29j35L73j98
$$ 114 -12 90 -116 27 -426 -12 182 -294 -115 173 140 14 31 -196 111 -157 6 -123 -258 115 -83
7802h3N4j06L60N6j15l99L22q3j08J94j90L12j33k76J99K00l02L27l46M17on24
$$ -83 -29 -135 225 281 166 -233 89 6 -102 92 -98 214 81 -195 4 204 -98 229 -117 300 294 -230
7824b30L01R2k61M0k86K91O1n6O0K9k24K89M1k37L19m44L62j17r9J12j94J72Q5
$$ -230 71 163 -98 -58 -344 -53 8 -48 12 41 -183 106 147 -90 229 -215 147 30 -69 43 -151 21 106
7847A06J57k34J1k0l6J64k86L98l02j24L02l00J29M5r6M22k10k53Q7k05M37k3
$$ 106 263 29 40 20 -16 148 -138 260 -42 -166 136 -164 -35 10 -86 336 126 -127 -40 -245 192 169
7869A69n47M33M5j7K04l95M21k39r4Q0j84r8L34j7l80K77P7L9j12p3L48m96M7
$$ 169 -378 55 100 83 287 -108 313 74 -20 60 -124 -222 112 95 -285 -8 69 108 -4 -77 271 -225 -178
7892a78K69m29M60l18Q4L10m06K71K31n50R7L64l16K15q9k63M99l83L2M41m20
$$ -178 91 -338 122 -196 -112 198 -208 63 294 -256 -159 205 -111 104 15 -248 251 -132 -100 341 -79
7913g9Q7R3j55L10m85N61k90j36Q0m8o2M29m85K84j67m1K68j66K73k16j70J85
$$ -79 8 101 -54 256 -229 332 42 -94 -14 -62 -124 305 -180 104 -63 -104 164 -2 271 55 -115 70
7935G0L17n57k29M44k18K44j59j52L67l48K58Q0k63J1N9J59K3l7j66L8KK12K14
$$ 70 387 -170 -399 45 -173 71 -88 -240 127 -221 37 117 -146 -135 -76 83 106 69 -97 -59 -57 155 369
7958C69m14K13m36Q0J89N2K62j46k90K02j36J59Q4j07k0p1j78J15O1J07r4j43
$$ 369 -45 168 -268 -188 1 53 315 169 -121 81 -55 104 188 81 61 -10 -188 -73 -12 95 1 -142
7980a42J00K58l19J91N38n12j39j52J04J86m93M59K21o74N21m0k20Jk1L23J26
$$ -142 -42 216 -103 88 626 114 -25 -177 -73 113 -380 79 300 -374 147 107 -113 -112 -133 190 316
8001C16n43K42Q2j34K32j52l17L85k77L74l34j26L11j74J04jj81K67p6K3P8k95
$$ 316 -227 15 97 -37 195 43 -274 111 -166 208 -126 -252 59 -115 -11 -12 -193 74 -2 21 99 -196
8023a96o0L40k23J98O6p8l8J47l69K06q5Q5J44m24M26k97O8K91k07N2K3J46j36
$$ -196 -256 84 -139 59 125 47 9 156 -213 -7 -92 -7 137 -287 139 -158 -90 201 -6 46 69 215 79
8046G9j05j59K17j9O2j36K1J45j70k28O7J14J92R5r7p2J26j53N8k90J93j3P7L91
$$ 79 -26 -185 32 13 75 -61 -40 105 -65 -293 -226 -112 80 175 78 6 132 -21 37 -253 -60 -73 4 395
8070C95k42J16m19J83J47K31m90M71j17l05j06M2j22N2j25N49k4j83O0j79r9M65
$$ 395 153 269 -150 33 180 411 -79 392 275 -30 -136 -94 -216 -164 -289 260 236 53 113 -66 -165 300
8092C00l20N2K8j6j88L58n50M51j47j35Q0pQ5l0J53k04k0k68K97R3q0J22k33M64
$$ 300 -20 32 60 44 -144 214 -336 115 -32 -167 -87 -94 -9 -39 114 -90 -110 -378 -81 12 -68 54 -179 285
8116B85l62j9K63r0L2Qj90R6P1l13L22j94O2K63j52J04k28j54J79J62K99n06q1
$$ 285 -77 -96 167 77 109 117 -73 23 94 -219 103 -91 -29 234 82 186 -42 -196 -17 145 444 -62 -143
8139a43J0K32m42M66L5k31L43l08oJ93j61K80l12r1O71m80j98O19m79j58J25k17
$$ -143 -133 99 -343 123 158 -73 270 -38 -44 149 -12 268 -44 -135 536 56 -142 477 -2 -160 -35 -252
8161b52P20m24j57R3M8O1M5q0j08M5J90J36l54O1n7k91M38m05P4L13j69K04j92
$$ -252 468 44 -113 -20 28 89 134 54 -54 -9 181 317 -37 24 -33 -324 114 -291 -217 96 -73 131 -61
8184f1J33j6k45L10J44m49Q7
$$ -61 72 56 -189 121 265 -184 -97
8191i7
$$ Imaginary data points
##PAGE= N=2
##DATA TABLE= (X++(I..I)), XYDATA
0@%%%qJ6j6J6j6K4m0N6p1Q6j03J21j47J79k13K53k99L54m12M79n56O38p30Q33
$$ 0 0 0 0 -8 8 -8 8 -8 16 -24 32 -39 47 -56 65 -82 97 -116 137 -162 192 -220 259 -297 341 -389 444
27D44r50J078j219J374j543J730j938K166k412K684k984L313l673M068m504M985
$$ 444 -506 572 -647 727 -816 914 -1024 1142 -1270 1414 -1570 1743 -1930 2138 -2366 2619
43B619n521O118o781P528q380R354j0481J1800j3376J5296j7692K0785k4944L0876
$$ 2619 -2902 3216 -3565 3963 -4417 4937 -5544 6256 -7120 8176 -9516 11269 -13675 17201
57A7201m0081N6429r4147L31697K31573l00732K29791k23952k23346J02246j19535
$$ 17201 -22880 33549 -60598 271099 502672 201940 431731 207779 -15567 86679 -32856
68c2856k36443J45544K0898o1464J74732J45550q8529J02373J03524j31372m127
$$ -32856 -269299 -123755 -102857 -164321 10411 155961 67432 169805 273329 141957 137830
79A37830K9211k21659m2100L1337j14880M1412Q3454k2683R4782J00943N3130
$$ 137830 167041 -54618 -96718 -65381 -180261 -138849 -55395 -78078 16704 117647 170777
90A70777N2434J5106K17o2994n8793J315j08768o7664J9802q3808J545R4893k5813
$$ 170777 223211 238317 238534 175540 116747 118062 9294 -58370 -38568 -122376 -120831 -25938 -51751
103e1751J4134P8039j1162j4298N2730q561q9881J3382J2238j07443M8286N6992
$$ -51751 -37617 40422 29260 14962 67692 59131 -30750 -17368 -5130 -112573 -64287 -7295
115g295j18493P2205Q3581j01507R5710P6069j13243O3278N1809r4673L4241K9622
$$ -7295 -125788 -53583 29998 -71509 24201 100270 -12973 50305 102114 7441 41682 71304
127G1304r0951j7176L1454n8397m0364M6957m6374n2758Q3336j7188l4156J01542
$$ 71304 -19647 -36823 -5369 -63766 -104130 -57173 -103547 -156305 -72969 -90157 -124313 -22771
139b2771k1044k9003Q8747k5155k1944M0860m5342k3865R441j2113N93p615K6532
$$ -22771 -43815 -72818 15929 -9226 -31170 9690 -35652 -59517 -50076 -62189 -61596 -69211 -42679
152d2679J9803m446O2037J0755k8599L9727k5924n0383J1537l8041n1405r155
$$ -42679 -22876 -27322 34715 45470 16871 56598 30674 -19709 -8172 -46213 -97618 -106773
164a06773o006j1239P541N0586N826k306Q2315n865k5416P4093m7468m9698O3252
$$ -106773 -112779 -124018 -116477 -65891 -60065 -62371 19944 14079 -11337 62756 15288 -34410 28842
177B8842n5688l3468O6937l4977j1073O6185r25m267M0488L371l6555R113J1933
$$ 28842 -26846 -60314 6623 -28354 -39427 26758 25833 21566 62054 65425 28870 37983 49916
190D9916o2602l328K2653o8300J7808M3568n4597L6134M0060m5345L5845K5291
$$ 49916 -12686 -16014 6639 -61661 -43853 -285 -54882 -18748 21312 -24033 11812 37103
202C7103l0256J8417O120j0480M295J1232J3294j4885J3132K2055l2695J7311
$$ 37103 6847 25264 31384 20904 25199 36431 49725 34840 47972 70027 37332 54643
214E4643J2564m7498J4986L758l5556J8052M602j2150R188O559P545j3079N598
$$ 54643 67207 19709 34695 38453 2897 20949 25551 13401 22589 29148 36693 23614 29212
227B9212P616m4784J1895J1952n0816L2208J8049l7985N2904K4121k3356M3014
$$ 29212 36828 -7956 3939 15891 -34925 -2717 15332 -22653 30251 54372 31016 74030
239G4030R213k6608Q086n104l0050k2091J926k1653k5377L6751l696j8615N6070
$$ 74030 83243 56635 64721 59617 29567 7476 9402 -12251 -37628 -877 -4573 -23188 32882
252C2882o402j8727M9434k8306l0390K3693l8331k4054J1876j6067k082J3384
$$ 32882 26480 7753 57187 28881 -1509 22184 -16147 -40201 -28325 -44392 -46474 -33090
264c3090J7659J2005J0237L5071m766j1531K6484l1590k3362J4902m2238j4543
$$ -33090 -15431 -3426 6811 41882 37116 25585 52069 20479 -2883 12019 -30219 -44762
276d4762J7637k2078O639J8728L089J0768N949J4155p623j3285J5076l1340j8632
$$ -44762 -27125 -49203 -42564 -23836 -20747 -9979 -4030 10125 2502 -10783 4293 -27047 -45679
289d5679K4145l4740k818L4158k4853J5350L5375j5304J3421J7478j1359l608
$$ -45679 -21534 -56274 -59092 -24934 -49787 -34437 938 -14366 -945 16533 5174 1566
301A566p66l617k1422k611J0355l0149J0866K4104l2093K2486K2801l1030K5129
$$ 1566 800 -2817 -24239 -26850 -16495 -46644 -35778 -11674 -43767 -21281 1520 -29510 -4381
314d381J0771k9315J6656N88j7111N474j11j974n778R412R297j5863K0493J0887
$$ -4381 6390 -22925 -6269 -5681 -22792 -17318 -17429 -19403 -25181 -15769 -6472 -22335 -1842 9045
328I045k4369K6003M173k5159K4954o242k0674J7859p807r711P021j838J827m072
$$ 9045 -15324 10679 14852 -10307 14647 8405 -12269 5590 -2217 -11928 -4907 -6745 -4918 -8990
342h990J1262O161j4012K2742J646k1206K7343p219k1095K4641j4356j3575K0065
$$ -8990 2272 8433 -5579 17163 18809 -2397 24946 17727 -3368 21273 6917 -6658 13407
355A3407j0325m263R865R60J805j322J2525l327j1781K0295j3149j5677K5739
$$ 13407 3082 -1181 8684 9644 11449 10127 22652 19325 7544 27839 14690 -987 24752
368B4752k0263j0261K5894j9195O06K1602j2886M307J0098k730L79l069N692r625
$$ 24752 4489 -5772 20122 927 1533 23135 10249 14556 24654 21924 22303 19234 24926 15301
382A5301q784J4957j9653m929K2109k4164K584K1306k2033R049J3191j7004O422
$$ 15301 6517 21474 1821 -3108 19001 -5163 -2579 18727 -3306 5743 18934 1930 8352
395H352M089o984m88k496M995r434L51J4531j7873Q057J8335k3397J3522J2254
$$ 8352 12441 5457 4969 2473 7468 -1966 -1615 12916 -4957 3100 21435 -1962 11560 23814
409B3814k3870J2912K057k0017P984l797r433o65j784L706q189O318J0056j5915
$$ 23814 -56 12856 14913 -5104 2880 -917 -10350 -11015 -12799 -9093 -17282 -10964 -908 -16823
423a6823J4444Q237k3167J7505J105k1848J7416m111j1771J5495j059m15O695
$$ -16823 -2379 5858 -17309 196 1301 -20547 -3131 -7242 -19013 -3518 -4577 -4992 1703
436A703M054N060p492O522r8k0610J0944p357k3610J8100q128j3872K2996n347
$$ 1703 5757 10817 3325 9847 9749 -10861 83 -7274 -30884 -12784 -20912 -34784 -11788 -17135
450a7135k362J8351m261L19L420k168l378j0464O036m484j0611K0881m193k906
$$ -17135 -19497 -1146 -5407 -5088 -1668 -3836 -7214 -17678 -11642 -16126 -26737 -5856 -10049 -12955
464a2955L0318p079k1K2112j5772m065M246j9830p074n337p268l692l106J3128
$$ -12955 17363 10284 10263 32375 16603 12538 16784 -3046 -10120 -15457 -22725 -26417 -29523 -16395
478a6395J7K376K3370q237J249J7867k0985k633Q005k2265J877N757q987J1240
$$ -16395 -16378 -14002 9368 1131 2380 20247 -738 -3371 4634 -17631 -15754 -9997 -18984 -7744
492g744R168Q057Q569N250J3375q015l494O657k4647n046L275k7941M117P929
$$ -7744 1424 9481 18050 23300 36675 28660 25166 31823 7176 2130 5405 -22536 -18419 -10490
506a0490j6316J4807Q682m363J3045L431%j702j830J985j3756J892O308j6105
$$ -10490 -26806 -11999 -3317 -7680 5365 8796 8796 7094 5264 7249 -6507 -4615 1693 -14412
520a4412J4338J0019j3912K1688O378j1185J7067l517r829N393q862o899m999
$$ -14412 -74 9945 -3967 17721 24099 12914 29981 26464 16635 22028 13166 6267 1268
533A268m028r54j1221N648K466j3198J4628n41j2229J9703m421p204J7314n720
$$ 1268 -2760 -3714 -14935 -9287 -6821 -20019 -5391 -5932 -18161 1542 -2879 -10083 7231 1511
547A511r79J0002m747J792J14J029J177q282R416j421j0010J6618o087q735J7467
$$ 1511 532 10534 5787 7579 7693 8722 9899 1617 11033 9612 -398 16220 10133 1398 18865
562A8865j2945p333J0538j6258n341K100j0683p91n27L615K073J56J6635j161
$$ 18865 5920 -1413 9125 -7133 -12474 -10374 -21057 -21848 -22375 -18760 -16687 -16531 104 -1057
576a057n98J8779j0615j883J4867j8590Q16R797j4791N372O070n878O236J283
$$ -1057 -1655 17124 6509 4626 19493 903 1719 11516 -3275 2097 8167 2289 8525 9808
590I808P24l366m208L302j3921n101O248j7494L688J0211j4006J2757R340r345
$$ 9808 10532 7166 2958 6260 -7661 -12762 -6514 -24008 -20320 -10109 -24115 -11358 -2018 -11363
604a1363J2286J923n734N239l438O37j047J227J0044m959P998J1852j1286R366
$$ -11363 923 2846 -2888 2351 -1087 -450 -1497 -270 9774 4815 12813 24665 13379 22745
618B2745K187j9806M819p915j9345L639o898n179P900K369Q242N389Q233Q740
$$ 22745 24932 5126 9945 2030 -17315 -13676 -20574 -25753 -17853 -15484 -7242 -1853 6380 15120
632A5120r506N121k733k0337M972p624j4939J6283M50J449K4759O177Q782J2998
$$ 15120 5614 10735 8002 -12335 -7363 -14987 -29926 -13643 -13193 -11744 13015 19192 27974 40972
646D0972j451k501j0700j0688j5699k1785k974j0216j0701J8768J850O976K8370
$$ 40972 39521 37020 26320 15632 -67 -21852 -24826 -35042 -45743 -26975 -25125 -18149 10221
659A0221P88O706J3644j2587o876p169j7849q668r299j070L779M660K2270J0076
$$ 10221 11009 17715 31359 18772 11896 4727 -13122 -21790 -31089 -32159 -28380 -23720 -1450 8626
673H626J0415K3270l493j45L945k2954j1772r099k4353n501m395l512R095P061
$$ 8626 19041 42311 38818 38673 42618 19664 7892 -1207 -25560 -31061 -35456 -38968 -29873 -22812
687b2812J5250J0063N848J4465o752m628M182k1291n826P70j7083N956P490j863
$$ -22812 -7562 2501 8349 22814 16062 11434 15616 -5675 -11501 -10731 -27814 -21858 -14368 -16231
701a6231J5503J0441N614R446K102J837p736o511k464j8715k984P95j6602Q379
$$ -16231 -728 9713 15327 24773 26875 28712 20976 14465 12001 -6714 -9698 -8903 -25505 -17126
715a7126M519r481J5447M016m923J1941j011k735L853k777R59k887J104K662p475
$$ -17126 -12607 -22088 -6641 -2625 -7548 4393 3382 647 4500 1723 2682 -205 899 3561 -3914
730c914P805K315q849J1706j316o053J2936n011k893R380o789q07J74p254r45
$$ -3914 3891 6206 -2643 9063 7747 1694 14630 9619 6726 16106 9317 8510 8684 1430 485
745D85p012l448o35q235P350J278l678J5602J847N28J4362m660m97N114r640k659
$$ 485 -6527 -9975 -10610 -18845 -11495 -10217 -13895 1707 3554 4082 18444 13784 13287 18401 8761 6102
761F102l788n276Kl527O300K849j213J4223k363k380J1597j2389o670M008j7620
$$ 6102 2314 -2962 -2960 -6487 -187 2662 1449 15672 13309 10929 22526 10137 3467 7475 -10145
776a0145l478K172r996M634M732K907P864M611P745O83q73N754j1501k493L488
$$ -10145 -13623 -11451 -21447 -16813 -12081 -9174 -1310 3301 11046 11729 10856 16610 5109 2616 6104
791F104j4887K878N027q960J0476M467m002R636j634k673N42q044j630n839n142
$$ 6104 -8783 -5905 -878 -9838 638 5105 1103 10739 9105 6432 6974 -1070 -2700 -8539 -13681
806a3681L674p281M341P696n242R027M589n663P489k949n784K773n240M13o9r92
$$ -13681 -10007 -17288 -12947 -5251 -10493 -1466 3123 -2540 4949 2000 -3784 -1011 -6251 -5838 -5907 -6899
822f899P016k218M293P016q135N637O57j3490M716m579j1114P679m023k236R395
$$ -6899 117 -2101 2192 9208 1073 6710 7367 -6123 -1407 -5986 -17100 -9421 -13444 -15680 -6285
837f285O4L645M026J034J862n210J266k955r517O442m412m917J3208k727J503
$$ -6285 -6221 -2576 1450 2484 4346 -864 402 -2553 -12070 -5628 -10040 -14957 -1749 -4476 -2973
852b973J3863n387L266N545r375k71l590p025n97n864J884J746j245J0348k41
$$ -2973 10890 5503 8769 14314 4939 4668 1078 -5947 -6544 -12408 -10524 -8778 -10023 325 84
867H4J514J0286n876k13L970j0483O12j960o820L703p68L114N434j107R068J030
$$ 84 1598 11884 6008 5795 9765 -718 -106 -2066 -8886 -5183 -5951 -2837 2597 1490 10558 11588
883A1588k906Q166q793l197M849j2920o66L874q483N705L378j957P038J496J799
$$ 11588 8682 16848 8055 4858 9707 -3213 -3879 -5 -8488 -2783 595 -1362 5676 7172 8971
898H971L59j983L032p040j490L407j0253M175M542q688R020L115o235R518j735
$$ 8971 9330 7347 10379 3339 1849 5256 -4997 -822 3720 -4968 4052 7167 932 10450 8715
913H715l914N087m376j438n57l279J602l484J364K795n503O578N90n194P535k678
$$ 8715 4801 9888 5512 4074 3517 238 1840 -1644 -280 2515 -2988 3590 4180 -1014 6521 3843
929C843l462O571n739J77L178n465K322j374j975L568n432K527K519o914O976
$$ 3843 381 6952 1213 1390 4568 -897 1425 51 -1924 1644 -3788 -1261 1258 -5656 1320
944A320n76n558Q569l397k770N963n304m37J823m232J051j830J117J174l287O526
$$ 1320 744 -4814 3755 358 -2412 3551 -1753 -2190 -367 -4599 -3548 -5378 -4261 -3087 -6374 152
960A52q74k977R035n618k318Q036j0125p89M099r110K226J785m787M270N07J848
$$ 152 -722 -3699 5336 -282 -2600 5436 -4689 -5478 -1379 -10489 -8263 -6478 -11265 -6995 -6488 -4640
976d640K681j001N110j964j939M569q020O32L045r034M286K477n567P153N51j296
$$ -4640 -1959 -2960 2150 186 -1753 2816 -5204 -4572 -1527 -10561 -6275 -3798 -9365 -2212 -1661 -2957
992b957O397k252J225M57m307L039n790l163L583p243K527L696n828P153K907
$$ -2957 3440 1188 2413 2870 -1437 1602 -4188 -7351 -3768 -11011 -8484 -4788 -10616 -3463 -556
1007e56k580P177o38k36K580l398R58k678k379K737n920K419M035o172P640K437
$$ -556 -3136 4041 3403 3167 5747 2349 3307 629 -1750 987 -4933 -2514 1521 -4651 2989 5426
1023E426n084Q665j772m888N188n344k797J304n504R09j209N90L161j741N845
$$ 5426 342 9007 7235 2347 7535 2191 -606 698 -4806 -3897 -5106 -4516 -1355 -3096 2749
1038B749L009k783Q202k486l569O385o607k369L704o739J760J149k882M566m58
$$ 2749 5758 2975 11177 8691 5122 11507 4900 2531 6235 -504 1256 2405 -477 4089 3631
1053C631J294K933l379L680j552n525M418o323k965N180o236J308M443l737N110
$$ 3631 4925 7858 4479 8159 6607 1082 5500 -823 -3788 1392 -4844 -3536 907 -2830 2280
1068B280J471o03M286k651J845K37m069L533l662k499N801o209J584M824p240
$$ 2280 3751 3148 7434 4783 6628 6865 2796 6329 2667 168 5969 -240 1344 6168 -1072
1083a072L606J637n824L204k011k288J683k941J741j096j242M683l785J160M523
$$ -1072 2534 4171 -1653 1551 -460 -2748 -1065 -4006 -2265 -3361 -4603 80 -3705 -2545 1978
1098A978o247L737K155o602N956j77l979N819k322K79K744l254K268j616k411
$$ 1978 -4269 -532 1623 -4979 977 800 -3179 2640 318 597 3341 87 2355 739 -1672
1113a672J953o005R80J270o380M813K66m328P568k304j293N318l735Q48N49l027
$$ -1672 281 -5724 -4744 -3474 -9854 -5041 -4775 -9103 -1535 -3839 -5132 186 -3549 -2701 -2152 -5179
1129e179K434k561N19L053l832N577J923l558O966k028l324N353o115j703K132
$$ -5179 -2745 -5306 -4787 -1734 -5566 11 1934 -1624 5342 3314 -10 5343 -772 -2475 -343
1144c43n922J155q76j630L102j442K320K630l099N558j719l285O018n296j034
$$ -343 -6265 -5110 -5986 -7616 -4514 -5956 -3636 -1006 -4105 1453 -266 -3551 2467 -2829 -3863
1159c863N076n673K496L747m009M905P12m39L346k262J273q77l554L276n101j906
$$ -3863 1213 -4460 -1964 1783 -2226 2679 3391 2952 6298 4036 5309 4432 878 4154 -947 -2853
1175b853M041o204J498L289n133N105J358k689M765j376P3K379l061J790j189
$$ -2853 1188 -5016 -3518 -229 -5362 -257 1101 -1588 3177 1801 1874 4253 1192 2982 1793
1190A793k237L891m095J480L903m707M661K494m224N959j243l046L288m711j509
$$ 1793 -444 3447 -648 832 4735 28 4689 7183 2959 8918 7675 4629 7917 3206 1697
1205A697q59m487J614l226k99L964l171N033M081l175O177k8l574M270n045l680
$$ 1697 838 -3649 -2035 -5261 -5560 -1596 -4767 266 4347 1172 7349 7321 3747 8017 2972 -708
1221g08J652n168N73P34r81M825O68L653M525k905M730j668o568J617o908n645
$$ -708 944 -4224 -3651 -2917 -3898 927 1595 5248 9773 6868 11598 9930 3362 4979 -1929 -7574
1237g574J631o619K17M824j362O179M222K290N859j561J004j225o331P1o225n702
$$ -7574 -5943 -12562 -12345 -7521 -8883 -2704 1518 3808 9667 8106 9110 7885 1554 1625 -4600 -10302
1253a0302L485m537J777O877n96O728N212j067M240k285l505k086p968k264m418
$$ -10302 -6817 -11354 -9577 -2700 -3296 3432 8644 7577 11817 9532 6027 3941 -4027 -6291 -10709
1268a0709m954L590j841K329Q953L5N994N860l095L935j836o093k68o428k634
$$ -10709 -15663 -12073 -13914 -11585 -2632 -2597 3397 9257 6162 10097 8261 2168 1900 -4528 -7162
1283g162j500l108L895O89K106P706j104M370N258n557K418k472p612J345n433
$$ -7162 -8662 -11770 -7875 -7186 -5080 2626 1522 5892 11150 5593 8011 5539 -2073 -728 -6161
1298f161m615K154k739J963L338R35N871J166K588L607l875K861n81o599K351
$$ -6161 -10776 -8622 -11361 -9398 -6060 -5125 746 1912 4500 8107 4232 7093 6512 -87 2264
1313B264l638m711M082l976K93M814j817M056J727p9M118k324L50P21n799J179
$$ 2264 -1374 -6085 -2003 -5979 -5686 -872 -2689 1367 3094 3015 7133 4809 5159 5880 81 1260
1329A260k553n636L446l693m63N045j843L865M618n52M579K2m05J517n608k50
$$ 1260 -1293 -6929 -3483 -7176 -7639 -2594 -4437 -572 4046 3494 8073 8095 7690 9207 3599 3349
1345C349k437n898K189k979j759N863j880L201N674j420L402J679l458J045m584
$$ 3349 912 -4986 -2797 -5776 -7535 -1672 -3552 -351 5323 3903 7305 8984 5526 6571 1987
1360A987k604j323n592J680r17j099O109o46L795O170k854L551J653n287J325
$$ 1987 -617 -1940 -7532 -5852 -6769 -7868 -1759 -2405 1390 7560 4706 8257 9910 4623 5948
1375E948l660n131J037l898r9J362q45M872Q47Q19M855k540J162J145n797J687
$$ 5948 2288 -2843 -1806 -5704 -5803 -4441 -5286 -414 433 1252 6107 3567 4729 5874 77 1764
1391A764k301m345K582k907k24L579j551L512J223m11M008k584K4K047n250J833
$$ 1764 -537 -4882 -2300 -5207 -5431 -1852 -3403 109 1332 921 4929 2345 2369 4416 -834 999
1407I99j54n004L546j087k367M164k029J80K525k159K229p44p46K556l042J660
$$ 999 845 -4159 -613 -1700 -4067 97 -1932 -1752 773 -1386 843 99 -647 1909 -1133 527
1423E27Q44l917L905j649l386M612l611o67L255l076K467J887j754K976m23j14
$$ 527 1371 -2546 1359 -290 -3676 936 -2675 -3342 -87 -3163 -696 1191 -563 2413 1990 1876
1439A876J858l905J541p38m180K626k908j223M260k743J992L287j728L735M6k200
$$ 1876 3734 -171 1370 632 -3548 -922 -3830 -5053 -793 -3536 -1544 1743 15 3750 3796 1596
1455A596K567l644p15km486K379j090j467M771j706J628M927l157K539P86l780
$$ 1596 4163 519 -196 -198 -4684 -2305 -3395 -4862 -91 -1797 -169 4758 1601 4140 4926 1146
1471A146J203k605j993N84k883J785L06q07M712j099Q70M032l807J670J149n184
$$ 1146 2349 -256 -2249 -1665 -4548 -2763 -2457 -3264 1448 349 1219 5251 1444 3114 4263 -921
1487i21K042j903l486L154j660m3L260j310K627O84q61K988l144k33Q04m257J999
$$ -921 1121 -782 -4268 -1114 -2774 -2817 443 -867 1760 2444 1583 4571 1427 1194 1998 -2259 -260
1504b60n70l271L827r94m84M244k482K002Q94k517K070k067j370J979l579J335
$$ -260 -830 -4101 -274 -1268 -1752 2492 10 2012 2906 389 2459 392 -978 1001 -2578 -1243
1520a243J119k542L208K15k000M246k213n61K151l021J355q52j805J918j607Q11
$$ -1243 -124 -2666 542 757 -1243 3003 790 229 2380 -641 714 -138 -1943 -25 -1632 -821
1536h21J381k525L217q3k092L589k587j109L477m073O71J946l279K253l2j095
$$ -821 560 -1965 1252 1169 -923 2666 79 -1030 2447 -1626 -955 991 -2288 -35 -67 -1162
1552a162K361j481R19K39j569K563j958j201L248l552O62K552l939K649O95k479
$$ -1162 1199 -282 637 876 -693 1870 -88 -1289 1959 -1593 -931 1621 -2318 331 1026 -1453
1568a453K823j360n68J960k252J559k00j924L203k224m83K888l807J974R97l286
$$ -1453 1370 10 -558 1402 -850 709 509 -1415 1788 -436 -919 1969 -1838 136 1133 -2153
1584b153L252p98j474K645j927P17Q00j894K075j180j017K458l004J030J924l869
$$ -2153 1099 301 -1173 1472 -455 262 1062 -832 1243 63 -954 1504 -1500 -470 1454 -2415
1600b415L132k53k469L523j306j033K658k159P56O56k022J981j835L06J211k917
$$ -2415 717 464 -2005 1518 212 -821 1837 -322 434 1090 -932 1049 -786 -480 731 -2186
1616b186K703J29k280L658j619j224L365k906J2J725k776J235l64j881K450j574
$$ -2186 517 646 -1634 2024 405 -819 2546 -360 -348 1377 -1399 -164 -528 -2409 41 -1533
1632a533J130J077j952L216q56j864L266k347l06J754l634J545N66k458K626p25
$$ -1533 -403 674 -1278 1938 1082 -782 2484 137 -169 1585 -2049 -504 62 -2396 230 -495
1648d95m30K782k220J574N09k802K683k022j790K976l268J056J462k681K877K56
$$ -495 -925 1857 -363 1211 1720 -1082 1601 -421 -2211 765 -2503 -1447 15 -2666 211 467
1664D67j082K506j159N22P25k107J067r80j647K403k771L83K510k797K847Q23
$$ 467 -615 1891 732 1254 1979 -128 939 -41 -1688 715 -2056 -1673 837 -1960 887 1710
1680A710k700L304j009k004K737l110Q4N42k505J834p21J75K409k035K426J177
$$ 1710 -990 2314 1305 -699 2038 -1072 -988 -446 -2951 -1117 -1838 -1663 746 -1289 1137 2314
1696B314k430K655q37k103K590k825o37J736k631J701pj200L084j243P35J484
$$ 2314 -116 2539 1702 -401 2189 -636 -1273 463 -2168 -467 -474 -1674 1410 167 902 2386
1712B386k374J440m91k791K395j430j694J862j989J014K023j790K528k9n80J985
$$ 2386 12 1452 961 -1830 565 -865 -2559 -697 -2686 -1672 351 -1439 1089 1060 480 2465
1728B465j794J141M6k440J809r88j806K684k446L49K397k995J931Q19k036J949
$$ 2465 671 1812 1858 -582 1227 239 -1567 1117 -1329 -980 1417 -1578 353 1172 -864 1085
1744A085j169k11J065j971J097l22j730K595j860P0K385k514J720J381k511K679
$$ 1085 -84 -295 770 -1201 -104 -426 -2156 439 -1421 -1351 1034 -1480 240 1621 -890 1789
1760A789k81j280K400j891J53M59k000J062j023j080J934k386M85J926k625K532
$$ 1789 1508 228 2628 737 890 1349 -651 411 -612 -1692 242 -2144 -1659 267 -2358 174
1776A74O51j947L056j619o46J230k018R31j51j827J900j113J86K559k019K302
$$ 174 825 -1122 1934 315 -331 899 -1119 -188 -339 -2166 -266 -1379 -1193 1366 -653 1649
1792A649J315k186K850j116k137J767k639o79L22j982O44q1l53J778m13J505J911
$$ 1649 2964 778 3628 2512 375 2142 -497 -1176 -854 -2836 -2192 -2273 -2626 -848 -1261 244 2155
1809B155j792K305l57k548K145k470j441K281l033J113J262j186K349K43M90K415
$$ 2155 363 2668 2311 -237 1908 -562 -2003 278 -2755 -1642 -380 -1566 783 1026 1516 3931
1825C931j797J069j34k694J388k601k063J947k776R8J889j603K748J253o10K695
$$ 3931 2134 3203 3069 375 1763 -838 -2901 -954 -3730 -3632 -1743 -3346 -598 655 45 2740
1841B740j141M69N46k386Q01q52k084J812k161K11K485j956J846J558j277K821
$$ 2740 1599 2068 2614 228 1029 177 -1907 -95 -2256 -2045 440 -1516 330 1888 611 3432
1857C432n65j546J014j960k64r76k223J285j316n85K235k090J950K303j526K570
$$ 3432 2867 1321 2335 375 111 -865 -3088 -1803 -3119 -3704 -1469 -3559 -1609 694 -832 1738
1873A738L97j259K080j644r81J110l053O55k09j195J756j554J217K030j500K222
$$ 1738 2135 876 2956 1312 331 1441 -1612 -957 -1166 -2361 -605 -2159 -942 1088 -412 1810
1889A810N33j740K280k063j334J411l286n02K49k047J674O1M27L060r91K176J953
$$ 1810 2343 603 2883 820 -514 897 -2389 -2891 -2642 -4689 -3015 -2954 -2527 533 -458 1718 3671
1906C671j896K237r01k429J198k781q90O14k174J202N57n76L016k75J270J905
$$ 3671 1775 4012 3111 682 1880 -901 -1791 -1177 -3351 -2149 -1592 -2168 848 573 1843 3748
1922C748k138R28m68k957J248k412j474J577k234O35K405p05L039J133J06K313
$$ 3748 1610 2538 2070 -887 361 -2051 -3525 -1948 -4182 -3547 -1142 -1847 1192 2325 2431 4744
1938D744j201j7l36k805P37k037j520J163j664N92K231j061K328J537j451K066
$$ 4744 3543 3526 3190 385 1122 -915 -2435 -1272 -2936 -2344 -113 -1174 1154 2691 1240 3306
1954C306j246o79K38k315r7m93j853J896p83J02K866j046J646J768j606J953m04
$$ 3306 2060 1381 1619 -696 -793 -1286 -3139 -1243 -2026 -1924 942 -104 1542 3310 1704 3657 3253
1971C253j809J251k022q35P20k303J049m12o54K161j029Q12J459j832K065P6k025
$$ 3253 1444 2695 673 -162 558 -1745 -696 -1108 -1762 399 -630 182 1641 -191 1874 1950 -75
1988g5J656j557q63J007j851M50L20j046J608k98Q12J421j060J276O96j619J330
$$ -75 1581 24 -839 168 -1683 -1233 -913 -1959 -351 -649 163 1584 524 1800 2496 877 2207
2005B207j283j907J532k536k76P60j843J236J016r43K693j159J543P59j859J458
$$ 2207 924 -983 549 -1987 -2263 -1503 -3346 -2110 -1094 -2037 656 -503 1040 1799 -60 1398
2021A398p70k363J710k312k02J568k081J836R70p19J960K68m97J242j212p6j64
$$ 1398 628 -1735 -25 -2337 -2539 -971 -3052 -1216 -246 -965 995 1263 766 2008 796 720 556
2038E56k477Q37j151j071J866j065L81K547j549J875P00j370J695j618l67J87
$$ 556 -1921 -1084 -2235 -3306 -1440 -2505 -2124 423 -1126 749 1449 79 1774 156 -211 -24
2054b4j612M52nj150K364j293M90J946j743J807L95k073J370n09j311J222j579
$$ -24 -1636 -1184 -1189 -2339 25 -1268 -778 1168 -575 1232 1627 -446 924 415 -896 326 -1253
2071a253J69Q39j485J476j00m6J723j328Q55Q31k118J924p12j094J400j186m26
$$ -1253 -1084 -245 -1730 -254 -354 -400 1323 -5 850 1681 -437 1487 775 -319 1081 -105 -531
2088e31J435j440J260j61r69J501n99M78Q40j528J053M46j975J578p48r85J693
$$ -531 904 -536 724 563 -406 1095 496 974 1814 286 1339 1785 -190 1388 640 -345 1348
2105A348j658N03J059j360J567l91n09J133j009O17J52j897J772j145q84J532
$$ 1348 -310 193 1252 -108 1459 1068 559 1692 683 1300 1452 -445 1327 182 -702 830
2121H30j289q0J370j300J173P43r14J286p82j91R78j961O09P6j596J686p37M8
$$ 830 -459 -539 831 -469 704 1447 533 1819 1037 846 1824 -137 472 548 -1048 638 -99 -51
2139e1J470j406O69J078j772R29o10j142R89j883L73N30j163J656l29k63K093
$$ -51 1419 13 682 1760 -12 917 307 -835 154 -1729 -1356 -826 -1989 -333 -662 -925 1168
2156A168j548J23J239j531M14K15j768J954j115n99J800j409J172K90j106J208
$$ 1168 -380 -257 982 -549 -135 80 -1688 266 -849 -1448 352 -1057 115 405 -701 507
2172E07j140m42R45j775K68O83j840J432k51p68K516j302Q8J077j066R77k41o68
$$ 507 -633 -1075 -130 -1905 -1637 -954 -2794 -1362 -1613 -2381 135 -1167 -1079 -2 -1068 -91 -332 -1000
2190a000P47r79N15P85j628J453N35j288J921j311j09J372k133J77N99j526N23
$$ -1000 -253 -1232 -717 68 -1560 -107 428 -860 1061 -250 -359 1013 -1120 -943 -344 -1870 -1347
2207a347k67l41J254p52N56N92p67J810o16o03J434j282o7J099j449J121M63j085
$$ -1347 -1614 -1955 -701 -1453 -897 -305 -1072 738 122 -481 953 -329 -396 703 -746 375 838 -247
2225b47J686o87K54N80o48L05j58j142R44j257p52J224j693Q39N22j141J883l2
$$ -247 1439 752 1006 1586 938 1243 1085 -57 887 -370 -1122 102 -1591 -752 -230 -1371 512 480
2243D80n71J683o74O67O05j236J360r07o77J305j517M54N25r83J568l38o99J968
$$ 480 -91 1592 918 1585 2190 954 2314 1407 730 2035 518 972 1497 514 2082 1744 1045 3013
2261C013j116n75N31j363m2n37j089N74q18%J098r84J849P20m73K400r13n06J521
$$ 3013 1897 1322 1853 490 448 -89 -1178 -604 -1422 -1422 -324 -1308 541 1261 788 3188 2275 1769 3290
2280C290k155k4J72j716R10o42n30J356n26J033R99j060Q70l81j434L62j671j023
$$ 3290 1135 1111 1283 -433 477 -165 -695 661 135 1168 2167 1107 1977 1596 162 524 -1147 -2170
2298b170K36j771O94O23p08K454k7R96J813o74R67j62j290M12j693j286O96j412
$$ -2170 -1934 -3705 -3011 -2388 -3096 -642 -669 327 2140 1466 2433 2271 981 1393 -300 -1586 -890 -2302
2316b302L17J482j271J804M38j67J092j240J22K3k121j14j097j224J349j186J38
$$ -2302 -1985 -503 -1774 30 468 301 1393 153 275 298 -1823 -1937 -3034 -4258 -2909 -4095 -3957
2333c957K268p54J881J188R0J336n44m26M36j888l21l5j339P98n55m3J343n02
$$ -3957 -1689 -2443 -562 626 716 2052 1508 1082 1518 -370 -691 -726 -2065 -1267 -1822 -1865 -522 -1024
2351a024Q55R69j176J091n09j714J048j805m31P67j477J008N06K3J995l36J215
$$ -1024 -169 800 -376 715 206 -1508 -460 -2265 -2696 -1929 -3406 -2398 -1892 -1869 126 -210 1005
2368A005J277r84R87K50j501Q79j171q44P90j523N95J68k10P41l23o1J062p06
$$ 1005 2282 1298 2285 2535 1034 1913 742 -102 688 -835 -240 -72 -282 459 136 75 1137 431
2386D31m64L46j355J239p42q07J473r92P57R54o61J408J42m62J280q22J76R10
$$ 431 -33 313 -1042 197 -545 -1352 121 -871 -114 840 179 1587 1729 1267 2547 1725 1901 2811
2404B811j634P57j33j204J461j162l84P69j487J30N26j315R18l09p20J376p61
$$ 2811 1177 1934 1801 597 2058 896 512 1281 -206 -76 450 -865 53 -256 -976 400 -361
2421c61O45N10p10J106j55n70J008j268O12O28j133P30M49o91J291n80J5O64j559
$$ -361 284 794 84 1190 1035 465 1473 205 817 1445 312 1042 1491 800 2091 1511 1526 2190 631
2440F31K05l35j624O09j194m83N54q61J067J034r83K182l17l33J256j245K57j3
$$ 631 836 501 -1123 -514 -1708 -2191 -1637 -2498 -1431 -397 -1380 802 485 152 1408 163 420 407
2458D07j221O29m22n82J523j007R96P19o97Q59J29j365N30j389q43K71j573P11
$$ 407 -814 -185 -607 -1189 334 -673 323 1042 345 1204 1333 -32 498 -891 -1734 -1463 -3036 -2325
2476b325L02j045J400j09Q30P76n00P29Q4j013J096q03p17J038p75O02P43j330
$$ -2325 -2023 -3068 -1668 -1777 -947 -171 -671 58 142 -871 225 -578 -1295 -257 -1032 -430 313 -1017
2494a017J510j29l56L33o21j99O7j445J034o47n44J075m82o3J141j100J051J95
$$ -1017 493 364 8 341 -280 -479 -412 -1857 -823 -1470 -2014 -939 -1421 -1484 -343 -1443 -392 -197
2512a97r63J167p14j00J076q56J165L61q87J344l37n93J200j667J41R8j159J037
$$ -197 -1160 7 -707 -807 269 -587 578 939 52 1396 1059 466 1666 -1 140 238 -921 116
2530A16m68n05J037R9m49Q87r20P57k33r17J074j292J50J087n91J027L24r77J786
$$ 116 -352 -857 180 279 -170 717 -203 554 321 -596 478 -814 -664 423 -168 859 1183 206 1992
2549A992j81J7K07j110k2K83j375O62o18j33J308q36L86J073j022P03m40r31O70
$$ 1992 1811 1828 2035 925 903 1186 -189 473 -145 -278 1030 194 580 1653 631 1334 894 -37 633
2568F33r58m47Q36r08P19N05k18J329j93J33P47j302M50k7j720J106j186j64J313
$$ 633 -325 -772 64 -844 -125 380 162 1491 1298 1431 2178 876 1326 1299 -421 685 -501 -665 648
2587F48q22O35O67p42J020n80p82L24j163m9j43j036J034K77j97J808n93L93J276
$$ 648 -174 461 1128 386 1406 826 44 368 -795 -844 -987 -2023 -989 -712 -909 899 306 699 1975
2606A975j466L54k03j507O73j116j19P08m81O83P51k77J228j39o77N46j284o08
$$ 1975 509 863 660 -847 -174 -1290 -1409 -701 -1182 -499 252 -25 1203 1064 387 933 -351 -959
2624i59K77j851P13j9k65J569l25O40J122o22O14k74j167P73j400n60Q38j250
$$ -959 -682 -2533 -1820 -1839 -2104 -535 -860 -220 902 280 894 620 -547 226 -1174 -1734 -896 -2146
2642b146Q68N98k30J328k6R2P29j243L01n08j387Q28r65JQ92l78P57J016n50J194
$$ -2146 -1278 -680 -910 418 392 484 1213 -30 271 -237 -1624 -796 -1761 -1760 -868 -1246 -489 527 -23 1171
2662A171j54n93O27j209l56K96j405M93J49k21J276m13O55O90n37O45q5j299R87
$$ 1171 1017 424 1051 -158 -514 -218 -1623 -1130 -981 -1202 74 -339 316 1006 469 1114 1029 -270 717
2681G17j271J4N30q42Q99N25n25P65j85k1P68j102Q2J77r78O34k44j002J753j164
$$ 717 -554 -540 -10 -852 47 572 47 812 627 606 1374 272 354 531 -447 187 -57 -1059 694 -470
2701d70N76R13j169P71K38j070R12p53M9M39n27N52M18o71J168n41k48O30j112
$$ -470 106 1019 -150 621 859 -211 701 -52 -3 436 -91 461 879 208 1376 835 587 1217 105
2720A05jM69j039Q20j62l09J297q42L79K56r79P16o67j028O94j147L33P96p10
$$ 105 104 573 -466 354 192 -117 1180 338 717 973 -6 710 43 -985 -291 -1438 -1105 -309 -1019
2739a019J585J63J9J054l81k07K26j192m6p20p35K48n5P0J270n60J101J64k15
$$ -1019 566 729 748 1802 1421 1214 1440 248 202 -518 -1253 -1005 -1060 -990 280 -280 821 985 770
2758G70N18p90r80L62j337m02K20j154J341M65L8J849j72Q31O22r20K86o54j286
$$ 770 1288 498 -482 -120 -1457 -1859 -1639 -2793 -1452 -987 -949 900 728 1559 2181 1261 1547 893 -393
2777c93K89j029p48J136j122J343M50k24R79K43m55M77r42m12k96j127L87l79
$$ -393 -104 -1133 -1881 -745 -1867 -524 -74 -298 681 924 469 946 4 -408 -704 -1831 -1444 -1823
2795a823j29J250n39Q49J182j031J892j97m98M83r88j73K00j413P67k37q19J237
$$ -1823 -1952 -702 -1241 -392 790 -241 1651 1454 956 1439 451 278 478 -935 -168 -405 -1224 13
2813A3o18j6P78m20O26j5r11R28q77m41N66p10j4O02p94J394m18j7J345p30R65
$$ 13 -605 -621 157 -263 363 348 -563 365 -512 -953 -387 -1097 -1111 -509 -1303 91 -327 -344 1001 271 1236
2834A236M46q30L78p7j113P94r59l4kq56N22J59o83J215p00L58M98p61N74j6j193
$$ 1236 1682 852 1230 1153 40 834 -125 -159 -161 -1017 -495 -336 -1019 196 -504 -146 352 -409 165 149 -1044
2855a044J053o97j19Q91o79M23Q78o77J335n4n25R68q89M2r9j209O66l83q34R99
$$ -1044 9 -688 -807 84 -595 -172 706 29 1364 1310 785 1753 864 906 807 -402 264 -119 -953 46
2875D6r63l1O71m48O52K07r90R04n63J03K20j212Q84N47n35J400k62j86J103o89
$$ 46 -917 -948 -277 -725 -73 134 -856 48 -515 -412 -192 -1404 -520 27 -508 892 630 444 1547 858
2895H58N05M1j190N48n34p42O69n53O2L78r33Q02K77r36Q46q79L0K65q47K80J33
$$ 858 1363 1404 214 762 228 -514 155 -398 -336 42 -891 -89 188 -748 98 -781 -751 -486 -1333 -1053 -920
2916i20k56J462m8O8J262q58P70K93j265M61r22j15L48q62N35J54p10R38o0q2
$$ -920 -1176 286 238 306 1568 710 1480 1773 508 969 47 -68 280 -582 -47 107 -603 335 275 193
2936A93P28j097M2p8o52M7o10l86J015l00L24J036k67J116N82o28O70k00m28J96
$$ 193 921 -176 -134 -212 -864 -817 -1427 -1813 -798 -1098 -774 262 -5 1111 1693 1065 1735 1535 1107 1303
2956A303j540L32k21n52P42j40k5M10l31K74K04p36N19p92m22M74q23Q9L26j30
$$ 1303 -237 95 -126 -678 64 -76 -101 309 -22 252 456 -280 239 -553 -975 -501 -1324 -1235 -909 -1039
2976a039Q00K00k20J263k56L85P78q38L9n41n07L47p35m62N00o79P02J64m73J102
$$ -1039 -239 -39 -259 1004 748 1133 1911 1073 1112 571 64 411 -324 -786 -286 -965 -263 -99 -572 530
2996E30n41l30N34j097K84j83q86R26m15k54J397l92M71N78j32M58K19n75O40
$$ 530 -11 -341 193 -904 -620 -803 -1689 -763 -1178 -1432 -35 -427 44 622 490 948 1167 592 1232
3015A232r77m11J82o78M86l05n25R97m08J4P95q43L30M6r37K42k34k09M38l95
$$ 1232 255 -156 26 -652 -166 -471 -996 1 -407 -393 402 -441 -111 -65 -1002 -760 -994 -1203 -765 -1160
3035a160N59K28M5J024k5PO22n52J27j40o70N05r44n30J009n05j68Q96p04Q43
$$ -1160 -601 -373 -328 696 671 678 1300 748 875 735 65 570 -374 -904 105 -400 -568 328 -376 467
3055D67L01j107M25n41K2N7r06M85L61p41R67J30r8J340l76K17N03m95L93o45
$$ 467 768 -339 86 -455 -433 -376 -1282 -797 -436 -1177 -210 -80 -178 1162 786 1003 1506 1011 1404 759
3075G59m09R7m21PO53q98O28j12l83R37o64k3L40q49M58l03m15P88n53M63J81
$$ 759 350 447 26 33 686 -212 416 304 -79 858 194 171 511 -338 120 -183 -598 190 -363 100 281
3096B81k47L52L50p96J182n91n60J146o83L51J29o96O11n96k26K53q38j5K47l16
$$ 281 34 386 736 -60 1122 531 -29 1117 434 785 914 218 829 233 7 260 -578 -593 -346 -662
3116f62O98j9p29J171p80J82P77q34K70N2n30M72m69Q1N79l47O58L74r70J017
$$ -662 36 17 -712 459 -321 -139 638 -196 74 126 -404 68 -401 -320 259 -88 570 944 -26 991
3136I91n32n29N75j209L31k65p15L55N4J98Q61m85J03P09q60N83m87m35M25n86
$$ 991 459 -70 505 -704 -373 -638 -1353 -998 -944 -746 115 -370 -267 442 -418 165 -322 -757 -332 -918
3156i18j32P94q18O61N06k67J016n03r9N28j143M09k17o87J67q2l69J011k42j62
$$ -918 -1050 -256 -1074 -413 93 -174 842 339 240 768 -375 34 -183 -870 -703 -785 -1154 -143 -385 -547
3176e47R06n50O27m00o09P89j084k45P09r66J055L66m65O65j78N18J54q88O06
$$ -547 359 -191 436 36 -573 216 -868 -1113 -404 -1370 -315 51 -414 251 73 591 745 -143 463
3195D63l73r18O47o02l44P90j9N93K13j62O18n20k07K77p15j24J46o43N39J29
$$ 463 90 -828 -181 -783 -1127 -337 -356 237 450 288 906 386 179 456 -259 -383 -237 -880 -341 -212
3215b12k13J022m28N43P44q66N38q08m86L14o83j30N39q5O05P6k99R20j34N1K2
$$ -212 -425 597 169 712 1456 590 1128 320 -166 148 -535 -665 -126 -211 394 470 171 1091 957 1008 1030
3236A030q44k0j1m35J67j93j21J126o74O94M50n27O02l02j044O07q98k4M08n61
$$ 1030 186 166 155 -280 -113 -306 -427 699 25 719 1169 642 1244 942 -102 505 -393 -417 -9 -570
3256e70P95J9j2O02O0OM23j085K40m3o74l82j9j47J117l48J96L57j08P11o72l22
$$ -570 225 244 232 834 894 900 1323 238 478 435 -239 -621 -640 -787 330 -18 178 535 427 1138 466 144
3278A44K57q50k80L39o71L87m2J6Q82r3J87N32n93K14m26l64O9o01K9O26n64O43
$$ 144 401 -449 -729 -390 -1061 -674 -716 -700 182 89 276 808 215 429 3 -361 -292 -893 -864 -238 -802 -159
3300a59J89k77R89k96n34K71o79J05O8j043N38j11q1R60n77J87O92l94O16m81
$$ -159 30 -247 742 446 -88 183 -496 -391 -323 -1366 -828 -939 -1020 -60 -637 -450 242 -152 464 -17
3320a7n78M31n42J05K98j35L79j22j3L77j54J2K99r25Q7J32o71R14l30J47M42
$$ -17 -595 -164 -706 -601 -303 -438 -59 -181 -194 183 29 41 340 -585 -498 -366 -1037 -123 -453 -306 136
3341A36l01N77l27k92M63n25k69L56r23L13O54l54P99M35k76Q95m12k39K60q98
$$ 136 -165 412 85 -207 256 -269 -538 -182 -1105 -792 -138 -492 307 742 466 1361 949 710 970 72
3361G2L1p9j032O75j20n5M17J75L57P34m18M70o82l71M74j488K27K94o76N40M55
$$ 72 103 24 -1008 -333 -453 -508 -91 84 441 1175 757 1227 545 174 648 -840 -613 -319 -995 -455 0
3382@k47J283K5O28L97n02J72q73o41O8j070L22J17o48O23N41k18Q56K66k20J87
$$ 0 -247 1036 1061 1689 2086 1584 1756 883 242 310 -760 -438 -321 -969 -346 195 -23 833 1099 879 1066
3403A066n59J8m30n64L77q45j01O89j01N40P41J27J89L79n59N31j028J11O1j086
$$ 1066 507 525 95 -469 -92 -937 -1038 -349 -450 90 831 958 1147 1526 967 1498 470 581 642 -444
3423d44K66n20K3O61l80LM14K3K01O5l40J69m07o7K98j086N03K28j89K01J46J01
$$ -444 -178 -698 -675 -14 -394 -391 23 46 247 312 -28 141 -266 -333 -35 -1121 -618 -390 -579 -378 -232 -131
3445a31M98j53M61lm27N90p53l17j31p45L56j45m83P2M52l01R68m80M39L52m29
$$ -131 367 214 675 672 245 835 82 -235 -366 -1111 -755 -900 -1383 -1311 -859 -1160 -192 -672 -233 119 -310
3466c10O51l90l04mn31k70N48o45P96M23n5O90N19n45J43j28j45l14o03j18j49
$$ -310 341 -49 -353 -357 -888 -1158 -610 -1255 -459 -36 -91 599 1118 573 716 588 443 129 -474 -592 -741
3487g41m98M64p20P69M66j81Q34m47J33N64l38k54Mo96q4N05k83M01k0J72P38
$$ -741 -1239 -775 -1495 -726 -260 -441 393 -54 79 643 305 51 55 -641 -725 -220 -503 -102 -122 50 788
3508G88k30L67k07k11K16m70o29M21o31j37J22j20O99J24r1M05Q7n1J76p94K4
$$ 788 558 925 718 507 723 253 -376 45 -586 -723 -601 -721 -22 102 11 416 503 452 628 -166 -142
3529a42K89m51Q67n01l62J020o57P11K25j88K87l19m33J12l54L34m01p53O16o3
$$ -142 147 -304 563 62 -300 720 63 774 999 811 1098 779 346 458 104 438 37 -716 -100 -163
3549a63k16N21l89O76j19k95Q16p06j43N52k94p3J21j96J03L88m34L00r4J34M95
$$ -163 -379 142 -247 429 310 15 831 125 -18 534 240 167 288 92 195 583 149 449 355 489 984
3570I84p23k0Q2k41m6k26l36O64m39j29J29r6K43J02n2M20m53O5L16m20K43k18
$$ 984 261 241 323 82 36 -190 -526 138 -301 -430 -301 -397 -154 -52 -104 316 -137 -72 244 -176 67 -151
3592a51K99L65o32N44k41j86J81n4l49N48l15k37J70k64L01l53J19q8l1m9K58
$$ -151 148 513 -119 425 184 -2 179 125 -224 324 9 -228 -58 -322 -21 -374 -255 -343 -374 -423 -165
3613a65o15L60o5k94Q00l41Q2L52l08Q2N12o05L22N8j12K68q31M6M99p53O28p3
$$ -165 -780 -420 -485 -779 21 -320 -238 114 -194 -112 400 -205 117 175 63 331 -500 -454 45 -708 -80 -153
3635a53k54N38l92n5N16j14m89K18m97M68r1n18P55k25P2J58J5O22k54M7L42k47
$$ -153 -407 131 -261 -316 200 86 -403 -185 -682 -214 -305 -823 -68 -293 -221 -63 -48 574 320 367 709 462
3657D62m51O13j090L66p1l02N63p70O72L61q16M84K76p0J52k07l28K52o05K33
$$ 462 11 624 -466 -100 -171 -473 90 -680 -8 353 -463 21 297 227 379 172 -156 96 -509 -276
3677b76K10k49N41l29J91P00l50J80N16o98K22l23l28J55m48r6L22m41N40J18
$$ -276 -66 -315 226 -103 88 788 438 618 1134 436 658 335 7 162 -286 -382 -60 -501 39 157
3697A57m75P05J2k86L69n63J39K4n35O40n14K8N10k50R6J86L2L74Nl99K86j21
$$ 157 -318 387 399 113 482 -81 58 82 -453 187 -327 -299 211 -39 57 243 275 649 654 255 541 420
3719D20k73M89r10N34o8p72O48m04J38K65m91Q15N0o43O49m10j04K92m27J49q7
$$ 420 147 636 -274 260 192 -580 68 -336 -198 67 -424 391 441 -202 447 37 -67 225 -202 -53 -140
3740a40l67L43l27L77N02k86K67j5k7K45n31kJ3n39K4J99p14Q12o5m09O60m3K07
$$ -140 -507 -164 -491 -114 388 102 369 354 327 572 41 39 52 -487 -463 -264 -978 -166 -231 -640 20 -23 184
3763A84m2j62L38j93o83O63l73l59M49l58J35J01K12M07n6k9J17m88J82l3l97
$$ 184 142 -20 318 125 -558 105 -268 -627 -178 -536 -401 -300 -88 319 263 234 351 -137 45 12 -385
3784c85J19k61J96M1R8m3N26o9p1j08j88M00l79Q8n7m24L20j7J91J4J08J10L01
$$ -385 -266 -527 -331 -290 -192 -235 291 222 151 43 -145 255 -124 -36 -93 -517 -197 -214 -23 -9 99 209 510
3807E10m04j16K78l88J18l37L7M27m52M59J23l66K96J96m73J67l73J54N9j57K92
$$ 510 106 -10 268 -120 -2 -339 -302 125 -327 132 255 -111 185 381 -92 75 -298 -144 -85 -242 50
3828E0l05J07M1k1M0L50o8L90j94n33L18o47L24mJ26O43l08P0J57l57K55m8k71
$$ 50 -255 -148 -107 -128 -88 262 194 584 390 -143 175 -472 -148 -152 -26 617 309 379 536 179 434 386 115
3851A15J3k58k09L55k82J06M29l37M02n3k33J55l2n45L02l32J50N7k35L45J50
$$ 115 128 -130 -339 16 -266 -160 269 -68 334 281 48 203 171 -374 -72 -404 -254 -197 -432 -87 63
3872F3l59M19K9K14qk47J9k88k74M81m06Q0M16j79pN53k00j9k72k12L89n40o7
$$ 63 -296 123 152 366 358 111 130 -158 -432 49 -357 -277 139 -40 -47 506 306 287 15 -197 192 -348 -415
3895d15K94n75M14J99J09Q0n6L7N7l9Q6k24k11L21m77J43J37j03M8M09m08M22
$$ -415 -121 -696 -282 -83 26 106 50 87 144 105 191 -33 -244 77 -400 -257 -120 -223 -175 234 -174 248
3917B48k48J35J60l23K51l46k92J37L64k77K25J31l2J41m62N02R6n90J54m7Pl4
$$ 248 0 135 295 -28 223 -123 -415 -278 86 -191 34 165 133 274 -188 314 410 -180 -26 -73 -66 -100
3939a00K8P2N5K31K47j28P1k22m95R5j39k39M06m72N78P7k63N90K04p37L90k30
$$ -100 -72 0 55 286 533 405 476 254 -241 -146 -285 -524 -118 -590 -12 65 -198 392 596 -141 249 19
3961A9l18K57k04j73k58L56J53K59m22R70rl2l30k77N1j61k92K50j53l64K73J34
$$ 19 -299 -42 -246 -419 -677 -321 -168 91 -331 639 630 598 268 -9 42 -119 -411 -161 -314 -678 -405 -271
3983b71m1N07J03O7L80l83j06k63k47j04j99O6J36J82M66L2R4Q7j21J23q6l56
$$ -271 -312 195 298 365 745 362 256 -7 -254 -358 -557 -491 -355 -173 293 325 419 506 385 508 422 66
4005F6M32p37k28nO5J11k25K35L03rP0K23k12L79l17l74M88m07N3R7k25m3Q9m9
$$ 66 498 -239 -467 -472 -407 -296 -521 -286 17 8 78 301 89 468 151 -223 265 -142 -89 8 -217 -260 -171 -220
4029b20K37RJ78L34m96Qj2j18o8L32o45N75m30K16j64l6J03M79l79K52p6q3J66
$$ -220 17 26 204 538 42 50 38 -80 -148 184 -461 114 -316 -100 -264 -300 -197 282 -97 155 79 -4 162
4052A62q6L27l03q6O1j95j66N01k68mK54m15N77J34l73J29k28j32J53k60p4K31
$$ 162 76 403 100 14 75 -120 -286 215 -53 -57 197 -218 359 493 120 249 21 -111 42 -218 -292 -61
4074f1n60M87l22L78K05k16M47m2J4J78k65l13K22l97j80J98J41J53l9k67L64
$$ -61 -621 -134 -456 -78 127 -89 358 316 330 508 243 -70 152 -245 -425 -227 -86 67 28 -239 125
4095A25K7L4L69o94K31J47n64L14n60J09K96k25M80m5J03J51P7k51L28k21m36
$$ 125 152 186 555 -139 92 239 -325 -11 -571 -462 -166 -391 89 44 147 298 375 124 452 231 -205
4116b05K31k91K24J67j37O7j44M08Ol28J51K6l74L38n32K03K02m04M08j86j0K83
$$ -205 26 -265 -41 126 -11 56 -88 320 326 -2 149 175 -199 139 -393 -190 12 -392 16 -170 -180 103
4138A03O1k8K45l59j99M79n81L97n65N36Q9l73K02M15n66L12M5m87N01l83J33
$$ 103 164 136 381 22 -177 302 -279 118 -447 89 178 -195 7 422 -144 168 213 -274 227 -156 -23
4159b3k71m18P00K5l66K30k49N10J55l81K48k55r2L64k89N0J34l64N92l63m0K94
$$ -23 -294 -712 -12 13 -353 -123 -372 138 293 -88 160 -95 -187 177 -112 -62 72 -292 300 -63 -103 191
4181A91J02q2J20p30P20k78l89M77j78R0Rj39j51L49l39M67o6l30M32m35J93R9
$$ 191 293 211 331 -399 321 43 -346 131 -47 43 52 -87 -238 111 -228 239 173 -157 275 -160 33 132
4203A32p18N96k36K27r9L17k23j3J98K54O5m55L19k20j42K37n7k37N6j98K89j30
$$ 132 -586 10 -226 1 -98 219 -4 -17 181 435 500 45 364 144 2 239 182 -55 1 -197 92 -38
4225c8K94n1k62L2K22L4p0j54k97N47l60K7R4k10L5K11Q2J70ml15N18m92p1P3
$$ -38 256 205 -57 -25 197 231 161 7 -290 257 -103 -76 18 -192 -157 54 136 306 302 -13 505 13 -58 15
4249A5k07L48j29l02K02q1M34l1l96L92m62QO81o75J6N38l61L55m13j85N24l86
$$ 15 -192 156 27 -275 -73 -154 280 249 -147 245 -217 -209 472 -203 -187 351 -10 345 -68 -253 271 -115
4271a15J14K92l51K70k96q8M5r0M50m21J08J0J84m9K02l0j98K46n87J37K59j67
$$ -115 -1 291 -60 210 -86 -174 -129 -219 231 -190 -82 -72 112 63 265 235 37 283 -304 -167 92 -75
4293g5J21m2q5N21l96q0J48l20L42j81j30J70j46r2k2M2J98k0j50M19j20k93J09
$$ -75 46 4 -81 440 44 -36 112 -208 134 -47 -177 -7 -153 -245 -267 -225 -27 -47 -197 222 102 -191 -82
4316h2L58l08K72n31N4O2k25L61n9o8K0l2L50k17K87j26l78M21k20j71L42k63
$$ -82 276 -32 240 -291 -237 -175 -400 -39 -98 -166 -146 -178 172 -45 242 116 -262 159 -61 -232 110 -153
4338a53J06L23m65k0K61j57K24L60q84P25l05q0J65k38L93n2m29M5J31k64L34
$$ -153 -47 276 -189 -209 52 -105 119 479 -405 320 15 -65 100 -138 255 203 -226 -181 -50 -314 20
4359B0o3P7M11m40J47j73q7M18m55J96p5k51M60j09k72n8n4R1K59k13M11K28n95
$$ 20 -43 34 445 5 152 -21 -108 310 -145 51 -24 -275 185 76 -196 -254 -308 -217 42 -171 240 468 -127
4382a27M42j31j99K19l77j55O3K24P8Nj54N19l55k4J01j96lL4J44o9n5j25M72
$$ -127 315 184 -15 204 -173 -328 -265 -41 37 42 -112 407 52 28 129 -67 -70 -36 108 39 -16 -141 331
4405C31j17K87m73p4M5n4j9M64j044N71J7j29N4J9J0M29o09J54N4j89L55k54J93
$$ 331 214 501 28 -46 -1 -55 -74 390 -654 -83 -66 -195 -141 -122 -112 317 -292 -138 -84 -273 82 -172 21
4428B1J12k19j9J93j28J54k22K5J81K8k39J60j63L22j82m33P57l65Qrk09L13J81
$$ 21 133 -86 -105 88 -40 114 -108 -83 98 126 -113 47 -116 206 24 -409 348 -17 -9 -18 -227 86 267
4451B67n47J03Q2j96M86n09K93M4l12M33j46q6J75k87K58k29J27mj19Q4L81j52
$$ 267 -280 -177 -95 -291 195 -314 -21 23 -289 144 -2 -88 87 -200 58 -171 -44 -48 -167 -83 298 146
4473A46j97N78m23Q5p8j00l0m18N26o8l93M80k24j33K87qJ87O4n18L08L13l30
$$ 146 -51 527 104 189 111 11 -19 -437 89 21 -372 108 -116 -249 38 30 217 281 -237 71 384 54
4495E4K21k33n29M65p9j61L86k24J25K48m23M49l08MRl90L73j59q3L75q3Q3p7
$$ 54 275 42 -487 -22 -101 -262 124 -100 25 273 -150 299 -9 -5 4 -386 -13 -172 -255 120 37 120 43
4518D3k28L40o9K4J12k04j68J21L04j86k6j87J04k13J02r7J27N1K85m68O48j29
$$ 43 -185 155 86 110 222 18 -150 -29 275 89 63 -124 -20 -233 -131 -228 -101 -50 235 -233 415 286
4540B86k80M25n39J21R7j84j18J44k09Q2P3K90k55k22N76l48j18M61j25k37J71
$$ 286 6 431 -108 13 110 -74 -192 -48 -257 -175 -102 188 -67 -289 287 -61 -179 282 157 -80 91
4561I1k88j10J35l41N09k01Q5N51m49J54J93k64j15L8om5k11k08k3O38k63J77
$$ 91 -197 -307 -172 -513 -4 -205 -120 431 -18 136 329 65 -50 -12 -18 -63 -274 -482 -505 133 -130 47
4583D7J80O4p6J40j47j28R7J41n19L62l97l13K41j36M44r9J59M31lk32R0l47O2
$$ 47 227 291 215 355 208 80 177 318 -201 161 -236 -549 -308 -444 0 -99 60 491 488 256 346 -1 61
4606F1m6m33J39n7K02m6L98j57J73j79M49k06k39K85j18m21L29k78M4J54k89L30
$$ 61 15 -418 -279 -336 -134 -180 218 61 234 55 504 298 59 344 226 -195 134 -144 -100 54 -235 95
4628I5l84L25M7J78k08J12OJ72m86J42L60j38l52R2k59K40k5r3J80k0J35K77j74
$$ 95 -289 36 83 261 53 165 171 343 -143 -1 359 221 -131 -39 -298 -58 -83 -176 4 -16 119 396 222
4651B22J16J89k33j06J35n20J47k58L0N1j43K44k7M2M99k58K88p3l54M4m6n76
$$ 222 338 527 294 188 323 -197 -50 -308 -278 -227 -370 -126 -153 -111 388 130 418 345 -9 35 -11 -587
4673e87L72n8n1k75P2L79K64k73K14L51j92J16m49K83l88q2m8J19l6k8K14M3K98
$$ -587 -215 -273 -324 -599 -527 -148 116 -157 57 408 216 332 -117 166 -222 -304 -352 -233 -269 -297 -83 -40 258
4696B58J08J04j37Q4k07k3l07j50l49M03O0k41L00J96j09M39k92O5M98n85r2m05
$$ 258 366 470 333 417 210 187 -120 -270 -619 -216 -156 -397 -97 99 -10 429 137 202 700 115 23 -382
4718c82L47Q9o79K73L28k75L88j90L9K30j1J41pl70J88j00l00Q1j58K09K26n54
$$ -382 -35 54 -625 -352 -24 -299 89 -101 -62 168 157 298 291 -79 109 9 -291 -210 -368 -159 67 -487
4740d87L28K32l12M73k02J40J22k03l6l16K13L41p9o08L67k80J24L16m92O54j78
$$ -487 -159 73 -239 234 32 172 294 91 55 -261 -48 293 214 -394 -27 -307 -183 133 -359 295 117
4761A17m0K21n9N9j74l95M01k73J0J33j54j0J88l77K24L09k81J11R7j08M9J04
$$ 117 77 298 239 298 124 -271 130 -143 -133 0 -154 -164 24 -353 -129 180 -101 10 107 -1 48 152
4783A52o2Q4m82N11l75O7K10m28L82J60l37l1N94o62M57j17k40J01k91M77j28
$$ 152 90 174 -308 203 -172 -105 105 -323 59 219 -118 -149 445 -217 240 123 -117 -16 -307 170 42
4804D2J8r7j66K65jj78L83q0k92M04m57j46L85j99l52L66k71L06R7m27M57k23
$$ 42 60 -37 -203 62 61 -117 266 186 -106 298 -159 -305 80 -119 -471 -105 -376 -70 27 -400 57 -166
4826a66J50L31o8j28m4n62N33l74L96n6l17K25k18J49N8R8r1M39o43K49O0j77
$$ -166 -16 315 247 119 75 -487 46 -328 68 12 -305 -80 -298 -149 -91 7 -84 355 -288 -39 21 -156
4848a56J65k63O4K98p8j02L5P4j72K22r7L65n39J22R4j23K53k19j46K16l34L89
$$ -156 9 -254 -190 108 30 -72 -37 37 -135 87 -10 355 -184 -62 32 -91 162 -57 -203 13 -321 68
4870F8N24l50p9M4m96M05l99J74K90l39P6J18l36K41K79m40N62m70O7j33j70N00
$$ 68 592 242 163 207 -289 116 -283 -109 181 -158 -82 36 -300 -59 220 -220 342 -128 -61 -194 -364 136
4892A36l35K89r9p4J74j30lL41j10l31L90k22j94L22m86N84j31l28O16o40K1J65
$$ 136 -199 90 -9 -83 91 -39 -42 299 189 -142 248 26 -168 154 -332 252 121 -207 409 -231 -210 -45
4914d5j15K68l78N60k8k60J46q2j83M3L77l43J32l2k97L92K7j96J01k3K52n5l13
$$ -45 -160 108 -270 290 262 2 148 66 -117 -74 303 -40 92 60 -237 155 182 -14 87 64 316 261 -52
4937e2K50l7j21K68m00j6J46J45J80m01N5k84K5Q9J69m2J85l09K87R9l55J1%P9
$$ -52 198 161 40 308 -92 -108 38 183 363 -38 17 -267 -242 -153 16 -26 159 -150 137 236 -119 -108 -108 -29
4961b9K82l67J15L86o26M1N45o74K29O5K6K78j19r3J09p06L83J02m4R7J54l08
$$ -29 253 -114 1 387 -239 -198 347 -327 -98 -33 -7 271 152 59 168 -538 -155 -53 -97 0 154 -154
4983a54L35m68L95q9j79K5N1n8J20k60L21N1l70J58L97m13K80L0k20P5j04om7
$$ -154 181 -287 108 19 -160 -135 -84 -142 -22 -282 39 90 -280 -122 275 -138 142 172 -48 27 -77 -83 -130
5006a30n1L93o2l9N7j76L01m17P8L82l41m10M33j4r4J66r2l8Q0k53J51J41k10
$$ -130 -181 212 150 111 168 -8 293 -124 -46 336 -5 -415 18 4 -90 76 -16 -54 26 -227 -76 65 -145
5029a45K33l60L70k3o00L42L40j98L02l97L27j9k04J01k33o2O57o17J16N8q6K64
$$ -145 88 -272 98 75 -525 -183 157 -41 261 -136 191 172 -32 69 -164 -226 431 -186 -70 -12 -98 166
5051A66k85j25M99k69M0J90l92L38j16J5k95J33K87o2m0N4k90j35N69j03k15M21
$$ 166 -119 -244 255 -14 26 216 -176 162 46 61 -234 -101 186 124 84 138 -152 -287 282 179 -36 385
5073C85m52J91Q4n38M69j79n0l1M2j3L44m52K30L68n31K09j27J88Mj20L08n87
$$ 385 -67 124 208 -330 139 -40 -90 -121 -79 -92 252 -200 30 398 -133 76 -51 137 141 21 329 -258
5095b58L67J05k07j52M99n66j09P43o00M23j60k15L13l12K75k7l23N07o17K87
$$ -258 109 214 7 -145 354 -212 -321 422 -178 245 85 -130 183 -129 146 119 -204 303 -314 -27
5115b7K43k21K02k5j11J78k75J6O30l66k25k1l66M31r9l7K58l24K53k28j58K53
$$ -27 216 -5 197 172 61 239 -36 -20 610 244 19 -2 -368 63 -36 -73 185 -139 114 -114 -272 -19
5137a9J40j08O3PN8l26J75J8Q6l12q0J89P0M7n3K12J80m04K7K57l17j3j30mK68
$$ -19 121 13 76 83 141 -185 -10 8 94 -218 -298 -109 -39 8 -45 167 347 -57 -30 227 -90 -103 -233 -237 31
5162C1n62M42J98k7M8m62M07M9l37J51M47o56L98J23k37jj1J99M3n9o1K4J48l1
$$ 31 -531 -89 109 82 130 -332 75 124 -213 -62 385 -271 127 250 13 12 1 200 243 184 123 147 295 264
5186B64J1j61R1l07K92j87m43M90k49L73j11j08J93K0j86J9N5l09K32j42J27j28
$$ 264 275 114 205 -102 190 3 -440 50 -199 174 63 -45 148 168 -18 1 56 -253 -21 -163 -36 -164
5208a64j75J24L01j06J99m27L36j51J39K58l69Q5q3J46j64n9j40Q1o8J56p0p6
$$ -164 -339 -215 86 -20 179 -248 88 -63 76 334 -35 50 -33 113 -51 -110 -250 -169 -237 -81 -151 -227
$$ [...]
8191b11
##END NTUPLES=NMR FID
##END=
