##TITLE=1H_69-2022
 CDCl3
 8 sc, 
 25.08.2022
##JCAMPDX= 6.0         $$ Bruker NMR JCAMP-DX V2.0
##DATA TYPE= NMR SPECTRUM
##DATA CLASS= NTUPLES
##ORIGIN= UXNMR, Bruker Analytische Messtechnik GmbH
##OWNER= root
$$ XWIN-NMR		Version 3.5
$$ Thu Aug 25 09:59:30 2022 Russian Standard Time (UT+4h)  she@DPX200
##.OBSERVE FREQUENCY= 200.1313499994
##.OBSERVE NUCLEUS= ^1H
##.ACQUISITION MODE= SIMULTANEOUS
##.ACQUISITION SCHEME= undefined
##.AVERAGES= 8
##.DIGITISER RES= 18
##SPECTROMETER/DATA SYSTEM= spect
##.PULSE SEQUENCE= zg30
##.SOLVENT NAME= CDCl3
##.SHIFT REFERENCE= (INTERNAL, CDCl3, 0, 15.7535)
##AUDIT TRAIL= $$ (NUMBER, WHEN, WHO, WHERE, WHAT)
$$ ##TITLE= Audit trail, XWIN-NMR		Version 3.5
$$ ##JCAMPDX= 5.01
$$ ##ORIGIN= Bruker BioSpin GmbH
$$ ##OWNER= she
$$ F:/spectra/data/she/nmr/H-F/1/pdata/1/auditp.txt
$$ ##AUDIT TRAIL=  $$ (NUMBER, WHEN, WHO, WHERE, WHAT)
(   1,<2022-08-25 09:57:42.81 +0400>,<she>,<DPX200>,
      <created by zg, POWCHK disabled, PULCHK disabled
       configuration hash MD5:
       00 E9 B6 7A A2 85 ED C7 34 08 36 98 17 FE 4E 26
       data hash MD5: 16K
       25 5A F5 F3 85 9D 3C 61 7F E2 93 24 A3 58 06 9B>)
(   2,<2022-08-25 09:57:57.65 +0400>,<she>,<DPX200>,
      <Start of raw data processing
       efp BC_mod = 2 LB = 0.24 FT_mod = 6 PKNL = 1 PHC0 = -18036.95 PHC1 = 10.60069 SI = 16K 
       data hash MD5: 16K
       6E 2C C9 DD 6A D4 6E EB 14 84 CA B3 78 27 D4 42>)
(   3,<2022-08-25 09:58:17.98 +0400>,<she>,<DPX200>,
      <pk PHC0 = -1.693484 PHC1 = 1.8 
       data hash MD5: 16K
       21 F6 78 33 D9 27 C7 F9 B1 7E 79 CF 19 4B 22 CF>)
(   4,<2022-08-25 09:58:21.09 +0400>,<she>,<DPX200>,
      <abs ABSG = 5 
       data hash MD5: 16K
       FC EE 83 6A B2 1C C3 F4 45 EB 31 EC AF B6 43 85>)
$$ ##END=
$$ 
$$ hash MD5
$$ 0C 50 83 54 A8 60 A9 4C 6A 60 61 F4 BC 6A 3F 04
##$RELAX= 
##$RELAX= 
##$RELAX= 
##$RELAX= 
##$RELAX= 
##$RELAX= 
$$ Bruker specific parameters
$$ --------------------------
##$DU= <F:/spectra>
##$EXPNO= 1
##$NAME= <H-F>
##$PROCNO= 1
##$TYPE= <nmr>
##$USER= <she>
##$AMP= (0..31)
100 100 100 100 100 100 100 100 100 100 100 100 100 100 100 100 100 100 
100 100 100 100 100 100 100 100 100 100 100 100 100 100 
##$AQSEQ= 0
##$AQ_mod= 1
##$AUNM= <au_zg>
##$AUTOPOS= <>
##$BF1= 200.13
##$BF2= 200.13
##$BF3= 200.13
##$BF4= 200.13
##$BF5= 200.13
##$BF6= 200.13
##$BF7= 200.13
##$BF8= 200.13
##$BYTORDA= 1
##$CFDGTYP= 0
##$CFRGTYP= 5
##$CHEMSTR= <none>
##$CNST= (0..31)
1 1 145 1 1 1 1 1 1 1 1 1 1 1 1 1 1 1 1 1 1 1 1 1 1 1 1 1 1 1 1 1 
##$CPDPRG= <>
##$CPDPRG1= <>
##$CPDPRG2= <>
##$CPDPRG3= <>
##$CPDPRG4= <mlev>
##$CPDPRG5= <mlev>
##$CPDPRG6= <mlev>
##$CPDPRG7= <mlev>
##$CPDPRG8= <mlev>
##$CPDPRGB= <>
##$CPDPRGT= <>
##$D= (0..31)
0 1.2 0 0 0 0 0 0 0 0.06 0 0.03 0 0 0 0 0.0002 0 0 0 0 0 0 0 0 0 0 0 0 
0 0 0 
##$DATE= 1661407062
##$DBL= (0..7)
120 120 120 120 120 120 120 120 
##$DBP= (0..7)
150 150 150 150 150 150 150 150 
##$DBP07= 0
##$DBPNAM0= <>
##$DBPNAM1= <>
##$DBPNAM2= <>
##$DBPNAM3= <>
##$DBPNAM4= <>
$$ [...]
##$SUBNAM3= <"">
##$SUBNAM4= <"">
##$SUBNAM5= <"">
##$SUBNAM6= <"">
##$SUBNAM7= <"">
##$SUBNAM8= <"">
##$SUBNAM9= <"">
##$SW= 18.0517283424941
##$SWIBOX= (0..15)
0 0 2 0 0 0 0 0 0 0 0 0 0 0 0 0 
##$SW_h= 3612.71676300578
##$TD= 16384
##$TD0= 1
##$TE= 0
##$TE2= 300
##$TE3= 300
##$TEG= 300
##$TL= (0..7)
0 120 120 120 120 120 120 120 
##$TP= (0..7)
150 150 150 150 150 150 150 150 
##$TP07= 0
##$TPNAME0= <>
##$TPNAME1= <>
##$TPNAME2= <>
##$TPNAME3= <>
##$TPNAME4= <>
##$TPNAME5= <>
##$TPNAME6= <>
##$TPNAME7= <>
##$TPOAL= (0..7)
0.5 0.5 0.5 0.5 0.5 0.5 0.5 0.5 
##$TPOFFS= (0..7)
0 0 0 0 0 0 0 0 
##$TUNHIN= 0
##$TUNHOUT= 0
##$TUNXOUT= 0
##$USERA1= <user>
##$USERA2= <user>
##$USERA3= <user>
##$USERA4= <user>
##$USERA5= <user>
##$V9= 5
##$VALIST= <valist>
##$VCLIST= <CCCCCCCCCCCCCCC>
##$VD= 0
##$VDLIST= <DDDDDDDDDDDDDDD>
##$VPLIST= <PPPPPPPPPPPPPPP>
##$VTLIST= <TTTTTTTTTTTTTTT>
##$WBST= 1024
##$WBSW= 4
##$XGAIN= (0..3)
0 0 0 0 
##$XL= 0
##$YL= 0
##$YMAX_a= 820820
##$YMIN_a= -738966
##$ZGOPTNS= <>
##$ZL1= 120
##$ZL2= 120
##$ZL3= 120
##$ZL4= 120
##$ABSF1= 15.73587
##$ABSF2= -2.315979
##$ABSG= 5
##$ABSL= 3
##$ALPHA= 0
##$AQORDER= 0
##$ASSFAC= 0
##$ASSFACI= 0
##$ASSFACX= 0
##$ASSWID= 0
##$AUNMP= <proc_1d>
##$AZFE= 0.1
##$AZFW= 0.1
##$BCFW= 0
##$BC_mod= 2
##$BYTORDP= 0
##$COROFFS= 0
##$CY= -3
##$DATMOD= 1
##$DC= 0
##$DFILT= <>
##$DTYPP= 0
##$F1P= 0
##$F2P= 0
##$FCOR= 1
##$FTSIZE= 16384
##$FT_mod= 6
##$GAMMA= 0
##$GB= 0
##$INTBC= 1
##$INTSCL= 1.705223e-09
##$ISEN= 128
##$LB= 0.24
##$LEV0= 0
##$LPBIN= 0
##$MAXI= 10000
##$MC2= 0
##$MEAN= 0
##$ME_mod= 0
##$MI= 1.114404
##$NCOEF= 0
##$NC_proc= -6
##$NLEV= 6
##$NOISF1= 3.799351
##$NOISF2= 2.8
##$NSP= 0
##$NTH_PI= 0
##$NZP= 0
##$OFFSET= 15.7535
##$PC= 1
##$PHC0= -18038.64
##$PHC1= 12.40069
##$PH_mod= 1
##$PKNL= yes
##$PPARMOD= 0
##$PSCAL= 0
##$PSIGN= 0
##$REVERSE= no
##$SF= 200.130003609176
##$SI= 16384
##$SIGF1= 3
##$SIGF2= 2
##$SINO= 5.538805
##$SIOLD= 16384
##$SREGLST= <1H.CDCl3>
##$SSB= 0
##$STSI= 16384
##$STSR= 0
##$SW_p= 3612.71676300578
##$SYMM= 0
##$S_DEV= 0
##$TDeff= 16384
##$TDoff= 0
##$TI= <>
##$TILT= no
##$TM1= 0
##$TM2= 0
##$TOPLEV= 0
##$USERP1= <user>
##$USERP2= <user>
##$USERP3= <user>
##$USERP4= <user>
##$USERP5= <user>
##$WDW= 1
##$XDIM= 16384
##$YMAX_p= 522090333
##$YMIN_p= -417045
$$ End of Bruker specific parameters
$$ ---------------------------------
##NTUPLES= NMR SPECTRUM
##VAR_NAME=  FREQUENCY,     SPECTRUM/REAL,   SPECTRUM/IMAG
##SYMBOL=    X,             R,               I
##VAR_TYPE=  INDEPENDENT,   DEPENDENT,       DEPENDENT
##VAR_FORM=  AFFN,          ASDF,            ASDF
##VAR_DIM=   16384,         16384,           16384
##UNITS=     HZ,            ARBITRARY UNITS, ARBITRARY UNITS
##FACTOR=    0.220516191357247, 1,           1
##FIRST=     3152.74800880341, 0,            0
##LAST=      -459.968754202368, 0,           0
##MIN=       -459.968754202368, -417045,     0
##MAX=       3152.74800880341, 522090333,    0
$$ Real data points
##PAGE= N=1
##DATA TABLE= (X++(R..R)), XYDATA
$$ [...]
6374a16811J40956J6593M1121j87352r1278K03169L7792q1221n0530M5486r1031
6363a33106J7363J92934j28389j23288Q0008J17542j81j60797M0887o0097j26001
6352b83125K642j04372J11942Q9242m1036R7181R5939L7524J1096j10357K3906
6341f9418J01097l8673r4996m3133J52504N5888p613j22946q5969L7187P0089
6330d5983J48514j46410N4496j20798P600P2280k1021j4392l3919N6006j51038
6319a94665N5460J37184P9975K2463j28362r7837K2574k0246O804J6267J12751
6308A2368o8904p3331j6397P8888N5339J6110J3637L5903j16280j02607O0840
6297a04434N564K05359n1774q4141K13613j04207o5172r1124p7736P0802k10066
$$ y = [-116811, 24145, 40738, 81859, -105493, -196771, 6398, 44190, -37031, -87561, -42075, -133106, -115743, 77191, -51198, -174486, -94478, 23064, 22883, -137914, -97027, -157124, -283125, -280483, -384855, -272913, -183671, -224707, -127526, -31587, 5937, 17033, -93324, -69418, 31679, -6994, -101990, -145123, 7381, 63269, 55656, -67290, -153259, -116072, -45983, 102531, -43879, 10617, -110181, -102581, -30301, -51322, -65714, -99633, -43627, -194665, -139205, -2021, 77954, 100417, -27945, -125782, -103208, -123454, -116650, -100383, 12368, -56536, -129867, -146264, -67376, -12037, 4073, 17710, 53613, -62667, -165274, -104434, -98870, 106489, 54715, -29426, 184187, 79980, 14808, -76316, -154052, -83250, -293316]
6286b93316J48587J17610p1408K183m5590j71256P3871J4615r4228l9207J2236
6275c45903K18509J46148q9081L547p3696q9052J28806R4036O2612j24781K8982
6264c9873L5972j58781o8290N5531m2551L3920J12514r7698j28962J95138J24836
6253B1756p216m5432J31800m4568j86870l4549L3175l9403K6463k1536Q5333P7607
6241c440j29971O3661O5767j7611l1034J35147j23344l0816L0386j21538L7926
6230a24867P296N76k1128n4660J6328M8777r8461J25909J4881l6612R0643j70319
6218b01637P0267L4705j7258k6261j56313J18031R6771n8971p8355J4824j426
6207b05623Q4786J3424o6156N1335l1876r650o8260P0393M293j18987K72416N5718
$$ y = [-293316, -144729, -27119, -98527, -96344, -141934, -313190, -239319, -224704, -318932, -358139, -345903, -127394, 18754, -70327, -66780, -140476, -229528, -100722, -6686, 55926, -68855, -39873, -3901, -162682, -230972, -175441, -217992, -184072, -71558, -169256, -298218, -103080, 21756, 14540, -30892, 100908, 56340, -130530, -165079, -131904, -171307, -144844, -166380, -81047, -3440, -133411, -69750, -3983, -21594, -52628, 82519, -40825, -71641, -41255, -162793, -124867, -117571, -116995, -138123, -192783, -176455, -127678, -226139, -100230, -85349, -121961, -31318, -201637, -131370, -96665, -113923, -140184, -296497, -178466, -81695, -140666, -219021, -204197, -205623, -120837, -107413, -173569, -122234, -154110, -163760, -232020, -161627, -157334, -276321, -3905, 51813]
6195E1813j17672j14290J086O3691P1801p9552J09787M1723j68700J2279J24961
6184c073N5739j25606L4202o8112n875m3632N9886k6495l2663K04217L5295j51711
6172f7828j15440j9681O6612q165L2903M0636j28148N4012k3585j00919J39530
6161a30073P1298j22440p6375Q0743L7811p569j03093J8824o848Q447Q8927P7752
6149f2596M541n5805J9184m4434J66706J40945k11924q4982L5025P2972P0284
6138D9916p3705j4409l8862j46519j2275m9790J17091O1330K1704j382m2800K3871
6126a05830j95201M6936k1132L6376J18407j09073q634J80417j43667m1789J72133
6115g1057P1976P0999j67428j41705m3947J36776j6052N1335J51343l883j66563
$$ y = [51813, -65859, -180149, -179063, -115372, -43571, -123123, -13336, 28387, -140313, -128034, -3073, 52666, -72940, -38738, -106850, -112725, -156357, -96471, -122966, -155629, 48588, 83883, -67828, -183268, -202949, -136337, -144502, -111599, -70963, -199111, -145099, -168684, -269603, -130073, -58775, -181215, -257590, -176847, -139036, -146605, -249698, -230874, -237722, -229275, -140348, -62596, -58055, -113860, -94676, -139110, 27596, 168541, -43383, -128365, -93340, -20368, 49916, -23789, -38198, -77060, -223579, -235854, -285644, -168553, -107223, -85519, -86901, -129701, -105830, -301031, -254095, -275227, -238851, -120444, -229517, -238151, -57734, -201401, -243190, -71057, 919, 71918, -95510, -237215, -281162, -144386, -160438, -109103, 42240, 38357, -128206]
6104a28206L8923J08687j49708j04135R6749L2512j16026j4739k0509N4063L0655
6093a71734J84404K0174m430P1931j40559K0917l1784M7588l0492k0590J07325
6082E2750j54529j33219J00002J51555m1735n9265r3597J8284O3564l5405r386
6071a40981K6789p0984l1920K0029J06156L8161j04092j32319r660R819M8545
6060b40457K17221K1353j59684R0489K4502l2221L4422p1207p4591k0548J89978
6049b0743o1529j11308M1253m500J23027R5900j14411n8125M5004n3415q556P7917
6037d9486P358q332n8582M0150O5j3776n0170m2160n4398J30703Q8965j3606j16159
6024a39428N8872Q7187n747k9502n9588m4523J1355Q5546p2572J14935k1906M429
$$ y = [-128206, -89283, 19404, -130304, -234439, -137690, -105178, -221204, -235943, -256452, -202389, -171734, 12670, 32844, 28414, 100345, -40214, -19297, -51081, -3493, -33985, -54575, 52750, -101779, -234998, -134996, 16559, -25176, -84441, -178038, -159754, -96190, -131595, -140981, -114192, -185176, -217096, -197067, -90911, -52750, -156842, -289161, -298821, -289002, -240457, -23236, -1883, -161567, -71078, -46576, -78797, -44375, -115582, -190173, -210721, -20743, -82272, -193580, -152327, -156827, -33800, 62100, -52311, -110436, -65432, -118847, -127403, -49486, -42128, -50460, -109042, -68892, -68827, -82603, -132773, -174933, -229331, -98628, -9663, -23269, -139428, -80556, 6631, 884, -28618, -88206, -132729, -121374, -35828, -108400, 6535, -15371, -10942]
6012a0942r9908M3424K3892j09687J13163L2019j4425n9637M3699J61611j63606
6001d0397p9900r887o2712J32120k0170j34842L9582O7142p0980N0964R6995Q978
5989b3107L6491j45127L2396p4848M9786l2112O0935Q3478J53568j62990p7838
5978i9368o6822r214J46613K0710N4399r2773R9251J3395j7974j30666q243O1230
5966b9462J2462j6900n8442l9075J47409n2597J9628l2056J19825N1991o3166
5955E9617l8385q1670N0586J3702k08615k6107J45715K2160k21557J73522O6460
5944d4572j39759R9325n6594P4543J05859L3515n6995p6353J27936m7167O1317
5933H1055k5667K0037K639k44835K1713O9323l5135Q9221j11289P3360J3341j33698
$$ y = [-10942, -110850, -67426, -43534, -153221, -40058, -8039, -22464, -82101, -38402, 123209, -40397, -120297, -130184, -192896, -60776, -80946, -215788, -176206, -109064, -180044, -129080, -32085, -23107, 13384, -131743, -99347, -174195, -124409, -156521, -95586, -12108, 141460, -21530, -99368, -166190, -175404, -28791, -8081, 46318, -46455, 52796, 66191, 48217, -82449, -90692, -29462, -17000, -33900, -92342, -131417, 15992, -36605, -16977, -49033, 70792, 122783, 59617, 21232, -60438, -9852, 3850, -204765, -230872, -85157, -62997, -284554, -111032, -44572, -184331, -85006, -141600, -67057, 38802, 72317, 15322, -61031, 66905, 19738, 81055, 55388, 75425, 78064, -166771, -145058, -75735, -110870, -21649, -132938, -59578, -46237, -179935]
5921a79935O837J48103l7569j11877R4036M3205J03534l9528j5981M3528J19569
5910A73922p3934j19066O070J94700j04804r573J9297r6377J07955l7231L1484
5899I2443j09384q7993l4502m9511L8459N3246P822l4622J47087q4078j6829p3362
5887a51224R814J15267k0058l7220N6080j8214N4111N5403m6893m2085o6642j31825
5875b23486J36438Q8274O8323j44003k9279l3194J8758J12004O5491o3018K2926
5864A9234j03819p1200J45672O971J61041p3989j58486J03536R4942n2469l5271
5853C6162P3214R1035l6737J13244k04622j18626J9323O3373j09972K6271p6585
5842a23920J7573K66594j09670j87592l9336J29050N7932P7942J06017j18853
$$ y = [-179935, -173098, -24995, -62564, -174441, -80405, -37200, 66334, 26806, 10825, 54353, 173922, 99988, -19078, -13008, 181692, 76888, 67315, 86612, -9765, 98190, 60959, 92443, -16941, -104934, -139436, -188947, -150488, -97242, -89420, -124042, 23045, -61033, -77862, -151224, -141410, -26143, -46201, -83421, -27341, -45555, 8556, 63959, 17066, -25019, -91661, -223486, -87048, 1226, 69549, -74454, -103733, -136927, -118169, -6165, 59326, -3692, 19234, -84585, -155785, -10113, -3142, 157899, 83910, -74576, 28960, 123902, 71433, 36162, 109376, 200411, 163674, 276918, 72296, -46330, -27007, 36366, -73606, -47335, -123920, -106347, 160247, 50577, -137015, -176351, -47301, 10631, 88573, 194590, 75737]
5832G5737n8331L2289J0073P5631o8753K9860p2940m7389m7162L205J03662r2898
5820e7016K3553L551P6307j72379M6659M6706L5799l2652k6214J42965j04022
5809a6743N1r693J250N9243l7003O9345M3521r5365j9702J21685o7275P1027j33085
5796a2744J1612J09433o2502k3294M9608l58K21j43737o1844K72471m9498j39751
5784e0383K3546K9782j11444J28336l8076l2951p9825K3547K0535J56993L3699
5773A03759j10231N5181J672R3946j17438j0535L8532k9040p7372M9480k077j00219
5761a04342J60374L5918K3588P7442Q660p9104j65597q1523j2250k7568Q4307
5750h0095j3234L613O3380J18495r7258o4480N686q2358L0311M5339L8023j26575
$$ y = [75737, 17406, 49695, 59768, 135399, 66646, 96506, 23566, -23823, -70985, -67780, 35882, -57016, -33463, -29912, 46395, -125984, -79325, -32619, 3180, -29472, -55686, 87279, -16743, -16692, -26385, -25135, 34108, -2895, 66450, 109971, 14606, -5096, 116589, 49314, 120341, -12744, -1132, 108301, 45799, 22505, 72113, 71755, 71976, -71761, -133605, 138866, 89368, -50383, -26837, 2945, -108499, 19837, -18239, -51190, -131015, -107468, -86933, 70060, 103759, -6472, 48709, 50381, 144327, 26889, 16354, 54886, 25846, -51526, -2046, -4123, -104342, 56032, 91950, 115538, 192980, 201640, 122536, -43061, -124584, -136834, -164402, -80095, -93329, -89716, -26336, 92159, -5099, -69579, -63893, -146251, -115940, -70601, -32578, -159153]
5738a59153J39558J68883j74801j1648N4365J1130k6540j76773P0303R90j53458
5727b57144J90034R0942m8176J5724n2084k2558J33335N7807J28889j16089j21192
5716e12N4244r2215M0172Q3248M4619j05701j24471P0420j43817o6038R3030J4728
5704a32293J59292J04207j07537J07669m8651p8636O2115r941k0814m7196J00534
5693H8749n5112M7188l6734m4699r948p9481n8641J87461m4711l1522O92j5048
5681e1806M5909M1659L0208M9412n6178P1976p1782j02597O9723J23730P3905
5670B24159o0380j81129O1074o9490n4905J03480j22503M0972j7032J09969j10540
5659g6325K21110j15876j47788n227l0713q193M0474R223J33359R5571l5717L3277
$$ y = [-159153, -19595, 149288, -25513, -37161, 17204, 28334, 1794, -174979, -104676, -103686, -257144, -67110, 23832, -24344, -8620, -60704, -83262, 50073, 107880, 236769, 120680, -512, 53732, -38483, 1689, 84937, 129556, 23855, -100616, -30196, -174013, -240051, -147021, -132293, 26999, 131206, 23669, 131338, 82687, 4051, 66166, 56225, 35411, -11785, 88749, 33637, 80825, 44091, -608, -10556, -90037, -148678, 38783, -5928, -37450, -36758, -51806, -5897, 35762, 65970, 115382, 59204, 131180, 59398, -43199, 26524, 150254, 224159, 163779, -17350, 43724, -25766, -80671, 22809, -99694, -58722, -75754, 34215, -76325, 144785, 28909, -118879, -124106, -154819, -163012, -122538, -113315, 20044, 115615, 79898, 113175]
5647A13175r646j13899M410O3907J31941k4886j80428O1427J645L4224L248j261
5635H3857N4551j04075o3533L9424P2605N9996o3535l1970N0250R9201O8471q3787
5623A81455j24758K1947j28330K5047o609j16943M2396J3003Q1609N0886p2510
5612c2807R4352L965M2517m2976p7500j57764J52377k2171N0685M0519L8963r394
5600H0766k39201O8068Q6741Q3982j98770l9332K60324n5504K1628o5272R1403
5589I4833l1824j5371Q3914j44760Q2387J35346q5223p385J37426r6840j00178
5578E2325j13007J4753L8575J11841r7075j70966j17351K04519J49311l2194r7148
5567e6417K3094J33644j58395L128R101N2959L1539m4541K6548j33977J46063
$$ y = [113175, 103529, -10370, -5960, 57947, 189888, 165002, -15426, 46001, 47646, 81870, 85118, 83857, 138408, 34333, -29200, 10224, 82829, 142825, 79290, 47320, 97570, 196771, 265242, 181455, 56697, 78644, -49686, -24639, -31248, -148191, -105795, -92792, -11183, 39703, -32807, 61545, 65510, 108027, 65051, -12449, -170213, -17836, -40007, 10678, 51197, 90160, 80766, -158435, -90367, -3626, 80356, -118414, -157746, 102578, 47074, 68702, 3430, 94833, 63009, 47638, 131552, -13208, 69179, 204525, 119302, 111917, 249343, 152503, 52325, -60682, -45929, -7354, 104487, 7412, -163554, -280905, -76386, 72925, 40731, -56417, -33323, 100321, -58074, -54946, -45845, 7114, 38653, -5888, 20660, -113317, 32746]
5556C2746q8669o7670K61094K937n1185M2527p7222k1190n3900J59704k0736n7364
5544F1072j71221J41474O3460j30784P7257k1031m295j44048Q598K5004J15842
5533B1328m8295J21500m977O4097o1760j55765J57682n7938k392J44982p1404
5522A07058o6706M7263l9046j32679O3311Q507l9017k5286n8145J11603O9990
5511D6853R5840j25616p4814P5641Q9704O4299j40478n435j55313n1580J02762
5500g8137J10941J3913k4166o3678l1924m0786J09354Q4462j22362r116k5534
5489g7033J48306L0546j06821M4989J818L2577q45o215r5054O5456J12514j18948
5477C1290p8491o89R1266J3551O6353j12211q0464R3379k780k9885J65542m3341
$$ y = [32746, -55923, -123593, 137501, 140438, 89253, 131780, 54558, 33368, -20532, 139172, 118436, 61072, -110149, 31325, 94785, -35999, 41258, 20227, 15932, -128116, -119518, -94514, 21328, -26967, 94533, 89556, 153653, 91893, -63872, 93810, 35872, 33480, 178462, 107058, 40352, 87615, 48569, -84110, -20799, -12292, -51309, -76595, -134740, -23137, 46853, 142693, 17077, -57737, 17904, 107608, 171907, 31429, 25994, -129319, -180899, -78137, 32804, 46717, 22551, -41127, -73051, -113837, -4483, 79979, -42383, -51499, -77033, 71273, 101819, -5002, 39987, 41805, 74382, 73537, 67322, -27732, 37724, 150238, 31290, -47201, -47890, 43376, 56927, 123280, 11069, -69395, 23984, 21204, -8681, 156861, 113520]
5465A13520j21944K696J40517R6822q348N857r1636K012p1407r8231j1386J8368
5453b3160l0121L744j3002Q4753m3355P3289K11916k52946j92284J86444J40642
5442A45920o5201k10902R2331O4422j14430M0858j5313J12139o5015m6557J02133
5431D0385K0619L1563k176j91217N762J23798J3055K4592L2004q2894M7297Q5854
5419A48642r4631j02301K41132L9745j24222j48429N6829K47894j0262l2547l488
5408B18362j51887L4899J43787l5849k8099l9874q1850J19068j55421k3203J62003
5397A61936r1237J36362m7380J04045k09016r2119R2047Q5846q6270j49269O3542
5386c1513J03824k7993k0053m6416m9854j59551J11021J82993o3343M1035J18421
$$ y = [113520, -8424, -5728, 134789, 231611, 223263, 229120, 137484, 139496, 68089, -30142, -41528, -23160, -53281, -49537, -62539, 22214, -21141, 52148, 264064, 11118, -181166, 5278, 145920, 80719, -130183, -37852, 26570, -87860, -47002, -62315, 49824, -15191, -61748, 40385, 61004, 92567, 90391, -100826, -95064, 28734, 41789, 66381, 98385, 15491, 62788, 148642, 54011, -48290, 192842, 232587, 108365, -40064, 16765, 264659, 254397, 221850, 218362, 66475, 101374, 245161, 209312, 181213, 141339, 59489, 178557, 23136, -67, 161936, 70699, 207061, 159681, 263726, 54710, -37409, 54638, 140484, 54214, -95055, -31513, 72311, 44318, 24265, -22151, -72005, -231556, -120535, 62458, -885, 40150, 158571]
5375A58571J0759k6709P0782k07415m650J18189p2672m3447J88842J40772p3409
5364B59613j13886j17689q652m5028K0615p0156k118O2951J35941J68677N8772
5353C49040j12274j81915o3894P8380J49669m407k7109j0595m5769o6398j7380
5342D7348l4261p901J13944j6267j18892j3114Q2749M3261M0275O1491Q177R5257
5330C02067j72195N4569j6890J28268L740j16702n2447k0805k50534k7736K30932
5319F2267o0687P1841J206J838l2246p033N8778j4053r9769J1872J24805J06613
5307B25432P5528M6801k23564l0031J61036K8821q0802P5517l0730q1146J4209
5296A81071p68k341K58163m4539k85648m1834l8958J58999K8896n3808N2369O2881
$$ y = [158571, 169330, 142621, 213403, 5988, 1338, 119527, 46855, 3408, 192250, 333022, 259613, 145727, 28038, 19386, -25642, -5027, -75183, -77301, -14350, 121591, 290268, 349040, 236766, 54851, -9043, 69337, 219006, 214599, 187490, 176895, 131126, 64728, 47348, 13087, 5186, 119130, 102863, -16029, -29143, 53606, 96867, 137142, 198633, 206810, 302067, 129872, 184441, 167551, 295819, 299559, 182857, 130410, 109605, -140929, -168665, 62267, 1580, 73421, 74627, 76465, 44219, 37186, 95964, 81911, -17858, -5986, 118819, 225432, 300960, 347761, 124197, 94166, 255202, 284023, 203221, 278738, 248008, 166862, 181071, 180303, 177962, 436125, 391586, 105938, 64104, 25146, 184145, 213041, 159233, 211602, 274483]
5284B74483j68542p8366P2075J25684J18911j65928L643j00088l7225J70860j3333
5273B02174J37927J03845j69514p4633N0001j6044J09216n0833j03396N7460j765
5262B44438j02402j2313J2100q2593J33369m4956j18979J86412k1521k36528Q4826
5251D1853J19882K4452q9676l0651p6286p6573J9550J10783J37708J05680o1810
5240B24912k1659J1461l4848L110j42968k702P9304n33J15811m1267j30057M4458
5228A05022j06907K2844O817P7004n8607R4112M8808P4308m9325O1102j28506
5217A46672m5897n4695J00746M4135P2035K1139p6651k19427n0387K44049N2491
5206B34210K7313j08550N6622l6427m8481M0735Q8255j4279R6147O5775M721j21107
$$ y = [274483, 105941, 27575, 99650, 225334, 344245, 178317, 181960, 81872, 44647, 215507, 202174, 340101, 443946, 274432, 199799, 249800, 233756, 342972, 292139, 188743, 246203, 244438, 142036, 129723, 141823, 59230, 192599, 147643, 28664, 215076, 193555, -42973, 41853, 161735, 186187, 96511, 65860, -10426, -86999, -67449, 43334, 181042, 286722, 224912, 203253, 214714, 179866, 182976, 40008, 37306, 116610, 116077, 231888, 190621, 60564, 105022, -1885, 20959, 27776, 104780, 46173, 140285, 189093, 263401, 214076, 275178, 146672, 100775, 46080, 146826, 190961, 262996, 284135, 207484, -11943, -62330, 181719, 234210, 261523, 152973, 209595, 173168, 124687, 165422, 253677, 239398, 335545, 401320, 406041, 284934]
5194B84934L4091o7580r2196j2496N5965N1311K2272n0867J42010J8927k6610
5183C59761J25193p0166j17396M2335j52610L5980M2552L5411j70082K3176K64954
5172D19108r7762O8017J22180n7331P0543p617j07331l8430j49116O7535J25718
5161D15514j22409j73R030j079P3141M304j58997j06703N5473Q6169O5180j82519
5149A36931N574L3572J2697j12028J41103J25513m059j54317N604M5684o607M4406
5137B74073J8501J45976n9483k1808m6730j51710k16521J66644J47288m0757j41244
5126G4229P4437R3603O6275j93748j05832Q5128l358j5067R7897o3574j26888
5115a6898k5327l5152Q5846N6090J45567j04013K2124O4360n6421j8233J21635
$$ y = [284934, 319025, 251445, 159249, 146753, 202718, 254029, 276301, 225434, 367444, 386371, 359761, 484954, 414788, 297392, 339727, 187117, 223097, 265649, 301060, 130978, 154154, 419108, 321346, 389363, 511543, 454212, 524755, 517138, 409807, 371377, 222261, 289796, 415514, 293105, 292932, 301962, 300883, 374024, 378328, 219331, 112628, 168101, 254270, 319450, 136931, 142505, 176077, 188774, 76746, 217849, 343362, 339303, 184986, 190590, 236274, 229667, 274073, 292574, 438550, 379067, 357259, 310529, 158819, -57702, 108942, 256230, 215473, 74229, 148666, 242269, 308544, 114796, 8964, 94092, 90734, 75667, 173564, 109990, -16898, -42225, -77377, 8469, 64559, 210126, 106113, 128237, 192597, 136176, 117943, 239578]
5104B39578j6669N9170j39699j53168l5402Q9977N0336K7251j06759L6412R2642
5093A43669j22858q763M3652P1277J5667j882j04844R1966j7731k7035o844k27915
5081a51641J79034Q7690k17988K01637K46072j8003j50687r8017j55638K25545
5071A48004l7633k0160J22184p3011l2884O9547k17049J26821N5244n6885N7621
5060A41799p2368P2784k32000J29690J44200J6686p7281r3392M0795J12718j97516
5049a3885r8693J07425Q9996k7890R7914m7050K6969P7812m0500j24375l1234
5038A6489J6293Q779J01080j2868p752o8887N5429P4880p8037R936r750j73241
5026f7649m252J61940N1628k3266j196k1441j24417l433p3137k8378J27012J73987
$$ y = [239578, 222909, 282079, 142380, -10788, -46190, 43787, 94123, 121374, 14615, 51027, 143669, 20811, 12048, 55700, 126977, 142644, 140762, 35918, 127884, 110153, 83118, 76274, -151641, 27393, 115083, -102905, 98732, 344804, 326801, 176114, 78097, -77541, 148004, 110371, 90211, 212395, 139384, 106500, 176047, -41002, 85819, 141063, 84178, 141799, 69431, 142215, -89785, 39905, 184105, 200791, 123510, 30118, 70913, 183631, -13885, -112578, -5153, 84843, 56953, 154867, 107817, 134786, 212598, 172098, 47723, 16489, 32782, 41561, 142641, 129773, 122021, 53134, 108563, 183443, 105406, 115342, 105592, -67649, -71901, 90039, 141667, 118401, 117205, 95764, -28653, -32086, -105223, -133601, -6589, 167398]
5014A67398J571K3152o8105P4660J26847k48834j59583J13406L2189n7373o1068
5003e5740L3704Q3373j4597j2655J25406J947l7999Q976K9416J54640j51320k4389
4991A40762j70928j1532Q6495k09442l2846J33064k3618k1424J65858O808M251
4980F7448J23030o6687k1441j21750o321p6126M9932K4043j18650L4354L9800
4969g2368N656P1436m35O8939k6324P767P8254p3582J1831Q2605n5518P2677Q5088
4956B56026K475p1698K2850n1800K6211q317j71374J7810J32076P3594K442j10447
4944A19848r8925q346l447j3774L5185j29944J78725J00126k0164m2385q0171
4933C6728o0112L0025O7229O2218j7257l9138J80812j75318j33993k0286J35021
$$ y = [167398, 168969, 192121, 124016, 198676, 325523, 76689, -82894, 30512, 62701, 5328, -55740, -22036, 61337, 46740, 34085, 159491, 161438, 123439, 132415, 161831, 316471, 165151, 140762, -30166, -41698, 44797, -164645, -197491, -64427, -88045, -109469, 56389, 63197, 67448, 190478, 123791, 102350, -19400, -25721, -101847, -51915, -27872, -146522, -112168, -72368, -66712, 4724, 4289, 73228, 46904, 54671, 132925, 59343, 71174, 153779, 98261, 170938, 256026, 258501, 186803, 209653, 157853, 184064, 175747, 4373, 22183, 154259, 227853, 230295, 119848, 20923, 12577, 9130, -4644, 30541, -99403, 79322, 179448, 159284, 116899, 36728, -23384, 6641, 73870, 136088, 118831, 79693, 260505, 85187, -48806, -69092, 65929]
4922F5929o738j14153J6348J32695l2964r9587l8877J24953K9087l257l2002P6212
4910A17646R7374j86964j47424N0940L6071M2083j7662K5717r4857M4371m8395
4899h1100j6294q001J75845J02163j12042p8791J43020M3135o0511K3037J1664
4888A42125k9110J18152k31534K0643J01109q630N0609j21364K1228p7490M5791
4877C1529l1507k7151L2374r610L885L9309M8823k7476P8314L239j16956K1566
4865D6339J56952o9093r7674M2628N872p309r4615J53250O9943k2432k135K7207
4853B08933j18514k913l5285O9252l4965P4416o1829o3591p2380P333J80978n9439
4841I1996L0169m209J5416M5424l3231m4860p1754N7513J09936L7373k30948k7547
$$ y = [65929, 59191, -54962, -38614, 94081, 61117, -38470, -77347, 47606, 76693, 73436, 41434, 117646, 215020, 28056, -119368, -68428, -32357, 9726, -7936, 17781, -77076, -32705, -81100, -97394, -105395, 70450, 172613, 60571, -18220, 124800, 167935, 107424, 130461, 142125, 113015, 231167, -367, 20276, 121385, 112755, 163364, 42000, 63228, -14262, 31529, 22, -27129, 5245, -4365, -480, 38829, 87652, 60176, 138490, 141729, 24773, 46339, 203291, 134198, 36524, 79152, 85024, 77715, -16900, 136350, 206293, 183861, 181726, 208933, 90419, 87506, 52221, 121473, 86508, 160924, 99095, 35504, -36876, -29543, 151435, 91996, 122165, 117956, 133372, 178796, 145565, 100705, 28951, 86464, 196400, 233773, 2825, -24722]
4829b4722L9309r294P7683l7647J34488k20O3185O4088k7513L5506j79959n5151
4817G9753j5633L1469l6977J46267J8527j45126k89442K3210J44899J11273J88201
4806B56421k4183j48779R649K4900o4389J23502N0096j7180P6320l924j93535
4795H8898j26511M8125q1808K2778o8727Q241J82653J4585m5296K287j9952j14120
4783h8847K0275J01180j3520j08285J33249j35100J85511r5243R9944l0367p5927
4772g130J50251K7455q180K28979j99707j26497J05725R6003m5880J8062O8239
4761C07320q0375j58926n3681J1330P095Q8069L5998L020j03338q9895m6530J56534
4749G6621K00406R784j16255j47179j16954M6949q4603J5981j5534K76598l7614
$$ y = [-24722, 14587, 5293, 82976, 45329, 179817, 179597, 242782, 306870, 279357, 314863, 134904, 79753, 64120, 95589, 58612, 204879, 223406, 78280, -211162, -187952, -43053, 68220, 256421, 232238, 83459, 93108, 118008, 53619, 177121, 227217, 210037, 286357, 282433, 88898, -37613, 10512, -71296, -48518, -117245, -109004, 73649, 88234, 42938, 45225, 25273, -88847, -68572, 32608, 19088, -89197, 44052, -91048, 94463, -780, 99164, 68797, -7130, 143121, 170576, 162396, 391375, 191668, 65171, 170896, 266899, 221019, 239081, 307320, 226945, 68019, 14338, 25668, 32763, 120832, 156830, 159850, 56512, -33383, -79913, 76621, 277027, 286811, 170556, 23377, -93577, -46628, -131231, -115250, -130784, 145814, 108200]
4738A08200q5336J42621M7904n7006P6684k22549m0906L6687n0622J13330M4431
4727A13438l3140N7820L9621j35874n4669J45222P3919j31271j09993Q492K40378
4716B13943K4410r4556j93937J62455n37l0948P1285K1605j08596o9373J3933
4705I684O8654O7565L7197Q163j10960J3150j30513J58475N6460N1149r6275r052
4693A23697l6230r8140J3469j25063K4525J63682J606o8836q4024P248J54680
4682G6614n0765j68728J32493M7934p4313L8000m6196O0416R6470m3010P0569
4671A39484j9407o5356l5112q345O5016K5837Q788O6323r3246k7841n8832N8236
4659E5545O9476Q9738k5815j65113J59154m2500J6926M8257k07518N5591J04486
$$ y = [108200, 22864, 165485, 213389, 156383, 233067, 10518, -30388, 6299, -44323, 69007, 113438, 80298, 138118, 177739, 41865, -12804, 132418, 206337, 75066, -34927, -26435, 213943, 238353, 143797, -50140, 112315, 111778, 80830, 152115, 173720, 65124, -4249, 9684, 78338, 145903, 183100, 191263, 80303, 93453, -37060, 121415, 177875, 229024, 132749, 123697, 87467, -10673, 2796, -122267, -97742, 65940, 67546, -1290, -85314, -78066, 76614, 25849, -142879, -10386, 37548, -36765, 1235, -44961, 15455, 111925, 68915, 139484, 120077, 54721, 19609, 11264, 76280, 102117, 110905, 177228, 83982, 56141, -2691, 55545, 125021, 214759, 188944, 23831, 182985, 140485, 157411, 205668, -1850, 53741, 158227]
4648A58227q6899N4222j9671J07505k1451k3430J1486k2540N0583p6009n0693
4637H1330J4313p5170N2609k3485j01451O9548K34388J37177j13779j21784n1202
4626A02494l8067J05855j9526k667m658K7652J8122J7227n7456j38962J05231
4615A15245j4552N2957l8354q3436J44093l0108N0592j282p8968j24675Q5046
4604G6558O9926L6848J01648p9555R5804n7054n8180m0997k77j19235Q0600J50317
4592B56403P5932j3294j28251q5986l3845J0967J43045K11418m2088j66461J4769
4581B42609M2927j47360Q0381L3924n0463m8739J64419M058l2904O2764J17616
4570D69232k19880m4941J18392j89318R5764M0319j0542j64702R6474J01923j03499
$$ y = [158227, 71328, 125550, 105879, 213384, 191933, 168503, 179989, 157449, 208032, 132023, 81330, 95643, 20473, 73082, 49597, -51854, 17694, 252082, 389259, 275480, 153696, 102494, 64427, 170282, 150756, 148089, 143431, 171083, 189205, 206432, 148976, 10014, 115245, 100693, 153650, 115296, 31860, 175953, 145845, 196437, 195155, 116187, -8488, 76558, 146484, 183332, 284980, 205425, 301229, 244175, 185995, 144998, 144721, 25486, 106086, 256403, 332335, 319041, 190790, 104804, 70959, 81926, 224971, 436389, 394301, 227840, 242609, 285536, 138176, 218557, 252481, 202018, 153279, 317698, 321756, 288852, 351616, 469232, 249352, 204411, 322803, 133485, 229249, 269568, 259026, 94324, 190798, 292721, 189222]
4559A89222O457L023K5025L5251L5476j65835P1182J88317L4606k3046l2913k3663
4547C43102M6987M7714j28886j52358Q367P8866J18979j00403J5456J21818L4772
4536D34414j02497j56344J0908Q7485O698r4042J11833n5557J89079l7252n552
4525C89173j27826j36018J48067n5844J44587O2136j89804N4550k0580O6834K2832
4514C58107j76850J26849M0203k764L5342j103J31285J8662j90941P9606P9169
4503D97565j72942k9403J2044l0224K9540k435J78431P6587k8652k2193j81531
4492C26787J42297J122R080j3404k2741J08661p0979P9149q4580n3627J33786
4481E55551j0640N5563K813o4786j06820N9756K05250K1922n9453n3690k6634
$$ y = [189222, 195679, 198702, 223727, 258978, 294454, 128619, 199801, 388118, 422724, 399678, 366765, 343102, 390089, 437803, 308917, 156559, 164926, 243792, 362771, 262368, 277824, 399642, 434414, 331917, 175573, 186481, 273966, 280664, 186622, 298455, 242898, 431977, 394725, 389173, 261347, 125329, 273396, 217552, 362139, 424275, 234471, 289021, 268441, 335275, 358107, 181257, 308106, 348309, 345545, 380887, 379784, 511069, 529731, 338790, 418396, 497565, 324623, 295220, 307264, 277040, 306580, 304145, 482576, 559163, 530511, 508318, 326787, 469084, 470206, 479286, 465882, 443141, 551802, 480823, 559972, 475392, 421765, 555551, 544911, 600474, 603287, 538501, 431681, 491437, 696687, 718609, 659156, 605466, 578832]
4470E78832J39517j6760j39391N7991J6098k211m3001J11202l4283j35057p61
4459E32176k4762J52078J00729m1387l724p6399k2185o3050K9923r3288j3287
4448D76824O1774L2043j15145L2842P6146J81550j2053j86241J1731l3577R6850
4437F22744J55674j2645j02320L5767j06060P9021q5685K1077J11382j57815Q1179
4426F42319J60199j9029m4295O6427O377j23489j07706j22116J14667J7314K1848
4415F12516J40228K3498Q3630R0984J0275n1659j20151n2677J28861L3986p1902
4404H27589m2535K2334P7142p8298n509M1089o463k7135r4598J63540J42132P0017
4392A089305k9024j2550j2251J60110O2888o7887P0214J00040j7779j59905J20846
$$ y = [578832, 718349, 701589, 562198, 620189, 636287, 634076, 591075, 702277, 667994, 532937, 532176, 507414, 659492, 760221, 718834, 715110, 638711, 616526, 553476, 583399, 490111, 476824, 538598, 570641, 455496, 488338, 564484, 746034, 733981, 547740, 559471, 525894, 622744, 778418, 765773, 663453, 699220, 593160, 672181, 586496, 607573, 718955, 561140, 642319, 802518, 783489, 739194, 805621, 811998, 688509, 580803, 458687, 573354, 590668, 612516, 752744, 776242, 859872, 950856, 961131, 909472, 789321, 736644, 865505, 899491, 827589, 785054, 807388, 884530, 806232, 800723, 841812, 835349, 808214, 713616, 877156, 1019288, 1089305, 1060281, 1047731, 1035480, 1195590, 1258478, 1190591, 1260805, 1360845, 1343066, 1183161, 1304007]
4381A304007L0143J71752j02456j6032j0354R8149q491p4865l992m5507J87879
4370A530233P6876M9563k9171K0173J91125J10647j84711m3824J12003k2222J33777
4359A944469k6599K9206o7616R1657N5649K1202o7769R646K06645o9442m6229
4348B080819J21525L4510N7036K9545k2358J61395p3701P6248j46439p1846O2256
4337B308990R6655N2754J56731m4539j7809l4412N6867Q2092l2488j17297P2015
4326B579559o2619p1001P825K90142o073l5274j02142k2155M7211l6462O5301
4315B654312O8644l7740J24659Q4394p3105L6151P6323k8166o4047R32J53293
4304B995650r0260j04202k86M7752J25931K4218j8583n4454J9459q1038P0627
$$ y = [1304007, 1334150, 1505902, 1403446, 1387414, 1377060, 1475209, 1466718, 1391853, 1387861, 1342354, 1530233, 1607109, 1656672, 1627501, 1647674, 1838799, 1949446, 1764735, 1720911, 1832914, 1810692, 1944469, 1917870, 1947076, 1879460, 1971117, 2026766, 2047968, 1980199, 1989845, 2196490, 2127048, 2080819, 2202344, 2236854, 2293890, 2323435, 2301077, 2462472, 2388771, 2465019, 2318580, 2246734, 2308990, 2405645, 2458399, 2615130, 2570591, 2552782, 2518370, 2575237, 2657329, 2624841, 2507544, 2579559, 2516940, 2445939, 2453764, 2743906, 2737833, 2702559, 2600417, 2578262, 2625473, 2589011, 2654312, 2722956, 2685216, 2809875, 2894269, 2821164, 2857315, 2933638, 2905472, 2841425, 2842357, 2995650, 2905390, 2801188, 2800902, 2848654, 2974585, 2998803, 2980220, 2925766, 2945225, 2864187, 2934814]
4293B934814l6515l2180j90165J75761J14215k05855l6508K4204M1112K38475
4283C027358j48790j77016n6060R2648p0863k33697J52226K38798q8921j33666
4273B602017M9605J63888l24245j62015K15186Q1794j72963j21023k22428K2100
4263B131916O3421P5132l3345R810O6144r6790l966j3998k5539L0815L6656n5940
4251B184316k10425j6438n1265Q4747J07029r041K5508M6181J06913j46621k78128
4240A842776K2453p390j2978P706n8542J04347Q7553j86518j62970j54867m1946
4229A439624P500o7727Q659j18313J9657Q2217Q3440o1511j6431p1480m1692j83593
4217A080350M2077o4969N3035N2781L287K8986p9160M6869R0856J0755n7972K7937
$$ y = [2934814, 2898299, 2866119, 2675954, 2851715, 2965930, 2760075, 2723567, 2747771, 2788883, 3027358, 2878568, 2701552, 2645492, 2738140, 2667277, 2433580, 2585806, 2824604, 2735683, 2602017, 2651622, 2815510, 2491265, 2329250, 2544436, 2626230, 2453267, 2332244, 2109816, 2131916, 2195337, 2270469, 2237124, 2246934, 2313078, 2216288, 2212322, 2198324, 2172785, 2203600, 2240256, 2184316, 1973891, 1957453, 1906188, 1990935, 2097964, 2088923, 2114431, 2160612, 2267525, 2120904, 1842776, 1865229, 1857839, 1844861, 1852567, 1794025, 1898372, 1985925, 1799407, 1636437, 1481570, 1439624, 1447124, 1379397, 1388056, 1269743, 1289400, 1371617, 1455057, 1393546, 1377115, 1305635, 1263943, 1080350, 1122427, 1057458, 1110493, 1163274, 1166561, 1195547, 1116387, 1163256, 1254112, 1264867, 1206895, 1234832]
4205A234832L0797k45212r1826Q5505q5718m9829J5610K67942q5627j80101L6782
4194I33155l9433o6949N8852J14139n9445j61378K00909J33642k4426M0843j51215
4183I78694J12639j0961J4011k4905n3608J923k9327j06409J15310l7679k2828
4172I36860J734O4025n2743J0904M015K5436n8879l2779O3284P7897J02026o0006
4160A081774k2670n8827P9948J5415j15845r6787J51851J30409J6204r5972l7300
4149A048200J07120J767J957Q5441n0962K3733j11076n9241o976M273k00412J02706
4137I46530J24051r4256J63083k0529k55280M2691J09816O4039J43018n9019Q9666
4126A253810q8464n4867J64817J98382o9461k02139J78245J30006j30376j446
$$ y = [1234832, 1265629, 1020417, 928591, 1014096, 928378, 878549, 894159, 1162101, 1076474, 896373, 933155, 893722, 826773, 885625, 999764, 940319, 778941, 979850, 1113492, 1089066, 1129909, 978694, 1091333, 1080372, 1094383, 1069478, 1015870, 1017793, 988466, 882057, 997367, 959688, 936860, 938594, 1002619, 949876, 960780, 964795, 990231, 931352, 898573, 961857, 1039754, 1141780, 1081774, 1059104, 1000277, 1080225, 1095640, 979795, 883008, 1034859, 1165268, 1181472, 1085500, 1048200, 1155320, 1157087, 1159044, 1244485, 1193523, 1217256, 1106180, 1046939, 1039963, 1044236, 843824, 946530, 1070581, 976325, 1139408, 1118879, 863599, 906290, 1016106, 1080145, 1223163, 1164144, 1253810, 1165346, 1110479, 1275296, 1473678, 1404217, 1202078, 1380323, 1510329, 1379953, 1378507]
4116A378507L4051j33761l810l5764P0568Q7835O5611K9984j30151r6550M5856
4105A312376J93289m6159J2019l176q6710P4697N3722j56840K8132J17961Q0527
4094A579838K5467N0067N3458l9860k084O2587o3148j92239R5232J79992m125
4083A745185l8486K4550P1219Q001R231o7295R6875O0227P8494n993n1142M3184
4071A974050N6741M5225m046J94660o3801j2767P9857k2265J36459n517j47232
4060B231364R5477O665J53107K48662k1060j23713l3642j1318P3780o6880N2352
4049B604794R7405m2901Q6142Q9944J53194L9644P7963m5682j33417k5599J02485
4038C003972J51427k0277Q7951j79248P8489j531L8910O297Q9159P8828M9385
$$ y = [1378507, 1412558, 1278797, 1274987, 1239223, 1309791, 1397626, 1463237, 1493221, 1363070, 1266520, 1312376, 1505665, 1459506, 1471525, 1468349, 1381639, 1456336, 1510058, 1353218, 1381350, 1499311, 1579838, 1605305, 1655372, 1708830, 1668970, 1666886, 1729473, 1666325, 1474086, 1569318, 1749310, 1745185, 1706699, 1731249, 1802468, 1810469, 1819700, 1752405, 1849280, 1909507, 1988001, 1982008, 1930866, 1974050, 2030791, 2076016, 2071970, 2266630, 2202829, 2190062, 2269919, 2247654, 2384113, 2378596, 2231364, 2326841, 2333506, 2486613, 2735275, 2714215, 2590502, 2556860, 2545542, 2619322, 2552442, 2604794, 2702199, 2659298, 2745440, 2835384, 2988578, 3028222, 3106185, 3060503, 2927086, 2901487, 3003972, 3155399, 3135122, 3223073, 3043825, 3122314, 3120783, 3159693, 3165990, 3255149, 3333977, 3383362]
4027C383362J18104j13131l9465M6216P6896n332K1167J01174M8455Q9218L5630
4016C762294j2619N133J04254R936p2556o7904K13497L1376O0418J23476k0504
4005D136801j22612J307K34002Q2890O0756m104l5612M4394L0567N0857l8689
3994D440557j08783R6193Q4468J00984o8082j6059o2704m0618J721J22430M8746
3983D598853m0603k2842N0233Q076J23279J10750l2012L0206q3732j6062J8018
3972D744164j6941O303m184L1932m2415J00477p0224q1091m2375n6473L7761J53452
3960D760386J26140k1123K4170j98559l1698J54345J02567J06467N4784K9988
3950E107467j4451J83150n648k2734r4688n8179k4915R5362q2272l4804k02029
$$ y = [3383362, 3501466, 3388335, 3348870, 3395086, 3471982, 3466650, 3487817, 3588991, 3637446, 3726664, 3762294, 3749675, 3754808, 3859062, 3868998, 3796442, 3728538, 3942035, 3973411, 4033829, 4157305, 4136801, 4014189, 4015496, 4249498, 4332388, 4393144, 4389040, 4353428, 4397822, 4428389, 4479246, 4440557, 4331774, 4427967, 4512435, 4613419, 4545337, 4529278, 4466574, 4425956, 4427677, 4550107, 4598853, 4558250, 4535408, 4585641, 4593717, 4716996, 4827746, 4795734, 4825940, 4742208, 4726146, 4744164, 4727223, 4733526, 4729342, 4761274, 4718859, 4819336, 4749112, 4668021, 4625646, 4569173, 4606934, 4760386, 4886526, 4865403, 4889573, 4691014, 4659316, 4813661, 4916228, 5022695, 5077479, 5107467, 5093016, 5276166, 5270518, 5247784, 5153096, 5094917, 5070002, 5165364, 5083092, 5048288, 4846259]
3939D846259P6584J02865n9748l4204J8567J57221q5205k44576m8930J26041M4355
3928D899229K287N5967k2880j13435N4120J48919r384j97609j14753J84623m6228
3917D840856n2232j24471J02527J24810k73029p402l174P0753k1823j7891m8427
3906D590497J14214M3799P8666l382j74900k9159J00420j78271j25212M7417R0429
3895D554518Q8070l5272j36289P3807R446j62945J86771j8693n9619J19631J56280
3884D775705O2270p5722p1195M2567R583j25535O6110J39145K6800j3991k1651
3873D814086j22245N515R5601K16466n9529j33212P1040K2026J100O0141P888
3862D978877O8794m5292o2919M2403K13438l063j2967o576o7185J52844N6667
$$ y = [4846259, 4922843, 5025708, 4965960, 4931756, 4950323, 5107544, 5022339, 4777763, 4728833, 4854874, 4899229, 4901516, 4957483, 4934603, 4821168, 4875288, 5024207, 5014823, 4817214, 4702461, 4887084, 4840856, 4788624, 4664153, 4766680, 4891490, 4618461, 4611059, 4607885, 4678638, 4656815, 4638924, 4590497, 4704711, 4748510, 4827176, 4823794, 4648894, 4619735, 4720155, 4541884, 4416672, 4464089, 4554518, 4642588, 4607316, 4471027, 4544834, 4554280, 4391335, 4578106, 4559413, 4499794, 4619425, 4775705, 4837975, 4762253, 4691058, 4733625, 4743208, 4617673, 4683783, 4822928, 4849728, 4835737, 4814086, 4691841, 4697356, 4792957, 5009423, 4949894, 4816682, 4887722, 4909748, 4910848, 4970989, 4978877, 5047671, 5002379, 4939460, 4981863, 5195301, 5192238, 5179271, 5172695, 5105510, 5258354, 5315021]
3851E315021m9401m4073N4094J38263K4956J91893J5501P3905k3212m157l5843
3840E656947M0842J52431L991J64404J70831j917Q1521M8124N8514P6386J00464
3829F552538J38432m252J39780Q5656Q410p7740Q7297P2206Q8506J06633j7093
3818G180373P2623M5429K52392J04781q1329J69280j479J63940K58586J61837
3808H326433P6869Q4658L79565J71639n4293O6362L90503K30591Q5185K57812
3798A0015324K25277J34632K17444L13175L25890K90591J21308q5755k21218J89964
3788A1526632J9362j7147J27344J12895P4418K14880J81622K83428P6882J42052
3778A2742368J88544J12938K94101J96825J56145K62215L70353L14371K40362
$$ y = [5315021, 5265620, 5221547, 5275641, 5413904, 5438860, 5630753, 5646254, 5720159, 5696947, 5692790, 5656947, 5697789, 5850220, 5854211, 6018615, 6189446, 6187529, 6269050, 6317174, 6375688, 6452074, 6552538, 6690970, 6686718, 6826498, 6912154, 6920564, 6842824, 6930121, 7002327, 7090833, 7197466, 7180373, 7252996, 7298425, 7550817, 7655598, 7574269, 7743549, 7742070, 7906010, 8164596, 8326433, 8403302, 8487960, 8867525, 9039164, 8984871, 9051233, 9441736, 9672327, 9757512, 10015324, 10240601, 10375233, 10592677, 10905852, 11231742, 11522333, 11643641, 11557886, 11336668, 11526632, 11545994, 11528847, 11656191, 11769086, 11843504, 12058384, 12240006, 12523434, 12600316, 12742368, 12930912, 13043850, 13337951, 13534776, 13690921, 13953136, 14323489, 14637860, 14878222]
3769A4878222L35029M14657J90759M29217N22836L03140M89779M57772M96589
3760A8518000N26918L04047N46221N62317L05042J82498K07262K20682M47634
3751B1820621M97570L61347L15963L07841N40886N41308O25574P11100O43572
3742B6365782P79091Q92082P31831R34147J040185J066687R84670J157551J425216
3733C5377242J334667J004557J205777J364823J255820J262334J106401J038066
3725D4949687J104636P83582Q22367P39668P13703P84455N07197N75730N16692
3716E1497717M68039P36184N97595O91145Q50257R51655R74439J010923J141350
3707E8919304J199317J279925J291699J387371J300839J167730J197826J055381
$$ y = [14878222, 15213251, 15627908, 15818667, 16247884, 16770720, 17073860, 17563639, 18021411, 18518000, 19044918, 19348965, 19895186, 20457503, 20762545, 20945043, 21152305, 21372987, 21820621, 22318191, 22679538, 22995501, 23303342, 23844228, 24385536, 25011110, 25722210, 26365782, 27144873, 28036955, 28768786, 29702933, 30743118, 31809805, 32794475, 33952026, 35377242, 36711909, 37716466, 38922243, 40287066, 41542886, 42805220, 43911621, 44949687, 46054323, 46837905, 47660272, 48399940, 49113643, 49898098, 50405295, 50981025, 51497717, 51965756, 52701940, 53299535, 53990680, 54840937, 55792592, 56767031, 57777954, 58919304, 60118621, 61398546, 62690245, 64077616, 65378455, 66546185, 67744011, 68799392]
3699F8799392Q64694R18428Q23486O67210L55339L24447L28651M18404K38380
3690G3738431K54150M38837M28962L24735O40516N54757O64738P95284Q82934
3681G8723344R46170R99202R74229Q54442Q60083J106223Q49325Q49070J252404
3672H7414492J031694R43263R64631J084643J360585R13580Q57395J094661R33318
3663I6598262J062143J003690Q70853J166619J217175Q93897R47590O15688M49480
3654A04825397L15286m8200m78995r96629j132416j342247j459772j724412j856431
3645I6101581j750525j815158j629110j396656j265654j165302j054853q86311
3637H5138012o03257n08813l99954m04108m03730k40214j38471J19523n3451j69933
$$ y = [68799392, 69664086, 70582514, 71406000, 72073210, 72428549, 72752996, 73081647, 73500051, 73738431, 73992581, 74431418, 74860380, 75185115, 75825631, 76380388, 77045126, 77840410, 78723344, 79669514, 80668716, 81642945, 82497387, 83357470, 84463693, 85313018, 86162088, 87414492, 88446186, 89389449, 90354080, 91438723, 92799308, 93712888, 94570283, 95664944, 96598262, 97660405, 98664095, 99534948, 100701567, 101918742, 102812639, 103760229, 104375917, 104825397, 105140683, 105092483, 104613488, 103616859, 102484443, 101142196, 99682424, 97958012, 96101581, 94351056, 92535898, 90906788, 89510132, 88244478, 87079176, 86024323, 85138012, 84534755, 84025942, 83625988, 83221880, 82818150, 82577936, 82439465, 82558988, 82505537, 82335604]
3627H2335604O4383R0921K35322L07737K62801N12045N72662M82279O03842P41693
3617H6209289P72902O43504O63425O77795O94169P49889O54954P89446N83890
3608I2439263N83905O76792N30345L30102K71355J59391J0489j38104k56221l63184
3598I4244133n97931q73818p17693o96489p65244p95608r75110p71297r39041
3589H7111902q86981q09802r39737q18554q50973o92173n95079o43511m44322
3580H0430770m69866l38857l18086j67453j18523j91871j95590n8214r934J5882
3570G8578258j37397j73170Q613l0452k12996K21542J32714J87589J19430K45207
3560G8939338L58884K01895N60178K72423M87798M68767M57699N84949N17136
$$ y = [82335604, 82399987, 82490908, 82726230, 83033967, 83296768, 83808813, 84381475, 84863754, 85467596, 86209289, 86982191, 87625695, 88289120, 88966915, 89661084, 90410973, 91065927, 91855373, 92439263, 93023168, 93699960, 94230305, 94560407, 94831762, 94991153, 95001642, 94863538, 94607317, 94244133, 93646202, 92772384, 92054691, 91358202, 90592958, 89797350, 88822240, 88050943, 87111902, 86224921, 85415119, 84475382, 83656828, 82805855, 82113682, 81518603, 80875092, 80430770, 79960904, 79622047, 79303961, 79136508, 79017985, 78826114, 78630524, 78572310, 78562376, 78578258, 78440861, 78267691, 78276304, 78245852, 78032856, 78254398, 78387112, 78574701, 78694131, 78939338, 79298222, 79500117, 80060295, 80332718, 80820516, 81289283, 81746982, 82331931, 82849067]
3551H2849067N51245L70619N22652M38430N06223K55491J61786K46328K78029
3542H6179870J77367J54174N97922K61352P9779L88343M80804M37072M74430M90700
3532H9721813L55885L79498L08059K42186M02996K42402L04637K44909K26714
3523I2429099M74248K87449L57084M59448M09044N21832N55239O23029M77538
3514I6594010L94366N82986M50915L47155M00017M64794J88376k4485K47834K27903
3504I9873871Q772q0443j69918Q6562o8614l98145J08626J21838p3341J11356
3494I9520564J50079M4722j99101q8505j84280k65366j60724l86233l12844j70331
3484I7947981q4458j59947m18761l80242k49684k38165j49932k71491l14641l64009
$$ y = [82849067, 83400312, 83770931, 84293583, 84732013, 85238236, 85493727, 85655513, 85901841, 86179870, 86357237, 86511411, 87109333, 87370685, 87450464, 87838807, 88319611, 88756683, 89231113, 89721813, 90077698, 90457196, 90765255, 91007441, 91410437, 91652839, 91957476, 92202385, 92429099, 92903347, 93190796, 93547880, 94007328, 94416372, 94938204, 95493443, 96116472, 96594010, 96988376, 97571362, 98022277, 98369432, 98769449, 99234243, 99422619, 99398134, 99645968, 99873871, 99882643, 99802200, 99632282, 99718844, 99650230, 99252085, 99360711, 99482549, 99409208, 99520564, 99670643, 99715365, 99516264, 99427759, 99243479, 98978113, 98817389, 98431156, 98118312, 97947981, 97863523, 97703576, 97284815, 96904573, 96654889, 96416724, 96266792, 95995301, 95680660, 95316651]
3474I5316651l90380l46967k33671m87734m04695m90962l47287l85229n55938
3465I1673788m90390n11763o67091m35937n66942o64296o16007p84518m21126
3456H6515718o83404o17275o88514m72333l28330l97532l11005j85648j19502
3447H2712175j50379J8405k3254M335k14534L5788Q518k8920k14720j52728j2206
3436H1982480k09418l21036k58229k04190j79535j30775P7955M2083o9251J99878
3426H0929962J74877L07893N03569N17597M04746L85634M02197M89458M82161
3417H4598094L15025L26018L10359L11982M08909M30460L92536M37985N75688
3408H8107056J67997L52008O15164N63913M14871N84094N76453P58170Q67588
$$ y = [95316651, 94926271, 94579304, 94345633, 93857899, 93453204, 92962242, 92614955, 92229726, 91673788, 91183398, 90671635, 90004544, 89568607, 89001665, 88337369, 87721362, 86936844, 86515718, 85832314, 85215039, 84526525, 84054192, 83725862, 83328330, 83017325, 82831677, 82712175, 82561796, 82580201, 82556947, 82561282, 82346748, 82382536, 82391054, 82362134, 82147414, 81994686, 81982480, 81773062, 81452026, 81193797, 80989607, 80810072, 80679297, 80757252, 80799335, 80730084, 80929962, 81104839, 81412732, 81916301, 82433898, 82838644, 83224278, 83626475, 84115933, 84598094, 84913119, 85239137, 85549496, 85861478, 86270387, 86700847, 87093383, 87531368, 88107056, 88275053, 88627061, 89242225, 89806138, 90221009, 90805103, 91381556, 92139726, 93007314]
3399I3007314J076776J156336J073866J080257J149246J308388J567608J391724
3391A02811515J358661J591391J445394J545805J616968J522621J272282J106343
3383A14270980R14671Q23812O53922O50730O18460O34397O50780P61183Q65879
3374A20844814Q11458R18939Q74147Q53046R59138R73892R54464J089297J065466
3365A29344661J146964J185817J256394J101839J301789J505334J374731J481671
3357A39699200J214020J164931J347784J239308J290771J268212J065350J029486
3349A49319062J208369J166050Q69870P47769Q61643Q43532R09310J062915Q72728
3340A57861248J049452J162035J067191J018508J290922J334841J259930J502463
$$ y = [93007314, 94084090, 95240426, 96314292, 97394549, 98543795, 99852183, 101419791, 102811515, 104170176, 105761567, 107206961, 108752766, 110369734, 111892355, 113164637, 114270980, 115185651, 116009463, 116663385, 117314115, 117932575, 118566972, 119217752, 119978935, 120844814, 121656272, 122575211, 123449358, 124302404, 125261542, 126235434, 127189898, 128279195, 129344661, 130491625, 131677442, 132933836, 134035675, 135337464, 136842798, 138217529, 139699200, 140913220, 142078151, 143425935, 144665243, 145956014, 147224226, 148289576, 149319062, 150527431, 151693481, 152563351, 153311120, 154172763, 155016295, 155925605, 156988520, 157861248, 158910700, 160072735, 161139926, 162158434, 163449356, 164784197, 166044127, 167546590]
3332A67546590J552025J447732J623356J675722J830487J958118J656923J750838
3324A81041791J973668J823020J768971J837240J929450K014213K220194K209560
3316A96818107K478250K658028K793987K988359L086973L432225L582712L616222
3308B21454863L643869L720844M096098M017897M306281M388881M469127N069133
3300B55166993N183479N322814N643146N564753N468060N591948N514720N143767
3292B98599680M882331M350630M271272L924014L639683L743010L797925M093250
3284C31301795M228278M610219M587407M579535M335329M189716M206101M238227
3276C66276607M071946M220803M137549L961779L961653M259535M101242M572387
$$ y = [167546590, 169098615, 170546347, 172169703, 173845425, 175675912, 177634030, 179290953, 181041791, 183015459, 184838479, 186607450, 188444690, 190374140, 192388353, 194608547, 196818107, 199296357, 201954385, 204748372, 207736731, 210823704, 214255929, 217838641, 221454863, 225098732, 228819576, 232915674, 236933571, 241239852, 245628733, 250097860, 255166993, 260350472, 265673286, 271316432, 276881185, 282349245, 287941193, 293455913, 298599680, 303482011, 307832641, 312103913, 316027927, 319667610, 323410620, 327208545, 331301795, 335530073, 340140292, 344727699, 349307234, 353642563, 357832279, 362038380, 366276607, 370348553, 374569356, 378706905, 382668684, 386630337, 390889872, 394991114, 399563501]
3268C99563501M880119N271978N871695O251802O375835O084853N852572N272158
3260D45424513M748819M167867L991604L709422L950010M091709M503020M907959
3252D79494923N314278N428104N621276N616013N212089M714608M006114L086252
3244E18493657K122931J290235J83510j449618l608347n824280q191221j0323615
3236D92693252j2480403j4123635j5127366j5329718j5197921j4783442j4318355
3229C91332412j3995890j4322819j4952659j5550927j5476210j4843350j3902411
3222B88288146j2960883j2077078j1259695j0840385j0061933r743501r470903
3215B11873768r095908q565961q217096q153833p625664p257921o984082o729565
$$ y = [399563501, 404443620, 409715598, 415587293, 421839095, 428214930, 434299783, 440152355, 445424513, 450173332, 454341199, 458332803, 462042225, 465992235, 470083944, 474586964, 479494923, 484809201, 490237305, 495858581, 501474594, 506686683, 511401291, 515407405, 518493657, 520616588, 521906823, 522090333, 520640715, 517032368, 511208088, 503016867, 492693252, 480212849, 466089214, 450961848, 435632130, 420434209, 405650767, 391332412, 377336522, 363013703, 348061044, 332510117, 317033907, 302190557, 288288146, 275327263, 263250185, 251990490, 241150105, 231088172, 221344671, 211873768, 202777860, 194211899, 185994803, 177840970, 170215306, 162957385, 155973303, 149243738]
3207A49243738o213935n830228n407132m947574m820723m303431m061531m009173
3199A09650011l519046l242839l221756k960376k831439k909792k606016k518768
3191H5839979k298727k092771k223981k125559k037457k132704k056810j873062
3183F8998908k085903j808396j683725j823710j662658j484060j540988j634461
3175E5275007j393572j287914j323307j307822j345645j168098j058432j067419
3167D5322798r94884j002758j080052r23993j026774p52968q11249p67895p57934
3158C7204291p90651q10043o12460m48373n87546n43132n99136n96612m03765
3149C1812573m93200o21131n45642n65709n72313m55554m27345o64011n04458
$$ y = [149243738, 143029803, 137199575, 131792443, 126844869, 122024146, 117720715, 113659184, 109650011, 106130965, 102888126, 99666370, 96705994, 93874555, 90964763, 88358747, 85839979, 83541252, 81448481, 79224500, 77098941, 75061484, 72928780, 70871970, 68998908, 66913005, 65104609, 63420884, 61597174, 59934516, 58450456, 56909468, 55275007, 53881435, 52593521, 51270214, 49962392, 48616747, 47448649, 46390217, 45322798, 44327914, 43325156, 42245104, 41321111, 40294337, 39541369, 38730120, 37962225, 37204291, 36413640, 35603597, 34991137, 34542764, 33955218, 33412086, 32812950, 32216338, 31812573, 31319373, 30698242, 30152600, 29586891, 29014578, 28559024, 28131679, 27467668, 26963210]
3140B6963210m95683o05638m53007m15846m20556m62280l50091l46684l94994
3131B3018431l26522l49190l29008m05681j32999j98695k88939k25612m8619j26806
3121B0586360j42250k05318k59210j39218J21949K7321l4485k53110l8567j77783
3111A9485689k68204j49104k57959k37852l93476m14603k38352l42314j32808
3102A7051017q1452k30565m37418l95978j60775l28600l00546K7698m1129m44991
3092A4657261j94930J270K2827k65449k72164p5029N1131j27246N3256j10909
3082A3740018o0031r1911j36199l2204m5404k4038j51642l44621m8244k0697k5136
3071A2759891k60906j91264j40702l6145n6309n5045q2628k12933j35729q2568
$$ y = [26963210, 26467527, 25861889, 25408882, 24993036, 24572480, 24110200, 23760109, 23413425, 23018431, 22691909, 22342719, 22013711, 21608030, 21475031, 21276336, 20987397, 20761785, 20713166, 20586360, 20444110, 20238792, 19979582, 19840364, 19962313, 19989634, 19955149, 19702039, 19663472, 19485689, 19217485, 19068381, 18810422, 18572570, 18179094, 17764491, 17526139, 17183825, 17051017, 16969565, 16739000, 16301582, 15905604, 15744829, 15416229, 15115683, 15143381, 15102252, 14657261, 14462331, 14463601, 14486428, 14220979, 13948815, 13873786, 13924917, 13797671, 13850927, 13740018, 13679987, 13588076, 13451877, 13419673, 13374269, 13350231, 13198589, 12853968, 12805724, 12785027, 12759891, 12498985, 12307721, 12167019, 12130874, 12074565, 12019520, 11936892, 11723959, 11588230, 11505662]
3061A1505662r8658j04631o9235j03879K0003q0488P0745m4448j19000M5244o8432
3050A0952883j63287O6279P3577r8905J30466j9358k09262J40625p8654K35771
3040A1030135J2433o1980K7591j33277r399P7077Q5313N1315J27147M6315Q5462
3029A1338132j2546o5006l3726J84683L34809J08769M0362p6114R6792J89630
3019A2105785J81592j47203J60010J27918K28328K04874J48873J25967j6908L03601
3009A3422837J91013J86010K23269L86673J41593k9909J52499M34402K40609J46470
2999A5495466J84615L30240L70381K52035L92863L77039L28404L32930N22053
2990A8586026M52750N20850N09456J27522M40581N88666M55650M23897O51947
$$ y = [11505662, 11407004, 11302373, 11233138, 11129259, 11149262, 11068774, 11139519, 11095071, 10976071, 11021315, 10952883, 10789596, 10855875, 10929452, 10830547, 10961013, 10941655, 10732393, 10873018, 10794364, 11030135, 11042568, 10980588, 11008179, 10874902, 10865503, 10942580, 11027893, 11079208, 11206355, 11252670, 11338132, 11325586, 11260580, 11226854, 11411537, 11746346, 11855115, 11895477, 11819363, 11916155, 12105785, 12287377, 12140174, 12300184, 12428102, 12656430, 12861304, 13010177, 13136144, 13119236, 13422837, 13613850, 13799860, 14023129, 14409802, 14551395, 14521486, 14673985, 15108387, 15348996, 15495466, 15680081, 16010321, 16380702, 16632737, 17025600, 17402639, 17731043, 18063973, 18586026, 19038776, 19559626, 20069082, 20196604, 20637185, 21225851, 21681501, 22105398, 22757345]
2981B2757345M79787N15682Q97021Q56307O29078M59881O81828Q11061Q48552
2972B8936542O60309O01991P59067N85276P27546N31826N39814N63741N29681
2963C4435793O43424O09183Q02271R16390Q61290R75329R85114J174085J184578
2954D2587457J083690J414243J433337J371546J626803J714910J822992K006081
2946E5061059K197050K356411K172027K581324K857371K782306K823603K899343
2938G5730494K818978L099772L143679L444608L807514M092818M629830N194970
2930A05962663N503869N724860O019705O321120O236705N783534N637737N463334
2922A52653527N284568N392083N307065N262245M709481M079782L642884K842827
$$ y = [22757345, 23237132, 23752814, 24649835, 25506142, 26135220, 26595101, 27276929, 28087990, 28936542, 29596851, 30198842, 30957909, 31543185, 32270731, 32802557, 33342371, 33906112, 34435793, 35079217, 35688400, 36490671, 37407061, 38268351, 39243680, 40228794, 41402879, 42587457, 43671147, 45085390, 46518727, 47890273, 49517076, 51231986, 53054978, 55061059, 57258109, 59614520, 61786547, 64367871, 67225242, 70007548, 72831151, 75730494, 78549472, 81649244, 84792923, 88237531, 92045045, 96137863, 100767693, 105962663, 111466532, 117191392, 123211097, 129532217, 135768922, 141552456, 147190193, 152653527, 157938095, 163330178, 168637243, 173899488, 178608969, 182688751, 186331635, 189174462]
2914A89174462K462341K231130J972398J953699K175834K559000K718103K817016
2906B08063983K813314L038118L555704M534237N139614O252504P477736Q802739
2898B49677949R606090Q926366P089814M163439J652054J148979L273818N947485
2890B91485994P856370P235002K732583n287117j2687522j6856908j7545043j6604942
2882B40328417j4835880j2779368j1126624r664693p879031o786072n876965n055291
2874A66324493m120529l283712k532347j924999j536116j009897q95819m95490
2866A50525584o63248r04135r11523j172293j123792j212494j206051j538217
2858A41793831k326543l308516m334477n391224o100898o443888o536595o447519
$$ y = [189174462, 191636803, 193867933, 195840331, 197794030, 199969864, 202528864, 205246967, 208063983, 210877297, 213915415, 217471119, 222005356, 227144970, 233397474, 240875210, 249677949, 259284039, 268210405, 275300219, 279463658, 281115712, 282264691, 285538509, 291485994, 299342364, 306577366, 309309949, 304022832, 291335310, 274478402, 256933359, 240328417, 225492537, 212713169, 201586545, 191921852, 184042821, 177256749, 171379784, 166324493, 162203964, 158920252, 156387905, 154462906, 152926790, 151916893, 151021074, 150525584, 149862336, 148958201, 148046678, 146874385, 145750593, 144538099, 143332048, 141793831, 139467288, 136158772, 131824295, 126433071, 120332173, 113888285, 107351690, 100904171]
2850A00904171o095662o096334n700665m900162m480486m293590l848561l679438
2842F1809273l418008k963763k864364k622854k265815k320596k233602j954195
2834D1166076j648155j820734j663394j286658j461733j179043j118174j121656
2826B9866529j178771j050646q82337p64069r95746q01154q06180p69942o98449
2817B1919235p43840m94647o41512o29733m76401m85457n39873l56528m55878
2808A7095366n96221l51217m55114l99339n72419j62095l29456n46588n11338
2799A3171579k94913k70850l55725k97204j75688l74842l42334n6766k01833m46185
2789A0355239k63379k55687k81672q3702j58540k96986j87704k02092p8230j69498
$$ y = [100904171, 94808509, 88712175, 83011510, 78111348, 73630862, 69337272, 65488711, 61809273, 58391265, 55427502, 52563138, 49940284, 47674469, 45353873, 43120271, 41166076, 39517921, 37697187, 36033793, 34747135, 33285402, 32106359, 30988185, 29866529, 28687758, 27637112, 26754775, 25990706, 24994960, 24193806, 23387626, 22617684, 21919235, 21175395, 20680748, 20039236, 19409503, 18933102, 18447645, 17907772, 17551244, 17095366, 16499145, 16147928, 15692814, 15293475, 14721056, 14558961, 14229505, 13682917, 13171579, 12876666, 12605816, 12250091, 11952887, 11777199, 11402357, 11060023, 11003257, 10801424, 10355239, 10091860, 9836173, 9554501, 9470799, 9312259, 9015273, 8827569, 8625477, 8547247, 8377749]
2779H377749l15281k20608P8804j39731j07265j5743j64547n0079j56576l08221
2769F978502k25397j87506j04662p2687l3138k39376j85401M0543j48207j63000
2759E659671j68016j48630k8646q5611p4881j1317q6710j13459j04663l5806j05285
2748D696647Q864j75255l37704P0205j53463j39692R433j11621R4121j84815M872
2737C781592n2292j52347K8282O8855o8891K114j36993N7704p2255p7809j36212
2726C241748M49j42088l6509o4571j26500R7500N0092m6979m6395j83089j22944
2715B620714r8957L3240Q9572l1436l562l2317q0361J13703M3233K6056o3891
2704B615994j42164j15046J4962J49649l1322l255M2818j05347j15981K8474K2145
$$ y = [8377749, 8062468, 7841860, 7920664, 7780933, 7673668, 7657925, 7493378, 7443299, 7286723, 6978502, 6753105, 6565599, 6460937, 6388250, 6355112, 6115736, 5930335, 5970878, 5822671, 5659671, 5491655, 5343025, 5314379, 5228768, 5153887, 5142570, 5055860, 4942401, 4837738, 4801932, 4696647, 4705511, 4530256, 4192552, 4262757, 4109294, 3969602, 3979035, 3867414, 3961535, 3776720, 3781592, 3729300, 3576953, 3605235, 3674090, 3605199, 3607313, 3470320, 3528024, 3455769, 3377960, 3241748, 3242197, 3100109, 3063600, 2999029, 2872529, 2970029, 3020121, 2973142, 2926747, 2743658, 2620714, 2521757, 2554997, 2644569, 2613133, 2609571, 2577254, 2496893, 2610596, 2653829, 2679885, 2615994, 2473830, 2358784, 2373746, 2523395, 2492073, 2488818, 2531636, 2426289, 2310308, 2338782, 2360927]
2693B360927m5310M4154n8030l8232Q0465N406J4508j02615j43055M4400J57032
2682B319650o3016j03325p1015M165N2343J8142j8797j05533j164R2957o3452
2671B060955m6047J8021R9919j6962o3238L9469O190j26237j18181N837N3968
2660A913694Q2998m9258j14165M1963R0537L6250J07454j91040p08L4473P7693
2649B029891K03557l9840j70034p3324K63346j01524n275K5863L5535M0789j5930
2638B193054J10918K1609L2309j56545L0957J25874M8528J4421O3682p3246j10947
2627B300614P5483L325P7973j142K3261j38520P7087J4410K06349k05276k432
2616B431132l8647L8925J86448Q2475L4242P5880j33287l4538J58306n1224k9278
$$ y = [2360927, 2315617, 2359771, 2301741, 2263509, 2343974, 2349380, 2363888, 2261273, 2118218, 2162618, 2319650, 2256634, 2153309, 2082294, 2086459, 2138802, 2156944, 2138147, 2032614, 2031450, 2124407, 2060955, 2014908, 2032929, 2132848, 2115886, 2052648, 2092117, 2098307, 1972070, 1853889, 1859726, 1913694, 1996692, 1947434, 1833269, 1875232, 1965769, 2002019, 2109473, 1918433, 1917725, 1952198, 2029891, 2233448, 2193608, 2023574, 1950250, 2213596, 2112072, 2106797, 2132660, 2168195, 2208984, 2193054, 2303972, 2325581, 2357890, 2201345, 2232302, 2358176, 2406704, 2421125, 2484807, 2411561, 2300614, 2376097, 2379422, 2457395, 2456253, 2479514, 2340994, 2418081, 2432491, 2638840, 2433564, 2431132, 2392485, 2431410, 2617858, 2700333, 2734575, 2810455, 2677168, 2642630, 2800936, 2749712, 2720434]
2605B720434Q0314j23850M0977J10830j19301k26585j75004j9116J9285m193j09060
2594B194731k31960J17198j01319k43158R2320j8864P6342N303p874l9768O0822
2583A903773l5608R0837K0774j76509K1458M7337q9455P3855j71592J55885J12396
2572A953151r9538k01608M6409n8301p2668j06656q8211j31707j1229R6216q0662
2561A245196q8524j17825m0944N7129p553j19027M8514Q6186K3468k60331j55605
2550F70684J44368J87684r4381Q6617J41538j38131j29990j23930N4622O6799
2540H65880J01817J3273j71163n8887J18867N4787j41380j08881J47374K4605
2530H46292k00375K1831K02162N2836M0535j21310p7640K75661j45384j87458
$$ y = [2720434, 2800748, 2676898, 2717875, 2828705, 2709404, 2482819, 2307815, 2288699, 2307984, 2303791, 2194731, 1962771, 2079969, 1978650, 1735492, 1827812, 1808948, 1885290, 1890593, 1882719, 1842951, 1903773, 1868165, 1959002, 1979776, 1803267, 1824725, 1872062, 1782607, 1856462, 1684870, 1840755, 1953151, 1853613, 1652005, 1698414, 1640113, 1567445, 1460789, 1372578, 1240871, 1229642, 1325858, 1245196, 1156672, 1038847, 997903, 1055032, 1047479, 928452, 976966, 1063152, 1086620, 826289, 670684, 815052, 1002736, 908355, 994972, 1136510, 998379, 868389, 744459, 799081, 865880, 967697, 980970, 809807, 750920, 869787, 924574, 783194, 674313, 821687, 846292, 645917, 667748, 869910, 922746, 963281, 841971, 764331, 1039992, 894608, 707150]
2520G07150P9311K6592j1546j17266J57621p5303K14184n7119o2886j21272j46690
2509E92776O4456l7831R8302n2459p7452K2242K7971J0127J4587M0898J4o8095
2497F35536j04298J8244Q7485J06938p2641j56095J29922q899J08535K198R455
2486G56380q7841j01307L9792p8552k0507J22649j95739j01403J47747n6679r6528
2475C28012k0449J12760L8029P2852N5880O6065j16993k22860J26289R2833j82790
2464C49628R4861J38702r0627P7395M178l7013j4637M3320P565o6122k06627J54448
2452D55071n6753J72810J8381m2882j3161j25219J09124P0923K0880j51838q6783
2441C70553N1904r61O7668j24027j22038o5896P209J27118K5937N9709j98916
$$ y = [707150, 786461, 813053, 801507, 684241, 841862, 766559, 980743, 923624, 860738, 739466, 592776, 657232, 619401, 717703, 665244, 587792, 610034, 638005, 648132, 662719, 703617, 703631, 635536, 531238, 549482, 636967, 743905, 671264, 515169, 645091, 636192, 744727, 746925, 756380, 668539, 567232, 607024, 528472, 507965, 630614, 434875, 333472, 481219, 424540, 328012, 307563, 420323, 458352, 531204, 587084, 653149, 536156, 313296, 439585, 532418, 349628, 444489, 583191, 492564, 569959, 574137, 537124, 522487, 565807, 573372, 507250, 300623, 455071, 398318, 571128, 589509, 546627, 533466, 408247, 517371, 588294, 609174, 457336, 370553, 422457, 421496, 489164, 365137, 243099, 177203, 184412, 311530, 337467, 397176, 198260]
2430A98260j08508J02963J3268R8559j7138j8430j8196N3343l918j5888Q1565
2419C65880j44248N6022J68423p5255j91467R1162M4765J66993l4010j23249j7038
2408C07978J04888J1288N6816Q2762q5600n2359M6051o9814j4982J05905n3937
2397D38996r5569M625J6539j50864K3344r344K6477M6466R4109m7996o5995P0124
2385C50912J6652Q7553O1275j38590j32943Q6582m6675N7568k6884Q5601K086
2374D03137n3306R7677J4097j87068j08462J37036M9608o0166J89736r8552R754
2363C93491K18942M6886j00913o7581l0280M3129L8691M4970r331J06672l7553
2352F47123r7171J47474P340p4172K8589N8880k29902m5895k8387M0873j2459
$$ y = [198260, 89752, 192715, 205983, 304542, 287404, 268974, 250778, 304121, 300203, 284315, 365880, 221632, 277654, 446077, 370822, 179355, 270517, 315282, 482275, 448265, 325016, 307978, 412866, 424154, 480970, 563732, 478132, 425773, 471824, 402010, 387028, 492933, 438996, 343427, 348052, 364591, 213727, 237071, 227727, 254204, 300670, 394779, 346783, 280788, 350912, 367564, 455117, 516392, 377802, 244859, 331441, 284766, 342334, 315450, 401051, 403137, 349831, 447508, 461605, 274537, 166075, 303111, 352719, 292553, 482289, 383737, 393491, 612433, 659319, 558406, 490825, 460545, 503674, 542365, 587335, 578004, 684676, 647123, 549952, 697426, 704766, 630594, 659183, 718063, 488161, 442266, 413879, 454752, 442293]
2341D42293j13954q7724M2783P269K00711N4628M3444k21960N8583J46352j16725
2330D55700j4781k5896r6508N8214p5756p675m1610K07812M4779j82953M3374
2319C64700J71078m9282k48364l1180J47092O7846N8342R0673k91971J24490j9341
2308C84083j27598j14100J55802k4954k21667J18607K15430o8538m191K15881
2298E28755K7137j75820j33274R2252r3741j89499K8009J77919J28015j06944
2288B82809l9792k1513m611p7605J17527K51765j05358O7070k65185o4338K78804
2277D19573j5471l9052j9511m4967K4296J03173l6780k3181N5093K9951r3314
2266C59810q2829l7914K02861K8644l8365m7523l3926J9064j3029l7623O009O3722
$$ y = [442293, 328339, 240615, 283398, 290667, 491378, 546006, 589450, 367490, 426073, 572425, 455700, 440919, 415023, 318515, 376729, 300973, 293298, 251688, 459500, 504279, 321326, 364700, 535778, 486496, 238132, 206952, 354044, 421890, 480232, 570905, 278934, 403424, 384083, 256485, 142385, 298187, 273233, 51566, 170173, 385603, 317065, 312874, 528755, 555892, 380072, 246798, 339050, 245309, 55810, 83819, 261738, 389753, 282809, 243017, 221504, 216893, 139288, 256815, 508580, 403222, 470292, 205107, 140769, 419573, 404102, 365050, 345539, 300572, 324868, 428041, 391261, 368080, 423173, 453124, 359810, 276981, 239067, 441928, 470572, 432207, 384684, 350758, 369822, 356793, 319170, 325179, 388901]
2254C88901n8643l4285J80057k0864k3804k5828n1076R8412m4171j15472O137
2243B99364R4595M5085M8578j25658J12842J44991j70527Q3234k1922j63096P4365
2232D21851R2020N8011o4223m6735P0871M9061M6844N9628l3436j40165j4856
2221D98871l4793N156Q1004l24j5376O8972J9657q5891l3338O6372j28336o1344
2209C80630J68763P3577J2265r3695Q9851Q2497q9647Q0542L9812j09192Q34N9756
2197F95993P2454r9239J0595M8495R2646j05160l6948M7872k9917K54889J7060
2186I68740K6342j21826l9872J91413O9558j1906O2298M1532l4022R0729J54062
2175A397048J53253l0627j7218j26014M4990k06314K3878j47343N6103J08610
$$ y = [388901, 330258, 295973, 476030, 455166, 431362, 405534, 354458, 452870, 408699, 293227, 299364, 393959, 439044, 487622, 361964, 474806, 619797, 449270, 532504, 510582, 347486, 421851, 513871, 571882, 507659, 460924, 531795, 580856, 627700, 687328, 653892, 513727, 498871, 464078, 469234, 550238, 549914, 534538, 603510, 623167, 537276, 503938, 570310, 441974, 380630, 549393, 622970, 635235, 541540, 631391, 713888, 624241, 704783, 744595, 635403, 636237, 695993, 768447, 669208, 679803, 728298, 820944, 715784, 678836, 726708, 696791, 951680, 968740, 995082, 873256, 833384, 1024797, 1094355, 1082449, 1144747, 1186279, 1152257, 1242986, 1397048, 1550301, 1519674, 1502456, 1376442, 1421432, 1215118, 1238996, 1091653, 1147756, 1256366]
2165A256366p8278O1742R7292J18117J49315q4079L2879k8303o4195K0075j6937
2154A463994Q6873n984J25855j62323R9756J02797O0135J62539J0776j07116R1002
2143A928304L9930O8601R6007M6177j0575j17693Q3296L6417j08582M03192O198
2132B471272J16574N8511M6825K03936J65947P8656K83309J60905J21066K14809
2122C921810K12111J67042M5635k4852L00885M17566K40481J70432K76592L97328
2112F125030K52636K48647L15498M75358O01258M27661M92247M64017O47987P93143
2102A0843482O73388P30875O67638J031801J413055J559878J928327K635820L086034
2093B4570298M055286N205429P484375R225660J1341094R319904K800718j0273094
$$ y = [1256366, 1178088, 1239830, 1337122, 1455239, 1604554, 1520475, 1553354, 1525051, 1460856, 1480931, 1463994, 1550867, 1544883, 1670738, 1508415, 1608171, 1710968, 1771103, 1933642, 1944418, 1837302, 1928304, 1968234, 2036835, 2132842, 2179019, 2168444, 2050751, 2134047, 2170464, 2061882, 2465074, 2471272, 2587846, 2646357, 2693182, 2897118, 3063065, 3141721, 3425030, 3585935, 3707001, 3921810, 4133921, 4300963, 4346598, 4321746, 4622631, 5040197, 5280678, 5451110, 5727702, 6125030, 6377666, 6626313, 6941811, 7417169, 8018427, 8446088, 8938335, 9402352, 10050339, 10843482, 11516870, 12247745, 12915383, 13947184, 15360239, 16920117, 18848444, 21484264, 24570298, 28625584, 33831013, 41315388, 50541048, 61882142, 71202046, 74002764, 63729670]
2085F3729670j4457536j0660384p981005n213499l976420k837887k485408j676235
2077A4441296j349810p66315q26696m90085o24352n15355q05771r98018p22838
2068G342056m72476p33779l96665l82987k86274j16513j21013l42765j75235j16262
2058D198087j17380k59785k14521j73475o497p0602j0980k78596j12737P8992
2048C032506j44489k52050j82208o4217R1441J6056k13030j39577m0122k5355
2038B078955m4439k7616k0546k39200j42424O2174J21571q1295p3902j07817n8408
2027A467053J63076j3681r9471j39639P5034j58465j05482R5777o2230O7006j35674
2016A153304j22911L5160j1370L4969j07636M9400L0941l8455o3176j1936j20023
$$ y = [63729670, 49272134, 38611750, 30630745, 25417246, 21440826, 18602939, 16117531, 14441296, 13091486, 12325171, 11498475, 11008390, 10384038, 9868683, 9062912, 8064894, 7342056, 6869580, 6135801, 5739136, 5356149, 5069875, 4953362, 4832349, 4489584, 4314349, 4198087, 4080707, 3820922, 3606401, 3432926, 3426429, 3355827, 3344847, 3066251, 2953514, 3032506, 2888017, 2635967, 2453759, 2389542, 2480983, 2497039, 2284009, 2144432, 2104310, 2078955, 2034516, 2006900, 1986354, 1747154, 1604730, 1666904, 1788475, 1707180, 1633278, 1525461, 1467053, 1630129, 1616448, 1516977, 1377338, 1452372, 1293907, 1188425, 1284202, 1221972, 1288978, 1153304, 1030393, 1065553, 1054183, 1089152, 981516, 1030916, 1061857, 1023402, 960226, 948290, 828267]
2005H28267q400J31908M8594n0475j60343j79386j0342q3269m1582J14029K2275
1994F11276K9790L6388m4993N5988j52191O9683N5175n2890P1676j44923L4523
1983E69502P2537m533J0283o5110j32692J2583J66650K6345P1013j15444l8621
1972E72513p2845M4413l8054j72008R830j2287J82611p0134p9995q0593Q9578
1961C73029P7776p8022L9644j6402J9289j34479O9032j1043L2305m2244j1124
1950C17761P1600k335J22687j9759j10780j77766j04569J07194J5334R541J06624
1939C35532M7625j25077R9637p8979q0495Q5823j11632o0268L5337J52673J0708
1928C10884j43194J55462J54424q6743j46489j03245O1593j8605k4509R61j12707
$$ y = [828267, 819867, 951775, 1000369, 949894, 789551, 610165, 599823, 516554, 474972, 589001, 611276, 641066, 677454, 632461, 688449, 536258, 605941, 661116, 608226, 679902, 534979, 569502, 642039, 637506, 647789, 582679, 449987, 462570, 629220, 655565, 726578, 611134, 572513, 499668, 544081, 506027, 334019, 343849, 331562, 514173, 444039, 364044, 283451, 373029, 450805, 372783, 412427, 396025, 415314, 280835, 349867, 338824, 371129, 328885, 317761, 389361, 387026, 509713, 489954, 379174, 201408, 96839, 204033, 219367, 228908, 335532, 383157, 258080, 357717, 278738, 198243, 284066, 172434, 112166, 147503, 300176, 310884, 167690, 323152, 477576, 390833, 244344, 141099, 202692, 184087, 159578, 160539, 47832]
1917D7832J3428n0149J10557J50234J1563j55405K8440r100j62653J85011M3220
1906B12978j758r5238j4504j64893P2885L9521M2674M6496l2903o1551Q3327l6784
1894I0250R4653m8444L7330N0811M0288p7711j24492P0500L007q4673L9708Q1928
1882A73155P7344l7559n7337J40179k2977o6402p2333J02805N9323q1615q6652
1871A27931O1473K5741J0680R0413j66756o385J41937q5387q4980K6230O7834
1860B08731o0557J36288j21153p8605l0798M7178l303M1518k7303J11677q7924
1849A35749K2899m5357q006o7298j8942M8482Q9471J24209m310o6425k30587P8241
1837E8126k3537L2968J66196J40707k62349M4465P1199q0192r8545J64141M0254
$$ y = [47832, 61260, 11111, 121668, 271902, 283465, 128060, 156500, 147400, -15253, 169758, 212978, 211220, 115982, 101478, -63415, 9470, 48991, 91665, 138161, 105258, 43707, 127034, 90250, 184903, 136459, 173789, 224600, 264888, 187177, 62685, 133185, 136192, 51519, 91227, 173155, 250499, 212940, 155603, 295782, 272805, 206403, 134070, 236875, 296198, 214583, 127931, 189404, 215145, 225825, 316238, 149482, 143097, 285034, 199647, 114667, 140897, 208731, 148174, 284462, 163309, 84704, 53906, 101084, 97781, 139299, 111996, 223673, 135749, 158648, 113291, 105285, 37987, 19045, 67527, 156998, 281207, 276897, 210472, -20115, 58126, 34589, 67557, 233753, 374460, 112111, 156576, 227775, 147583, 49038, 213179, 253433]
1826B53433J5557K0490r6845J50930j9839o5778J00451J62832q6084J02893j12332
1815D25708q853M0036k12116l7976q4851J08232r6712Q6376K8587m3651R7528
1804C02308J1268r1435j80244J12864R3682n1542l7708p8377l4968n3557O3338
1793E5629m5027j4735J17072p2204l4786l3208J17132j63355P9973J26167J1718
1782A44376J21763j57094Q996r5185J2530J32071L3997j26194K3508q7140L1816
1771D3444j4023k4392K9090l7468o9216J41230J05487K5839O977j48014K1994
1760H0948n0938o352P9208j5945j8091n3489K8802J57852j48791k9393J42330
1749A66141j17065k9736O2509q9892m6637m4848J81599j78329O0820J96681j8417
$$ y = [253433, 268990, 289480, 192635, 343565, 323726, 257948, 358399, 521231, 435147, 538040, 425708, 416855, 456891, 244775, 206799, 121948, 230180, 133468, 219844, 248431, 204780, 302308, 313576, 222141, 41897, 154761, 248443, 196901, 159193, 80816, 45848, -7709, 55629, 10602, -4133, 112939, 40735, 5949, -27259, 89873, -73482, 6491, 132658, 144376, 266139, 109045, 118041, 22856, 35386, 167457, 201454, 75260, 98768, 11628, 43444, 29421, 5029, 34119, -3349, -72565, 68665, 174152, 199991, 206968, 58954, 80948, 30010, 23658, 102866, 86921, 68830, 15341, 44143, 201995, 53204, 23811, 166141, 49076, 19340, 81849, -8043, -54680, -99528, 82071, -96258, -35438, 161243, 142826]
1738A42826j7274j37521p5311J12198k9183K0275M6269l0627O6755M0389o3524
1727G5272k2317r4430m0852K3347l9649Q3159l8290q9412J46768O6288j92439
1716a22555l8432J07813J58193J49795j26282r6324j08942j13951J50442R7966
1706E7723M1452O5500j65025n1222K0889R1150m6674j2462n4191j38811J08625
1695h3046J48627M4660n8407P1503m6069o5393J16824Q2609j79792k25591p074
1684b01149J32087R2010j62612J02565J81992j34380J59548m1678p5296o7018
1674a3931N8333n1439q6058J80588J65396o8816j32836p9380J98961k4635p9963
1663F6220J6466Q0980n1367k9511n4106P2646J31362K050J07312j13386j3527
$$ y = [142826, 125552, -11969, -87280, 24918, -4265, 16010, 62279, 31652, 98407, 138796, 75272, 52955, -41475, -82327, -58980, -98629, -15470, -53760, -143172, 3596, 69884, -122555, -160987, -53174, 105019, 254814, 128532, 32208, -76734, -190685, -40243, 57723, 99175, 164675, -350, -51572, -30683, 60467, 13793, 1331, -52860, -191671, -83046, 65581, 110241, 51834, 123337, 77268, 11875, 128699, 211308, 31516, -194075, -201149, -69062, 22948, -139664, -37099, 144893, 10513, 170061, 128383, 53087, -13931, 44402, -7037, -93095, 87493, 252889, 184073, 51237, -28143, 170818, 146183, 66220, 82686, 163666, 112299, 82788, 28682, 101328, 232690, 234740, 342052, 228666, 215139]
1652B15139o3649K7940m9006k29717O9185n2087K5700R3315j39159J37866j8368
1641A7159K01875R3476j26891Q2115j65935L2218L4542q4566k6291q2154K0173
1630d279J7674O8744k8745O1910j71304k8297P9811L1858L3550j3407M0640p7654
1618A0501n0833L32P3110m5753j4347O8299J8903n6483N0388j3923p3787p9500
1606a13093k5018R4093j57495K50946K0281O9819n081j39156K8848Q9928M5938
1595A60010r3691n1863J5205J52495r1456l0141j38491Q6685K7773j09225J7773
1584e4926q3088O1393M9906K52594j04521j30136L80j47237P4888J85097p547
1573I6803j25287P4816P8153l9177j54925M0386J52043j14835j47526J12719m2581
$$ y = [215139, 151490, 179430, 130424, -99293, -30108, -82195, -56495, 36820, -102339, 35527, 17159, 219034, 312510, 185619, 267734, 101799, 134017, 168559, 83993, 57702, -24452, -4279, 13395, 82139, 53394, 115304, -56000, -84297, -4486, 27372, 60922, 47515, 88155, 10501, -40332, -40000, 33110, -12643, -26990, 41309, 60212, 3729, 54117, 40194, -33593, -113093, -138111, -44018, -201513, 49433, 69714, 139533, 134452, -4704, 24144, 114072, 160010, 66319, 14456, 29661, 182156, 90700, 60559, -77932, 8753, 36526, -72699, -54926, -138014, -76621, -26715, 225879, 121358, -8778, -8398, -155635, -80747, 104350, 96803, -28484, 46332, 124485, 85308, -69617, -29231, 122812, 7977, -139549, -26830, -69411]
1562f9411n7312J791J10719L9280k5656k2733J68930n1351k5480q4070n0508P3369
1550G568j5949M4891J21282r4995o8990n9281r924Q9039n3524j0002N9518R283
1538A8916m9786o3621J65401K3746k5921j9221p6273l5698R2570k3293j8741m272
1526a6193l4447P8305j40489J20533m957m3173p4379K08569n6595k09804J37603
1515c5027m1482o260m492J7096j5269O6850K2292J57436k5658o7971J36961r1657
1503A12819k3138M679M0969r7617j20515N8710p7607m1452J08752n4741J08046
1492A8905p5334n4427R7136q909o0980Q2066J25255o3523k6806m8997J39134J9352
1480A42872k06508M4227N1017J36832n1225m8511r0518O7945n1012k4073m16l7051
$$ y = [-69411, -126723, -124932, -14213, 25067, -589, -23322, 145608, 94257, 68777, -15293, -65801, 7568, -8381, 36510, 157792, 62797, -6193, -65474, -75398, 13641, -39883, -49885, 9633, 18916, -30870, -94491, 70910, 94656, 68735, 49514, -26759, -62457, 30113, 6820, -11921, -16193, -50640, 27665, -112824, 7709, 2752, -40421, -114800, 93769, 37174, -172630, -35027, -76509, -82769, -87261, -70165, -85434, -18584, 3708, 161144, 135486, 67515, 204476, 112819, 89681, 94360, 135329, 37712, -82803, -24093, -101700, -143152, -34400, -89141, 18905, -56429, -110856, -13720, -22629, -83609, -1543, 123712, 60189, 33383, -15614, 123520, 142872, -63636, -19409, 31608, 168440, 117215, 68704, -21814, 46131, -4881, -28954, -29370, -66421]
1468f6421P4035P8033Q0393p9786q2683Q5613M358q0327N8522J04270j58730r4861
1456g7584O8168P5966q6460m6614K9084j28138m8062J96417J93247j87209J11841
1445A00656J37204j25232o3215j52092r9755J32488J86509l0345j32824L7107
1435i499O8851Q5968j75511O7717O1263n274k7700q6590Q6444J3429j09572j15754
1423a46228P452J08523o6643P8930N7992o9469K423R0352r031k06192N2190J59542
1411E9841J2512J805n7691o9544o3810J06460l3680j02916O1515j73735J79931
1400g9312M6639M0636j47401J62235O0811n2706R2178q7917J6003k31514n9903
1389b40251j14531L14057o7765j24075J65646P5296j16085J04911K09139k48034
$$ y = [-66421, 7614, 85647, 166040, 86254, 3571, 89184, 93542, 13215, 71737, 176007, 17277, -77584, -9416, 66550, -19910, -66524, -37440, -165578, -213640, -17223, 176024, -11185, 100656, 237860, 112628, 49413, -102679, -202434, -69946, 116563, 86218, -46606, -9499, 59352, 145320, -30191, 37526, 98789, 93515, 65815, -20775, 65669, 79098, -30474, -146228, -138776, -30253, -96896, -17966, 40026, -29443, -27020, 63332, 54301, -151891, -99701, 59841, 72353, 74158, 16467, -53077, -116887, -10427, -44107, -147023, -85508, -259243, -79312, -32673, 7963, -139438, 22797, 83608, 30902, 123080, 35163, 51166, -180348, -240251, -354782, -40725, -108490, -232565, -66919, 8377, -107708, -2797, 206342, -41692]
1379d1692p5652K0244O1441O5822O7363j3385j35228k1393L8578j765N5935Q5684
1367A05952O4957n4181O872l9570j20209j23748O7554R6301J36133o4794j5695
1356E9572J30263j70518Q692j7052q2605j2582R877J08852j1547K8364J96294
1345B47610o9584l43482J9339K24747j22256J20212k842m6468j29826J0546L0299
1334f1705m6950J50137m3271j01904l1180j8758M2100K3646J10252j05613P0807
1323a2439o3826P543j9751N5174K6796j6805Q207K2347K39328o1245j42586k34481
1311a91738L4186K10272j31220q6312K43117j99391K6487o9056k830K77747J1279
1300A22541q2083k20220p5477J36280k0267P6793N0411q317J06631J25190k04006
$$ y = [-41692, -117344, -97100, -35659, 30163, 97526, 84141, -51087, -72480, -33902, -35667, 20268, 105952, 170909, 116728, 123600, 84030, -36179, -159927, -92373, 3928, 140061, 75267, 59572, 189835, 19317, 28009, 10957, -71648, -84230, -74353, 34499, 22952, 51316, 247610, 178026, -165456, -146117, 78630, -43626, 76586, 73744, 27276, -102550, -92004, -61705, -108655, 41482, -1789, -103693, -134873, -153631, -111531, -87885, 22367, -83246, -12439, -76265, -68722, -88473, -33299, -6503, -23308, -15101, 7246, 246574, 185329, 42743, -191738, -157552, 52720, -78500, -164812, 78305, -121086, -94599, -163655, -166485, 111262, 122541, 40458, -179762, -255239, -118959, -139226, -62433, -12022, -20339, 86292, 211482, 7476]
1289G476k37784j8846J25226J69399l2522n3436P011O5456O3846q6096m0287J37711
1277A07154n1568j97963k1994l2838O9967J93793M2724N2146j59840l0922J14944
1266H5603r2731q2649P8306l1019k7714J46609j47524P0166r008P415p9779J2880
1254f9445J66217N7034J5670j81244k8290k4013k4851J91195j24132j87848K561
1243b07146J71322j991J79110J6740n9616l2961k22079J86826p1420q5399J95961
1232F9347J38733P9198j39795m2106N986o5195m8717J27579J3073j53107r1333
1221a06337o0299J12944N3903L7682j36046N5651M918j00558k4782M539J85379
1210B6994l6368o0987J39903J5208j40246j5295n7671J51204J09469p5534j26767
$$ y = [7476, -230308, -249154, -123928, 45471, 12949, -40487, -33476, 31980, 95826, 9730, -30557, 107154, 55586, -142377, -164371, -197209, -127242, 66551, 109275, 161421, 1581, -29341, 85603, -7128, -89777, -11471, -42490, -70204, 76405, -71119, -953, -9961, -2546, -82325, -69445, 96772, 153806, 169476, -11768, -40058, -64071, -88922, 102273, -21859, -209707, -207146, -35824, -37815, 141295, 158035, 98419, 65458, -156621, 30205, -41215, -126614, 69347, 208080, 287278, 147483, 105377, 111363, 46168, -2549, 125030, 138103, -15004, -106337, -166636, -53692, 211, 37893, -98153, -42502, -37584, -138142, -162924, -158385, 26994, -9374, -70361, 69542, 84750, -55496, -70791, -128462, 22742, 132211, 56677, -70090]
1199g0090n2337J81138M6310j60320M2717k3769O1073M6456p6858j7720J2992
1188a0408Q4369l0703J38852j0125M6071j39225q3638Q8538q2825K0855J2166
1177C3927j19522j80360R0886N8908K1497J07804o4662K3626j07814R0351O8850
1166B3491k0273j22876J22876m2933n2224L2742J95274j06367j19475j1301O0334
1155d0732o3156q4973O0744K9031p766J0458j1939J08523J568m609N4785r9411
1143d7477N24q6700m9358J41808J12472p8379n9514J01438J08974n0040p1972
1132B1776J8229J2728q0435m2316j10851K05078j16629j24798J78724J58616o7612
1121E2510q6266N0260L6636K367j03337P8190q1472j40805J09055q331J2126R7585
$$ y = [-70090, -122427, 58711, 105021, -55299, -12582, -36351, 24722, 71178, -5680, -23400, -10408, 73961, 43258, 182110, 171985, 218056, 78831, -4807, 83731, 906, 21761, 33927, -85595, -265955, -175069, -116161, -94664, 13140, -51522, -27896, -135710, -45359, 23491, 3218, -119658, 3218, -39715, -91939, -59197, 136077, 29710, -89765, -101066, -40732, -103888, -188861, -128117, -99086, -106852, -96394, -108333, 190, 1758, -2851, 51934, -47477, -46953, -133653, -183011, -41203, 71269, -7110, -66624, 34814, 143788, 93748, 21776, 40005, 52733, -27702, -70018, -180869, 24209, -92420, -217218, -38494, 120122, 52510, -33756, 16504, 53140, 55507, -47830, 30360, -51112, -191917, -82862, -91193, -79067, 18518]
1109A8518r107j07918R4912L7071q4558o1863J3181K5500j56411P5242K26452
1098G1019r8478j04053J22706L1546j45129p0274J02985k3334j3020L1621J28719
1087C4308o137m8684M6285J68661O3745j82190p9970J5282q7289n9895J94502
1076E8618L1253l8121j31352P669n4803o0795l438J40981O2859j8871J2117P9366
1064H5483j16187N9169j64326l980J11958p8816m0340l0502Q0952k9300o5502
1053a91391K0041k6473K41659P1659j92012J22038J13485k9949K1999k8136m8961
1042G3959j02318J9966q405k4512J4718p8050K25929M8822k77675o1075J54474
1031a4167J12763j29190o3209Q528o6245J78890n3478K8074P5873l390j04271
$$ y = [18518, 9411, -98507, -3595, 33476, -51082, -112945, -99764, -74264, -230675, -155433, 71019, -27459, -131512, -8806, 22740, -122389, -192663, -89678, -113012, -126032, -94411, 34308, 28171, -20513, 25772, 194433, 258178, 75988, -3982, 11300, -75989, -135884, 58618, 89871, 51750, -79602, -71933, -126736, -187531, -190969, -49988, 12871, -6000, 6117, 85483, -30704, 28465, -135861, -139841, -27883, -106699, -147039, -177541, -96589, -125889, -191391, -171350, -197823, 43836, 115495, -76517, 45521, 159006, 129057, 151056, 122920, 73959, -28359, -8393, -16798, -41310, -26592, -104642, 121287, 170109, -107566, -168641, -14167, 98596, -30594, -93803, -85275, -151520, 27370, -26108, 1966, 77839, 74449, -29822]
1020b9822j92268Q1422Q4028J11948n7827M5882J51448J0144k6430n6140j0011
1009A12374m4956p960o174j62861l0581L4205o1248J5247M0174J39851R0548j21847
997c228j29561J6831J18645K32809p0637q8244Q084n7844j02999N2831j06357
986a29670K4842R904j7299j12988J45942J24569o1610j02473K7308j9902m8710
975a60087j9998L24162P5041j72736J12527j5653n0301j08192J47904k565L103
964A33205r3346j07927J21035n2196J6403j23679J8422M3716k3991K519P4673
953H834n4628j8300q6972p137K01857m0299M8043j14275J00993k6566o7157J56500
941A00893Q137k07979p5847L6703p870J10552M7678o789j57204O516j9765o990
$$ y = [-29822, -222090, -140668, -56640, 55308, -2519, 43363, 194811, 204955, 178525, 122385, 112374, 67418, 59458, 53284, -109577, -140158, -105953, -167201, -151954, -111780, 28071, 118619, -3228, -132789, -115958, 2687, 235496, 164859, 76615, 84699, 26855, -76144, -23313, -129670, -104828, -94924, -112223, -225211, -79269, 45300, -16310, -118783, -91475, -111377, -160087, -180085, 144077, 219118, 46382, 158909, 143256, 92955, -15237, 132667, 130102, 133205, 39859, -68068, 52967, 771, 17174, -106505, -88083, -44367, -68358, -65839, 8834, -45794, -64094, -151066, -158203, 43654, 3355, 51398, -62877, 38116, 11550, -55607, 100893, 109030, -98949, -174796, -138093, -145963, -35411, 12267, 5478, -151726, -145210, -164975, -171965]
929a71965M3586P6044J32306j21290q1937l0367K7434J39586N6922j86833l1718
918a48232p0629J21663m2631J34569R504m2956o092j70831J2730O0873N7190o9321
906a54163o0437O7904K6276L2442J09393j4329q6986L502J41903n7064p0143k286
894f3988J08382j8170L0903j40808l4350J23911L5821j12261M6321l1414o1348
883a17001P9108o4809J69188n2598m9435p4560J32905J2589r9369N2981K1047
872A0046P717j5678M2618l7511L6130r6213N0187m1077j29309J41048k583o2712
860i7337L7031L0832J21384R101q0749l369q184l5402j17071R5554l2275J2576
848f7909P3179P571L3640J5123m9774O800K2153R1157m9765j05914M3775N5018
$$ y = [-171965, -128379, -52335, 79971, -41319, -123256, -153623, -126189, 13397, 70319, -116514, -148232, -218861, -97198, -139829, -5260, 4244, -38712, -44804, -215635, -202905, -142032, -84842, -154163, -214600, -146696, -120420, -87978, 21415, 7086, -79900, -76398, 65505, 8441, -61702, -63988, 44394, 26224, 57127, -83681, -118031, 5880, 41701, -70560, -24239, -55653, -117001, -37893, -102702, 66486, 13888, -35547, -110107, 22798, 35387, -63982, -11001, 10046, 17763, 2085, 44703, 7192, 43322, -52891, -2704, -43781, -173090, -32042, -34625, -97337, -60306, -29474, 91910, 101011, 20262, 16893, 8709, -26693, -143764, -48210, -80485, -67909, 5270, 12841, 46481, 61604, 11830, 18630, 40783, 131940, 82175, -23739, 20036, 75054]
836G5054n1295j26053L1431j3086o4022Q3264Q5000P0813o8162j33483J64416
825E3877P1876m5667J00590N8882j88208n0638J38412k68818K17882l9135j07616
814e8563J53407K2790q1319n3406r176Q7678M6070o7758N9425J6047P2707j78309
802I593q8244q143K820j7992j4394O744q0636M8768J43545p4865j7425q057l1740
789a30026L337Q0468l2672M3213N6407k3951p4067R7117k6378k1092J52078j74736
777e0302j857J30813j03409L8238n0875j3090r0245L931k5122j642J71193Q3910
765I1543j12239Q0360K2550j19717J0747k1063j631p8247J24819J8402l6791j02110
753a23377k06708J67740j516O1620L168M6181K32336j48651k07070m2251N5059
$$ y = [75054, 23759, -102294, -70863, -83949, -147971, -64707, 20293, 91106, 22944, -110539, 53877, 125753, 80086, 180676, 239558, 51350, 712, 139124, -129694, 88188, 49053, -58563, 94844, 117634, 36315, -17091, -26267, 61411, 107481, 39723, 99148, 115195, 187902, 9593, -78651, -86794, -83974, -101966, -116360, -109616, -190252, -141484, 2061, -72804, -90229, -98286, -130026, -126689, -46221, -78893, -35680, 20727, -3224, -77291, 19826, -6552, -27644, 124434, -50302, -52159, 78654, -24755, 13483, -37392, -50482, -140727, -136796, -161918, -163560, 7633, 91543, -20696, 59664, 82214, -37503, -26756, -47819, -49450, -127697, -2878, 15524, -21267, -123377, -330085, -162345, -163861, -102241, -99073, -52892, 179444, 30793, -176277, -218528, -163469]
742a63469P4091j0580R1341k408j11445J78595j36811o4705q3560P2218R4663
731f2070j08532K6930k2453J00445J97769l5835j68114n9094r3331K53315N876
720C4906m9061P5178j78030N6688P2431o3449J5027J55026r8318k3817k6650j86359
708b16428n9904Q2257J34099M0606k6355O8287k4084J3684n9479j64157K07648
697c826R0312N0339O488m7234Q7681p6247q1853p9049R8953p806n518j05919R651
684f4028N2770L7181l2364j76546J6093L6409J56868m4004N447M8922J12217l6714
672A12251n280n6619J4854R0019m3981p296J9726j15153O4833l8639r291j861
660B3563m0496M5536k30881j7546K11789J20644n3673m7262j32427j6053R9149
$$ y = [-163469, -89378, -99958, -8617, -11025, -122470, 56125, -80686, -145391, -228951, -156733, -62070, -170602, -143672, -166125, -65680, 132089, 96254, -71860, -130954, -224285, 29030, 34906, -14155, 61023, -117007, -60319, 12112, -51337, -36310, 118716, 20398, -3419, -30069, -216428, -276332, -194075, -59976, -19370, -45725, 22562, -1522, 12162, -47317, -211474, -3826, 86486, 136825, 143313, 96079, 183760, 107513, 25660, -53389, 45564, 37758, 32240, -73679, -64028, -11258, 25923, -6441, -182987, -166894, -130485, 26383, -17621, -12174, 36748, 148965, 112251, 106971, 50352, 65206, 155225, 111244, 103948, 123674, 8521, 73354, 34715, 25424, 23563, -16933, 28603, -202278, -219824, -8035, 112609, 58936, 11674, -120753, -136806, -37657]
649c7657q5598k5675P6932J8711j23992N6327K15100o1536K863J02154K1203N1524
637B10356j11134j45801J6619j3692N8149j33128J2618L2037L8167M2042K912
626I145j64137k3722j6608J10046R4924o9958K8136q2537m7297J28197O013K4006
614c792o7090J45125K4056o770r6208L6606M6964j2702l0984l3643R2913j05880
602a1405q058n1413Q5006q1920j71545L6920N6133P1075J70689j23959J7202j20311
590a31586J53474p432j37444J23743N2403L6699j3228q751P1638j21791r4285
579g6560K6209J55731l6999l3140L695j58587K1817o2066Q3088L5799N2302J22606
567A33895M904m6622P4754j17760M9412L711j20289J04449r3158J1507N4521j73079
$$ y = [-37657, -123255, -148930, -71998, -53287, -177279, -120952, 94148, 32612, 35475, 137629, 158832, 210356, 99222, -46579, -29960, -43652, 14497, -118631, -106013, -73976, -35809, 6233, 9145, -154992, -178714, -195322, -85276, 9648, -60310, -32174, -114711, -162008, -33811, -27798, -3792, -70882, 74243, 98299, 91529, -4679, 31927, 78891, 66189, 35205, 1562, 94475, -11405, -19463, -70876, 14130, -67790, -239335, -202415, -146282, -75207, 95482, -28477, -11275, -131586, 21888, 14456, -122988, 755, 53158, 89857, 76629, 67878, 139516, 17725, -76560, -50351, 105380, 68381, 35241, 38936, -119651, -97834, -159900, -76812, -41013, 11289, 133895, 138799, 92177, 166931, 49171, 98583, 102294, -17995, 86454, -6704, 4803, 59324, -113755]
555a13755p1855J82933m1668q6044q5609N691K9539M8268K9087l2953J39003m0052
543c7415j49512J52785j25999N8644J79313P4605Q4521K0049j58860k08374J22558
532A2315l7583N1437J37230k3899j41818J8583j26498P8944p613o6225J21797
521A6670j34466J43583j3441O4827J65906j26195j38440J19J13885M1916j79146
510d4782N9325R7588m3057R9643O5398o9502j68652n9824n552k8330J45444r3588
498d5889n0326K29564o706j49157q7305J52606N875m6182o2783J54696j22405
487b8012j8924P5895J68937o4316j5735J2964k19561q2356k0291K03854N7115
476F9570l1677J03293j72717o283J02158m2o7746o7928J73394j6245k12619N7287
$$ y = [-113755, -185610, -2677, -44345, -130389, -215998, -210307, -180768, -132500, -103413, -136366, 2637, -37415, -186927, -34142, -160141, -101497, 77816, 152421, 236942, 256991, 98131, -110243, 12315, -25268, 26169, 163399, 139500, -2318, 16265, -110233, -31289, -38902, -105127, 16670, -117796, 25787, 12346, 77173, 243079, 116884, -21556, -21437, 92448, 134364, -44782, 14543, 112131, 69074, 168717, 234115, 164613, -4039, -63863, -69415, -97745, 47699, -45889, -96215, 133349, 126643, -22514, -109819, 42787, 48662, 2480, -60303, 94393, -28012, -46936, 28959, 197896, 133580, 117845, 130809, -88752, -171108, -191399, 12455, 69570, 37893, 141186, -31531, -37814, 64344, 64302, -3444, -71372, 102022, 85777, -126842, -69555]
464f9555N9144j04142P1599o8706J58500p2570j8419j13925N1224j1145P5301
453d2694J33380Q1938k7489m87n1164o7233j44370P8863P3430j55353J56955K3268
441E9044P798J09433l7748j35038n8474j01978m4331R485j1053p9350P9180J30202
429g2830L2067M1778P7410j5838o3930O0459l7824o7345M7352k6192J1482m7391
417f0802J31080R322j807j73252O9435J32050k7517j07907k0607J624Q2354k06464
405a72491M9966J06326L4399l6922j26452N9330N7563R7910n1504q7339k34965
394c04179N4524L5014o376J20562K05808q0522j63852l6621J85189j00441L0540
383f0354l5293j75874J19699O7197Q2495L5611M6261K8561m3149r8949r067J19699
$$ y = [-69555, -10411, -114553, -42954, -111660, 46840, -25730, -44149, -158074, -106850, -117995, -42694, 90686, 172624, 145135, 144648, 93484, 26251, -118119, -39256, 34174, -121179, 35776, 59044, 66842, 176275, 138527, 3489, -54985, -156963, -201294, -191809, -202862, -282212, -203032, -72830, -40763, 1015, 78425, 62587, -1343, 59116, 21292, -46053, 1299, -24893, -13411, -60802, 70278, 79600, 77793, -95459, -26024, 106026, 78509, -29398, -50005, -48381, 33973, -172491, -122525, -16199, 18200, -18722, -145174, -85844, -28281, 69629, 18125, -69214, -304179, -249655, -214641, -221017, -100455, 105353, 24831, -139021, -175642, 9547, -90894, -60354, -95647, -271521, -151822, -84625, -2130, 33481, 79742, 108303, 65154, -33795, -42862, 76837]
371G6837j21467l0445R9825j36433R3969r335J2196K6452k2826L1893m7297J6706
359i925L1255O9547J45565q8420J0169M2443k03376j4114J8053n2587L4872k793
347a9311j17145M3368k1554q1225J01244j76759J9744J44012N0564j2408k25937
336b95407O5724J5275P9489J11032k8p3534N8095K8580q6691j11775K13370j7372
324a3242M1446m7232r1174J32399j16574N270L1960m979n4471O855q4990R7816
312i6916Q323K178M817j8530m2563J1051J16034O2509q40O7647j31347j26323
300a43960J299P6509J20569j31615J1835J36599M943j8744l480k4953n2382o0086
288h3466Q0749l6291p6644j2348J06300n5053J0598J28502k04694N7500R0964
$$ y = [76837, -44630, -75075, 24750, -111683, -17714, -27049, -14853, 11599, -11227, 20666, -26631, -9925, 21330, 90877, 236442, 148022, 158191, 200634, -2742, -16856, 1197, -51390, -16518, -19311, -136456, -93088, -114642, -195867, -94623, -271382, -251638, -107626, -57062, -69470, -295407, -229683, -214408, -134919, -23887, -23915, -97449, -39354, -10774, -97465, -209240, 4130, -13242, 28204, -19028, -110202, 22197, -94377, -89107, -57147, -62126, -116597, -109742, -194732, -96916, -88593, -86415, -81598, -100128, -142691, -131640, -15606, 46903, 46063, 113710, -17637, -143960, -142661, -66152, 54417, -77198, -65363, 71236, 76179, 57435, 53955, 29002, -23380, -83466, -2717, -39008, -115652, -128000, -21700, -76753, -66155, 62347, -142347, -84847, 6117]
277F117m6823m4343O9974J06629j02482m0616P254N9914R4216p5051Q916l8579
265E126l9565R416p7166J12644n1023j0390R1391M4950J2872q1387J8590r4023
253e8565M1599j758j6540j45767m5058J26387n7419O49J4270O6756O0282l3801
241d8965l1455q5229N4956K0243n9389R7281J51681q9484j57804P5635Q774m4203
229a07959M0064J54181p1952P6251J1861j41451M0607l3727L6127k0128j00821
218a16947J00250K8215M0480j03849J0254O7712k5546K5671o1867r7190P642l0818
206a55993M3495J6389J14594n0323K4864Q7040o0029j01999N4449j8570M6161
195G8K6244n1739r4298j5056r738O7015Q3636K029q0222q1900J66608N4890l9411
$$ y = [6117, -40706, -85049, -15075, 91554, -10928, -51544, -44290, 15624, 109840, 34789, 43705, 5126, -34439, -25023, -102189, 10455, -40568, -50958, 40433, 85383, 98255, 16868, 35458, -58565, -16966, -18724, -35264, -181031, -226089, -99702, -157121, -156472, -142202, -75446, -15164, -48965, -80420, -165649, -110693, -90450, -149839, -52558, 99123, 9639, -148165, -72530, -63756, -107959, -67895, 86286, 14334, 90585, 102446, -39005, 1602, -32125, 4002, -16126, -116947, -16697, 11518, 51998, -51851, -41597, 26115, 569, 26240, -35627, -132817, -125175, -155993, -112498, -96109, 18485, -31838, -6974, 80066, 20037, -81962, -27513, -46083, 78, 26322, -25417, -119715, -134771, -144509, -77494, 6142, 8171, -72051, -153951, 12657, 67547, 28136]
182B8136n3605m7120O4390o0838j06734m5065J606J79523n1887k7968N0902j5498
170h4158O7503K7065o9818m1817l7543L735j72784O8719k9149R6686Q2491O3873
158b5197q1007J56619Q9879o8726m7333M9241j68868N5212J13175k5894j9218
147B7883j5683n8661k6795J05555L9981l3093P7328K633Q280L2973o8631j88681
135i6911O0723j4994k2332Q7100l1128n5899J12013K9726j61732J28519j5562
124A9523j4623K5095J03657j63882q3878O4672J40572k33295K2592J31198L5929
113D7560o9946K9939O6277j91072j04307Q1046P9411R2057j6502j6878P6200L1358
$$ y = [28136, -25469, -72589, -8199, -69037, -175771, -220836, -219230, -39707, -91594, -119562, -68660, -84158, -16655, 10410, -59408, -101225, -138768, -135033, -307817, -239098, -268247, -171561, -89070, -25197, -106204, 50415, 140294, 71568, 24235, 73476, -95392, -40180, 72995, 47101, 27883, 12200, -46461, -73256, 32299, 72280, 39187, 116515, 119148, 127428, 160401, 91770, -96911, -36188, -51182, -73514, 13586, -17542, -73441, 38572, 68298, -93434, 35085, 19523, 4900, 29995, 133652, -30230, -114108, -49436, 91136, -142159, -119567, 11631, 47560, -22386, 7553, 73830, -117242, -221549, -140503, -61092, 30965, 14463, -2415, 73785, 105143]
$$ [...]
##END NTUPLES=NMR SPECTRUM
##END=
