##TITLE=1H_68-2024
 CDCl3
 8 sc, 
 3.9.2024
##JCAMPDX= 6.0         $$ Bruker NMR JCAMP-DX V2.0
##DATA TYPE= NMR FID
##DATA CLASS= NTUPLES
##ORIGIN= UXNMR, Bruker Analytische Messtechnik GmbH
##OWNER= root
$$ XWIN-NMR		Version 3.5
$$ Tue Sep  3 14:10:48 2024 Russian Standard Time (UT+4h)  she@DPX200
##.OBSERVE FREQUENCY= 200.1318
##.OBSERVE NUCLEUS= ^1H
##.DELAY= (6, 6)
##.ACQUISITION MODE= SIMULTANEOUS
##.ACQUISITION SCHEME= undefined
##.AVERAGES= 8
##.DIGITISER RES= 18
##SPECTROMETER/DATA SYSTEM= spect
##.PULSE SEQUENCE= zg30
##.SOLVENT NAME= DMSO
##.SHIFT REFERENCE= (INTERNAL, DMSO, 0, 15.7039)
##AUDIT TRAIL= $$ (NUMBER, WHEN, WHO, WHERE, WHAT)
$$ ##TITLE= Audit trail, XWIN-NMR		Version 3.5
$$ ##JCAMPDX= 5.01
$$ ##ORIGIN= Bruker BioSpin GmbH
$$ ##OWNER= she
$$ F:/spectra/data/she/nmr/H-F/1/audita.txt
$$ ##AUDIT TRAIL=  $$ (NUMBER, WHEN, WHO, WHERE, WHAT)
(   1,<2024-09-03 14:09:34.54 +0400>,<she>,<DPX200>,
      <created by zg, POWCHK disabled, PULCHK disabled
       configuration hash MD5:
       00 E9 B6 7A A2 85 ED C7 34 08 36 98 17 FE 4E 26
       data hash MD5: 16K
       A4 A6 7A 2E 16 82 B2 6C 92 9B 97 9C A4 75 7D C1>)
$$ ##END=
$$ 
$$ hash MD5
$$ 7C 8C 16 92 8D FE EC C7 C1 62 7D 1C C6 46 34 A9
##$RELAX= 
##$RELAX= 
##$RELAX= 
##$RELAX= 
##$RELAX= 
##$RELAX= 
$$ Bruker specific parameters
$$ --------------------------
##$DU= <F:/spectra>
##$EXPNO= 1
##$NAME= <H-F>
##$PROCNO= 1
##$TYPE= <nmr>
##$USER= <she>
##$AMP= (0..31)
100 100 100 100 100 100 100 100 100 100 100 100 100 100 100 100 100 100 
100 100 100 100 100 100 100 100 100 100 100 100 100 100 
##$AQSEQ= 0
##$AQ_mod= 1
##$AUNM= <au_zg>
##$AUTOPOS= <>
##$BF1= 200.13
##$BF2= 200.13
##$BF3= 200.13
##$BF4= 200.13
##$BF5= 200.13
##$BF6= 200.13
##$BF7= 200.13
##$BF8= 200.13
##$BYTORDA= 1
##$CFDGTYP= 0
##$CFRGTYP= 5
##$CHEMSTR= <none>
##$CNST= (0..31)
1 1 145 1 1 1 1 1 1 1 1 1 1 1 1 1 1 1 1 1 1 1 1 1 1 1 1 1 1 1 1 1 
##$CPDPRG= <>
##$CPDPRG1= <>
##$CPDPRG2= <>
##$CPDPRG3= <>
##$CPDPRG4= <mlev>
##$CPDPRG5= <mlev>
##$CPDPRG6= <mlev>
##$CPDPRG7= <mlev>
##$CPDPRG8= <mlev>
##$CPDPRGB= <>
##$CPDPRGT= <>
##$D= (0..31)
0 1.2 0 0 0 0 0 0 0 0.06 0 0.03 0 0 0 0 0.0002 0 0 0 0 0 0 0 0 0 0 0 0 
0 0 0 
##$DATE= 1725358173
##$DBL= (0..7)
120 120 120 120 120 120 120 120 
##$DBP= (0..7)
150 150 150 150 150 150 150 150 
##$DBP07= 0
##$DBPNAM0= <>
##$DBPNAM1= <>
##$DBPNAM2= <>
##$DBPNAM3= <>
##$DBPNAM4= <>
##$DBPNAM5= <>
##$DBPNAM6= <>
##$DBPNAM7= <>
##$DBPOAL= (0..7)
0.5 0.5 0.5 0.5 0.5 0.5 0.5 0.5 
##$DBPOFFS= (0..7)
0 0 0 0 0 0 0 0 
##$DE= 6
##$DECBNUC= <off>
##$DECIM= 24
##$DECNUC= <off>
##$DECSTAT= 4
##$DIGMOD= 1
##$DIGTYP= 9
##$DL= (0..7)
0 120 120 120 120 120 120 120 
##$DP= (0..7)
150 150 150 150 150 150 150 150 
##$DP07= 0
##$DPNAME0= <>
##$DPNAME1= <>
##$DPNAME2= <>
##$DPNAME3= <>
##$DPNAME4= <>
##$DPNAME5= <>
##$DPNAME6= <>
##$DPNAME7= <>
##$DPOAL= (0..7)
0.5 0.5 0.5 0.5 0.5 0.5 0.5 0.5 
##$DPOFFS= (0..7)
0 0 0 0 0 0 0 0 
##$DQDMODE= 0
##$DR= 18
##$DS= 0
##$DSLIST= <SSSSSSSSSSSSSSS>
##$DSPFIRM= 0
$$ [...]
##$SUBNAM2= <"">
##$SUBNAM3= <"">
##$SUBNAM4= <"">
##$SUBNAM5= <"">
##$SUBNAM6= <"">
##$SUBNAM7= <"">
##$SUBNAM8= <"">
##$SUBNAM9= <"">
##$SW= 24.0689170037331
##$SWIBOX= (0..15)
0 0 2 0 0 0 0 0 0 0 0 0 0 0 0 0 
##$SW_h= 4816.95568400771
##$TD= 16384
##$TD0= 1
##$TE= 0
##$TE2= 300
##$TE3= 300
##$TEG= 300
##$TL= (0..7)
0 120 120 120 120 120 120 120 
##$TP= (0..7)
150 150 150 150 150 150 150 150 
##$TP07= 0
##$TPNAME0= <>
##$TPNAME1= <>
##$TPNAME2= <>
##$TPNAME3= <>
##$TPNAME4= <>
##$TPNAME5= <>
##$TPNAME6= <>
##$TPNAME7= <>
##$TPOAL= (0..7)
0.5 0.5 0.5 0.5 0.5 0.5 0.5 0.5 
##$TPOFFS= (0..7)
0 0 0 0 0 0 0 0 
##$TUNHIN= 0
##$TUNHOUT= 0
##$TUNXOUT= 0
##$USERA1= <user>
##$USERA2= <user>
##$USERA3= <user>
##$USERA4= <user>
##$USERA5= <user>
##$V9= 5
##$VALIST= <valist>
##$VCLIST= <CCCCCCCCCCCCCCC>
##$VD= 0
##$VDLIST= <DDDDDDDDDDDDDDD>
##$VPLIST= <PPPPPPPPPPPPPPP>
##$VTLIST= <TTTTTTTTTTTTTTT>
##$WBST= 1024
##$WBSW= 4
##$XGAIN= (0..3)
0 0 0 0 
##$XL= 0
##$YL= 0
##$YMAX_a= 143667
##$YMIN_a= -112918
##$ZGOPTNS= <>
##$ZL1= 120
##$ZL2= 120
##$ZL3= 120
##$ZL4= 120
##$ABSF1= 10
##$ABSF2= 0
##$ABSG= 5
##$ABSL= 3
##$ALPHA= 0
##$AQORDER= 0
##$ASSFAC= 0
##$ASSFACI= 0
##$ASSFACX= 0
##$ASSWID= 0
##$AUNMP= <proc_1d>
##$AZFE= 0.1
##$AZFW= 0.1
##$BCFW= 1
##$BC_mod= 2
##$BYTORDP= 1
##$COROFFS= 0
##$CY= 11.3945322036743
##$DATMOD= 1
##$DC= 2
##$DFILT= <>
##$DTYPP= 0
##$F1P= 15.6554695791079
##$F2P= 12.8336369535428
##$FCOR= 0.5
##$FTSIZE= 0
##$FT_mod= 4
##$GAMMA= 1
##$GB= 0.15
##$INTBC= 1
##$INTSCL= 1
##$ISEN= 128
##$LB= 0.24
##$LEV0= 0
##$LPBIN= 0
##$MAXI= 10000
##$MC2= 0
##$MEAN= 0
##$ME_mod= 0
##$MI= 1.114404
##$NCOEF= 0
##$NC_proc= 0
##$NLEV= 6
##$NOISF1= 3.799351
##$NOISF2= 2.8
##$NSP= 1
##$NTH_PI= 0
##$NZP= 0
##$OFFSET= 15.70392
##$PC= 1
##$PHC0= -25996.05
##$PHC1= 17.58748
##$PH_mod= 1
##$PKNL= yes
##$PPARMOD= 0
##$PSCAL= 0
##$PSIGN= 0
##$REVERSE= no
##$SF= 200.130013532006
##$SI= 16384
##$SIGF1= 3
##$SIGF2= 2
##$SINO= 400
##$SIOLD= 16384
##$SREGLST= <1H.CDCl3>
##$SSB= 0
##$STSI= 0
##$STSR= 0
##$SW_p= 3612.71676300578
##$SYMM= 0
##$S_DEV= 0
##$TDeff= 0
##$TDoff= 0
##$TI= <>
##$TILT= no
##$TM1= 0
##$TM2= 0
##$TOPLEV= 0
##$USERP1= <user>
##$USERP2= <user>
##$USERP3= <user>
##$USERP4= <user>
##$USERP5= <user>
##$WDW= 1
##$XDIM= 8192
##$YMAX_p= 0
##$YMIN_p= 0
$$ End of Bruker specific parameters
$$ ---------------------------------
##NTUPLES= NMR FID
##VAR_NAME=  TIME,          FID/REAL,        FID/IMAG
##SYMBOL=    X,             R,               I
##VAR_TYPE=  INDEPENDENT,   DEPENDENT,       DEPENDENT
##VAR_FORM=  AFFN,          ASDF,            ASDF
##VAR_DIM=   8192,          8192,            8192
##UNITS=     SECONDS,       ARBITRARY UNITS, ARBITRARY UNITS
##FACTOR=    0.0002076,     1,               1
##FIRST=     0,             0,               0
##LAST=      1.7004516,     0,               0
##MIN=       0,             -112918,         0
##MAX=       1.7004516,     143667,          0
$$ Real data points
##PAGE= N=1
##DATA TABLE= (X++(R..R)), XYDATA
0 0 0 0 0 0 0 0 0 0 0 0 0 8 -8 8 -8 9 -16 16 -17 23 -25 31 -34 41 -48 55 -63 71 -79 90 -102 114 -129 145
34 145 -161 179 -201 223 -247 274 -303 336 -373 412 -456 506 -562 624 -698 778 -876 991 -1129
53 -1129 1302 -1523 1816 -2229 2864 -3980 6598 -29032 -5704 5617 55457 114819 90381 132953
67 132953 98670 63433 69249 2552 -10876 -20222 -82701 -54860 -72571 -85463 -31616 -47233
79 -47233 -17282 24473 298 48541 51633 32914 72611 36224 27806 39184 -18900 -8637 -26521
92 -26521 -66699 -36038 -65137 -63121 -22604 -44898 -1462 23519 10987 62498 48535 41956 67897
105 67897 20981 24921 18933 -29779 -8046 -32996 -49825 -15997 -44177 -21240 3646 -18546
117 -18546 23841 21571 10644 47114 15895 19684 32980 -10248 9254 -5662 -34990 -7109
129 -7109 -38217 -36093 -11310 -40711 -8160 -106 -14323 27902 11569 14058 40655 5722 22865
142 22865 22042 -10546 16725 -5364 -13890 13505 -16149 2036 12778 -14343 16001 7 -14294
155 -14294 10451 -22308 -13831 -2619 -30778 -515 -5056 -14444 20832 -687 9360 26406 -4535
168 -4535 16876 8256 -13543 11391 -13885 -13036 6389 -21235 2109 4349 -13506 16549 -1088
181 -1088 -2521 19079 -8861 8542 12424 -9605 18202 2797 -3870 17978 -10832 -819 3895
194 3895 -22964 36 -12897 -22291 3760 -17709 -3900 11477 -8934 17796 11894 -254 23559
207 23559 -1770 427 10460 -18078 345 -5064 -20347 6687 -9785 -4672 15633 -6019 14551
220 14551 15392 -2214 20993 1841 -3192 12148 -15627 -3629 -2351 -22791 1608 -10768 -13461
233 -13461 9917 -10101 4403 13012 -7040 15297 4374 -5264 13881 -9703 -2721 4959 -16776
246 -16776 4443 -1709 -10666 13460 -4296 2582 15103 -5834 11507 6421 -8258 12035 -6591
259 -6591 -5783 6922 -15133 1344 764 -13788 8421 -5911 -6374 10123 -10735 3574 6279 -9269
273 -9269 12065 871 -2801 14533 -5957 3716 7196 -12037 5709 -5588 -12797 5774 -12744
286 -12744 -2734 7078 -9110 12011 6881 -949 18067 -1417 2363 9732 -12784 1462 -4617
299 -4617 -16750 3295 -11286 -6544 8405 -8144 9577 9742 -2483 16647 1343 -951 10742
312 10742 -11217 -792 -714 -16180 2475 -7551 -8976 8205 -8592 3688 9493 -5783 12509
325 12509 3113 -2600 12866 -5482 1637 7322 -9780 6044 -581 -8947 7598 -9154 -4357
338 -4357 3780 -13400 2144 -1187 -9354 9212 -2930 1539 13013 -2813 10730 8141 -4531
351 -4531 10775 -4064 -5982 4106 -14170 -3119 -1682 -13640 5217 -3404 -3536 11652 -3901
364 -3901 5797 8757 -6311 8624 -1821 -7376 6612 -9616 -1629 4741 -8774 7748 2553
377 2553 -3344 12463 -2471 2018 8289 -8511 4516 -856 -10033 5622 -8350 -4578 5279 -10119
391 -10119 3153 2180 -7906 8142 -2945 -2487 8324 -6859 4343 5056 -6326 9725 -339
404 -339 -2143 9960 -6250 1937 3217 -10106 3730 -4662 -8541 4844 -8740 -746 5772 -5919
418 -5919 9157 4030 -835 12670 -1616 1623 6592 -8862 2359 -3041 -11048 3173 -8879
431 -8879 -4532 5215 -7672 5104 3961 -4150 9865 -1392 -1457 7731 -6932 2213 2753 -7566
445 -7566 7426 -1676 -2147 9156 -4916 3109 4957 -6964 5726 -2361 -6018 5650 -7068 -153
459 -153 4521 -7148 6342 863 -4303 7325 -6145 -2135 2689 -10529 1082 -1885 -7314 7085
473 7085 -2806 1850 10405 -1647 8803 6351 -2968 8286 -3785 -4874 3076 -11125 -1915 -1419
487 -1419 -10027 4653 -2753 -2105 8825 -3054 4694 6372 -4341 7190 -411 -4036 6081 -6277
501 -6277 -424 2782 -8568 3616 -1462 -5886 5408 -5798 -1110 4088 -7118 4317 1337 -3544
515 -3544 8794 -1069 2204 9013 -2994 5969 2673 -5232 5306 -5493 -5344 1848 -9612 -646
529 -646 -29 -6826 5648 -645 -774 8657 -3332 3644 4637 -6073 4605 -2990 -5729 3197 -7427
544 -7427 -875 2839 -6198 5679 1084 -2090 8347 -2624 1601 5343 -5845 4215 283 -5050
558 -5050 6178 -3725 -483 5536 -5413 3598 994 -6194 4040 -5454 -4450 2620 -7501 1651
572 1651 1833 -4365 7471 731 966 8615 -2859 3069 2674 -6649 2946 -4359 -6005 2880 -6737
587 -6737 -255 3815 -4203 6906 2602 -350 8707 -1761 1764 4539 -6393 2498 -1887 -6524
601 -6524 3383 -5767 -2145 3498 -5795 3118 1300 -4098 5603 -2438 -939 5400 -4672 3344 2575
616 2575 -3848 6125 -1331 -1539 4916 -5413 562 966 -6961 3194 -2603 -3456 5385 -3215 3174
631 3174 5553 -2450 6961 1257 -2316 4902 -5355 -2375 208 -9281 432 -2660 -5599 4801 -2409
646 -2409 1860 7184 -1630 6231 3819 -2668 5255 -4018 -3196 1938 -7605 -283 -123 -5220 4899
661 4899 -884 151 7248 -1914 4268 3791 -3809 3857 -2267 -4183 3029 -6316 -943 1051 -5918
676 -5918 3283 -802 -3112 5368 -2854 1041 4668 -3811 4718 1353 -2110 5679 -2743 -476 3010
691 3010 -6132 1130 -1219 -6324 2671 -4268 -2134 4073 -3889 4323 4304 -519 8257 1129 444 5782
707 5782 -4613 65 -819 -8440 -452 -5881 -6165 2143 -4997 1360 4676 -810 8085 4147 1485
722 1485 7617 -1812 661 1867 -7208 -228 -3378 -6599 1687 -4886 -1132 3891 -2859 4638 2913
737 2913 -1381 6159 -725 344 4301 -4309 1383 730 -5204 2858 -3100 -3454 2174 -5499 257 568
753 568 -4619 3927 -212 -466 6522 -985 4076 4817 -1622 4731 -843 -3551 1680 -6457 -3185 -583
769 -583 -7506 551 -1044 -2703 5655 17 3387 6758 -769 5221 2270 -2569 3412 -3769 -3480 779
785 779 -6848 -540 -1116 -4723 3633 -1371 -145 5070 -2186 3065 3309 -2671 4360 -902 -1669 3791
801 3791 -3568 364 1619 -4361 2611 -1356 -3388 3039 -4130 -674 1925 -4187 3219 873 -1231
816 -1231 5894 -645 1597 4409 -3126 2604 -372 -4627 1633 -4591 -3238 1479 -4804 2036 1880
831 1880 -2063 5342 524 972 5138 -2499 1810 1245 -4523 1929 -2895 -3130 2364 -4003 706 1970
847 1970 -3087 4098 485 -1479 4084 -2586 326 2020 -3752 2863 26 -2484 4173 -2000 -52
862 -52 2881 -3746 1983 -308 -4019 2346 -2896 -1546 2622 -3490 2602 2006 -1669 5001 -147 -488
878 -488 3576 -3450 692 567 -4776 1538 -2750 -2418 3332 -2860 1749 2957 -1723 4215 416 -1422
894 -1422 3429 -3327 -570 1085 -4491 1591 -562 -2387 3426 -2151 615 3266 -2954 2772 243
909 243 -2842 2688 -2522 -1222 2507 -3169 1951 1408 -2158 4407 -863 -314 2959 -3706 481 303
925 303 -4012 2172 -1444 -1633 3324 -1981 1808 2816 -2045 3424 -450 -2172 2405 -3721 -686 1128
941 1128 -4000 1992 -108 -1514 3923 -1343 1056 2931 -3009 1972 -134 -3376 2491 -2909 -1169
956 -1169 2190 -3259 2289 1211 -2241 3996 -585 -502 3008 -3255 997 549 -3736 1950 -1798 -1503
972 -1503 2922 -2345 1587 2168 -2071 3318 -330 -1829 2693 -3177 -183 1358 -3586 2316 -166
987 -166 -1604 3897 -1338 682 2687 -2979 2136 -301 -2843 2139 -2483 -843 2283 -2797 1797
1002 1797 1481 -2068 3634 -831 -286 2495 -3046 676 309 -3492 1959 -1324 -879 3007 -1978 1771
1018 1771 2191 -1879 3176 -420 -1830 2018 -3256 -563 888 -3490 1726 -176 -1283 3671 -1319
1033 -1319 1064 2643 -2752 1901 -470 -2774 1851 -2983 -857 1959 -2722 2016 1365 -1595 3313
1048 3313 -947 -548 2384 -3007 814 133 -3146 1942 -1430 -914 2978 -1837 1545 2050 -1987 2591
1064 2591 -770 -1643 2245 -2777 -146 1208 -2811 2320 -133 -911 3423 -1318 245 2065 -2922
1079 -2922 1346 -749 -2872 2040 -2626 -610 2112 -2411 2191 1037 -1098 3338 -998 -272 1969
1094 1969 -3185 707 217 -2829 1738 -1007 -768 2699 -1940 1657 1419 -2244 2203 -827 -1634 1753
1110 1753 -2759 -68 926 -2763 2149 119 -778 3126 -1448 983 2394 -2514 1650 -554 -2670
1125 -2670 2233 -2427 -652 2017 -2497 1937 1175 -1418 2852 -935 -444 2023 -2898 369 -170 -2736
1141 -2736 1814 -1065 -547 3133 -1626 1749 1884 -1679 2447 -723 -1646 1718 -2818 -36 1017 -2598
1157 -2598 2122 168 -1003 2999 -1192 749 1782 -2904 1585 -655 -1931 2050 -1682 76 2182
1172 2182 -1662 2181 866 -1645 2475 -1651 -1012 1316 -3086 312 -19 -2410 2395 -598 49 2786
1188 2786 -1066 1778 1795 -1920 2200 -936 -1685 1432 -2965 -138 519 -2165 2318 -123 -847 3507
1204 3507 -1001 877 1738 -2161 1426 -736 -2091 1791 -2017 -379 1331 -2517 2315 420 -1335
1219 -1335 2502 -1035 -304 1487 -2137 927 365 -2085 2260 -1241 -583 2411 -1534 959 1246 -1958
1235 -1958 1783 -1049 -1351 1507 -2467 516 993 -1880 2385 237 -721 2908 -1328 326 1031 -2786
1251 -2786 627 -1041 -2289 1453 -2015 75 2061 -1728 2337 853 -929 2693 -1340 -553 1210
1266 1210 -3012 681 83 -1865 1972 -1019 -170 2210 -1294 1540 1349 -1964 1235 -1113 -1479 1512
1282 1512 -2396 147 928 -1603 2243 -131 -940 2822 -1429 258 1319 -2621 1124 -806 -1394 1581
1298 1581 -1588 -275 1851 -1575 1734 300 -1201 2213 -1153 -303 1346 -2343 825 45 -1806
1313 -1806 1869 -820 -370 1931 -1440 943 820 -2126 1638 -921 -1354 1305 -1725 631 912 -1588
1329 -1588 2345 145 -717 2166 -1357 -29 520 -2620 890 -826 -1765 1687 -1433 524 2100 -997
1345 -997 2190 964 -1080 2159 -1338 -996 666 -2417 568 -110 -1610 1663 -663 -225 2055 -1254
1361 -1254 1177 1187 -1644 1589 -861 -1337 1346 -2416 146 501 -1499 1955 -39 -634 2054 -1295
1377 -1295 280 756 -1991 1098 -310 -1403 1622 -1495 314 1654 -1584 1671 564 -806 1555
1392 1555 -1497 -846 865 -2123 1152 195 -1241 1803 -491 -103 2385 -1408 893 584 -1873 966
1408 966 -1334 -1038 1163 -1763 653 939 -1526 1932 71 -529 2157 -1299 179 732 -2292 866
1424 866 -766 -1498 1552 -1411 578 1547 -1163 1743 0 -1024 1614 -1500 -547 1031 -2155 462
1440 462 106 -1313 1664 -632 136 1794 -1338 1170 973 -2006 1591 -1322 -880 1348 -1756 840
1456 840 1137 -1358 1781 -290 -661 1768 -1482 42 477 -1859 926 -619 -1177 1655 -776 513
1472 513 1459 -1187 1285 291 -1288 1439 -1447 -840 618 -2371 720 246 -1149 1684 -349 62
1488 62 1646 -976 959 540 -1687 1140 -1189 -1144 1214 -1617 775 1100 -1388 1895 -162 -534 1717
1505 1717 -1252 -78 478 -2047 765 -592 -1239 1679 -976 194 1464 -993 1337 525 -1056 1757
1521 1757 -1071 -471 834 -1866 900 177 -1197 1941 -672 -249 1626 -1468 800 464 -1318 1366
1537 1366 -1296 -1129 1300 -1376 475 725 -998 1845 -119 -666 1564 -1289 120 424 -1973 663
1553 663 -535 -1003 1468 -569 548 1376 -1374 1304 275 -1094 1656 -1170 -696 632 -1664 930
1569 930 236 -567 1763 -211 53 1818 -1259 625 234 -1416 1175 -1290 -921 1067 -1236 445
1585 445 421 -1010 1718 39 -337 1488 -1492 -101 337 -1619 1024 -408 -667 1449 -949 607
1601 607 1565 -1145 1480 -19 -1221 893 -1232 -328 792 -1713 815 175 -1036 1805 -273 114
1617 114 1131 -1455 606 352 -1588 705 -1013 -430 1337 -793 734 1108 -873 1684 -203 -443
1633 -443 1442 -1443 -81 -33 -1465 1119 -436 -834 1488 -734 406 1345 -1121 1085 99 -1179
1649 -1179 1138 -1010 -384 492 -1369 745 219 -992 1440 -575 -116 1256 -1366 533 -34 -1213
1665 -1213 957 -860 -463 1118 -1007 632 819 -1173 1330 -336 -677 1333 -1220 -133 51 -1550
1681 -1550 975 -490 -725 1551 -775 452 1160 -975 1557 -240 -953 1023 -1241 48 809 -1169
1697 -1169 602 207 -635 1659 -513 -163 1008 -1169 471 43 -1474 1349 -979 -721 1028 -1137
1713 -1137 954 668 -819 1488 -447 -395 880 -1479 -162 38 -1279 522 -297 -693 1342 -679
1729 -679 522 1024 -745 890 16 -795 1029 -1359 -165 452 -1347 893 26 -476 1623 -284 -70
1746 -70 894 -1265 741 -30 -1571 720 -738 -375 1224 -862 846 989 -880 1172 -472 -707 1088
1763 1088 -1288 -227 452 -1232 812 -53 -643 1594 -870 718 568 -1207 1070 -140 -969 757
1779 757 -867 124 681 -965 947 420 -414 1553 -361 122 924 -1228 309 -164 -1097 972 -634
1796 -634 -352 977 -749 1077 855 -564 1231 -320 -387 915 -1230 -329 179 -1280 812 -76 -374
1813 -374 1309 -470 543 790 -924 708 -203 -852 815 -1139 -47 536 -1130 797 87 -827 1134
1830 1134 -577 -2 776 -1277 479 -199 -1068 619 -648 -423 604 -421 923 714 -869 1294
1846 1294 -450 -576 933 -1076 -112 180 -931 905 -284 -177 1170 -598 443 579 -1026 998
1862 998 -359 -1171 628 -949 -221 572 -821 1007 442 -593 1347 -406 121 588 -1004 354 -183
1879 -183 -1203 628 -843 -265 848 -939 717 320 -702 801 -642 -585 937 -1133 40 353
1895 353 -1031 505 -196 -179 1085 -302 268 590 -1134 370 -167 -862 914 -825 -27 354 -902
1912 -902 913 214 -608 931 -686 -283 504 -1243 314 -351 -847 923 -533 -87 666 -464 841
1929 841 791 -789 920 -524 -887 678 -1230 89 291 -1234 890 -159 -165 1149 -366 460 649
1946 649 -899 531 -228 -673 612 -662 367 426 -869 835 270 -488 1182 -672 306 322 -1028
1963 -1028 389 -106 -629 658 -396 -176 1009 -571 661 333 -455 866 -670 -467 695 -1143
1979 -1143 -118 64 -793 915 46 -142 982 -569 294 383 -909 452 -764 -742 493 -865 -26
1996 -26 814 -812 823 463 -270 1164 -452 107 193 -1189 363 183 -1103 430 -728 65 683 -497
2014 -497 929 527 -844 834 -595 -546 402 -829 89 452 -609 916 -315 -80 1002 -450 170
2031 170 568 -862 364 -383 -519 779 -613 126 630 -536 761 232 -445 808 -713 126 259
2048 259 -1166 360 99 -886 752 -530 449 1166 -506 789 383 -318 603 -566 -730 266 -374 -72
2066 -72 178 -591 955 11 -18 895 -708 433 222 -739 192 -191 -866 546 -693 252 402 -659 607
2085 607 165 -513 761 -378 -187 490 -875 455 -209 -676 497 -178 70 992 -725 803 379 -676
2103 -676 877 -424 -74 484 -937 419 -159 -544 931 -68 157 854 -546 269 401 -884 350
2120 350 -186 -730 561 -762 286 482 -695 1033 311 -32 633 -395 -156 712 -830 665 -265
2137 -265 -869 791 -500 184 795 -544 566 172 -993 490 -474 -154 441 -902 108 263 -434
2154 -434 959 -344 -99 994 -274 171 -11 -632 533 -328 -573 473 -439 65 516 -640 632
2171 632 95 -399 481 -658 -12 505 -612 299 -119 -405 585 -491 90 697 -737 640 94 -364
2189 -364 643 -475 -295 488 -784 220 64 -362 781 505 76 483 -666 207 178 -869 496 -312
2207 -312 -239 487 -752 74 472 -615 729 -85 -553 609 -726 -134 342 -807 263 262 -255 244 -15
2226 -15 115 487 -344 574 -34 -744 491 -589 -131 483 -725 26 578 -381 922 105 -356 480 -403
2245 -403 168 101 -862 83 -510 -409 309 -460 128 509 -272 675 193 -656 413 -467 -224 16 -772 197
2265 197 -93 -337 389 -109 39 679 -443 691 -135 -532 575 -494 -339 236 -764 371 260 -357
2283 -357 548 -319 -370 765 -843 220 -16 -707 215 -231 -331 422 -676 219 548 -406 662 27 -347
2302 -347 771 -444 116 157 -877 487 -46 -264 622 -424 295 606 -454 395 3 -634 536 -418
2320 -418 -52 68 -622 333 380 -97 827 -478 -133 831 -527 -7 146 -753 155 260 -297 517 -718
2339 -718 291 478 -687 705 -227 -251 576 -923 -260 163 -533 455 -94 -403 871 -76 341 396 -405
2358 -405 187 -179 -288 484 -342 -405 532 -671 109 122 -329 599 -104 -118 323 -353 192 125 -629 441 -260
2379 -260 -3 593 -687 152 248 -584 699 -197 -403 392 -528 27 37 -656 438 353 -176 951 -15 77
2399 77 433 -636 314 70 -349 350 -340 -364 548 -586 650 219 91 787 -201 -269 440 -334 19 -102
2419 -102 -628 435 -358 -211 635 -467 317 614 -491 471 -40 -226 416 -392 -192 361 -534 315 -80
2438 -80 18 591 -282 132 387 -459 210 -33 -204 132 -237 -106 330 -354 264 348 -394 734 -268 -45
2458 -45 207 -500 74 -96 -595 558 -199 -399 618 -843 469 405 -267 387 -342 -195 386 -335 -1
2477 -1 270 -448 309 -133 -270 869 -138 235 509 -745 88 -171 -376 310 -407 -17 123 -398 263 408
2497 408 -252 525 -98 -31 521 -553 -22 -229 -520 246 -274 -132 464 -221 277 251 -184 818 -299 -300
2517 -300 209 -635 -298 92 -626 531 461 -309 477 -280 -45 222 -441 324 -129 -1051 444 -642 -338
2536 -338 304 -471 508 450 -363 494 56 -424 654 -401 80 7 -732 538 -200 -418 706 -477 191
2555 191 350 -733 170 -479 -437 243 -721 -99 199 -317 295 -35 5 352 -43 83 189 -426 252 20
2575 20 -546 114 -579 115 465 -465 225 353 -218 689 11 -210 303 -604 -81 -111 -404 446 73 -239 268
2596 268 -345 290 247 -471 253 -4 -382 141 -535 -145 113 -622 249 -74 -147 740 -235 93 571 -547
2616 -547 338 -401 -353 360 -288 417 505 -638 331 399 -150 434 -254 -254 492 -430 164 167 -390 392 -197 -219
2638 -219 420 -505 444 204 -126 458 -466 -230 159 -521 -157 183 -544 446 115 14 282 -153 164 331
2658 331 -429 -44 47 -354 220 -327 96 447 -237 408 10 -126 424 -589 -51 402 -374 -67 208 -321
2678 -321 339 -287 -144 496 -257 283 97 -350 282 -381 -184 104 -424 311 414 -420 302 -241 32 247
2698 247 51 360 -121 -568 462 -45 -498 235 -292 64 334 -246 174 17 243 753 -296 -210 384 -694
2718 -694 46 -269 -456 328 -30 28 243 -293 433 332 -125 370 -422 -176 423 -311 -186 153 54 326 -270
2739 -270 -168 495 -362 -109 181 -494 93 -122 -208 437 -503 162 557 -593 507 267 -192 628 -137 -322
2759 -322 255 -490 -272 -398 -594 106 -249 329 309 -364 92 -69 -281 369 -132 -159 439 -292 36 205 -475
2780 -475 403 15 -325 531 -51 -111 577 -527 487 -129 -344 407 -34 16 262 -287 320 279 -65 348
2800 348 -479 -16 170 -560 99 112 -357 361 -116 0 327 -275 263 118 -751 368 -329 -31 260 -201
2820 -201 9 244 -278 347 58 -460 164 -442 152 464 -306 164 -56 -195 285 -101 157 231 -639 475
2840 475 210 -614 778 -555 -200 494 -248 181 365 -381 665 -293 -332 126 -141 333 -18 -285 199
2859 199 -261 -225 560 -428 379 63 -259 495 140 -95 470 -418 251 221 -444 133 -256 -296 301 -400 -36
2880 -36 338 -150 195 294 -208 -48 -230 -41 96 -254 211 146 -311 401 -230 120 252 -246 293 142 -620
2901 -620 325 -424 -269 215 -399 -18 465 -296 250 152 -32 426 122 -215 248 -481 -188 -375 -413 193 10
2922 10 267 353 -605 357 -56 -690 284 -448 -33 474 -535 127 220 -450 521 -200 213 411 -619 157
2942 157 161 -551 417 -146 -206 70 -140 254 102 -89 341 114 -248 423 -220 -120 160 -198 132 -94 -304
2963 -304 331 -98 6 535 -161 443 369 -174 -53 -509 64 250 -171 -7 102 -323 284 -161 -244 789
2983 789 -601 50 240 -226 352 -87 -91 254 -570 16 473 -254 310 -377 -355 321 -438 -14 -173 -217 213
3004 213 -191 14 466 227 25 294 -100 117 119 -246 260 82 -42 505 165 42 186 -166 288 62 59
3025 59 264 -299 80 -62 -474 192 -206 -346 418 -350 -63 327 13 299 90 -264 268 -431 -123 -303
3045 -303 -484 153 -139 -386 740 -106 -222 484 -110 255 -7 -283 118 -268 -253 525 -161 276 399 -34
3065 -34 179 -50 7 246 -296 17 338 -249 274 -7 -17 262 -630 141 402 -564 535 -91 -392 112 -401
3086 -401 -186 169 -231 301 -304 -270 93 -273 1 363 -29 320 -28 -120 375 -263 99 477 -203 -75 54
3107 54 -295 588 12 -243 293 -298 -113 168 -584 36 -229 -476 119 -275 10 239 -206 385 -179 -75
3127 -75 415 -477 -295 151 -515 282 -153 -318 -23 233 200 333 -383 231 -168 -533 254 -253 179 220 -403
3148 -403 191 262 -171 583 -45 -6 355 -95 220 119 -496 403 -344 -279 504 -200 25 46 -377 123 -80
3169 -80 -306 234 -473 178 268 -276 207 -246 -351 53 -131 -40 376 -346 109 -429 -222 178 -590 -106 46
3190 46 -452 340 183 -53 325 -158 180 48 -137 489 64 -251 207 -236 -188 580 -325 189 80 -234 508
3211 508 -2 5 2 -93 -27 189 -296 -45 -223 -67 664 101 15 198 -458 361 332 -231 -21 -382 -197 397 -338
3234 -338 334 305 -144 421 166 -95 465 -355 190 177 23 195 -441 160 486 -242 317 219 -141 415 -20
3255 -20 -68 614 1 80 -31 -254 296 168 -244 163 -375 69 385 -379 190 -188 -406 435 -158 -314 -30
3276 -30 -347 343 83 -111 502 141 -110 106 -671 58 10 -301 122 -286 -293 -30 -224 136 227 -152 294 31
3298 31 -414 86 -286 40 3 -276 51 -240 -165 660 127 188 345 -261 129 -219 -570 242 -226 78 697
3319 697 -103 242 259 -391 335 190 -214 371 -356 62 129 -457 50 -79 -310 414 -248 210 145 -161 480
3340 480 -82 -419 356 -170 101 -70 -411 -57 -171 -81 568 130 278 100 -285 96 -372 -146 191 -20
3360 -20 75 167 -125 298 207 92 704 -263 -2 190 -311 165 146 -90 23 100 -172 408 -268 -28 -126 -117 202
3383 202 -230 -279 193 -311 100 193 -622 181 42 8 149 -373 -34 86 -91 114 -144 -210 226 5 -2 -3 -197
3406 -197 154 -2 -227 466 -129 0 464 123 287 -36 -413 136 -265 -277 99 -319 -69 210 -197 46
3426 46 -64 -310 538 -235 -408 -118 -195 188 -268 20 415 -297 -68 406 -82 246 123 -72 125 -123 215
3447 215 157 132 128 -35 -249 210 81 -13 149 -503 37 23 -521 338 117 -311 1 -146 200 176 2 277
3469 277 255 -249 236 -339 168 315 -231 671 -60 86 386 -22 -305 -199 -133 86 -200 -358 265 -156 -309
3490 -309 484 -237 218 118 -207 276 139 -138 92 -299 131 -375 -390 292 -258 181 302 -168 106 108 -348
3511 -348 116 61 -367 108 -189 -2 -40 -436 377 56 -134 43 -367 74 101 -219 263 19 -431 299 -33
3532 -33 38 246 -409 295 44 -125 377 -148 -230 123 -375 -74 -32 -153 197 -161 -205 181 -125 -88 94 -113
3554 -113 100 -224 -244 329 -395 29 252 -259 -26 -34 175 91 114 121 151 -77 261 5 -218 395 -138 262 163
3577 163 -201 337 47 -100 478 -89 -28 500 73 54 -62 -108 320 -95 -136 374 -358 254 217 47 63 -56
3599 -56 -163 445 17 -27 158 -17 19 -9 10 193 -232 -14 62 -346 102 -158 -140 333 55 -86 233 -92
3621 -92 173 288 -68 393 -182 -220 365 -117 296 -134 -133 430 6 13 -111 158 101 407 -315 87 -69 -90 250
3644 250 -281 144 243 -213 460 532 -78 -106 -285 186 2 -177 303 197 -385 159 99 -176 368 -200 187
3665 187 202 -28 261 32 -165 36 -146 79 -31 -121 70 -128 -167 409 20 231 415 -352 308 -311 -144
3686 -144 367 -105 24 38 -401 246 -227 -211 169 -291 -40 91 -73 76 -73 7 195 -180 209 291 75
3707 75 61 120 -81 168 -209 -84 396 -318 -308 193 -231 168 191 -46 412 -486 383 14 -197 39 -138 -154
3729 -154 204 33 -159 97 -223 210 91 260 253 -96 -84 164 -356 273 -94 135 464 -187 -139 512 -87
3750 -87 390 100 -193 -52 -302 149 -32 -258 172 42 11 522 68 -183 -201 -9 221 230 -166 -46 -15 103
3772 103 562 -183 -20 -86 -166 -79 125 92 258 21 -145 35 -291 -55 -25 -108 -223 148 304 371 -317 25
3794 25 30 -258 60 -162 -177 -120 -115 -195 172 -510 326 32 -34 41 67 288 23 -402 386 -78 103 141 -57 -79
3818 -79 -51 -221 -30 128 -159 566 121 328 70 -115 -174 96 -241 176 29 76 220 80 -75 -178 -438
3839 -438 271 -25 -442 97 -201 -244 -108 1 205 -38 -108 324 146 168 130 -74 177 -24 -175 148 -73
3860 -73 -110 101 11 207 299 92 94 -11 345 98 -347 139 -135 -177 157 -120 198 -2 -329 112 249 2
3882 2 -194 36 76 225 -165 174 359 -459 299 -26 86 171 -188 -252 20 -276 117 11 -553 -52 -91 174
3904 174 109 27 139 -364 -63 128 -488 243 47 -187 -165 -442 -58 179 -73 22 45 -154 269 -232 -366 76
3926 76 -327 -7 455 -95 -24 293 -196 235 189 -201 204 -456 225 146 -195 221 -140 -24 289 -102 -286
3947 -286 196 91 226 -67 92 181 118 -47 64 -42 -28 -284 -134 200 -283 190 216 -249 131 202 -75 246
3969 246 127 39 44 -180 31 405 -303 243 226 -9 260 -321 254 150 14 139 -72 -78 -77 -52 167 181 -116
3992 -116 201 -44 151 83 -407 60 -42 -283 156 -242 -176 123 150 -89 387 -19 -128 65 -29 2 -26 -2
4014 -2 12 10 128 117 -157 231 -71 120 24 -12 268 161 -70 172 -62 -14 245 -169 145 -11 -321 105 167
4037 167 -204 -5 -153 -82 15 -117 382 -109 -234 323 -383 175 312 -128 76 -205 29 177 -14 -45 24
4058 24 -427 96 41 292 247 93 379 184 -87 205 -214 -133 -53 240 -112 3 115 -44 305 -152 405 -251
4080 -251 25 161 20 -281 241 -221 124 -93 -75 204 101 65 -49 -53 199 193 -259 32 -142 23 143 -172
4102 -172 -117 145 172 47 -88 56 579 -107 21 45 -37 -12 72 190 -37 -179 -114 271 -142 -224 -13 6 66
4125 66 -214 -32 -325 -12 340 29 -230 155 -49 -50 217 -2 -190 196 41 -25 -54 139 178 -81 -72 -122 105
4148 105 37 -231 -119 222 64 -78 -139 -300 264 -199 -16 145 -153 -94 369 5 399 47 -84 -88 -53 7
4170 7 50 -189 206 86 124 48 -8 -91 75 21 -41 -428 -78 -124 139 25 -6 -265 302 53 -357 -113 -13 44
4194 44 -140 -422 -10 -427 -160 260 -225 -70 43 -155 43 -30 -234 351 -138 -69 11 -40 -81 73 -244 52
4216 52 221 108 262 -156 270 115 -169 -1 -91 -207 227 -281 -118 463 -181 241 22 81 -48 -70 174
4237 174 267 -13 60 -70 -193 12 -76 -95 26 -63 28 343 35 76 18 21 -151 174 -278 89 21 -82 2 185
4261 185 523 -473 -20 339 -5 48 -92 83 -330 -226 340 72 -318 -78 174 0 306 -221 -184 135 -276
4282 -276 -158 -94 300 40 -440 -185 -179 -248 88 -8 34 112 -58 -177 -56 -237 263 166 78 -128 -124 -134 -73 -70 7
4307 7 339 46 247 -103 -151 224 -179 7 122 168 36 -155 145 -134 -95 7 -86 -260 243 118 -240 -58
4329 -58 -118 41 203 -153 266 120 -164 226 50 125 -31 -175 197 -47 -87 -46 145 -368 -40 119 51 -23
4351 -23 -185 175 -222 -12 285 -247 328 58 -123 34 -37 -99 213 -32 -260 53 -112 -84 197 -90 3 52
4373 52 -173 110 -225 22 -37 119 270 -332 -406 53 102 93 32 105 110 144 -134 14 -253 18 84 -134 73 57
4397 57 -173 -90 -223 34 170 80 -190 -81 -216 -56 156 -33 234 -166 284 -99 -57 248 -158 -27 147
4418 147 -27 280 278 85 235 3 85 168 39 114 -24 -126 204 -389 212 278 154 -23 266 -231 31 -105
4440 -105 -128 -55 -64 36 -1 -250 69 143 -69 173 -101 -405 -238 -144 124 204 38 -28 -120 403 -51 175 -30
4463 -30 -100 -147 421 123 -286 69 -88 -30 117 -61 43 -178 43 207 43 -111 152 -195 -60 261 -219
4484 -219 417 50 -30 306 -87 204 -119 -25 -43 -89 54 141 -84 -12 -95 -44 163 76 -132 31 -156 -207 173
4507 173 -66 -233 -9 -175 177 125 -204 160 47 25 -336 -163 263 39 134 -132 50 194 197 9 -248 16
4529 16 -148 0 -139 207 74 22 39 -108 224 -82 -240 126 -74 -188 413 -103 16 -166 -10 191 152
4550 152 -200 -31 -30 22 -39 -44 207 38 82 -266 37 -4 182 -66 112 104 -52 199 -68 -12 79 -224 -187 -123 -197
4575 -197 -196 83 -66 -44 -235 -61 68 -242 -80 177 40 -96 89 -53 -44 -98 -20 189 -52 -228 167 -226
4597 -226 369 -570 -168 34 -25 -97 54 -162 -36 7 25 53 -239 197 24 109 219 111 178 56 -125 304
4619 304 -47 -9 -81 -121 -148 146 -168 17 99 74 -118 -85 20 66 -147 -155 -7 -63 -120 -46 -96 -426 -178 76 377
4644 377 80 16 -44 189 94 25 -191 52 -200 112 -350 -529 90 -252 153 314 404 -19 -109 -96 85 47 -108
4667 -108 -36 -133 182 -279 127 44 198 104 123 12 -39 246 -282 220 -128 179 69 -129 -249 224 47 165
4689 165 -15 8 135 -190 100 72 -97 101 -262 174 345 -31 -190 -225 -41 -209 -162 -158 154 51 -19 274
4711 274 77 208 462 45 65 43 252 -20 52 -139 194 113 183 73 -46 -74 -58 70 -95 -41 92 169 -97
4734 -97 135 -132 74 8 -71 300 -248 64 195 -454 34 -190 123 194 -246 -19 223 230 148 172 -180 13 -14
4757 -14 230 49 -105 164 -314 292 29 131 -247 90 50 -91 107 -22 -72 -20 118 64 159 -194 -284 231
4779 231 -179 -54 -145 220 298 -184 178 -112 -29 152 -41 -85 319 -263 48 23 -15 174 -223 55 213 74
4801 74 -144 142 -27 96 53 -33 54 -92 190 -32 -323 80 272 -3 160 -284 155 -39 45 92 -86 -80 -153
4824 -153 166 -87 262 -4 -19 30 76 -186 50 -90 -6 -23 195 -53 -205 235 -270 45 -35 290 -18 78
4846 78 -82 175 -101 209 -193 46 -55 -63 -279 258 -109 -280 45 135 -15 168 -143 139 9 -14 95 -312
4868 -312 -108 -191 -112 21 -86 12 343 -164 175 123 -11 284 243 145 73 -357 105 345 -122 208 -39 152
4890 152 -54 -10 175 -49 250 -36 37 237 -233 -149 169 121 419 74 -71 -53 -30 -54 -82 50 -310 37 -170
4913 -170 -154 6 2 -41 -31 10 99 -268 -15 165 -174 -87 213 8 82 -7 -157 289 -49 -130 297 -69 26 -40
4937 -40 139 373 -40 181 131 -84 -3 -35 -233 176 72 -51 146 -134 182 -18 -167 -140 57 -88 -179 49
4959 49 32 154 -291 206 136 -47 -131 134 -221 -178 -152 -127 -153 6 80 71 135 61 -143 -31 203 -353 2 -298
4983 -298 -236 65 103 -44 160 145 67 -86 68 68 -135 -120 -65 179 -114 215 -68 -80 256 -63 -400 -77 20
5006 20 48 114 189 275 -260 5 -17 121 230 -327 114 -3 -86 -79 24 -124 -16 206 1 -165 -194 -7 -34 68
5030 68 186 -130 140 206 485 -53 -141 283 -284 323 11 -77 -123 127 302 -25 -182 24 299 310 -204 -265
5052 -265 99 -119 261 19 37 -289 184 -82 -167 -353 9 -108 4 -184 -280 -188 -153 177 177 21 -180 39
5074 39 -348 -47 142 -183 -175 -46 154 46 115 -13 328 -52 -110 -437 42 -54 -172 -75 -275 138 57 96 -146
5097 -146 90 172 -452 126 181 198 93 49 84 -117 205 145 -212 -318 5 39 -107 308 133 -1 -239 -176 -21
5120 -21 -23 -87 -19 -45 -115 -31 159 1 116 146 -232 -57 126 59 46 155 115 -103 33 -274 76 224 308 -165
5144 -165 -70 -35 41 -162 24 -122 -22 306 -155 -146 144 1 144 92 -66 373 358 73 -112 -228 43 74 -159
5167 -159 -47 -43 -53 50 -18 -154 179 -54 -97 -129 179 97 -73 104 98 -64 192 177 143 -112 -246 -14 -100 99
5191 99 -190 54 -160 -172 -66 -213 -128 -233 107 -220 5 213 43 159 -61 48 110 -68 89 -136 337
5212 337 -108 301 -13 -172 -231 54 -128 -122 -401 -120 -88 13 -60 81 529 -123 136 -125 -184 -215 -142 84 492
5235 492 -5 -224 189 60 -125 200 -104 147 -424 346 14 -323 59 -223 184 129 -165 6 -380 0
5255 0 79 -85 98 -224 -90 22 -184 -236 73 69 -159 58 -297 -41 290 -107 181 111 -79 -4 -236 -28 457
5278 457 -94 22 -243 -16 318 25 239 177 157 321 158 -89 -221 163 -415 -104 -37 -95 161 146 110 339
5300 339 10 -333 -52 -101 75 -44 -232 -245 -59 -4 20 295 269 -47 -60 79 31 278 -43 -59 -241 -131 179
5323 179 -113 -177 48 -128 142 103 263 325 -11 19 -43 -66 -204 -91 -126 -37 64 68 13 -167 -223 293 151 -76
5347 -76 245 -94 -41 50 -42 -52 268 234 -56 -304 -68 287 -17 -35 -30 -59 -8 222 45 -347 -134 24 -211 -110
5371 -110 137 18 -188 47 -330 102 -48 -12 49 -232 -23 118 48 102 226 -39 -135 -204 -94 5 -161 -279
5393 -279 13 183 -199 124 174 -30 -22 209 -212 -102 195 110 116 28 -182 78 200 -7 -220 213 -83 -41 123
5416 123 70 291 -170 10 148 0 229 -132 211 -277 310 9 -201 192 -263 -244 246 -216 -76 -82 295
5437 295 33 -104 -216 0 -4 82 102 114 64 -42 51 -77 -49 -180 60 92 -2 137 -19 198 213 -30 52 -114
5461 -114 -154 40 0 -411 -140 93 -13 255 103 -94 46 -24 -62 -306 182 87 45 -374 155 37 -155 -227
5483 -227 -133 -69 -119 10 -141 -106 183 -3 227 167 138 130 86 343 98 304 94 313 -151 11 65 -123 -124 -25
5507 -25 -273 -73 -408 -253 -292 102 144 -266 150 -31 -8 -242 116 134 -32 -137 -137 237 -19 -267 196 118 -35
5530 -35 -130 136 129 -79 -418 -121 375 -8 170 -179 -77 45 -164 3 243 -216 -30 382 -4 -68 2 24
5552 24 -36 -40 96 68 138 -229 132 -110 131 -171 -4 -48 11 -124 34 -249 -154 -100 231 11 -119 -190 -63 28
5576 28 137 -79 69 -180 25 44 -108 498 24 79 90 86 60 181 39 64 137 -250 117 1 64 85 -167 -6
5600 -6 94 -48 -21 -63 338 -36 136 113 101 -170 98 -10 -132 -4 50 204 16 -26 175 -109 -162 123 107
5623 107 18 208 84 -136 -46 -14 146 57 -70 412 31 228 318 49 17 40 164 66 19 -54 155 107 -97 -105
5647 -105 -191 261 19 -351 86 -112 60 -124 -173 -267 -184 -105 -23 -21 196 260 -50 105 -205 436 155 -106 150
5670 150 -40 -74 -89 255 -221 329 -88 -44 36 310 -64 108 -98 -129 -240 -145 31 -88 82 -32 170 -180
5692 -180 76 -181 116 62 175 29 -19 -147 -203 -64 171 79 -99 -156 -62 -115 -6 -125 -21 -159 217 -228
5714 -228 53 -270 -3 -12 37 41 277 4 66 22 133 -11 137 120 60 198 -76 149 267 -170 170 -132 192
5737 192 -147 108 -95 -189 64 -250 189 -33 15 127 272 -98 83 -18 193 171 -419 -165 -8 27 139
5758 139 189 270 68 -221 -72 -48 147 25 146 -223 36 -158 -16 396 -29 -35 145 97 129 331 226 -14
5780 -14 -20 176 -56 -123 -198 6 -192 356 -153 218 54 78 14 -2 -65 -131 255 -215 -143 159 -345 150 210 -110
5804 -110 -118 133 113 -155 -70 -47 210 -123 96 -239 1 296 -239 221 -243 -99 -210 -36 193 -46 -26 6
5826 6 227 -368 279 180 16 278 86 -33 -37 -212 36 77 -108 219 -138 294 30 9 -181 -258 103 284 -371
5849 -371 13 169 -121 91 228 -156 -115 -75 -109 290 -18 -216 -164 76 -194 -118 11 -87 113 0 249 170
5871 170 63 -30 -81 -118 -91 -109 -23 -119 -74 -101 -3 -39 19 14 -157 -30 4 87 -37 -51 -95 -64 247 -134 -85 102 56
5898 56 -174 49 177 156 -227 111 16 -25 -36 1 214 -27 49 112 75 -179 -87 -26 -216 44 41 -73 -148 -349 407
5923 407 33 270 39 67 368 211 177 261 122 46 4 -220 145 178 143 -183 26 225 3 141 -114 -5
5945 -5 -185 -167 184 47 149 -345 -32 104 -159 195 19 50 75 -47 30 -163 -94 -1 -63 70 -41 154 -239
5968 -239 59 53 -128 123 -51 -20 -50 6 195 37 54 67 -46 -143 -27 -136 -35 -79 167 -5 -139 36 201
5991 201 -16 -128 -83 61 128 -251 7 105 -263 108 -144 202 -135 -243 13 -104 -81 -460 -141 -43 170 -182
6013 -182 208 109 87 -148 62 -76 105 126 72 137 -17 344 -44 215 -83 196 162 -143 -218 -170 -43 -215 -306
6036 -306 178 -127 196 -102 -166 -23 -382 74 64 -231 142 -205 -40 -176 132 19 141 363 210 88 -75
6057 -75 -123 -260 -97 -77 -33 214 166 -34 -9 -17 -45 67 -334 210 364 234 -68 103 -23 205 -89 116 -181
6080 -181 -266 -35 -142 181 171 37 -12 -3 1 -194 32 69 270 122 -86 36 38 206 -71 -143 239 -24 -124 214
6104 214 -234 -76 126 -293 -272 -2 -51 23 -115 75 4 166 320 -337 -27 150 -113 48 -47 -82 244 -86
6126 -86 -185 -35 279 255 -187 -131 170 -13 -245 234 52 45 -38 172 484 181 -104 155 -118 34 50 -1 -18
6149 -18 -222 74 145 -62 175 -344 -47 -192 -10 -69 181 -218 -395 218 -148 -130 -10 -42 198 24 99 -8
6171 -8 -292 52 24 -59 90 -181 119 54 321 54 214 -124 14 34 -210 -301 -148 -41 79 188 -101 394
6193 394 -72 40 39 -275 341 -428 15 217 304 175 320 158 71 -88 93 39 -88 115 -46 -145 56 62 162
6216 162 -49 -100 88 -337 -68 -121 -227 172 -163 -231 108 118 -51 64 -178 -12 77 -172 -238 -178 230 -69
6238 -69 -226 62 220 82 69 49 -287 73 71 140 189 11 28 -131 -42 105 163 291 178 -157 -57 318 31
6261 31 -172 16 -221 2 255 6 238 39 41 -83 -116 66 39 -282 -244 95 263 183 128 142 -68 -200 -162
6284 -162 26 72 -99 -40 43 -322 83 34 -147 182 -109 -181 -170 -63 -28 -102 126 5 -7 80 125 -313 -169 -48
6308 -48 -9 -25 -265 -46 66 -15 74 -52 396 363 -98 -53 136 -48 106 -103 -5 -168 226 277 59 -214 -35
6331 -35 -22 196 -27 -273 -126 -81 -111 -25 124 -30 -99 -16 187 -168 -28 268 107 -7 -384 -23 117 152 10
6354 10 125 191 -14 -45 248 -170 291 244 7 -85 -217 -120 137 -58 41 46 59 197 146 152 -355 -90 -172 84 -226
6379 -226 80 -42 -102 -161 -237 -251 429 4 126 -4 -325 185 -20 100 301 -21 -307 -34 10 81 -84 -378
6401 -378 -24 -70 156 60 -298 -66 33 152 -111 -61 -36 12 66 45 39 -196 -29 246 57 -126 -226 97 -193
6424 -193 135 147 156 186 104 28 25 -46 96 -130 -270 -34 -84 240 102 271 152 135 -17 200 76 157 -59 85
6448 85 -236 237 -52 -88 18 65 116 47 -94 -351 293 143 56 57 113 5 11 241 -97 102 34 4 141 229 -166
6473 -166 -101 -36 -27 140 -75 72 65 106 323 -64 -41 60 -106 -132 177 155 -244 287 -43 -31 3 -191 48 -201
6497 -201 -28 46 -179 310 175 -47 -12 -260 67 39 86 -511 44 58 -205 17 -156 8 202 2 -88 -104
6519 -104 194 168 -198 22 60 -149 133 76 200 -77 352 93 -81 35 -320 -228 -45 -183 -16 38 7 -12
6541 -12 341 13 188 153 191 -117 -56 143 -138 -375 63 238 109 245 196 228 192 -28 -236 143 293 201 -31
6564 -31 -275 6 -16 -103 34 -34 -195 -241 199 45 4 -252 -140 57 -484 -155 -103 7 149 314 212 177 69
6587 69 167 -200 -94 13 -58 -150 -193 -42 161 -17 80 75 -75 -64 -559 3 -59 -50 42 158 -169 3 19 128 107
6612 107 -102 32 -1 242 189 52 -8 -26 60 200 10 -229 -122 -112 -123 -31 56 358 -23 210 65 57 -76 -225
6636 -225 -21 -192 -13 -103 -150 -182 -215 217 -269 -63 53 148 147 -201 79 110 -61 112 98 5 252 -432 207
6659 207 -102 -275 -37 -150 147 -18 -43 113 92 -134 -14 -102 24 -177 -188 223 91 -220 -386 40 95 215
6681 215 65 -300 90 -318 50 118 106 -142 -9 -188 74 -15 223 267 221 -166 31 209 238 -117 -188 283
6703 283 19 -78 -303 -291 200 106 -22 -75 -108 -18 102 -109 242 -184 62 -88 -341 -79 152 137 46 151 -193
6726 -193 100 46 22 90 348 203 -29 141 130 284 26 -69 -378 25 -108 84 436 -34 -119 41 -28 -362
6748 -362 36 -37 22 29 39 96 -165 86 -25 7 18 -118 -279 -62 -122 -26 -224 -246 254 153 -144 246 -56 64
6772 64 73 -245 194 190 198 46 69 -118 -227 224 67 3 -37 118 16 146 -102 -123 -108 -33 1 -88 -40 -123 -117 -58 -134
6799 -134 -92 95 3 149 133 -45 -296 -18 -147 -41 9 70 176 366 187 90 166 -41 199 -213 146 259
6821 259 21 -392 49 -11 92 149 224 353 105 121 51 74 -49 -91 -60 -208 -97 85 -65 119 -52 57 -32
6844 -32 -76 -36 -91 -7 -99 -88 -105 -94 -113 76 -250 -177 -168 124 220 -357 150 -67 91 -23 155 147 3 228 100
6869 100 260 17 49 9 363 -153 -257 -314 109 -63 289 -408 32 85 -226 216 9 -258 303 -83 81
6890 81 -217 -97 -113 -19 -30 87 80 -175 44 22 -32 -7 -204 -50 -23 -25 275 243 198 -95 23 -251 10 -38 -231
6915 -231 17 32 -176 -207 149 -51 -293 30 80 261 -112 -420 -1 64 100 81 168 53 225 39 -63 152
6937 152 -87 94 -87 -3 144 -244 67 23 -65 -102 284 -23 -39 -52 -104 274 -250 116 129 -198 190 -202 -122
6960 -122 92 -85 -79 -34 99 -34 -115 -77 302 155 30 -106 51 125 -35 63 241 -219 73 77 255 56 137
6983 137 -313 202 -97 -28 98 -69 183 90 10 53 -150 -140 281 -326 77 39 -206 195 -41 50 233 1
7005 1 109 122 -14 -7 -24 99 -164 -241 1 287 -102 123 74 211 59 157 34 -70 108 183 133 262 90 88
7029 88 35 130 194 -84 18 -12 -162 -173 304 -37 46 -47 8 232 167 37 -139 -154 -214 282 -59 59 -112 2
7053 2 62 290 72 -108 82 3 130 194 -145 109 -62 260 -159 -177 94 111 56 98 46 -23 -33 -194 -188 -90 -153
7078 -153 -128 -171 -151 261 -111 69 4 97 197 -28 -204 145 -98 54 27 -304 99 -64 48 -257 357 -184
7100 -184 -119 63 -18 167 -121 316 -104 -61 -105 -44 233 -139 86 275 -89 16 20 -102 43 143 -257 -73
7122 -73 -44 79 -150 -216 -216 -91 34 33 -297 -168 -420 -31 142 -108 -134 179 -13 -11 -140 -144 303 318 -17 -308
7146 -308 -69 -120 -138 -307 112 13 38 114 35 -42 -239 -14 260 -152 -26 106 -18 83 318 197 -293 126
7168 126 58 -119 -67 -199 29 -50 -111 -70 -396 150 184 31 169 -167 -126 -1 -5 -41 11 -57 -23 74 118 18 -69
7193 -69 68 -18 -189 201 -127 -168 -10 -194 -115 -45 -2 271 -186 232 320 109 -391 178 82 -42 -73 -278 243
7216 243 -158 -95 40 3 -46 -4 8 52 49 -216 -291 -204 304 263 -314 -169 93 -62 -211 60 178 142 105 -39
7240 -39 102 -152 157 -33 250 175 -152 -81 562 253 293 159 -378 97 54 17 330 -261 24 -216 -82 272
7262 272 21 -120 -20 128 -121 208 24 256 -237 63 -33 67 46 93 31 -56 -86 -292 64 -91 48 -85
7284 -85 -9 158 -11 -43 -400 -26 -84 -58 -75 -239 79 219 -197 -155 213 -125 86 43 215 -22 -45 -127 -35 0
7308 0 -193 -13 -11 -51 200 -99 42 3 -60 120 175 -105 65 -224 109 221 -12 72 62 76 238 -134 -120 -202
7332 -202 -168 -36 -16 82 -370 -32 177 78 188 363 -72 -7 105 180 -10 -279 -247 226 26 -29 67 23 -27 -359
7356 -359 146 -121 71 53 73 -270 319 -10 226 372 -71 -105 120 106 -20 231 80 -211 -188 -80 105 -15
7378 -15 235 -147 1 196 -136 74 -62 123 253 136 -66 39 -4 -106 -85 -78 -15 97 40 -36 -17 -221 17
7401 17 162 -168 75 -208 132 237 -217 -128 142 100 10 -147 -27 46 -136 153 -57 41 249 30 -80 129
7423 129 -75 283 -141 -27 69 -68 -230 274 103 -130 -75 -7 280 -8 -50 189 -195 -63 175 -112 473
7444 473 174 -60 166 -77 109 172 -60 201 100 47 44 345 68 162 -264 -120 -229 -289 26 116 207 16 -39
7467 -39 -16 -37 -8 41 23 -133 317 153 25 -5 -164 -179 -1 -30 132 59 -227 -120 19 -27 6 -21 37 73 -9
7492 -9 244 -230 -116 -127 64 56 -106 -141 254 257 -85 33 -181 -184 71 82 -10 213 149 -203 -94 -134 -250 110 42
7517 42 -182 143 117 56 162 -107 130 82 -160 -191 91 67 -105 -166 -263 54 182 137 30 -66 17 -87 57 -43
7541 -43 -26 -51 -32 -187 0 88 -63 -8 -33 -8 151 17 52 73 -120 271 101 103 66 -222 -34 -303 -276 154 -50
7566 -50 -83 124 -32 71 -213 135 -48 -16 -9 193 -181 -349 -73 -8 45 67 -13 76 241 216 66 -221 78 -15
7590 -15 -124 61 174 -251 36 180 17 251 -66 -2 107 -152 12 39 -179 -86 -228 -47 211 -95 320
7611 320 -9 -7 289 -16 -104 125 44 27 126 -194 -65 -4 -35 -98 -240 -12 129 -42 122 -41 -138 -249 39
7634 39 225 -160 -51 420 429 248 155 124 128 -25 92 24 -68 82 31 -239 131 -73 -115 -206 40 199 -16 -2
7658 -2 90 57 -301 335 112 -4 167 -227 176 -374 34 28 -22 113 -152 86 58 -149 -125 217 -75 -52 -171
7681 -171 -145 108 173 164 48 77 60 57 140 115 -150 -68 -69 196 -347 156 -18 207 277 160 33 85 -6 98 -148
7706 -148 -120 18 34 376 218 31 -7 80 -50 138 -89 -235 47 -62 -106 -80 -26 85 -400 -257 59 -42
7728 -42 -87 2 218 91 -123 250 208 -156 -71 4 52 -35 -194 14 -1 -258 -198 -34 -343 154 -22 -203 -45
7751 -45 91 -48 28 423 -152 -335 -67 48 -100 124 187 11 442 -44 -49 -250 88 240 299 -270 92 -291
7773 -291 115 -25 68 -51 4 73 132 -14 15 138 -177 19 199 -74 -99 269 -231 -34 -181 -12 -17 -45 171
7796 171 0 -43 239 -34 -107 -178 329 46 213 -39 121 -181 -262 153 74 -55 -22 194 -139 -152 -65 240 -75
7819 -75 -114 45 30 95 -77 -88 -44 -351 202 202 -220 68 -2 -201 147 24 44 -48 55 -52 143 329 85 12
7843 12 -103 90 -26 153 169 -329 317 -205 1 67 228 135 151 -57 -72 3 100 103 200 -43 178 -158 166 283
7867 283 74 244 -324 -329 80 99 -23 -131 149 25 -7 204 -141 -114 -186 -154 -169 127 -220 75 52 -147 35
7890 35 -89 -86 8 59 0 154 -8 68 -173 -59 108 47 14 72 78 84 10 200 -145 -129 361 253 -267 -1 215
7915 215 -251 -220 -96 235 -17 30 70 -70 -157 -29 6 -211 134 109 -38 102 -24 123 -98 89 -148 -19
7937 -19 130 74 48 5 107 -120 -81 344 -8 -87 -179 -27 -82 -77 216 40 -80 -76 -52 71 -232 -122 111 -14
7961 -14 210 210 266 78 -29 -92 82 -228 -218 -166 -371 26 176 41 34 -261 96 -158 76 57 -161 150 15
7984 15 -80 151 256 -30 -57 -61 -26 -358 144 -88 57 53 0 79 65 -272 -137 130 104 313 -53 8 37 32 -26 146
8010 146 -6 94 -59 22 42 205 70 81 60 -19 145 260 -129 -198 1 -97 -104 -77 260 73 -51 -13 -107 26
8034 26 -43 64 211 161 99 -142 13 -119 -8 -503 -214 236 66 82 71 -40 -119 206 111 124 -70 -5 47 62
8058 62 -115 -116 -179 -77 -122 -65 118 -301 -123 -246 -254 84 5 -211 28 108 -230 15 -18 -12 -163 -146 -117 87 -96
8083 -96 487 -397 -58 -295 -384 149 51 239 50 331 428 -122 358 90 5 -167 -221 176 -222 199 -245 319
8105 319 340 142 167 162 -146 -156 -262 -220 234 86 -245 -9 -182 -43 -83 63 -26 114 -225 133 40 133 -68
8128 -68 -107 -295 -372 -170 -153 122 188 244 25 -54 -22 -199 74 -111 267 13 -270 145 -155 94 25 -84 385
8151 385 113 42 -311 90 38 229 -62 153 -159 -167 220 -73 -176 -38 323 14 -82 111 -119 -18 -49 105
8173 105 -113 208 -145 186 -150 -259 -14 -18 -239 177 -164 88 125 -187 104 45 32 72
8191G2
$$ Imaginary data points
##PAGE= N=2
##DATA TABLE= (X++(I..I)), XYDATA
0 0 0 0 0 0 0 0 0 0 8 -8 8 -8 16 -16 16 -24 25 -32 40 -48 56 -64 72 -83 96 -108 124 -140 162 -181 205
31 205 -229 257 -287 320 -360 399 -440 490 -543 600 -666 737 -814 904 -1001 1114 -1241 1386
49 1386 -1556 1758 -1998 2295 -2669 3158 -3830 4809 -6385 9335 -16802 75190 143667 88304
63 88304 127558 51206 42911 15949 -50949 -49984 -85636 -112918 -67221 -93963 -52096 -10908 -25809
76 -25809 31669 40186 30941 80518 44652 48327 58544 2878 16876 -4991 -47165 -19423 -59210
89 -59210 -61499 -33379 -64352 -23607 -5549 -14525 43970 34934 43160 78130 38660 53357 45819
102 45819 -3103 15008 -22350 -45612 -22628 -61503 -41246 -21794 -42641 4877 3629 2166
114 2166 44189 15999 29245 41720 1288 24650 4907 -22835 3126 -33439 -31223 -12806
126 -12806 -45977 -13745 -10954 -24123 19861 3501 13221 42741 11924 35808 33109 2960 29086
139 29086 -1223 -11750 8452 -28130 -9792 -3119 -27850 7678 -6487 -12011 16367 -15026
151 -15026 -2091 4975 -26095 2485 -10445 -19823 12874 -10788 4948 23406 -2607 25471
163 25471 16469 -2104 22648 -7787 -7247 6367 -24907 -1941 -4029 -19772 12785 -5448 -1178
176 -1178 20499 -7634 12356 11609 -10400 16400 -3102 -6671 14685 -13689 2097 5828 -18692
189 -18692 5943 -10345 -18376 4827 -20722 -6747 4738 -15786 13789 7216 -145 26543 2873
202 2873 9711 18778 -10182 8627 -2288 -18524 5028 -16645 -10420 7199 -14578 9523 9348
215 9348 -3726 22588 2912 2400 16933 -11605 2128 -713 -21589 1343 -15007 -16608 4657
228 4657 -16156 1438 9099 -8297 17759 6140 94 20094 -4579 3739 8880 -14813 5554
241 5554 -4945 -13151 9130 -10342 -450 11588 -8935 13065 6770 -5131 15158 -5582 -2934
254 -2934 7538 -15962 1008 -1941 -15648 7105 -8376 -5598 10255 -10395 5953 6223 -8580
267 -8580 12654 -1208 -2569 13845 -7495 5357 7859 -10052 9461 -3551 -9046 7625 -13177
280 -13177 -3137 2923 -13609 8015 889 -4396 16469 -1274 6335 13340 -7513 7859 -1303
293 -1303 -13489 4156 -14463 -9185 3044 -14321 4756 4534 -4719 16968 2160 3859 15054
306 15054 -6498 5256 1950 -13834 3436 -10336 -11105 4496 -12574 2078 6148 -7003 13744
319 13744 3298 -186 14865 -4441 3967 6982 -10224 6281 -3277 -9679 6712 -9818 -2796
332 -2796 4652 -11866 4344 -1367 -9105 9030 -6037 136 10445 -5900 9771 6961 -3034
345 -3034 13312 -1802 -1788 7087 -12171 -1068 -3122 -15029 2779 -8277 -6688 8171 -6444
358 -6444 6574 9219 -3967 12760 1697 -2678 9287 -8785 -784 2240 -11958 4894 -2042
371 -2042 -5828 10662 -4137 3291 9148 -7046 7143 77 -8085 6145 -9183 -4881 3558 -11724
385 -11724 3243 633 -7284 9467 -3114 -494 9748 -6438 5624 4218 -6398 9467 -2432
398 -2432 -2305 8847 -6981 2777 3533 -8955 6133 -4134 -6754 5076 -10005 -1071 2727 -8811
412 -8811 7306 898 -1926 12159 -1902 4229 8624 -6202 5543 -1502 -9055 3509 -9962
425 -9962 -5798 2128 -10786 3161 1624 -4118 10885 -326 1861 10047 -4691 4860 2588 -7281
439 -7281 6155 -4375 -3695 6748 -6712 3425 4425 -6340 7548 -1559 -4231 6443 -8417
452 -8417 -296 2266 -9135 5216 -1446 -4384 8178 -4721 1204 5046 -7988 4040 -1751 -7462
466 -7462 5685 -5653 -230 7448 -4246 8571 6115 -1062 11058 -1347 -815 5103 -9825 -469
480 -469 -2938 -11640 1850 -6468 -4525 6103 -5174 5088 6618 -2694 9581 697 -1552 7328
494 7328 -6266 38 1789 -8845 3264 -3122 -5903 5660 -5585 446 4250 -6412 5413
507 5413 731 -3714 7882 -2746 1942 7402 -4085 6164 2806 -3995 6795 -4315 -3045 2615
521 2615 -9994 -189 -2035 -8997 4000 -3754 -1456 7759 -3534 5730 5645 -3413 7524 -1010 -3238
536 -3238 4951 -7553 -733 987 -8166 4454 -1297 -2579 8205 -2539 3197 6319 -4591 5399
550 5399 -364 -4778 5363 -5748 -1568 3129 -6901 3611 263 -4935 6086 -4196 -1939 3839
564 3839 -7471 1660 -24 -6228 6004 -1667 421 8134 -2494 5287 4872 -3960 5412 -3083 -4863
579 -4863 2745 -8158 -1489 441 -6857 4644 180 -929 8645 -1446 3847 5513 -4351 4405
593 4405 -1318 -6102 2917 -7037 -3174 1467 -7390 2993 322 -3837 6706 -2046 734 5820 -4148
608 -4148 4282 1806 -4069 6377 -2412 -1174 5048 -4924 2237 1400 -6161 3959 -3008 -3639 3926
623 3926 -5314 1804 3227 -3675 6507 906 -729 6523 -3288 465 1541 -7894 1114 -3782 -6928
638 -6928 2741 -5232 30 5346 -2589 6869 4454 -327 7939 -1122 -621 3208 -6883 84 -2141
653 -2141 -7182 2904 -3726 -1474 5492 -2916 4683 4297 -2195 6683 -1256 -2334 3351 -6693 -661
668 -661 212 -7021 2697 -1934 -3015 5307 -3048 2502 4300 -3226 5220 601 -1971 5583 -3191 169
684 169 3129 -5271 2548 -946 -5211 3020 -4910 -2201 2899 -5476 3095 2430 -1846 7357 919 1627
700 1627 6574 -2974 2808 753 -6120 1165 -5643 -6255 452 -7322 -660 1633 -3357 6777 2903
715 2903 2032 9171 318 3710 4092 -4791 1924 -3219 -7013 261 -7273 -2865 1466 -4852 4089 2158
731 2158 -716 7293 145 1876 5181 -3565 2772 198 -5004 2690 -4122 -2870 2043 -5560 771
746 771 645 -4372 3965 -1384 -673 5389 -2250 3471 4221 -1985 5715 195 -1698 3700 -5068 -1646
762 -1646 -485 -7732 -35 -3279 -4773 3494 -2280 2068 5623 -343 6966 3652 -468 5823 -2374
777 -2374 -1300 901 -7017 -1175 -2807 -6254 2272 -3066 -829 4797 -1788 4424 3713 -1661 5727
792 5727 -639 -910 3879 -4086 363 982 -4484 2941 -2140 -2858 3011 -4027 -102 1772 -4242 3025
808 3025 -527 -1979 4932 -1815 1783 4394 -2385 3846 646 -3251 2772 -4178 -2483 963 -6211
823 -6211 824 -543 -3049 4613 -410 1276 5608 -1775 3160 2280 -3415 2846 -2828 -3296 1266 -5316
839 -5316 -245 586 -4050 3779 158 -372 5020 -1875 1462 2770 -3430 2645 -786 -2746 3435 -3080
855 -3080 137 2534 -3637 2828 -135 -2848 2946 -2920 -784 2161 -4102 2267 654 -2592 4523
870 4523 -584 553 4127 -2849 2187 740 -3886 2534 -3081 -2508 2051 -4114 856 1980 -2778
885 -2778 4472 522 -88 4538 -2282 1125 1525 -4298 1590 -1598 -3120 2143 -2457 427 2710 -2529
901 -2529 3495 903 -1839 3846 -2555 -592 1951 -4226 1431 115 -2791 3696 -1189 182 3803
916 3803 -2778 2033 536 -3358 2311 -2528 -1890 2590 -3459 1456 2104 -2314 3929 -123 -761 3617
932 3617 -2734 539 918 -4269 1600 -1646 -2804 2916 -2552 1049 3144 -2187 3308 692 -1887
947 -1887 2869 -2715 -1193 1656 -4122 1669 20 -2252 3747 -1218 476 3277 -2347 2094 546
962 546 -2970 2414 -2067 -1871 2233 -3441 1147 1580 -2206 3374 -455 -755 3240 -2714 560 1222
978 1222 -3559 1728 -1427 -2280 2558 -2191 1030 2920 -2514 2883 101 -1987 2896 -2842 -670
993 -670 1647 -3801 1517 -138 -2199 3331 -1135 353 3001 -2469 1852 405 -3321 2138 -2144
1008 -2144 -1788 2000 -2986 1812 1519 -2135 3802 51 -757 3186 -2583 296 489 -3918 1315 -1456
1024 -1456 -1876 2734 -1937 1207 2537 -2210 2982 113 -1834 2600 -2823 -884 1114 -3816 1420
1039 1420 32 -1946 3448 -588 376 3219 -2233 1625 413 -3014 2020 -2422 -1673 2040 -2806
1054 -2806 1462 2001 -1591 3195 -204 -524 2444 -2436 268 659 -3403 1674 -882 -1232 2988 -1608
1070 -1608 1011 2215 -2329 2359 -1 -2343 1940 -2482 -667 1323 -2937 1903 534 -1149 3339
1085 3339 -863 399 2826 -2454 1634 268 -2833 1828 -1859 -1202 2099 -2288 1427 1519 -1881 2915
1101 2915 -385 -801 2551 -2565 455 819 -2973 1650 -691 -1593 2850 -1566 1077 2244 -1777 2496
1117 2496 -224 -1907 1863 -2273 -737 935 -2839 1727 81 -1534 3218 -1191 490 2299 -2517
1132 -2517 1080 64 -2632 1785 -2187 -1143 1856 -2248 1766 1772 -1472 3310 -296 -348 2110 -2220
1148 -2220 311 52 -2998 1118 -1164 -1579 2905 -1589 923 2155 -1565 2242 -116 -1675 1912
1163 1912 -2362 -250 1100 -2476 1910 265 -1189 2511 -1419 82 1645 -2525 1013 -512 -2540
1178 -2540 1902 -1431 -354 2616 -1944 2221 1789 -772 2711 -394 -692 1960 -2791 -169 44 -2945
1194 -2945 1542 -1202 -1166 2526 -1330 1483 2141 -1495 2339 -180 -1550 2030 -2570 -54 1091 -2668
1210 -2668 1499 -18 -1152 2529 -1170 239 1932 -2003 1632 229 -2148 1737 -1509 -453 2072
1225 2072 -1869 1439 960 -1622 2257 -855 -1458 1476 -2367 129 188 -2588 1777 -266 -726 2675
1241 2675 -1056 903 1686 -2108 1631 -789 -2143 1372 -2610 -342 813 -2300 1702 488 -743
1256 -743 3016 -499 443 1923 -2211 1185 -49 -2391 1301 -1711 -772 1665 -1586 1778 1133 -1313
1272 -1313 2581 -653 -671 1796 -2522 207 215 -2327 1760 -653 -430 2599 -1276 1096 1750 -1760 1788
1289 1788 -429 -1566 1679 -2638 -375 1047 -2022 1778 493 -927 2485 -651 450 1643 -1694
1304 -1694 1115 -446 -2408 1577 -1497 -374 1836 -1647 1238 921 -1428 2136 -1048 -843 1656
1319 1656 -2278 530 596 -2073 1919 -379 -562 2171 -1263 459 1087 -2094 1285 -712 -1724 1492
1335 1492 -2179 22 1189 -1535 1780 417 -650 2438 -861 53 1255 -2424 601 -328 -2037
1350 -2037 1498 -1561 -271 1566 -1283 1485 1337 -1070 2123 -358 -864 1373 -2211 145 170 -2194
1366 -2194 1380 -990 -490 2652 -1151 1033 1279 -1991 1579 -698 -1374 1351 -1953 -22 1107 -1803
1382 -1803 1860 189 -906 2229 -966 395 1263 -2349 915 -232 -1666 1729 -1067 -51 2077
1397 2077 -1146 1480 957 -1568 1806 -880 -816 990 -2149 422 485 -1817 1335 -427 -97 2194
1413 2194 -1140 1018 1501 -1755 1562 -870 -1358 1221 -1869 -286 929 -1386 1791 360 -429 1891
1429 1891 -894 13 1228 -2357 726 -620 -1628 1461 -1393 -144 1688 -1353 1493 625 -1085
1444 -1085 2085 -1057 -421 1229 -2121 555 284 -1611 1389 -367 -247 2034 -1581 577 1047 -1641
1460 -1641 1252 -1034 -1145 1352 -1286 650 1234 -1335 1604 216 -583 1574 -951 -316 732 -2111
1476 -2111 842 -426 -1395 1416 -992 -200 1978 -1202 1155 764 -1326 1283 -1154 -661 873 -2069
1492 -2069 187 427 -1538 1975 -344 -212 1670 -1324 718 736 -1580 1196 -948 -1501 1190 -1666
1508 -1666 185 1001 -1727 1540 293 -426 2047 -1265 466 859 -1746 840 -122 -1517 1418 -1207
1524 -1207 -84 1728 -1345 1144 507 -1109 1534 -1033 -247 1036 -1685 491 619 -1255 1473 -302
1540 -302 -379 1653 -1341 946 728 -1488 1225 -875 -1263 933 -1468 331 1215 -1376 1553 360
1556 360 -627 1515 -1433 -148 747 -1723 662 -193 -1235 1564 -782 41 1637 -1024 1263 532
1572 532 -992 1338 -1154 -881 1014 -1832 93 445 -1304 1563 -235 -69 1752 -829 550 598
1588 598 -1363 1062 -557 -968 1001 -1257 773 851 -1362 1267 66 -883 1565 -1413 90 492
1604 492 -1812 806 -304 -954 1630 -844 340 1270 -1114 1062 814 -811 1136 -1045 -727 1157
1620 1157 -1500 409 395 -893 1678 8 83 1789 -1049 511 397 -1770 800 -1137 -1042 1121 -1294
1637 -1294 232 788 -1240 1580 236 -176 1353 -1146 -70 586 -1030 647 -117 -724 1108 -927
1653 -927 12 1355 -970 1239 173 -955 1151 -1127 -816 646 -1312 554 478 -915 1526 -561
1669 -561 -414 1253 -982 351 314 -1309 779 -553 -588 994 -1139 447 915 -1089 1415 288 -424
1686 -424 1252 -1144 -352 313 -1527 837 -311 -1138 1528 -630 166 1412 -804 1069 262 -746
1702 -746 1042 -1038 -358 961 -1232 552 510 -734 1424 -162 -84 1383 -978 313 429 -1168 859
1719 859 -778 -622 562 -923 383 652 -860 1553 -214 -607 935 -1103 243 683 -1272 554
1735 554 -43 -809 1531 -445 278 1178 -1463 772 140 -887 787 -782 -543 543 -1226 732 565
1752 565 -640 1185 -9 145 934 -1155 254 63 -1282 746 -672 -538 1162 -941 621 1007
1768 1007 -667 1417 -114 -624 1280 -1145 170 399 -1285 761 -20 -1020 1251 -776 525 964
1784 964 -1078 617 -98 -735 941 -1055 -479 746 -1175 639 176 -705 1144 -299 -172 988 -1042
1801 -1042 194 89 -1339 390 -413 -818 1116 -782 110 673 -630 1175 -427 -848 904 -1031
1817 -1031 -184 567 -1398 613 -82 -450 1510 -486 329 1077 -902 800 -143 -872 812 -721 -613
1834 -613 878 -952 514 425 -721 1330 -316 274 1276 -1471 384 34 -1416 756 -530 -545 657
1851 657 -815 463 884 -675 1218 -382 -855 750 -1073 78 392 -1326 464 254 -232 1228
1867 1228 -469 215 1061 -673 958 79 -754 831 -867 -573 777 -1166 314 573 -655 1103
1883 1103 -472 -114 750 -704 458 -283 -991 774 -574 -140 996 -929 669 639 -623 764 -206
1900 -206 -465 684 -1011 -199 522 -1155 1069 -119 -706 964 -422 -152 452 -1182 351 -281 -1113
1917 -1113 501 -866 17 769 -681 559 634 -504 1375 -389 -350 634 -1150 426 -312 -1406 909
1934 909 -199 -345 1053 -440 454 568 -355 946 -163 -521 766 -1225 -128 292 -1220 568 -301
1951 -301 -261 718 -508 358 600 -701 696 -215 -587 821 -1067 -49 571 -714 554 278 -566 1227
1969 1227 -37 -200 518 -1160 272 164 -906 949 -126 -377 932 -527 489 819 -676 984
1985 984 -478 -682 335 -1030 -89 286 -985 329 304 -288 1093 -404 316 770 -545 358 -246 -959
2003 -959 516 -974 -134 873 -449 585 148 -245 963 -355 76 663 -1060 429 -283 -1100 732
2020 732 -373 -352 1141 -496 415 493 -357 1139 -442 -578 572 -1039 386 498 -853 670 137
2037 137 -156 859 -331 213 627 -1122 341 -433 -648 724 -771 -178 474 -748 487 538 -191 905
2055 905 -420 94 731 -1219 117 -130 -1144 734 -571 -434 886 -536 622 329 -480 638 -319
2072 -319 -369 491 -869 60 483 -754 674 -34 -201 1151 -405 234 732 -833 439 -336 -397 511
2090 511 -715 219 343 -456 745 184 -173 757 -399 -71 349 -971 281 -260 -914 387 -347 -184
2108 -184 848 -704 296 680 -773 651 0 -408 443 -699 -90 371 -452 739 -75 -38 830 -503
2126 -503 179 335 -608 376 -199 -808 610 -712 -12 686 -822 698 465 -151 962 16 -508 631
2144 631 -939 204 115 -713 669 -161 147 735 -361 714 450 -748 363 -329 -363 304 -667 20
2162 20 -108 -544 634 -219 -187 852 -265 359 412 -907 355 -315 -545 387 -361 345 552 -397 441
2181 441 321 -351 771 -390 -417 364 -969 60 -81 -453 416 -97 -10 818 -329 664 226 -904 479
2200 479 -465 -358 541 -897 201 326 -632 676 -86 15 1114 -234 -32 265 -866 428 -112 -533
2218 -533 605 -605 -288 328 -658 370 548 -46 490 -572 -584 205 -1029 140 63 -782 699 -193
2236 -193 -48 579 -418 539 255 -754 518 -648 -461 169 -806 -197 490 -244 612 -399 -149 559 -398
2255 -398 -60 402 -762 226 -309 -421 651 -634 90 619 -623 474 288 -414 812 -544 -347 547
2273 547 -723 17 396 -596 540 26 179 630 -519 652 99 -866 582 -257 -355 324 -831 -77
2291 -77 606 -626 515 -64 41 540 -446 311 108 -527 278 112 -610 393 -512 54 816 -383 856
2310 856 402 -563 500 -356 -41 213 -808 317 99 -255 845 101 -109 597 -331 219 157 -728 290
2329 290 -344 -366 279 -633 175 -52 -148 730 -453 -457 727 -176 273 239 -668 388 -256 -608 704 -435
2349 -435 122 659 -558 481 -205 -440 726 -508 -294 185 -946 273 -93 -207 614 -388 -105 337
2367 337 -249 525 -114 -583 692 -671 -632 172 -525 315 121 -423 442 -87 -466 553 -157 -89 164 -708
2387 -708 315 -539 -101 723 -316 260 547 -425 740 235 -474 222 -336 -207 309 -658 513 -70 -413
2406 -413 658 266 155 870 -165 285 182 -857 -2 -373 -523 214 -582 20 32 -376 837 -96 -181
2425 -181 582 -468 393 306 -721 269 -237 -702 786 -377 398 241 -386 759 -218 -475 593 -480
2443 -480 -129 290 -712 286 190 -150 621 -169 252 305 -294 540 266 -574 579 -503 -242 194 -587 492
2463 492 403 -769 612 -34 -167 384 -675 -75 23 -586 256 -358 -590 476 -89 221 425 -267 553
2482 553 225 -280 302 -466 -41 48 -493 356 -114 -279 560 -259 -105 470 -660 -41 -221 -754 599 -453
2502 -453 -200 166 -656 467 449 -124 733 -236 -316 181 -439 176 112 -670 356 -496 -462 520 -261 3 333
2523 333 -589 459 -195 -366 373 -319 -355 70 -441 289 -91 -315 601 -51 11 96 -571 461 -63 -465
2543 -465 348 -542 -321 482 -443 192 223 -310 478 -359 -154 443 -388 -99 225 -393 499 -170 -493 577
2563 577 15 387 507 -365 93 -179 -453 345 -265 -83 5 -675 356 -259 -124 539 -181 189 322 -608
2583 -608 275 19 -511 473 -500 5 564 -463 290 81 -286 505 -86 -387 435 -575 92 32 -568 28
2603 28 -191 -167 499 -60 37 449 -530 330 63 -94 276 -389 -91 416 -487 354 224 -159 462 -345 -23
2624 -23 390 -674 51 130 -345 200 17 -89 53 -314 428 73 -412 793 -296 -75 605 -229 67 237
2644 237 -649 465 39 -378 518 -463 137 477 -365 250 -149 -119 414 -437 -58 96 -434 155 108 -221
2664 -221 310 -109 -67 289 -298 100 27 -210 381 -47 -214 319 -425 314 188 -456 527 -54 -292 221 -605
2685 -605 91 178 -492 211 -582 -62 683 54 -214 241 -588 152 114 -38 168 -387 -211 112 -412 385 -98
2706 -98 -149 534 -431 -152 388 -433 62 -197 -469 500 -353 -313 276 -270 192 354 -410 456 -345 -438 481
2727 481 -505 346 8 -737 434 -233 -180 700 -423 116 478 -172 439 -417 -714 483 -761 -16 477
2746 477 -529 265 69 -467 446 135 -27 760 -354 -12 -33 -732 21 -416 -248 491 -134 91 506 -204
2766 -204 360 43 -226 263 -389 245 73 -501 403 -13 171 359 -232 157 347 -205 187 -101 -386 366
2786 366 -375 -334 314 -325 230 171 -229 644 47 40 562 -177 478 158 -520 312 -418 -359 274 -260 409 591
2808 591 -391 495 -155 -114 231 -686 -201 246 -388 247 232 -90 631 -332 258 578 -324 356 52 -458 389
2829 389 -258 -219 261 -284 76 315 -461 571 -328 179 57 -760 83 -15 -500 170 -171 5 205 -471
2849 -471 320 101 -252 565 54 -212 89 -384 188 167 -479 459 151 -249 523 -252 199 323 -216 278
2869 278 -199 -497 485 -304 -42 361 -201 296 -217 49 547 -185 -347 475 -426 256 74 -231 346 -392
2889 -392 -123 296 33 196 288 -329 588 -403 58 147 -250 273 154 -402 364 70 -455 297 -46 5 -170
2910 -170 -271 446 -46 -247 173 -409 -138 591 -174 448 -29 -17 234 -168 -109 -142 -402 295 -81 -493 189
2931 189 -321 -9 532 -458 87 248 -259 678 -148 -291 207 -345 -186 41 -246 383 -58 -185 307 -455
2951 -455 293 144 -417 429 -277 -458 359 -484 -284 409 -392 446 30 -86 582 -182 54 15 -500 52
2971 52 32 -367 205 18 41 519 -398 306 130 -320 380 -113 -251 455 -441 -110 39 -318 461 106 -63
2992 -63 470 -114 25 513 -361 243 -318 -67 160 -548 116 378 -269 525 104 -273 453 -202 -148 47 -499
3013 -499 275 -94 -371 375 86 -93 467 -97 202 44 -478 153 -186 -125 -39 -490 -139 10 -439 29 -174
3034 -174 134 570 -285 86 -93 -296 155 -115 -465 171 -125 55 458 -244 100 -225 -145 443 -587 -191
3054 -191 129 -369 455 13 -256 674 -7 167 239 -67 387 111 -253 432 -305 12 123 -657 472 208
3074 208 -503 271 -27 -65 194 -415 30 -132 -296 242 -65 -140 94 -397 166 -104 -144 556 -397 -90 305
3095 305 -5 -70 505 -319 -87 -109 -357 212 -142 -174 240 -360 348 288 -431 174 -126 -102 267 -446 54 29
3117 29 -365 498 28 82 752 -180 66 115 -420 -34 -313 -208 322 -173 87 133 -310 541 -127 -435 130
3138 130 -258 -73 24 -480 62 -3 -218 389 -371 -211 41 -497 -62 96 -495 207 -397 99 700 -176 56
3159 56 140 -239 348 -99 -98 489 -499 304 153 -607 168 -54 -104 327 -487 14 226 -393 221 107 -139 185
3181 185 -359 -154 19 -617 203 -197 -759 254 -259 78 378 -479 234 266 -571 156 37 -245 149 -68
3201 -68 65 303 126 175 -136 -17 549 -205 -92 29 -519 93 -314 -387 11 -231 9 273 -304 119 13
3222 13 -401 343 -333 -148 -16 -567 8 100 -40 258 -409 -142 283 -267 146 206 -559 290 17 -114 337
3243 337 -158 207 11 -363 365 -98 -293 577 -260 132 114 -352 -71 -206 -414 310 121 -189 126 -221
3263 -221 380 17 -48 18 -210 -236 223 -385 214 -28 -368 194 -5 26 286 -471 398 12 -204 295 -2
3284 -2 -431 404 -456 130 420 -419 573 24 -103 299 -146 -56 166 -442 314 -309 -173 169 -278 198 123
3305 123 -212 94 -49 -257 94 -229 -246 183 -321 -7 244 -7 612 22 116 -12 -152 6 85 -35 248
3326 248 -47 73 113 -170 249 87 -158 116 43 -130 585 -497 -116 96 -299 363 -179 -319 -25 -645
3346 -645 2 403 -127 517 176 -273 447 -469 -294 21 -252 442 -281 -242 417 -124 -198 548 -273 402 -162
3367 -162 -9 228 -24 -248 318 -319 124 214 -45 268 -79 -339 250 104 13 207 -191 169 225 -136 143
3388 143 -192 27 214 -501 231 37 -19 202 -50 -375 -214 -134 541 224 -423 319 19 71 247 -88 93
3409 93 -43 -158 217 -294 -164 321 -174 16 205 -314 178 -402 15 367 -536 97 -145 -360 206 -388
3429 -388 -210 492 -34 268 -115 -49 268 -78 -94 150 -336 190 283 -236 458 -206 -34 532 -147 -23 122
3450 122 -155 34 -171 -43 188 192 -48 383 -230 259 336 -187 314 -200 -197 -24 -152 -56 332 -347 -215 -150
3472 -150 -107 112 10 -39 285 -60 236 -235 -280 66 -102 73 207 -351 277 -48 -86 430 -206 -141 366 43
3494 43 22 56 -21 127 -305 -216 222 -102 436 175 -200 364 -261 -263 -13 -425 103 -194 -393 275 -69 -276
3516 -276 114 -28 53 124 -329 105 -73 -205 416 -101 -152 69 -344 216 409 -71 248 50 -58 125 -189
3537 -189 9 93 -650 164 -105 -213 371 -139 208 138 185 125 -57 -40 63 -186 82 -94 -316 142 -282 -122
3559 -122 284 -377 72 276 -78 215 -188 4 345 87 126 -252 -358 626 220 -81 385 -224 -118 254
3579 254 -35 -66 58 -507 278 98 15 -47 -125 292 -43 -66 181 -71 62 249 -102 -77 -225 -342 25 -94
3601 -94 -152 457 -156 251 115 -178 421 -141 -27 253 -156 110 161 -383 372 -60 -34 289 -122 212 391
3622 391 -250 -122 -86 -495 -6 -98 -199 315 -131 148 241 -14 354 -329 -245 192 -146 272 397 -171 297
3643 297 23 -69 130 -343 -71 -13 -172 -55 18 40 207 -64 -51 -4 -422 -29 188 -197 770 -133 95 113
3665 113 -227 -123 -130 148 281 -89 -110 156 -266 407 -184 -163 331 -74 112 513 -55 110 156 -212 -125 -12
3687 -12 -154 113 80 -126 87 -328 335 125 -144 123 -261 -41 -62 -298 75 -87 -342 347 -454 198 59
3708 59 -44 26 -42 -268 156 -122 -245 451 -13 258 287 142 112 81 -149 170 -140 271 224 -197 140 -180
3730 -180 165 235 73 132 198 -131 119 -255 -174 322 118 0 202 32 230 -45 -14 20 30 -210 59 -465
3752 -465 19 144 -233 105 -366 0 61 -270 153 -79 -173 172 -150 -181 -122 20 -157 -113 8 411 37 91
3774 91 -51 154 -135 140 -510 401 -333 -41 443 -73 400 359 2 -135 267 211 466 -297 51 357 -374
3795 -374 -151 -80 -132 67 -107 -92 44 -86 -7 20 -38 251 82 75 127 -461 -72 409 70 138 -279 -41 52 -168
3819 -168 96 -2 -286 141 -37 -31 210 -197 -141 347 -220 357 -32 34 -75 87 0 270 -272 252 -42 -204
3841 -204 111 -162 -254 62 -146 140 -28 -206 -88 -132 122 185 -64 -57 13 1 427 161 -85 145 -49 61
3863 61 -15 -184 -33 -146 248 141 -232 43 -19 -89 -1 75 -105 585 -241 -174 135 -89 13 140 -354 -130
3885 -130 -65 231 101 -99 225 291 384 259 -178 -233 62 -212 175 1 9 -3 -391 -151 219 -219 -198 16 -91
3908 -91 213 -183 -120 -93 -62 -170 143 -122 415 46 -359 245 38 177 -61 -190 24 -187 -191 207 4 -123
3930 -123 44 -261 -214 -12 -77 298 52 49 22 -129 124 -112 -270 280 328 -15 65 -72 6 -12 -80 155 -268
3953 -268 -244 169 -243 96 -60 -6 495 -243 -205 238 -49 88 276 -236 437 -229 -275 84 -74 69 106 109
3975 109 161 222 -25 51 -94 -143 254 3 -400 214 -221 306 -141 211 477 -199 -112 159 -50 44 189 118
3997 118 330 87 165 -15 70 283 253 8 348 -290 144 -35 -80 243 137 -238 148 135 -291 186 16 155
4019 155 86 -370 145 -386 -33 200 -388 479 111 -100 245 -91 -31 156 54 31 86 -186 70 65 -164 135
4041 135 -218 -53 187 -411 230 216 -124 -185 -362 94 50 -30 -89 1 -477 245 -171 -51 24 -217 -61 170
4063 170 -232 204 -183 -65 -134 -29 73 -138 -5 -239 231 612 43 -359 113 19 -178 42 -24 -5 171
4084 171 -175 -129 196 -127 346 81 130 168 -292 -377 -152 216 -165 -11 -75 178 -101 3 201 -83 206 121
4106 121 17 -19 -172 24 159 -166 -179 130 -337 249 -10 -106 347 -2 -306 -222 -174 -20 -31 -207 116 151
4128 151 -191 187 80 -186 19 202 279 60 -18 220 -205 -32 -33 -107 265 67 -151 83 104 -65 -14 -261
4150 -261 -35 127 83 -3 -105 342 -4 9 -145 -10 98 52 -110 72 -180 -169 264 107 56 6 -167 220
4172 220 78 -21 278 53 -282 374 -214 77 -96 177 -45 -148 -78 120 -160 40 31 -11 215 -46 -2 -70
4194 -70 -97 62 -124 -126 143 90 -32 318 -171 -149 -119 -32 -96 -100 -53 32 -168 -103 447 -419 -61 95 38 132 57 -80
4220 -80 102 -259 -123 124 -154 240 -85 -64 104 132 -238 -159 129 240 54 49 348 71 -118 324 -44 -39 -65
4243 -65 127 446 388 13 342 -100 -159 -54 -204 225 190 -75 237 -111 124 140 169 431 -60 -103 -120 365 -116
4266 -116 -311 -93 456 0 30 101 -248 54 139 -286 209 73 63 -92 -175 -155 -48 -115 129 150 -333 100 146
4289 146 -10 196 -199 27 -45 -498 -194 120 -130 -59 160 135 99 77 -274 -44 -171 -34 -97 155 185 69
4311 69 34 -84 -176 -10 83 91 -91 -147 191 -71 -220 33 -252 -200 295 101 155 -322 -81 119 242 42 -86
4334 -86 17 332 -88 -514 -59 -34 162 277 -78 -16 -237 -11 96 -392 170 -69 -192 75 3 -385 -11
4355 -11 -155 -213 43 -142 -107 187 -8 -26 64 54 66 -231 -85 -71 68 51 -106 -121 -6 143 84 19 12 -138 279
4380 279 -146 -195 -227 42 -111 301 360 -54 -312 167 -232 -115 264 -10 -298 -363 -101 -37 -132 -122 -2 -115
4402 -115 -115 97 -252 -268 406 -397 95 -381 144 -125 -141 150 105 -170 269 31 134 47 -191 79 77 -72 -120
4425 -120 17 102 147 174 -127 25 -64 4 9 -336 26 -248 -108 139 58 100 -197 -151 -49 -215 49 -93 129
4448 129 129 -244 -26 175 -179 -99 9 80 -254 115 152 -168 -220 52 183 -112 321 -33 -87 -28 203 -259 -18
4471 -18 28 28 20 8 258 -329 25 -171 -64 84 66 -289 312 147 -74 -39 -30 -27 149 -87 -309 -181 -112 -10 -431
4496 -431 133 -232 -196 -52 -52 53 210 112 -94 214 -107 29 317 74 159 192 -99 82 -206 -102 101 238
4518 238 -71 -253 -167 -354 -236 -34 49 63 31 -3 149 336 104 313 -268 114 162 142 -199 -322 -89 -95 437
4541 437 -146 55 142 -47 -23 197 96 115 -88 17 232 47 -107 203 64 -60 93 126 132 -176 35 -189
4563 -189 135 36 -46 49 172 2 372 -243 -124 -219 -380 -484 -62 97 -113 113 -260 115 342 -331 -19
4584 -19 -77 3 387 313 64 144 -154 260 9 13 32 -78 -235 -100 -49 -12 -149 8 -89 -282 -218 -108 -181 -5
4608 -5 -10 211 54 143 99 -98 -120 392 14 -4 -269 -380 306 -38 72 423 -33 -433 310 -144 156 268 -96
4631 -96 165 24 -16 -27 -231 -210 -72 -205 92 -217 -14 416 -294 157 21 -65 215 -168 -96 77 27 -184
4653 -184 81 67 119 223 146 82 270 -72 -183 -32 -230 116 25 -166 -107 35 131 -160 106 -276 385 1
4675 1 -280 -168 87 -164 34 72 -211 228 -234 80 50 -143 47 -214 -158 265 -69 -329 139 -62 -193 327
4697 327 -79 -68 31 -202 69 -374 -197 -12 159 145 33 -24 76 -177 154 67 -172 80 289 -141 17 45
4719 45 -123 379 -404 -82 -138 -178 9 225 -79 119 52 -33 226 53 8 -233 88 222 169 -102 198 -145
4741 -145 172 25 -27 -47 5 60 -6 -16 -126 -308 -59 -43 -239 174 76 -204 234 94 30 -132 -77 -103 55 -8
4765 -8 -259 178 -176 245 28 -142 221 -19 -207 29 -96 -26 131 -198 10 -137 -58 34 -292 -20 -100 161
4787 161 84 -68 -169 178 -261 196 -176 -158 19 213 125 71 -149 182 98 -60 -15 -8 32 -63 -97 362 122 -11
4811 -11 122 314 -226 -35 79 48 -25 -180 114 132 -145 116 -205 288 -265 -143 230 159 -70 198 87 -219
4833 -219 -200 -227 134 -184 -41 -108 -141 33 -158 -539 -198 -132 366 31 -57 482 212 219 -48 -66 134 -59 263
4856 263 -27 -75 -156 47 73 -67 94 -20 -84 205 -105 -20 -238 -171 127 -93 -14 169 74 -76 214 224 -20
4879 -20 -94 240 -405 101 33 40 70 256 26 62 85 80 160 -76 -207 -222 -292 -25 -222 -105 256 8 26 -196 103
4904 103 -76 236 -114 20 145 211 412 -253 54 125 74 -78 -465 -66 -208 465 60 253 125 -196 179
4925 179 84 61 -202 -208 -105 -240 -51 -145 -126 162 81 -277 31 -20 113 -225 -96 84 -50 -97 59 315 163
4948 163 34 -196 -13 155 -162 45 46 41 219 169 -84 -148 -103 25 72 -148 -23 8 -49 -35 -97 -107 108 -81
4972 -81 -305 229 -146 -48 -194 -32 -234 86 29 25 -186 -49 63 -154 202 -74 160 -167 12 97 261 30
4994 30 -88 -44 -206 195 -8 75 119 -117 142 -8 -80 206 89 122 -55 -112 228 -111 -147 -24 -186 28 -74
5017 -74 -459 32 -9 -85 -90 -57 4 -176 -44 -72 118 162 168 -181 -250 -209 3 346 -26 -17 242 72 15 300 -23
5042 -23 223 162 -325 113 -6 -135 94 -99 -33 45 -225 41 26 187 36 8 -231 -35 196 82 -39 -11
5064 -11 37 -210 -155 40 -52 6 -315 95 67 -71 -61 -164 12 -200 -269 30 117 36 -137 109 189 87 -42 117
5088 117 163 -23 -274 -22 -87 -176 -122 -171 136 203 99 5 -64 -22 297 155 101 46 -105 -131 1 -70 39 20 46
5113 46 151 234 -40 -11 -101 -69 158 -239 197 68 -81 -68 -168 -257 -233 -52 -83 25 37 195 -272 183 130 242
5137 242 -186 113 330 -69 101 111 -78 -144 -93 -102 170 73 -53 -122 20 159 -60 102 -23 -131 -83 -104 -198
5160 -198 -140 14 316 105 -59 -112 -143 0 195 109 -105 136 -180 -23 147 70 -144 -38 -145 200 -95 -199
5182 -199 -218 47 41 -165 201 86 283 -54 36 142 -63 120 309 225 126 -62 -220 136 194 -91 10 -146
5204 -146 132 330 -119 -325 101 6 -187 -86 272 202 374 182 111 -56 15 -283 -80 -97 -253 -120 -7 -147
5226 -147 69 4 199 -144 102 147 34 -176 237 -5 -92 -200 -20 -415 -423 86 122 68 65 126 160 174 -223 -8
5250 -8 1 371 -2 402 -28 -28 100 57 65 233 94 -17 363 280 -154 -118 -116 -222 70 15 34 55 -170 419 -26
5275 -26 20 442 -14 -248 -135 -24 18 -26 136 -240 -39 -232 141 -190 241 142 245 164 90 93 128 181 -65 -24
5299 -24 -259 -207 -72 250 -139 17 -29 275 75 294 177 -86 50 -34 38 17 4 -33 290 -211 9 -22 -62
5322 -62 267 207 199 238 -59 -214 -247 -51 -129 116 -258 -100 -423 91 79 158 -21 -205 -174 113 26 47 153 42
5346 42 57 -45 -315 23 -91 64 362 119 -57 -67 108 -132 40 35 225 -110 28 77 264 14 -230 -155
5368 -155 -96 -39 12 -32 -53 174 352 -147 -106 -106 -176 -214 -12 -29 -180 -256 31 -232 281 26 162 23 12 -190
5392 -190 266 -121 -138 -113 -115 144 -66 -187 35 23 72 -4 114 -15 -26 -87 -111 35 148 -212 -38 113 15 -114
5416 -114 363 61 44 271 68 -201 288 60 -208 -174 102 147 -235 74 -130 39 143 -114 -49 228 -50
5437 -50 122 166 -128 322 -115 100 -54 -101 108 -282 127 212 -118 -210 180 -239 12 -189 36 254 213 218 81
5460 81 68 -466 -100 -287 -97 -110 -35 83 210 -12 94 -51 -102 31 -51 -90 -136 -181 12 210 19 -172 -305
5483 -305 -215 -167 -14 289 274 -138 -52 -36 -294 54 70 102 -330 -235 252 337 -3 69 -58 263 27 81 45 -157
5507 -157 140 243 9 76 -139 -63 297 67 240 -49 42 -131 53 -279 -245 -71 40 145 -26 -115 105 1
5529 1 41 83 -190 -109 -231 181 -119 22 309 42 -120 238 188 -127 11 -34 161 60 124 -161 -193 -195 -193 117
5553 117 145 148 131 36 -306 -248 157 126 -1 -59 -59 14 89 211 61 105 85 -185 -81 -532 128 274 337 -177 -11
5578 -11 -109 118 105 184 66 -185 94 -77 -407 24 -52 5 -71 307 11 -156 -30 81 135 123 132 -1 -259 200
5602 200 153 11 -119 99 197 187 -62 40 199 332 -28 -185 69 -138 -174 -301 115 78 17 77 -37 16 -121
5625 -121 151 -159 -148 -195 -79 -138 -268 -39 -106 -37 45 168 -155 -231 -177 318 43 96 54 -7 -27 -146 86 94 60
5650 60 23 -126 -52 -73 -173 -46 -166 51 130 -58 -162 -150 -56 -256 15 202 120 239 -34 45 172 -123 -250
5673 -250 59 -135 142 -2 103 66 -98 23 -362 180 77 193 18 -31 163 -17 16 -200 -294 177 29
5694 29 201 -95 150 -39 155 94 -15 235 -142 -231 -43 47 -17 14 64 115 68 89 159 217 41 -337 -168 206
5718 206 -48 -163 -1 -18 124 153 21 185 290 -247 173 -281 75 242 -354 389 47 -232 29 73 -95
5739 -95 -219 152 167 -16 94 -11 380 99 -197 -140 -166 -127 -171 -103 -44 -60 108 359 74 5 -180 130 47 47
5763 47 58 44 -164 80 202 250 147 217 -167 -115 143 -125 -1 8 319 -106 0 -161 -232 217 162 198 16 -86
5787 -86 173 145 307 124 -199 -44 -12 -91 25 -291 29 72 -17 -37 259 -122 -202 -264 14 122 -39 129 -159
5810 -159 -97 -281 18 -10 36 -53 142 -206 -216 -73 88 41 95 -114 -243 -12 -29 -119 24 -243 -78 -56 27 203
5834 203 -1 -44 72 -133 82 -122 99 215 -40 179 165 -34 -140 4 -77 -58 -47 -33 -201 -16 162 259
5856 259 -125 32 2 -19 5 -31 252 27 -38 371 159 -2 330 -124 -117 -322 -147 171 34 22 -73 -219 -25
5879 -25 -53 -319 -39 334 234 -77 -105 -217 325 209 -191 -34 45 -25 -67 89 121 -156 -392 308 -331 -86
5901 -86 424 15 94 145 -26 385 -34 219 -303 100 295 -59 -108 -65 -55 -233 -141 55 34 239 -159 137 5
5924 5 -28 -52 -71 114 -202 -197 -68 -171 215 20 523 157 29 195 2 184 -73 263 -9 -45 -82 -155 -144 211
5948 211 -78 -87 -140 294 18 -339 442 86 21 -98 -224 -34 -7 138 -192 60 71 -237 22 140 141 -107 251
5971 251 -414 -32 101 -15 207 -56 -96 -208 -229 308 251 257 232 -142 -19 199 -158 -134 86 -29 243 -61
5993 -61 -184 111 -106 202 7 -30 -91 -205 -290 212 -180 -35 399 -167 -138 186 -95 -78 154 81 40 185 -75
6016 -75 -178 1 27 -271 187 -1 27 -88 198 -56 -1 -13 58 170 87 209 252 -33 83 127 -192 14 118
6039 118 100 39 192 239 -360 -67 90 -8 -143 215 94 84 -13 100 84 -90 58 81 30 -115 72 65 172 195
6063 195 48 109 -214 -205 37 -123 1 61 -33 68 -123 27 59 285 36 -205 182 92 -81 -165 -131 -303 -206
6086 -206 58 -96 52 -46 -34 70 159 -232 132 23 30 -19 -85 350 11 293 -152 83 213 -114 84 -489
6108 -489 6 -137 89 -134 205 240 164 191 207 -119 146 -258 -142 -28 69 -175 -41 -21 30 126 -40 498 -186
6131 -186 352 114 -192 87 -137 -266 -178 -310 -232 34 -75 356 10 58 -95 -447 290 192 -130 -159 -154 186
6153 186 -223 -87 200 -186 -221 73 -104 -179 -12 120 -201 232 93 -24 -116 -269 210 -83 154 148 -165 -43
6175 -43 216 177 238 -8 -80 101 -84 106 -233 -4 11 66 102 176 -167 -126 -291 -106 53 -257 -96 -126 111
6198 111 123 64 -66 -95 61 -13 77 18 -9 233 -86 -37 -364 177 38 179 110 -61 -249 95 -124 -293 -136
6221 -136 -418 -316 -261 18 -299 165 -56 259 -18 -17 -3 -250 31 5 74 152 48 -111 111 -193 -113 -331 32
6244 32 222 -40 -65 137 -137 96 345 46 -185 117 -145 -12 10 -257 177 -29 124 57 -51 78 -122
6265 -122 109 116 -49 66 42 -110 -25 142 -182 -58 -15 -61 -166 -16 34 208 102 380 -63 -201 -62 -28 -15
6288 -15 -39 -224 146 31 -63 -9 6 154 188 89 109 -24 133 443 197 74 220 44 42 -286 59 222 23
6311 23 -238 88 -42 -85 293 95 300 -347 89 -8 -20 74 20 11 -92 46 69 -317 117 -17 -186 192 111
6334 111 253 133 252 -116 -99 155 42 44 -73 40 132 -358 129 -20 91 -16 150 246 -94 -8 240 130
6356 130 -36 -63 8 45 -87 76 142 121 43 -111 327 238 72 304 26 -288 26 -162 139 -41 -36 13 -73 174
6380 174 71 -49 322 -210 141 19 -20 151 -96 -7 -80 -169 -51 -109 91 111 -167 105 -355 -343 77 -228
6402 -228 -129 39 -101 179 -299 -28 185 -135 -104 225 226 144 271 66 121 77 330 -68 111 12 -338 31 -217
6425 -217 -108 -327 -85 133 113 241 -136 80 -267 116 163 231 -58 180 214 -28 -110 -27 -111 -6 -78 2 267
6448 267 227 54 -97 9 -292 -48 54 -129 65 204 -119 -270 -78 2 24 -234 391 172 70 31 118 66
6470 66 107 79 -29 -494 -65 235 307 -48 -150 -98 -54 -161 -157 182 6 -48 131 159 17 144 -27 150 -94
6493 -94 11 46 19 -68 -123 46 -314 -71 218 31 -1 49 -29 -27 -153 -92 -50 212 161 -184 98 24 -119 -137 -52
6518 -52 -42 35 138 24 2 -43 127 -49 219 166 6 21 92 314 -235 -216 79 152 -8 -59 -51 -62 226 90 -149
6543 -149 -126 80 167 -286 1 -96 -38 -159 65 -54 -116 -75 -228 366 -81 56 -283 105 26 -273 -146 64
6565 64 -47 -82 -28 123 42 -16 -67 63 -9 -197 17 -34 133 261 -207 408 -69 -342 144 -260 -34 -94 209
6588 209 128 143 -174 -64 11 185 181 -286 169 -108 312 227 125 -201 150 -153 108 21 -415 -176 11 -227
6610 -227 -79 -146 -257 94 -69 91 -78 4 361 15 -12 271 -185 347 104 -120 142 117 -30 71 -319
6631 -319 -181 -139 68 -63 273 251 -128 33 -12 107 -203 48 -277 75 -155 -252 46 -101 98 -171 -345
6652 -345 -120 211 -256 -20 -17 -74 -25 -379 47 105 -278 315 263 -8 18 -72 -156 97 -55 98 8 54 -161 169
6676 169 25 154 -6 24 141 147 334 -306 18 100 53 101 36 -113 224 282 -2 179 209 175 3 -18 -223 -230
6700 -230 -115 109 166 -43 55 7 481 -80 -71 -82 20 -11 -17 257 -34 127 -63 336 153 -105 -260 98 -20
6723 -20 64 -9 10 78 -53 108 10 187 6 -39 17 52 63 65 54 -114 -146 97 206 -104 46 -33 -196 -66 82
6748 82 35 -152 78 90 15 -184 183 137 -82 157 -165 -295 284 259 178 198 109 22 154 -212 -35 199 -57
6771 -57 78 139 -19 77 6 107 161 -66 44 150 -54 -18 -23 -90 -125 208 -163 86 147 -144 106 -139 139 154
6795 154 254 -320 -74 -56 62 -110 163 -106 -65 -180 -111 243 -141 -100 132 -110 10 -47 92 41 7 127
6817 127 243 -64 -102 191 -296 178 34 -75 -58 90 336 103 -212 120 263 88 379 26 10 118 -133
6838 -133 -71 160 -126 102 -232 -408 194 -9 195 -337 158 370 48 222 -49 110 176 172 -155 -74 71 317
6860 317 92 -201 65 -96 -148 59 48 96 203 152 -263 79 96 -34 -56 -416 -93 78 -164 -40 133 94
6882 94 -117 -42 360 208 82 -165 325 -193 194 -58 178 131 -42 235 130 287 117 -261 74 -272 -425
6903 -425 122 -45 126 95 70 153 121 136 184 -144 52 -197 39 -2 -38 -43 71 -69 -20 393 77 156 57 -28 -41
6928 -41 27 -15 -59 -22 95 -50 -202 211 -5 235 460 -1 72 230 -71 104 -7 -142 172 30 78 -339
6950 -339 -61 81 46 -148 253 -80 -14 -254 -185 -78 45 236 -10 24 -85 184 76 413 -220 214 -85
6971 -85 -49 8 57 54 -44 -97 255 7 -213 68 -47 -78 -382 108 49 -40 273 -82 1 160 1 -104 121 70
6995 70 166 -156 -143 -118 155 90 41 90 99 -136 -31 314 333 -9 244 216 226 -212 -113 -234 301 -102 86 -130
7019 -130 -54 -100 -56 166 -208 37 105 -112 -60 -3 174 -36 -151 12 38 262 -242 -33 -32 109 -153 -179 -114 -152
7043 -152 194 -421 -61 -70 67 62 200 -141 137 15 24 196 25 92 101 238 282 -161 78 -190 57 77 -68 -9
7067 -9 109 -72 -116 126 -89 -27 -9 96 -52 -45 87 -170 -386 108 -56 28 306 -65 -334 150 142 -32 -69 -566
7091 -566 -361 214 -347 -68 -181 62 -344 123 322 112 341 -252 163 43 -183 -70 -128 167 -10 -133
7111 -133 -138 241 -98 -267 -66 -36 -4 -219 285 -467 28 -114 135 -266 155 -132 34 77 24 433 -79 -92
7133 -92 270 -29 -168 -200 45 -309 -170 -30 -16 -142 -66 -116 168 199 181 18 -112 215 -45 0 -149 -205 58
7156 58 76 176 -150 361 -131 -5 -145 -177 -241 -63 -82 -272 140 119 -32 248 -219 -196 60 -57 46 -65
7178 -65 89 119 -194 -186 113 37 90 200 -130 101 266 20 10 -222 16 -49 146 64 114 -94 160 -28 -91 -173
7202 -173 -124 185 300 130 117 -55 297 76 -316 -250 -229 9 94 -55 -162 -214 -151 -35 -266 -189 78 -176 -265
7225 -265 9 265 319 -3 -17 -299 29 -169 49 -9 137 -260 125 28 -66 -64 122 145 -95 -97 -228 -48 -79 -90
7249 -90 -114 205 -97 122 -192 23 -238 -59 277 53 -216 28 -288 -230 236 -319 30 59 -9 -61 -22 141
7271 141 -29 -223 15 52 62 233 -23 92 133 -170 -105 -22 28 -77 -17 15 194 -95 285 182 65 196 -108
7294 -108 -279 27 -26 -89 249 158 -20 -7 -87 17 -110 46 96 -185 190 -34 -191 17 33 80 85 -244 310
7317 310 229 130 -43 -147 -287 179 4 -88 -294 122 23 -299 -93 276 80 -148 34 -71 -63 -121 -7 -140
7339 -140 89 -8 -132 267 151 188 2 34 -85 85 -45 -379 -94 159 -248 -90 -204 -317 33 -187 451
7360 451 -38 -96 226 -44 30 -162 113 -36 57 153 -37 -87 -278 -19 62 58 178 80 105 57 248 215 -91 -156
7384 -156 382 47 -7 -96 -22 240 101 253 12 46 -287 89 87 -227 -3 -136 7 -159 -1 202 -44 -182
7406 -182 115 283 50 -13 35 239 -473 108 -39 -181 5 76 -28 392 -45 260 -149 -180 55 -66 -77 -165
7428 -165 9 121 30 12 98 137 83 105 -171 -265 -327 -74 2 59 113 -46 268 -27 281 -235 -89 -252 -94 209
7452 209 -110 138 140 -43 469 279 -171 13 3 -170 235 61 408 -80 4 89 12 303 -64 -62 -197 80 131
7475 131 102 316 299 20 -2 -206 -237 174 70 -338 26 242 -47 2 -24 -287 -47 215 284 -80 149 -206
7497 -206 93 -14 302 -144 123 -140 -46 -313 19 -123 17 252 -251 -20 -54 55 130 69 26 141 -208 -106
7519 -106 -70 406 -177 109 -152 150 19 105 135 -112 35 62 -147 188 46 222 60 76 -254 -10 436 -283
7541 -283 150 -22 7 347 128 34 205 30 117 -114 -80 -360 36 235 128 -7 -199 -21 39 157 158 232 207
7564 207 -61 -355 199 120 -331 -64 -35 -51 -247 -195 30 -201 -135 35 -33 -34 10 -79 -28 -85 41 -75 -93 40
7588 40 9 107 -45 -43 -46 340 -77 176 258 125 149 129 -24 61 339 -75 -80 125 -154 -92 54 -111 21 -42 100
7613 100 151 -173 10 129 -72 150 29 -248 -132 201 251 54 -114 40 48 3 -232 52 20 -99 -90 25 -125
7636 -125 67 -141 -4 193 -149 175 241 -1 214 81 -31 -7 263 -46 203 -176 216 205 -231 -269 -242 -193
7658 -193 -88 194 28 -169 -5 -43 23 -75 -24 -105 -249 -49 -59 -26 -168 121 90 -173 178 391 -49 91 208
7681 208 244 441 -70 83 114 31 -301 -52 299 4 77 67 61 -411 423 -138 126 -39 -70 -102 242 -290 120
7704 120 16 -40 -28 -316 -105 -41 -172 19 -100 90 -35 63 224 37 182 14 -212 -144 16 -7 -109 -102 43
7727 43 195 124 -188 30 -69 -252 -115 141 -23 104 -193 74 -29 -2 157 -15 45 120 -69 45 -38 409
7749 409 326 141 81 -60 27 -12 109 31 -78 -145 140 -266 -49 -189 -64 9 -284 -142 -188 62 -67 137 13
7772 13 181 64 -173 -41 22 77 -79 -173 13 1 -106 13 144 173 182 59 -42 286 4 -80 173 20 -190
7795 -190 -202 -342 120 -26 -152 -139 -83 264 -109 -54 -320 10 56 -338 -220 -377 -21 170 -189 -136 -265 -54
7817 -54 52 -346 -79 -179 -160 -101 57 122 -568 93 -146 72 61 -73 -181 87 -125 53 33 -221 92 18
7839 18 -103 12 172 -298 160 -79 -222 134 -189 -366 -203 -175 -82 -218 -200 7 199 64 94 -57 291 145
7861 145 -53 188 -404 -14 24 296 -118 -108 -243 -163 -356 -16 118 -273 437 -142 136 40 169 -16 -194
7882 -194 -80 304 -79 -154 238 -30 79 32 -13 23 -22 306 32 31 55 -268 -56 -70 107 -270 101 317 -175
7905 -175 70 157 198 -71 8 -101 -181 -10 -93 212 -63 93 134 193 145 -9 -46 152 -162 -155 -14 94 -25 -4
7929 -4 3 -102 94 170 -198 172 -212 -276 177 -3 28 221 -216 20 197 222 372 -95 -56 -141 -104 -96 -30 -149 58
7954 58 -187 -9 162 -131 -71 -85 -56 152 68 129 -96 -155 -176 -207 -101 -202 91 -54 121 -15 78 -13 8 152
7978 152 21 10 305 435 21 -123 -27 -21 -185 -125 338 -291 91 -43 404 129 -102 103 183 138 121 -105 76
8001 76 11 -88 192 139 97 -242 187 273 -83 155 280 -176 194 -11 90 72 -55 171 142 -6 -120 -48 55
8024 55 -80 -8 12 -18 -45 -157 -204 -122 -262 -131 155 228 219 -165 -15 167 -23 258 109 58 -193 -118 -440 204
8048 204 -115 107 47 7 -172 119 229 51 -54 -139 331 4 55 217 -138 294 -151 213 -24 -42 -65 94
8070 94 102 126 88 -224 59 -332 67 -175 167 43 130 14 220 137 -124 40 -81 -172 60 -185 146 -82 -41
8093 -41 -55 -70 66 -45 -163 12 118 101 -157 -108 82 -20 89 363 29 -184 90 -233 121 368 82 92
8115 92 166 193 35 -102 -43 -206 -138 34 -7 -38 -223 -100 -143 218 13 -119 -119 195 -31 0 -162 140 -10 179
8139 179 320 -105 74 358 -78 -193 -132 278 137 -224 44 -64 -246 49 -170 -225 -201 -190 -96 270 154 42
8161 42 -308 -5 211 -409 -5 59 -21 -84 -208 -40 304 -211 -226 -132 -10 -13 70 40 115 8 -234 -140 -74 54
8185 54 131 4 -115 127 48 316
8191C16
##END NTUPLES=NMR FID
##END=
