##TITLE=1H_68-2023Bay
 CDCl3
 8 sc, 
 6.9.2023
##JCAMPDX= 6.0         $$ Bruker NMR JCAMP-DX V2.0
##DATA TYPE= NMR FID
##DATA CLASS= NTUPLES
##ORIGIN= UXNMR, Bruker Analytische Messtechnik GmbH
##OWNER= root
$$ XWIN-NMR		Version 3.5
$$ Wed Sep  6 14:34:18 2023 Russian Standard Time (UT+4h)  she@DPX200
##.OBSERVE FREQUENCY= 200.13135
##.OBSERVE NUCLEUS= ^1H
##.DELAY= (6, 6)
##.ACQUISITION MODE= SIMULTANEOUS
##.ACQUISITION SCHEME= undefined
##.AVERAGES= 8
##.DIGITISER RES= 18
##SPECTROMETER/DATA SYSTEM= spect
##.PULSE SEQUENCE= zg30
##.SOLVENT NAME= CDCl3
##.SHIFT REFERENCE= (INTERNAL, CDCl3, 0, 15.7039)
##AUDIT TRAIL= $$ (NUMBER, WHEN, WHO, WHERE, WHAT)
$$ ##TITLE= Audit trail, XWIN-NMR		Version 3.5
$$ ##JCAMPDX= 5.01
$$ ##ORIGIN= Bruker BioSpin GmbH
$$ ##OWNER= she
$$ F:/spectra/data/she/nmr/H-F/1/audita.txt
$$ ##AUDIT TRAIL=  $$ (NUMBER, WHEN, WHO, WHERE, WHAT)
(   1,<2023-09-06 14:33:09.40 +0400>,<she>,<DPX200>,
      <created by zg, POWCHK disabled, PULCHK disabled
       configuration hash MD5:
       00 E9 B6 7A A2 85 ED C7 34 08 36 98 17 FE 4E 26
       data hash MD5: 16K
       25 C8 A5 7E 94 CA FB 60 A5 C1 14 86 A2 CE 12 56>)
$$ ##END=
$$ 
$$ hash MD5
$$ 44 83 E6 9C 35 8F 25 5D 98 A6 9D 5F E9 65 65 D4
##$RELAX= 
##$RELAX= 
##$RELAX= 
##$RELAX= 
##$RELAX= 
##$RELAX= 
$$ Bruker specific parameters
$$ --------------------------
##$DU= <F:/spectra>
##$EXPNO= 1
##$NAME= <H-F>
##$PROCNO= 1
##$TYPE= <nmr>
##$USER= <she>
##$AMP= (0..31)
100 100 100 100 100 100 100 100 100 100 100 100 100 100 100 100 100 100 
100 100 100 100 100 100 100 100 100 100 100 100 100 100 
##$AQSEQ= 0
##$AQ_mod= 1
##$AUNM= <au_zg>
##$AUTOPOS= <>
##$BF1= 200.13
##$BF2= 200.13
##$BF3= 200.13
##$BF4= 200.13
##$BF5= 200.13
##$BF6= 200.13
##$BF7= 200.13
##$BF8= 200.13
##$BYTORDA= 1
##$CFDGTYP= 0
##$CFRGTYP= 5
##$CHEMSTR= <none>
##$CNST= (0..31)
1 1 145 1 1 1 1 1 1 1 1 1 1 1 1 1 1 1 1 1 1 1 1 1 1 1 1 1 1 1 1 1 
##$CPDPRG= <>
##$CPDPRG1= <>
##$CPDPRG2= <>
##$CPDPRG3= <>
##$CPDPRG4= <mlev>
##$CPDPRG5= <mlev>
##$CPDPRG6= <mlev>
##$CPDPRG7= <mlev>
##$CPDPRG8= <mlev>
##$CPDPRGB= <>
##$CPDPRGT= <>
##$D= (0..31)
0 1.2 0 0 0 0 0 0 0 0.06 0 0.03 0 0 0 0 0.0002 0 0 0 0 0 0 0 0 0 0 0 0 
0 0 0 
##$DATE= 1693996388
##$DBL= (0..7)
120 120 120 120 120 120 120 120 
##$DBP= (0..7)
150 150 150 150 150 150 150 150 
##$DBP07= 0
##$DBPNAM0= <>
##$DBPNAM1= <>
##$DBPNAM2= <>
##$DBPNAM3= <>
##$DBPNAM4= <>
##$DBPNAM5= <>
##$DBPNAM6= <>
##$DBPNAM7= <>
##$DBPOAL= (0..7)
0.5 0.5 0.5 0.5 0.5 0.5 0.5 0.5 
##$DBPOFFS= (0..7)
0 0 0 0 0 0 0 0 
##$DE= 6
##$DECBNUC= <off>
##$DECIM= 32
##$DECNUC= <off>
##$DECSTAT= 4
##$DIGMOD= 1
##$DIGTYP= 9
##$DL= (0..7)
0 120 120 120 120 120 120 120 
##$DP= (0..7)
150 150 150 150 150 150 150 150 
##$DP07= 0
##$DPNAME0= <>
##$DPNAME1= <>
##$DPNAME2= <>
##$DPNAME3= <>
##$DPNAME4= <>
##$DPNAME5= <>
##$DPNAME6= <>
##$DPNAME7= <>
##$DPOAL= (0..7)
0.5 0.5 0.5 0.5 0.5 0.5 0.5 0.5 
##$DPOFFS= (0..7)
0 0 0 0 0 0 0 0 
##$DQDMODE= 0
##$DR= 18
##$DS= 0
##$DSLIST= <SSSSSSSSSSSSSSS>
$$ [...]
##$SUBNAM2= <"">
##$SUBNAM3= <"">
##$SUBNAM4= <"">
##$SUBNAM5= <"">
##$SUBNAM6= <"">
##$SUBNAM7= <"">
##$SUBNAM8= <"">
##$SUBNAM9= <"">
##$SW= 18.05172834244
##$SWIBOX= (0..15)
0 0 2 0 0 0 0 0 0 0 0 0 0 0 0 0 
##$SW_h= 3612.71676300578
##$TD= 16384
##$TD0= 1
##$TE= 0
##$TE2= 300
##$TE3= 300
##$TEG= 300
##$TL= (0..7)
0 120 120 120 120 120 120 120 
##$TP= (0..7)
150 150 150 150 150 150 150 150 
##$TP07= 0
##$TPNAME0= <>
##$TPNAME1= <>
##$TPNAME2= <>
##$TPNAME3= <>
##$TPNAME4= <>
##$TPNAME5= <>
##$TPNAME6= <>
##$TPNAME7= <>
##$TPOAL= (0..7)
0.5 0.5 0.5 0.5 0.5 0.5 0.5 0.5 
##$TPOFFS= (0..7)
0 0 0 0 0 0 0 0 
##$TUNHIN= 0
##$TUNHOUT= 0
##$TUNXOUT= 0
##$USERA1= <user>
##$USERA2= <user>
##$USERA3= <user>
##$USERA4= <user>
##$USERA5= <user>
##$V9= 5
##$VALIST= <valist>
##$VCLIST= <CCCCCCCCCCCCCCC>
##$VD= 0
##$VDLIST= <DDDDDDDDDDDDDDD>
##$VPLIST= <PPPPPPPPPPPPPPP>
##$VTLIST= <TTTTTTTTTTTTTTT>
##$WBST= 1024
##$WBSW= 4
##$XGAIN= (0..3)
0 0 0 0 
##$XL= 0
##$YL= 0
##$YMAX_a= 109791
##$YMIN_a= -164593
##$ZGOPTNS= <>
##$ZL1= 120
##$ZL2= 120
##$ZL3= 120
##$ZL4= 120
##$ABSF1= 10
##$ABSF2= 0
##$ABSG= 5
##$ABSL= 3
##$ALPHA= 0
##$AQORDER= 0
##$ASSFAC= 0
##$ASSFACI= 0
##$ASSFACX= 0
##$ASSWID= 0
##$AUNMP= <proc_1d>
##$AZFE= 0.1
##$AZFW= 0.1
##$BCFW= 1
##$BC_mod= 2
##$BYTORDP= 1
##$COROFFS= 0
##$CY= 11.3945322036743
##$DATMOD= 1
##$DC= 2
##$DFILT= <>
##$DTYPP= 0
##$F1P= 15.7292609196834
##$F2P= 12.9074282941183
##$FCOR= 0.5
##$FTSIZE= 0
##$FT_mod= 4
##$GAMMA= 1
##$GB= 0.15
##$INTBC= 1
##$INTSCL= 1
##$ISEN= 128
##$LB= 0.24
##$LEV0= 0
##$LPBIN= 0
##$MAXI= 10000
##$MC2= 0
##$MEAN= 0
##$ME_mod= 0
##$MI= 1.114404
##$NCOEF= 0
##$NC_proc= 0
##$NLEV= 6
##$NOISF1= 3.799351
##$NOISF2= 2.8
##$NSP= 1
##$NTH_PI= 0
##$NZP= 0
##$OFFSET= 15.70392
##$PC= 1
##$PHC0= -21042.06
##$PHC1= 11.25271
##$PH_mod= 1
##$PKNL= yes
##$PPARMOD= 0
##$PSCAL= 0
##$PSIGN= 0
##$REVERSE= no
##$SF= 200.130013532006
##$SI= 16384
##$SIGF1= 3
##$SIGF2= 2
##$SINO= 400
##$SIOLD= 16384
##$SREGLST= <1H.CDCl3>
##$SSB= 0
##$STSI= 0
##$STSR= 0
##$SW_p= 3612.71676300578
##$SYMM= 0
##$S_DEV= 0
##$TDeff= 0
##$TDoff= 0
##$TI= <>
##$TILT= no
##$TM1= 0
##$TM2= 0
##$TOPLEV= 0
##$USERP1= <user>
##$USERP2= <user>
##$USERP3= <user>
##$USERP4= <user>
##$USERP5= <user>
##$WDW= 1
##$XDIM= 8192
##$YMAX_p= 0
##$YMIN_p= 0
$$ End of Bruker specific parameters
$$ ---------------------------------
##NTUPLES= NMR FID
##VAR_NAME=  TIME,          FID/REAL,        FID/IMAG
##SYMBOL=    X,             R,               I
##VAR_TYPE=  INDEPENDENT,   DEPENDENT,       DEPENDENT
##VAR_FORM=  AFFN,          ASDF,            ASDF
##VAR_DIM=   8192,          8192,            8192
##UNITS=     SECONDS,       ARBITRARY UNITS, ARBITRARY UNITS
##FACTOR=    0.0002768,     1,               1
##FIRST=     0,             0,               0
##LAST=      2.2672688,     0,               0
##MIN=       0,             -164593,         0
##MAX=       2.2672688,     109791,          0
$$ Real data points
##PAGE= N=1
##DATA TABLE= (X++(R..R)), XYDATA
$$ [...]
2242A105l074L431l06k764L952k863r54L108k903J701P04k534L135k411j65L015
2258B177l949K073Q71l452K851q43j002K908k896J485J037l786L923j520j365
2273a488L629k991N82J973l138K724p84j490L189l343O58J998l351K715L11k628
2289a434L112k205n3J823l231K267m3k395L357k213j59L067l164J583Q56k883
2305a715K641j755n22K781l148J934J038k809L221j345j328K915k833Q71J092
2320A038k995K844r23j401L431k844N15K058l074K256m62k012K965k456M30K114
2336A484k986K491Kk410L253k208j51K346l113J596N74k457L037j784o99K700
2352A675l125J612Q02k825L248j791r55K774l214J485J228k832K930j065j185
$$ y = [1105, -1969, 1462, 1156, -1608, 2344, -519, -1473, 1635, -1268, 433, 1137, -1397, 1738, -673, -838, 2177, -1772, 301, 1172, -2280, 571, -272, -1274, 1634, -1262, 223, 1260, -2526, 1397, -123, -1488, 2141, -850, -268, 1705, -1433, 1291, 507, -983, 2206, -1137, -479, 1519, -1832, 883, 1194, -1434, 1678, -527, -580, 1243, -1988, 279, 236, -2159, 1198, -1015, -1174, 1893, -1271, 312, 1168, -1715, 926, -829, -1351, 1430, -1718, 216, 1254, -1555, 1666, 321, -1007, 1908, -925, -54, 1038, -1957, 887, -36, -1437, 1994, -850, -335, 1723, -1351, 905, 443, -1569, 1396, -1060, -630, 1484, -1502, 989, 991, -1419, 1834, -374, -525, 1821, -1292, 304, 878, -1579, 1458, -326, -1025, 1675, -1450, 162, 964, -1861, 1387, -404, -1359, 1415, -1799, -314, 914, -1918, 1012, -53, -1238]
2367a238K867k594J006J604l214K859p18j893K994k450M72K092l143K439k64j835
2383a016K839k220l43K266l217J961L03k419L286j906m49K497k850J458O00k568
2399a778K924j829n05K625k701J258J344k726K830j201j247K771k745J072R95
2414A087k569K660p62j809L145k486N57J473k988K325l37k000L008k165L14K044
2430A497k943J928K12k245K877j864K9K043k757J806M33k422L168j750r22K594
2446A684k932J368O64k347K748j257j047K719k932J106J280k622K414p11j534
2461a399K598k244P55J576k635K637r01j609K915k337R0J848k277J628k16j865
2477a436K821j985L99K018l177J896L32k515K467j295o31J961k199J523K49k141
$$ y = [-1238, 1629, -965, 41, 1645, -1569, 1290, 572, -1321, 1673, -777, -305, 1787, -1356, 1083, 819, -1016, 1823, -397, -740, 1526, -1691, 270, 573, -1846, 1440, -466, -915, 1582, -1268, 190, 790, -1778, 1146, -683, -1188, 1437, -1264, -6, 1338, -1388, 1442, 241, -1006, 1765, -980, 92, 1087, -1482, 1178, 416, -1393, 1752, -734, -177, 1296, -1692, 633, 296, -1704, 1304, -861, -547, 1497, -1446, 482, 694, -1551, 1326, -538, -509, 1534, -1223, 583, 1016, -1406, 1762, 12, -910, 1684, -1248, 120, 784, -1563, 1185, -72, -1119, 1600, -1332, -226, 1054, -1568, 846, 135, -1399, 1199, -1045, -290, 1286, -1349, 1288, 387, -1222, 1693, -644, -554, 1294, -983, 645, 429, -1436, 1385, -600, -201, 1817, -1360, 536, 868, -1647, 820, -475, -1106, 855, -1344, 179, 428, -1713]
2493a713L087j362j038K828k933P90J048k141K091o09o15K308k699J186J395k926
2509a303K496m46j820K268k170K96J313k141K577q45j488K932k486k48K225k311
2525a151J273R1j909K504j865N00K136k688K136mk484K628j098r20K241k181J055
2542B64L02k167K909j500m35K737k861M44J376k696J922m30q97K061k353R81J215
2559H72k494K839k94k002K396k122j17J750j861K026p01j625K823k374K90K506
2575A912k814J507N31k781J896j191L81J921k364J643k8k585K910o67j131K514
2591A654k509M23M51j473K512j115l54K580l034O19J633k627K126o0j616J543
2607G53j809Q19J363k309K547n67k295K682j797j50K043k262J419k66j742K332
$$ y = [-1713, 1374, 12, -1026, 1802, -1131, -341, 707, -1434, 657, 48, -567, 1741, -958, 228, 1623, -1303, 1193, 747, -1073, 1195, -975, -679, 634, -1507, 1070, 225, -1263, 1669, -817, -1065, 1160, -1151, 122, 213, -1696, 808, -1057, -557, 1579, -1109, 1027, 1023, -1461, 1167, 69, -851, 1390, -791, 264, 566, -1601, 1308, -192, -627, 2110, -751, -307, 1069, -1627, 295, -135, -1032, 1029, -1324, -343, 872, -1622, 1217, 923, -1079, 1317, -805, -922, 828, -1033, 993, 292, -1333, 1490, -884, -594, 1912, -902, 605, 1136, -1645, 251, -940, -559, 1362, -1002, 641, 613, -1972, 938, 271, -860, 1654, -855, -432, 19, -1454, 1058, -57, -411, 2169, -865, -246, 1387, -1240, 886, 826, -790, 753, -1056, -237, 1126, -1183, 1364, 797, -1498, 1184, -613, -763, 1280, -982, 437, 171, -1571, 761]
2623G61j535M83J941k756J156P08k430K494p19k83J553k374J134O16k092K895
2639A552j153j294K495k688M93J396j771K077r87j186J963k437J080J814k444
2654a090J774k77j578J825j242N20J251k045J756p52j712K712j430Q1J976k365
2670e96N74J53j147K079j346P0J584k861J262P94k035K809j123j060J979k435
2686a299Q77R74j861K615j034j445K217j990M55J656j782J582n39j462K047j873
2702h62R67J350k420J660m42j596K004j092k7J599k375J522j47j571K483j454
2718d01j6J736k394O94O71j434K094r66k83J748k494J107P46k008K272q28j028
2735g84J803j676O79Q99j824J884q28j153K124k023N15J471k069J551m93j178
$$ y = [761, -774, -291, 1650, -1106, 50, 758, -1672, 822, 103, -180, 1373, -1001, 133, 749, -1343, 1552, 399, -895, 1600, -1088, -595, 801, -970, 1107, 120, -1066, 897, -1540, -460, 1354, -1090, 684, 407, -1171, 654, -588, -68, 1183, -862, 894, 142, -1570, 1142, -288, -207, 1769, -596, -22, 131, -1016, 1063, -283, -213, 1371, -1490, -228, 566, -1469, 1340, 217, -843, 1136, -1299, -422, 552, -1309, 1306, 272, -1173, 1044, -946, -491, 1165, -617, 965, 426, -1036, 1011, -862, 105, 1455, -965, 695, 253, -1343, 661, -431, -458, 1141, -1234, 288, 141, -1430, 1053, -401, -417, 1319, -1075, -381, 290, -1144, 950, -16, -299, 1449, -1045, 62, 808, -1200, 1072, 244, -784, 1019, -657, 22, 921, -903, 981, 153, -1000, 1124, -899, -384, 1087, -982, 569, 76, -1102]
2751a102K028j706N61J334k283J620j98j486K482j357o2J351k039J347j9j611
2767a140K360j411l10J813k309J230N38j924K048j021m98J594k047R39P10j767
2783a195K168q23j188K189j918N67J297k062J752o66j076K014j569L03J431k176
2799i52J519j05j481J965j340O8J314k028J272L15j640K132j296m81J896k270
2815a112J192N28j926J977j014l53J692j879J143O39j669J828j074o83J943j945
2831g13Q79Q25j986J765m91j040J937j756J93J507k131J570l78j203J706j306
2847f22J20J442j880J146K96j569J970j244o4J536k066J260M52j715J922j018
2863c4o89J894j864Q21M89j670J879q74p44J815j897P50P56j835J932o33j106
$$ y = [-1102, 926, -780, -219, 1115, -1168, 452, 254, -1232, 1250, -107, -169, 1182, -857, 490, 471, -1140, 1220, -191, -501, 1312, -997, 233, 771, -1153, 895, -126, -624, 970, -1077, -138, 572, -1195, 973, 150, -1038, 1151, -767, -200, 1097, -965, 787, 121, -955, 1059, -510, -207, 1224, -952, 567, 462, -1019, 946, -394, -326, 988, -1040, 232, 547, -1093, 1039, -257, -738, 1158, -1112, 80, 608, -1318, 659, -355, -708, 984, -895, 248, 887, -782, 1046, -28, -711, 1232, -713, 166, 991, -995, 770, 279, -761, 1176, -580, -387, 1120, -1011, 559, 181, -1022, 684, -622, -502, 940, -940, 206, 502, -1067, 903, -341, -405, 1131, -935, 325, 777, -938, 984, -34, -723, 1171, -693, 128, 617, -1053, 826, -48, -792, 1023, -874, -124, 632, -1203, 729, 96, -1010]
2880a010J745j400L84R91j730J485j93j227K037j557L41J155j822J298L7j340
2896h06J742j095k28J571k100J214K50j512J824j115l53J415j794J109M51j855
2912a282J994r65m33J602j794R43N54j613J833q06o21J713j445L48R71j969J704
2929G34m57j109J835j612L22J145k037J503j19j219J844j354j08J245j952J649
2945C10k45j117J699j150J43J221j658J034M63j571J937j223j30J506j897R54
2961B76O88j904J955q42o59J559j808Q14R83k085J530m31q79J796j831N08J001
2978F71j707J553l58j031J530j286J70J215j848J407j18j180J962j146j05J155
2994H84j668J049N2j198J796j226l28J457j630J067L48j479J857j029n68J597
$$ y = [-1010, 735, -665, -281, 710, -1020, 465, 272, -955, 1082, -475, -134, 1021, -801, 497, 534, -806, 936, -159, -387, 1184, -916, 298, 548, -964, 860, -255, -608, 807, -987, 122, 573, -1282, 712, -253, -686, 916, -878, 65, 619, -994, 839, 33, -588, 1125, -320, 28, 999, -970, 734, 277, -832, 1003, -609, -287, 858, -1179, 324, 205, -1014, 830, -524, -632, 613, -1339, 310, 65, -1052, 647, -503, -360, 861, -797, 237, 700, -871, 1066, -157, -287, 1219, -678, 276, 964, -940, 1015, 173, -486, 1073, -735, 79, 1062, -1023, 507, 76, -803, 993, -838, -330, 671, -1036, 517, 159, -872, 658, -628, -458, 757, -1091, 316, 198, -982, 980, -166, -271, 884, -784, 265, 317, -881, 915, -311, -639, 818, -812, 255, 603, -876, 981, -48, -616, 981]
3010I81j734Q13N13j435J719p13q77J876j641O93P25j689J623o42r85J757j494
3027e10L33J138j698J069k25j171J880j458K65R05j928J541N3j377J900j051l75
3044g09J322j670J212J55j339J823q88l23J425j542P91P96j740J629n41p47J464
3061A118j684P77P18j848J440m34q90J836j496L34P76j383J118n08p26J648j447
3078f51R9J400j849J218mj187J770r26r7R94j854J264J84j389J894j045n93J622
3096H50j509Q51K81j184J474j052m84J845j751O52P48j777J599l40p58J366j321
3113e10P39N09j576J589o66r12J843r94k62R22j427J077k52p09J502j506J89J361
3131I17k029J292K30j192J301r97n4J180j670J116K97j550K023r83p12J786j423
$$ y = [981, -753, 60, 573, -862, 857, 144, -733, 1143, -498, 195, 920, -769, 854, 212, -773, 984, -510, -177, 961, -737, 332, 107, -1064, 816, -642, -377, 528, -1400, 141, 194, -1183, 717, -334, -709, 613, -1057, 155, 310, -1029, 794, -94, -417, 1008, -534, 257, 1053, -687, 942, 401, -346, 1118, -566, 211, 929, -919, 521, 87, -803, 1033, -463, -129, 647, -736, 382, -126, -852, 796, -651, -552, 848, -1001, 217, 213, -974, 796, -130, -227, 767, -1087, 177, 361, -1028, 866, -179, -772, 850, -659, 192, 473, -711, 763, -289, -773, 1072, -679, -27, 721, -1056, 543, 203, -555, 811, -510, 229, 738, -838, 751, 85, -827, 1016, 22, -240, 682, -745, 332, 80, -629, 873, -633, -444, 917, -1112, 180, 410, -782, 519, -478, -532, 648, -1022, 94, 391, -1159, 864, -119, -831, 955, -468]
3148d68P09N73j562J534r14l03J570j801Q60Q66k022J485l77j140J864j412M38
3165a00N94j728J731m27j157K131j472J17J076j651J010J22r08J668j447L44Q04
3182G07j774J450N22j640J522r32l58J190j181Q36K14j264J503j176m95J841j361
3199c96K79Q37j703J422p62j58J464j333N24N02j910J481r8o16J432j263K09N20
3217D31j326J325k42r10K021j713J50J078j754J188N26j370J353j216n6J161j628
3234i82J176M77j523J473p82o65J477j130N50L85j267J410r04n85K106j768O63
3251A11N59j418J016n6p90J464j242K89Q24j953J556N1j093J446j033j37R09j407
3269i04J155N3j260J847j172j01J202j501J035K26j201J288o38l46J189j711J274
$$ y = [-468, 241, 814, -748, 786, -128, -431, 1139, -662, 198, 1064, -958, 527, 150, -990, 874, -538, -100, 494, -1234, 497, 70, -1087, 1044, -428, -311, 765, -886, 124, 246, -662, 1006, -441, -97, 707, -1067, 383, 905, -735, 787, -145, -503, 687, -494, 342, 556, -708, 795, -381, -876, 965, -396, -117, 720, -983, 439, -323, -481, 983, -350, 174, 676, -1234, 247, 149, -467, 965, -298, -89, 431, -895, 430, 188, -722, 1299, -414, -264, 814, -940, 248, 774, -596, 757, -459, -515, 646, -982, 194, 671, -852, 621, -161, -826, 651, -479, 71, 456, -811, 599, -305, -890, 1216, -552, 111, 670, -748, 268, 212, -578, 886, -356, -67, 757, -1196, 360, 411, -682, 764, -269, -406, 503, -904, 251, 304, -956, 891, -281, -382, 820, -681, 354, 580, -621, 667, 29, -317, 872, -839, 435]
3286D35P4j291J526p84o43J427j150L12N65j156J195o43o59J489j231M59P99j716
3304i92J436j93p99J475j353N12N36j420J072m2r10J549j178J2J125j275Q61J26
3322E42j218J185r12O1J159j737Q73L29j154J228l89l96J204j566N91P13j461
3339i48J632o35o24J532j417N03Q11j351R43l18o84J494j349K48Q75j421J117
3356D08J12j215J651j209q6R24j396J148m4r82J368r80o8J108j553Q18M16j112
3374f92J221p18l00J376j491P12L22j092J341p59l85J205j159O38M28j565J243
3391C25j71j036J482j093L06P46j256J191k22j186J724j070R7J014j594J085k0
3408C22p63J183r58p5J015j493J103P6j207J463q36l26J360j588P14M33j315J258
$$ y = [435, 509, -782, 744, -40, -683, 744, -406, -94, 471, -685, 510, -133, -792, 697, -534, -75, 724, -992, 444, 251, -548, 927, -426, 86, 622, -798, 274, 232, -678, 871, -307, -295, 830, -445, 416, 542, -676, 509, -403, -342, 817, -920, -47, 282, -872, 356, -33, -429, 775, -791, -200, 513, -948, 684, 49, -575, 957, -460, 43, 854, -497, 446, 128, -556, 938, -411, -163, 712, -709, 408, 520, -695, 956, -253, -339, 585, -811, 337, 293, -689, 679, -301, -369, 739, -814, 4, 420, -692, 529, -189, -489, 887, -604, 108, 430, -662, 679, -80, -465, 740, -419, 219, 647, -918, 325, 154, -882, 600, -493, -187, 559, -697, 494, 272, -914, 810, -260, -163, 851, -743, 342, 322, -441, 742, -216, -291, 724, -769, 334, 410, -797, 666, -170, -496, 864, -724, -10, 423, -892, 366]
3426C66o72k45J040j385R08J90j050J287n80m77J189q65K98N95j052J088m65o94
3444e24J427j215R4P44j090J009q2q71J388r39q5P64j322J092L2j238J510q91
3462a97k46R04j166Q69O2j015J355r72K33R66j282O21M69j480J277l59q81J376
3480E34r93M96K22r72J287m95o59J294j194J79P97r40P04j59o93J517j243J77
3498a41Q82j286P70K57r83R26n83j18Q68j206J039n1p83J222r40l92J172j108
3516d55P06r1p20R28p90k45J394j477Q68N60j555R57j63m93J064r71M01O14j414
3535h82J541n61o24J555j152R2P75j208P95j07o44J187j172K71Q78j549J004L65
3553E64j284J276q56N8M94r75R33j1j015J478r84l46J322j241N85L72o81P34o85
$$ y = [366, -306, -551, 489, -896, 12, 202, -848, 439, -141, -618, 571, -294, 4, 599, -453, 635, 170, -524, 903, -312, -218, 526, -564, 445, 363, -508, 880, -59, -144, 620, -702, 390, 422, -816, 694, -197, -443, 461, -705, 164, 226, -789, 566, -406, -173, 793, -489, 132, 601, -879, 398, 39, -842, 534, -459, 37, 259, -713, 574, 79, -580, 714, -480, -301, 496, -444, 260, 101, -592, 925, -318, -141, 741, -545, 225, 482, -501, 425, -158, -276, 592, -614, 425, 374, -409, 813, -127, -519, 653, -455, 251, 160, -560, 368, -422, -667, 727, -750, 118, 678, -877, 80, -83, -576, 488, -483, -82, 532, -882, 659, 98, -526, 1029, -123, -31, 744, -464, 331, 224, -420, 767, -405, -134, 744, -805, 199, 564, -720, 556, -300, -242, 252, -723, 210, 199, -816, 662, -322, -668, 654, -587, -2, 370, -311, 423, -262]
3572b62Q8P92j346P58O14j301J018N8j071J161o49N8K70r04J093l52o35J329r48
3591b29k38J018r82O58n1n16R28j138N75O66j580J105M39j511J385n08k69N05
3609B57n71L30q9l98J351r28j66J135j322j51Q37o87O15n2l40N78j208R55K64
3628D10j282J481k24j220J350p79K0N31n34P97o15m79J217j316K08J433j215J60
3646e7K58p12O73n51O07M95j431R88k21j159J430j29n19J040r73P5J64n11J156
3665F23n51q1J024j446N6J108j125O80J18n03L88q63P27L41j238J476k95j233
3683g94J346q28j72R57o99M49m82m59J433j524N13J038j147L67M29r18O62j42
3701B9r1O59r82P40l7j100J572o39q00J472j293L16M04o06P88o63k0R26j313M69
$$ y = [-262, -174, 618, -728, 30, 644, -657, 361, 419, -652, 509, -140, -82, 188, -716, 377, 25, -610, 719, -229, -467, 551, -431, 227, 176, -340, 588, -550, 25, 691, -889, 216, 655, -856, 529, 21, -248, 257, -314, 16, -73, -471, 880, -48, -214, 921, -401, -552, 285, -402, 213, 161, -179, 399, -809, 146, 410, -872, 609, 385, -835, 515, -264, -244, 287, -247, 550, -65, -544, 673, -643, -435, 998, -217, -57, 201, -511, 162, -389, 218, 713, -718, 270, 49, -1110, 320, 191, -328, 712, -261, -186, -22, -533, 623, 72, -9, 1015, -431, -375, 733, -392, 288, 406, -97, 291, -572, 155, 496, -742, 734, 439, -794, 552, -276, -448, 509, -190, 259, -223, -682, 751, -773, -260, 778, -369, -2, 427, -491, 171, 29, -62, 597, -385, 355, 318, -782, 790, 151, -649, 823, -470, -154, 250, -356, 432, -231, -251, 675, -638, -169]
3721a69P43j250J050j66r21J061o19L58K72p85J090n42p78J486r39l00R21p46
3739b34K87O5n90Q03q39N57O47j240N99K53j121J009j67k31L74o83P77k03o41
3758e78J246q24l38J209j047K26N51q38P21l86j50P56r80N44K93j070R76J61q99
3777d27R08o67J25L81r93J028n93l92J299p75o3Q98j213N55K80o20N42m71O6P33
3797F01j099M46L63q92J106m55k43Q04r65M87J61r62R79k85p27J146p56J69Q31
3816G09j134P04j44o01P87o15J36N39j036J016j20q73J337p81j55O92p26N92r3
3835B34p99J049o39k83R03p21N20N7o74O17l52k26Q48r92L46K79r11J205n47l82
3855d68J112p87P7M55o65N85l05l29R16p72J43O27j120R99j62n39P74q10M0O67
$$ y = [-169, 574, -676, 374, 208, -713, 348, -271, 87, 359, -426, 664, 122, -656, 830, -109, -409, 512, -234, 53, 118, -472, 331, -508, 49, 696, -544, 55, 308, -813, 196, 29, -202, 172, -511, 266, 63, -578, 668, -156, -494, 715, -332, -106, 445, -393, 328, -58, -208, 548, -432, 112, 405, -665, 311, 472, -427, 481, -186, -61, 320, -673, 355, -238, -630, 669, -106, -169, 729, -484, 71, 351, -269, 273, -198, -132, 601, -498, -52, 311, -581, 525, 70, -173, 631, -334, 153, 314, -648, 331, 46, -681, 465, -291, -122, 709, -425, 279, 135, -466, 321, -294, -158, 381, -655, 361, 241, -632, 705, -76, -231, 461, -265, 327, 234, -565, 484, -155, -438, 465, -256, 264, 321, -353, 264, -88, -314, 534, -458, -112, 167, -744, 461, -86, -468, 644, -143, -66, 389, -276, 309, 4, -325, 591, -181, -38, 589, -531, 468, 306, -233, 541, -269, -229, 438]
3875D38r00O44n9p87J031o63j75Q35o61M12J44o92P29l46k31P19q17K43N33q84
3895d87Q54m36k34Q95o05k1L72o57M44p3m43R47q75J84M11o67Q06k68n09J015
3915F53q82J21L41o15M26M75q56P54n68J5O70r67O49j25p02J096q42J59Q13q89
3935b74L75oo96R34m16k71O60q47N64K46o55N36j99k60O08p58L54M01o06O82k01
3956A71l03P99o71N8M37o91M53q3m69P92o04Q3P05r60M89J75p66P81o93J4N16
3977B33o17M52J06p17J187q43k59R71q82J25M19p12Q64l11k99R19r43L98L87q44
3997c66P69j92n38O89n79J41K73o32Q85l71l42Q64r10J50O93r17M55K61p59P30
4017C04n12L65M74j253J073N6r39R80n55l63N32m32N43k23m33O17l78l65R86r85
$$ y = [438, -462, 182, 123, -664, 367, -296, -471, 364, -297, 115, 259, -433, 296, -50, -281, 438, -379, -136, 397, -487, 367, -69, -303, 592, -13, -34, 338, -319, 125, 52, -391, 556, -319, -135, 276, -391, 415, 147, -362, 653, -229, -108, 233, -382, 44, 519, -337, 417, -151, -136, 534, -433, 216, 91, -611, 485, -357, -198, 615, -274, 101, 95, -601, 333, -83, -354, 306, -541, 23, 269, -386, 150, -49, -309, 299, -459, -105, 296, -310, 372, 171, -132, 667, -4, 54, 491, -200, 253, 170, -299, 493, -111, -28, 677, -283, 206, 381, -385, 396, -297, -283, 233, -384, 68, 174, -543, 644, -199, -458, 513, -369, -244, 175, -537, 327, 16, -283, 636, -307, 91, 478, -366, 403, 211, -327, 362, -217, -76, 197, -435, 450, 79, -263, 601, -309, -159, 534, -383, 72, 333, -426, 304, -208, 157, 631, -622, 451, 507, -432, 548, -7, -370, 162, -270, 273, 50, -383, 234, -144, -509, 477, -508]
4037e08L17P18r55M59k1l01N00m39M42K26j024J023j73o93R44m62j63M95o69M96
4057B12k68j32R16r19Q0P16q50J70K78n58M26l07J32K72q21J056j31q79J002j68
4077B27p30P82k08j43j8k15O34o60j01J201j207L24P67j185N14K31o26M82j14
4096d5K21j25p14R38k80o34J116m45l50O02n68P5L8nO26p58J74Q10j329O29N75
4117E51q42N81j21l06J93l80P93k36p28J129p37n34J108o13J18M03m63M67p67
4136c84J41P88j135N84O69j219P79N1q28Q28l42K07K1o29R99n73o13J307o61l04
4156c14R33p12n5K15j47N54p26J94N13j135Q84K77j099Q00j07o03M71j67M71l52
4176a05l10R91p94n17J312o84k4N42l51k08J40m9M04n70M97K49j016N61L27r18
$$ y = [-508, -191, 527, -428, 31, 10, -291, 209, -230, 212, 438, -586, 437, 264, -429, 515, 53, -110, 385, -284, 212, -56, -188, 728, -191, -111, 605, -245, -75, 203, -355, 71, -236, -104, 168, -653, 403, 272, -607, 395, 227, -503, 279, 71, -72, -90, -305, 329, -331, -432, 769, -438, -114, 653, -532, -18, 213, -413, 69, -45, 176, 51, -663, 275, -5, -639, 477, 32, -318, 284, -284, -209, -171, -176, 450, -308, -134, 676, -653, -24, 551, -291, 290, 169, -137, 56, -324, 469, 233, -495, 634, -103, -637, 471, -142, -24, 379, -84, 383, -384, -243, 545, -590, -6, 663, -556, 223, 274, -554, 274, -68, 139, 160, -469, 530, -43, -656, 651, -10, -314, 619, -93, -148, 67, -80, 474, -252, -58, 455, -680, 204, 481, -618, 182, 75, -528, -57, -224, 247, -105, -415, 576, -218, -735, 577, -107, -131, 411, 60, -148, -8, -57, 347, -223, 274, 523, -493, 68, 395, -523]
4196e23P07J47l77Q3j16L59l66m62J109p29j65J012r75j13P07l74L25n37K86L02
4216C00r58Q65R0q93Q84q8n16M89k57J44j3l51P77p01j66J027r09N7R18j097L45
4237e3J96l62K88k78J54M25q81Q05J92r43R39l66k79L68l33L73j26k67P70o33
4257a1m00J013p55J39N04p52L61j59j52M58r18Q76kj015J062p7o85J116p69K10
4277D4l2l82O23m25j03Q75j038N01L11q10O63N1m83M69l89J66M82r14N92k60p35
4298g94J145m26j71P12o48K38ol44L84m27L03O06r54M83J52n49N95k1m29L97n14
4319b68M82k17n90O05l0l25P57n93R9L74n78L45j17l29N23p60K35N69o41N36L87
4340D64o97O95m98q7O16p56M60n2n95R67n74K08L90o96J19N53p92L52j53k56Q40
$$ y = [-523, 184, 331, -46, 37, -79, 280, -86, -548, 561, -168, -333, 679, -296, -409, 298, -76, 249, -288, -2, 300, -658, 207, 297, -596, 288, 200, -316, 173, -84, 60, 47, -304, 473, -228, -394, 633, -276, -219, 699, -398, -53, 143, -219, 69, -209, -55, 370, -511, 294, 486, -457, 482, 116, -163, 205, -128, 245, 119, -148, 622, -11, -411, 602, -153, -14, 490, -262, 99, -60, -212, 246, -672, 204, 202, -813, 249, 172, -513, 603, -166, 44, 12, -370, 253, -172, -275, 600, -438, 63, 374, -436, 227, 278, -205, 264, -125, 41, 523, -391, 201, -59, -794, 351, -75, -246, 466, -182, 56, 50, -294, 90, -337, -34, 572, -382, 101, 253, -296, 299, 278, -151, 246, -268, 214, -3, -593, 12, -18, -343, 414, -179, -80, 294, -284, 61, -56, -385, 138, -622, -387, 182, -459, 77, 464, -233, 462, -36, -123, 493, -263, 197, 145, -450, 517, -57, 151, 541, -155, -36, 517, -275, 77, -76, -332, 508]
4361E08q36K81J77o97N58J54l85N37o05M31P4o65M30r8n25R39n48J70M17n88O17
4382C46j28l40N93n71J95L61q30O00j84l73N35j71m5L97n47L52J12p27R47o70
4402a48rN60q12P33Q3p63O72k36l91O22n66J26M07o03M77J15n56O03o45L60J3
4423D2n89O28K5m18O27m99q7P60q73N70n9m14N88m38p3L56n10N56N7n02O94l33
4445A08j46M87n54J50K36p04O33m58K3O59o71Q6L03o68N71r9k02N54n73J73L25
4466B33m48M35j88l20M21m23K32L49p82O51k85p3O33n99kN27o34K81L76n68K54
4487G0k01N4L07o89O01R0n40P70m56m31P96n51L65j81k70N40l94q6O99r93N63
4508F3L94p02K97qj76L60n06K20K48n57P04k46l55Q14p64O3N55o33L78m2m97N16
$$ y = [508, -328, -47, 130, -567, -9, 145, -240, 297, -308, 123, 197, -468, -38, -136, -661, 278, -270, -100, 317, -271, 346, 218, -122, 471, -100, 95, 456, -374, 226, 42, -331, 204, 33, -12, 385, -162, 190, 302, -425, 522, -148, -157, 403, -409, 324, 407, -356, 316, 80, -311, 311, -255, -129, 278, -325, 152, 267, -289, 314, -331, 29, 42, -547, 81, 106, -312, 315, -184, -271, 489, -384, 186, 127, -287, 301, -137, -210, 146, -364, 192, 249, -253, 441, 108, -38, 449, -105, 45, 281, -423, 210, -248, -225, 434, -237, -151, 152, -516, 55, -44, -246, 308, -265, -92, 233, -215, 220, 32, -288, 133, -290, -58, 291, -491, 160, -125, -198, 435, -164, -166, 361, -273, 8, 384, -184, 70, -131, -77, 230, -459, 142, 232, -308, 462, 6, -425, 371, -180, 185, 4, -266, 274, -120, -206, 493, -500, 63, 457, -245, 52, 44, -132, 228, -278, -58, 190, -367, 337, 91, -264, 550, -214, -151, 404, -229, 149, 107, -390, 126]
4530A26l56J23N38q48N44J15o28N56j42j07K64l19M73k0p29O98k00k32P64o93
4550g3j41J63j00L38l20j02N50p70M45M80r02P50j00n07J02L16j03L0l83N02j74
4571Am10R75p44l2O51m82k9J22l11N96m22J19J24m42M45K14p99M87L2k57K65k06
4593a03L60m64j34P30m34l10O88m18j34M33k78P0J42j61K74p32P09p7n78O14r1
4614A06n13M12j70N9J33j93K30k28l28R35n63k91J036q96K20K57m15k5J1K73K87
4635C37p46O70Op45N11K11m62M89O3m82J43j98M17n29K47P38r95l0P32m58R7J44
4657A60k08K86m78K03J42o13J009j44q63R63m18k99M18j50m1j02o1N84p60R5O86
4678D09n02l3N80o38L22o2j47K20o44Q38j52p74Q01o8p16O75r1k83N46l18J18
$$ y = [126, -230, -107, 431, -417, 127, 242, -386, 170, 28, -79, 185, -134, 339, 319, -410, 288, 88, -144, 620, -73, -214, -51, -151, 187, -133, -235, 315, -455, -10, 470, -432, 318, 218, -289, -187, 129, 26, 56, -327, 175, 1, -409, 566, -178, -210, 441, -41, -70, 52, -259, 337, -85, 34, 158, -284, 161, 375, -424, 63, 95, -162, 103, -103, 257, -207, -341, 389, -45, -355, 333, -85, -219, 214, -64, 6, 148, -13, 261, -471, 238, 161, -417, 197, 106, -407, 5, -165, -106, 27, -166, 64, -164, -492, 443, -120, -411, 625, -271, -51, 206, -209, -234, -223, 50, 337, -409, 261, 267, -478, 33, 244, -218, 271, 334, -148, -5, -203, 214, -315, -68, 670, -325, -355, 377, -81, 16, 160, -48, 238, -240, -37, 105, -508, 501, 357, -506, 457, 39, -260, 158, 8, -33, -135, -196, 388, -372, -277, 409, -93, -126, 454, -184, 138, 76, -71, 149, -495, 343, 191, -583, 218, 150, -566, 109, 18, -265, 281, -37, 81]
4699H1k83J41L62o29L19N96q97K63M35n75K80q6J24N6m04L68q6n52P13k47m38
4720d59N68q0m4j7j53M42n94J50M70p44O10J92m68N2K21k50J07j41J18K17l70
4741a73N49n23k36R19p34K5M06l45J66k83oM17n13L80K10o49L00K63l72M67j63
4762A05M5j18k55L84k02r9M23k72l74O34l43k5K68l22L71l78O8L46o39M47R3p40
4784e83R47k94l20M88n11J65Q6k07M11k63p7O36o49K05M04n95J99o0j07L21m24
4805b28M97P1o57M42L4m01N53j18l23L48l65L52l14l3O34n20j88M39l60K7K66
4826A56m97M68k3k68M77n10J81K17n47N39j26k93L53l29O2M20n23L44j68j69N82
4847C46m79L7L15o06M45j6k98K95J8j2K02o10L48J12k21L71j32j49L00m02L64
$$ y = [81, -202, -61, 301, -328, -9, 587, -310, -47, 388, -187, 93, 7, 131, 187, -217, 151, 65, -487, 226, -21, -459, 109, 29, -15, -32, -185, 257, -337, -187, 283, -461, 149, 341, -127, -75, 146, -104, 3, -138, -20, 197, -173, 376, -147, -383, 536, -198, -173, 233, -112, 54, -229, -235, 182, -331, 49, 259, -390, -90, 173, -199, 268, 105, 150, 32, -223, 161, -41, -140, 283, 11, -363, 271, -72, -97, 171, -151, 220, -158, -90, 256, -383, 64, 157, -583, 364, 70, -250, 238, -273, -108, -22, -229, 182, -81, -158, 478, -171, 34, 438, -157, 42, -18, -125, 196, -228, 269, 340, -317, 125, 159, -242, 311, 193, -130, 218, -147, 205, -109, -142, 492, -28, -216, 223, -137, -110, 156, -341, 127, 104, -164, 313, -197, -16, 201, -346, 193, 67, -226, 127, -202, -140, 280, -243, 101, -67, -236, 346, -133, -96, 219, -387, 58, 42, -256, 39, 57, 45, 247, -363, -15, 97, -124, 247, 115, -34, 266, -136, 228]
4868B28N9l14M33m44p5L00m45J2M71l58K07K9l26L19l56O0L30m18M63j08k23L82
4890B26l39N3M07n16M16l42o9M98m90J16L04o54N39L2n17M74k24J32J05l97J62
4911h4K83n36N33k99J31P5k68L47J4l46L83l89k5N52m50K14K8k46K70j22k50K73
4933H8j31kJ74l09L43k74j30O92o10l0J75j58K87l0j13L74m65K75N7m94L84pk91
4956a95K98j50Q8j1k50M82l33k50O27k07k25M50m88L05j41j52K23r8j12M20n51
4977b70J21M71m54J28Ql63P55l43m9J3o1J73Q0l39K81j26r3K62n19L17J47j66
4999b7L79n07K57J21m01K83J11m27J61J19l06M65m87L63j69qK60k80k09N33l03
5020g2j10M13n14M47j45J17p3l83M28J66m42L22J72n06K91n0k84M68m27L08j15
$$ y = [228, 287, -27, 406, -38, -113, 187, -258, -246, 225, -133, 74, 103, -223, 96, -260, -200, 130, -288, 175, 67, -156, 226, -113, -60, 347, -169, 247, -95, -164, 334, -156, -40, 264, -390, 149, 181, -336, 138, -86, 46, 151, -246, -84, 199, -337, 196, -103, 28, 103, -165, 182, 196, -150, 233, -156, -181, 371, -79, 135, 163, -83, 187, 65, -185, 88, -43, -45, 129, -180, 163, -111, -241, 451, -159, -189, -14, -172, 115, 85, -28, 346, -119, 156, 213, -281, 103, 96, -195, 103, -47, 41, 30, -220, 262, -71, -321, 306, 99, -126, 324, -164, 141, 0, -152, 71, -27, -139, 281, -270, -149, 322, -132, -4, 4, -359, 396, 53, 4, 17, -44, 129, 209, -130, 151, 25, -68, 194, -325, -8, 139, -27, 352, -155, 102, 223, -178, 105, 216, -211, -50, 69, -237, 228, -259, 104, -65, -73, 187, -93, -302, 231, -72, -182, 231, -283, 164, 19, 136, 63, -320, 108, 274, -168, 154, 326, -180, 111, 61, -223, 245, -182, 126, 11]
5041A1k92N07k41k04L97m39KO65n31J63k74J23M0q0K26Q0m19M43j30j95L21k37
5063f4N1J19j28k1M9j27O56q19J71K71m86K93jr0K13k28K29J81o75P37k46k30
5085a45M19k03l10M80k23O2o8r6L43l75J51L67n74p3L88m40K17K74m15L88l01
5106a34P3K22n23N74k14j44L86j84l15M32p2j14j13K61J87m38K25K61n69L67l0
5127A38j83K88k02N8j52j14N85m21m09O33j18k19M08l48j69J59qQ8l96K96M33
5148C47q12N37K48p36L45K75l11J15Q3J31k42k94P64m74j35M59n61k2M02l16J79
5169a8j9j8J87l97J55M52n96L03P4l36K53j33L5m7Q8J9Q5k16M46j12k94N70n29
5192d8k35N11k16k9O8n2J51l37K65J61q09N77K31p06M80Mk2K50o68N67l29Q1M49
$$ y = [11, -281, 226, -15, -219, 178, -261, -259, 406, -125, 38, -236, -113, -73, -153, 73, 153, -266, 177, 47, -148, 173, -64, -13, 106, -22, -43, 6, -121, 535, -284, -113, 158, -328, -35, -36, -126, 87, -141, 88, 269, -406, 331, 85, -145, 274, 71, -239, 241, 18, 80, 12, -84, 259, -116, 35, 402, -172, -245, 143, -297, -80, 194, -221, 167, -134, -61, 161, -362, 212, -2, -146, 240, 56, -259, 173, 101, -13, -126, 135, 322, -116, 109, 370, -199, 168, 138, -45, 243, 41, 99, -53, -167, 418, -3, -412, 221, 103, -116, 292, -56, -225, -66, -74, 14, -382, -86, 347, -465, 72, 320, -416, -71, 204, -107, 8, 91, 222, -20, -314, 450, -24, -159, 300, -261, -283, 119, -197, -18, -37, -55, 132, -265, -110, 342, -254, 49, 123, -213, 40, -93, -58, -105, -17, 2, 87, -129, 317, 205, -89, 481, -48, -283, 228, 12, -17, 51, -1, 150, -187, 78, 239, -570, 7, 238, -468, 12, 16, -6, 244, -424, 143, -186, -105, 344]
5215C44n12l8M97m31N0L27r7L0n31L35J51l49J84K84n87L18Q7l05L36k06L89l63
5237h7p9L60m47P3P23o07m0L91l80J53k83K10J28k64L29q2m97P21k53l18M65m40
5259b24J24J39k25K38l86K04L57m04K3K86n30K01K96k57J12J12j39O9k26M22j15
5280G7m37N99k98j48M61l61J36J31j80K49k56M5K32l84L4M6k45L52k55J55J49
5301A02k88K82Q7m88M08M5k73L73l65L4Q9m6j0j01K0L30n17J76L58m19K96J21
5323B14m56K69M1k60J16p2K76j39k26K95j35O9R2j47O2J01k03J73j94n1J76L9
5345D0j11J57k17K51n7m6Q9k72K35J17l45K89j22k61M90l04N1K21n29Q9K50j88
5367a73K05j28j20K95k50J90K03l62M13k46j13J90l81L84J0m67M72J6j2J30m23
$$ y = [344, -168, -206, 291, -140, -90, 237, 140, 170, -361, -26, 125, -224, -40, 244, -343, -25, 62, -243, 93, -113, 276, -87, -166, 194, -253, -180, 543, -64, -104, 287, -93, 60, -223, -13, 115, -149, 180, 98, -399, 322, 69, -249, 216, -224, -100, 39, -186, 52, -334, -130, 227, -177, -154, 132, -398, -197, 99, -158, -46, 66, -73, -4, -230, 192, 77, -360, 239, -59, -207, 254, -107, 29, 160, -20, 229, -27, 18, 250, -134, -100, -54, -299, 53, -202, -47, 102, -186, 96, 183, -305, 103, 148, -125, 248, -117, -83, 6, -40, -50, -151, -131, 199, -318, -142, 216, -203, 93, 214, -242, 27, 68, -192, -76, -148, 128, -11, -237, 58, -77, -8, 84, -63, -1, 100, -103, 70, -124, -175, 1, 40, -71, 86, -131, 120, 63, 17, 106, -166, 69, 186, -159, 130, 8, -253, 237, -67, -16, 205, -324, -235, 15, -173, 32, -96, -216, 79, -171, 19, 222, -140, 273, 27, -86, 104, -277, 107, 117, -350, 122, 138, 126, 256, -167]
5388a67K35J91l39J98q6k10M25l70N6P6j57K48j46j2L01k77j68L86k21K98j44
5409A17k88L37l56K19J64m56L10j02m7J00J1KJ99l58K23J26n19M15l8k6J7l19
5431b69J24K12l95L60j70j3L05l94J88L05m37J34K95m43M61l75K73K7l56K92O9
5452A93m31M67j85q3P9j63J49J29l65K21M8m39O61n96N21j50q6J19j16j1R9j9
5474D2nQ7k78K72k57P3J94l55K85J23k58J14j56J65J98j91j87K07k14P2J46r5
5496a8%j90K08J20l59M92j95l20L37M0l11L50j32P7k6l06L57r0p2K05m50K41K65
5519B23m30K70p7j06K24k20J01N9j86K10q4j71K74k05J2K13k37K15l20j5O08n33
5541a75Q0K02j49n1K05j50K85k96j16J60l4K00N6l20K26k62J5J11k05J9K95N3
$$ y = [-167, 68, 259, -80, 118, 32, -178, 247, -123, -67, 9, -148, 100, -46, -58, 243, -34, -202, 184, -37, 261, 117, -171, 166, -190, 29, 193, -263, 47, -55, -102, -2, 9, 11, 210, -148, 75, 201, -318, 97, 59, 33, 50, -269, -145, 67, -328, 32, -138, -151, 154, -240, -52, 253, -184, -50, 245, -198, 263, -112, 161, 188, -168, 124, 193, -238, 229, 44, -39, 40, -123, 26, 155, -210, 11, 59, -380, 281, -315, 206, 56, -30, 89, -27, -38, 61, 42, 37, 124, -154, 118, -139, -66, 128, -227, 58, 181, -77, 37, -119, 46, 244, 53, -134, 73, -141, -69, 77, -18, -18, -208, 0, 120, -239, 253, 58, -262, 75, 115, -196, 154, 22, 99, 73, -233, 124, 34, -38, 167, -283, -42, 223, -207, 63, -14, -120, 104, -116, -15, 44, -142, 68, -16, -187, 87, -118, -106, 107, -130, 85, -235, -250, 358, -175, -95, 107, -42, -93, 112, -38, 247, -49, -165, -5, -39, 161, 217, -103, 123, -139, -124, -13, -218, -199, 96, 149]
5563A49j8j20NR1n60M97J27m66L33Jj98L30l55J65j0Q2K42m45j59N99l10j63M01
5586B18l54J12J31r3J95l79K53pk86K93O4l01J79k46K19K30n13Q5K51j04R2k10
5608a71K20K20m05J46lqM9JO0o7j83J24J34m96O41j36l26K86J9j68L8k97L39k
5632A5j02P5j94J75K73l17J26O1k57R9J08J52k31j51K43J1k08J85j8l74O44l27
5654a2j2PNK57l43Q1L26o36L84K16l45J21n3jJ14k32K06R0l26L57k84p0O9J06
5678B5j34J81J36j76k1j56K19l70J82M00m98J82K38k49L3pj23L2j23M61j42k84
5700a94K49r9j62K81n1Pp8J20P2k57o7L68k59J34J72n13M62j23j73J46k18J49
5722c4o0k6J79j2J5J33k31q3K29j10J26l7j17K94k83j31K13l64L21J41m32M65
$$ y = [149, 131, 11, 16, 107, -453, 44, 171, -295, 38, 39, -159, 171, -184, -19, -29, 53, 295, -150, -309, 290, -20, -183, 218, -136, -24, 107, 14, 209, -170, 83, 76, -210, 83, 147, -154, 25, -221, -2, 228, -285, -200, 51, -53, 39, -171, 49, 269, -136, 10, 7, -1, 48, 49, 109, 42, -141, -17, 117, -379, 262, 126, -200, 86, 105, -63, -25, -322, 17, 15, -87, -12, -206, -31, 242, -75, 51, 112, -145, -46, 62, 214, -17, -168, 75, 86, -122, 63, 45, -329, 315, -12, -24, -17, -12, 245, -98, -17, 309, -327, 57, 273, -72, 49, -4, -5, 109, -123, 83, 173, -153, 204, -80, -150, -81, 25, -109, 72, 208, 32, 11, -145, 74, -296, -114, 286, -212, -30, 208, -41, -8, -15, -138, -106, -229, 232, 90, -194, 55, -44, -206, 75, 24, 31, -47, 73, 145, -112, -179, 189, -70, 64, 236, -277, 185, 62, -111, 35, -183, -34, -94, -120, 59, 47, 62, 195, -36, -119, 110, 0, 126, 89, -28, 266, -17, -148, 65, -299, 22, 163, -269, 196]
5744A96j64q9J84k74L78j58k05K66k84J46L65m29o4J31QK03j32j29K79m09J36
5765d5j0j05J70J26j42O1k90J15J94j71K23j60j30K81j43q3O8n6J22J1L0K8k33
5788a39K17J67m98Q2K99j95Q8J20j99J43k64K34L3k05K71j41n3K68k22m0K82l58
5810a10l9J6j9L19k97J73J31l97K40J55k22K41k30P3l9k18J70N4l3K93l14J5K35
5833A97l68L40j98N6o7Pm3Q2J8J66k38k9J23o0j15N3J05N8R6l11R5K55j92K19
5857B49j77rL54n66K4N1K27k9o6n3M7k38K50O5k39K44j00l3n5J37Jk46J31L6J18
5882A23q8j10k07L27J06m90M76k40N7K52k12pJ75j76K5l6O1L20k18k74j26P2K71
5905H1K8l09J81j85K96r2k19L15j48JJ05p9J14R2k76K69l04j28L79j21J22Nj55
$$ y = [196, 32, -57, 127, -147, 231, 73, -132, 134, -150, -4, 361, -68, -132, -1, 7, 210, 78, -51, 228, -181, -45, -55, -160, 10, 136, -6, 55, -235, -120, 74, -97, 126, -34, -164, 117, -26, -109, -41, -97, 25, 36, 66, 94, -139, 78, 245, -253, -171, 128, -67, 21, 141, -58, 85, -179, 55, 88, -117, 154, 13, -40, 228, 6, -34, 248, -110, -149, -133, -152, 167, -130, 43, 174, -223, 17, 172, -50, 191, -39, 34, -5, -223, -53, 1, -32, 261, -53, -38, 197, -171, 169, -29, 27, -40, -33, -76, 6, 24, 190, -48, -77, 46, -14, -129, -76, 29, 87, 183, -128, -33, 222, 30, 249, 72, 63, 417, -149, -125, -74, 153, 124, 58, 5, 52, -186, 64, 129, -110, 134, 34, 1, -54, 83, 84, -162, -31, 5, 123, 35, -75, -282, 45, 151, -339, 137, -103, -46, 206, -6, -13, 162, -14, 11, -25, 36, 356, 138, -136, -262, -190, 81, 109, -200, -19, -204, 92, 0, -219, 96, -52, -51, 54, -25, 89, 181, -95, 174, -130, -258, 121, 0, 122, 127, -28]
5928b8J63j21k19L68j19K0J92m55K95j37J39j17k13j26N27k93K06K49m27Q3o5
5949g8rK94m95L53j29nP1n2j05K9p5K25P5k31J87k21J52r4J98k36K79k88J29J32
5973A06n1N1j35k08L22l3r8L74o98M09J62k41J71k69J46Q6k56J43P7j79K47j97
5995g1J24J57l08K22m03J23K50jp3N0jj28J24j16K53l35L2M4j04L47l05o0L25
6018A46j71j23K01j79K43j00j65K95k77K35j43J0Q2l6j08J89o5j38J79j33n5J81
6040F8n5j46P2O2K24l29J86l1k77J49O0M8J27l57J46J30j94Q7j5j22K16q5l7J1
6064f2n3J36P0l98J66L5J0K34j16o0P6j34J42k89P0R1j37J11O8o4O0O1K3L5j32
6089e7R3p1m5J32j02j80L89j40j56J71j65K69k00K3r7N8p8L58k71J53j53n5Qm
$$ y = [-28, 135, 14, -205, 163, 44, 64, 256, -199, 96, -41, 98, -19, -232, -358, 169, -124, 82, 331, -96, -13, -78, -87, 207, -288, 65, -64, -69, 2, -50, -155, -126, -201, 24, 99, -132, 55, -166, -14, -108, 90, -146, 133, -155, -26, 106, 55, 106, -29, -237, 85, 52, -46, 328, -370, 39, 201, -40, 131, -138, 8, 94, -162, -19, 58, -121, 126, -71, 53, 210, -98, 124, -279, -156, 94, 93, 20, 70, 69, -59, 65, -51, 202, -133, -101, -57, -161, 186, -119, -179, 146, -25, -148, 53, -126, 117, 17, -148, 147, -130, 105, -38, -28, 54, 18, -90, 99, 34, -104, 75, -58, -113, 68, 13, -133, -61, 1, 225, -104, 82, 51, -226, -77, -17, 31, 158, -199, -53, 77, -117, -30, -45, -167, 49, -36, -73, -62, -115, 21, 91, -307, -141, -106, -96, 138, 22, -38, 38, -96, 46, -243, -173, -82, -219, -108, -40, -104, -44, 17, 40, 75, -57, 36, -35, -80, 52, -50, -230, 159, 19, -137, 34, -131, 138, -62, -39, -136, -78, -156, 202, -69, 84, -69, -124, -116, -120]
6113a20J65n2j86K28J48l64J97n5j8J27k1r4J37m9K04j84m7K69m56M0L61l27R4
6136cP4kk9j07J56k47J41j0MM1J73k30K31j80j94P5J06m3M5J25m9J21m12K19J06
6161A11m73O56j38k07J30j41J17k75J68K86j48m2J35l98K00J3R2k36R7m8J25r0
6183f6J24p8k73K58K53l68Q1P6J10l6k92L93k71j31K92k08M9J25k07J89j37J88
6205G1kJ9q2R1l80L53j59l4M9J33j67P1o0J20Rj30K82l87N2K09p0M5J12l81J38
6230i8J46j06Q0jok28j9L17j74m0J82n0j2l2J07j85K97L7pk59j06K71l12J84K66
6255B52l76J9J46j08K27k22J03P7l27K69n2j98K78J33l01j15K51l5q3o9K47k29
6277a13J49Pq7p3ol5J24K14j82M4j34L29k08p9J80j25q2K00k05M0J60m8r5j1L01
$$ y = [-120, 45, -7, -193, 35, 183, -181, 16, -39, -57, 70, 49, -45, 92, 43, 247, 63, 16, 285, -171, -131, 230, -97, -3, 71, 69, 40, -67, 89, -158, -17, -27, -23, 18, 191, -39, 192, 12, -182, -107, -1, -44, 1, 126, 77, 198, -214, 5, 111, -362, 294, 156, -51, 79, -62, 55, -220, -52, 234, 86, 44, 179, -219, -19, -6, 86, -150, -53, -101, 24, -66, 58, -20, -293, -35, 218, -150, -69, 7, 117, 81, -211, 182, -89, -220, 72, -136, -87, 38, -169, 20, -117, 71, 69, 88, 6, 97, -283, 70, -89, -123, -74, 59, -108, -37, -97, 23, 32, -98, 184, -203, -151, 58, -12, 33, 145, -236, -98, 48, -58, 22, 21, 15, -213, -232, 85, -89, -129, 53, 3, -9, -41, 66, -119, 178, 215, 208, -51, -157, 114, -198, -14, 252, -124, -105, 41, -67, 160, -62, 41, 118, -209, 60, 8, -190, 88, 221, -80, -195, 56, 21, -62, -131, 116, -113, 36, 43, -44, -117, -123, -158, -34, 180, -2, 42, -92, 237, 29, -50, 130, 5, -77, 123, -82, -42, 118, 70, -25, -36, 265]
6302B65J60n79L21j61m0k5J12o8O7q4J33j13m9P0L1j58K04J1n0m8k89L06j25J33
6326B4J7r3K45k31m3J36p2J20J9j53J28p1k63K89q9Kl8J18j26L58l86K4Q8Q3M5
6351A31k65O9J87m47M08K3j96J68j00k73N40j93j03K2j38K26k48J39OL2j7K38
6373B09j90J08j5r7Q6k55L7L49k57K15m19K02Q9mr9J43r8K4m6o2J07L1q2m5J28
6398E9o0N7j72q9J94R8o5j10n1J68k92L40k35N7J14p6J98j83Q9O6k09J21J55j84
6422a0J84q8k25K61k36K9P1k4j34K17j62J04J10j25Mj2J7J97k38J20oj91K61k07
6446h3l0J3R3M3M9k68K26j2N4j35k2p5j47K13J00o0p9oJ20K8j89J35j34J12q0
6471a34J5R9J95l9j82J46m3rO3k42M2l1J02r4qM4Q8j84K11j62j19J70J31k61L88
$$ y = [265, 425, -154, 167, 6, -34, -59, 53, -15, 52, -32, 101, -12, -61, 9, 40, -118, 86, 97, 47, -1, -290, 16, -109, 24, 41, -52, 193, -38, -81, 55, -17, 103, 122, -31, 97, 26, -237, 52, -37, -35, -73, 45, -81, 277, -109, -85, 3, 86, 131, -134, -65, 122, -325, 83, 106, -90, 78, -22, -295, 245, 52, -51, -29, -167, 59, -189, -50, -44, -12, -29, 209, 19, 127, 112, 15, 101, -154, -117, 232, -25, 190, -229, -27, 62, 58, -41, 102, 4, 28, -18, -80, 27, 58, -24, -69, 59, -1, 56, -116, -205, -11, 87, 22, -88, -139, 29, -263, 77, -158, -101, 13, -63, 135, -48, 41, 107, -102, 19, 174, -10, 174, 86, -139, 122, -114, -85, -14, -38, -172, 45, -117, -13, 97, -28, -24, -36, -19, 178, -60, 60, 54, -137, 124, -83, -113, -100, -7, 36, 85, -183, 43, 31, 85, -50, -72, -147, -294, -81, 19, -41, -120, -126, -6, 22, -167, -32, -166, -54, -134, -119, -20, 175, 136, -46, 100, 57, 48, 111, -131, -89, -120, -18, -112, -120, -76, 12, -172, 39, -123, -242, -72, 59, -202, 186]
6496A86k53n2K06k14J81j70l1K00j8k31K01j42J21J27M0o2L6m43K80P1Q3j2N9
6519A63ok44n1L18j53rK8j55K35l3j23K9J23j61J59j15J13j10j16O8J76j18o7
6542d9RO4M1J20j72k36J68N4R1j3j27O1K2J36l19J61j81Q8K60j70J54j42o3J18
6566G5Pj54R1j4n4K20k16N8r5J33M6k05Q4l3q1P0Pr9J39k2J90k38J35J03j41L
6592IK3p0LP1O2j32J50j34O6m9J36M6k91L88j80j05p2J23m6l8OJ86n7K8l4j86
6618i7j1J87j44K27l1j64J85k86K24P7l19J62j72K4K00m0j64K25l10J13J20j12
6640a06K46k16J2J07n8m2O6j14K42j4j0j77j47M12l0l78K64K1k30J48J22k24L16
6663B10O0j70O2j02q0k62N9L02k11R6K18k37r4pJ45M6J2P3q4M0k7L6k61M03k47
$$ y = [186, -67, -119, 87, -127, 54, -116, -147, 53, 35, -196, 5, -137, -16, 111, 151, 89, 125, -318, -38, 33, 116, 104, 163, 157, -87, -138, 180, 27, 18, 46, -109, 126, 93, -30, -1, 122, -39, 120, 5, 118, 8, -108, -40, 136, 18, -49, -40, 24, 65, 185, 13, -223, -55, -1, 90, 77, -50, 11, 33, 169, -150, 11, -170, -82, 178, 8, 162, 20, -43, 75, 82, -72, 19, 5, -49, 171, -45, 13, -82, 51, 97, -108, -24, -57, -138, -68, -61, -160, -21, -43, 147, -91, 44, 147, 6, 9, 32, -38, -35, 36, 98, -34, 116, -18, 48, -1, 135, 181, -110, 278, 98, -7, -79, 44, -2, -40, -34, 152, 95, 123, 89, -97, -108, 79, -65, 162, 131, -33, 152, -134, 90, 167, -152, 10, -162, -138, 62, 22, -142, 83, -227, -114, 6, -106, 140, -76, -64, 43, -15, -57, 9, -105, 137, 123, 113, -64, -211, 201, 171, -207, 57, 78, -152, -4, 118, -106, 210, 270, 100, 162, 60, -20, -282, -223, 79, -132, -36, 182, -55, -149, -156, -11, 35, 47, 120, 36, 76, 49, 85, -176, 227, -20]
6688b0j14J18p1Q0N6n0j11r4l9K43j9J47K8k2j57j90J24K05j24J03J21k54N8j19
6712a01J21N3j90J22k38J24K10k02KK76k47n7J52j17Q6n2K65j6q0q3J6m9K03m35
6736b37K23Q6o6j61jJ1K4P4J2O7j48OK19j27MJ22k84K81J7J9j84j18L39k67J01
6761A2N7j13L7N1np4J08k18J1n4K89K6k8p6J83j42k45O8J75j7j20K05K4l27L10
6786A37j35o8R5j28j34K88N8m22J49O4K37k22K03N1j28k31K08j06P7l8J49Pj93
6809h2K73k48j16k8j5J89N5j17J67JQ3m1q4O5j4k31P6J0p2J49J27j79N4J3j52
6834a17M8K06k08O0o2K78j84l3j14k9J54j20p2J98J3o6M0L2o1R6j31K39j51k66
6858b50L11l7R7k17K13k22K29K2l3j19K14k80j9K53q7qq8n5jJ20j27Lm0J07J81
$$ y = [-20, -134, -16, -87, -7, 49, -1, -112, -206, -245, -2, -21, 126, 154, 132, -25, -215, -91, 114, -10, 93, 214, -40, 18, -101, 20, 73, -117, 5, -233, -109, 101, -101, -99, 177, -70, -127, 25, -92, -6, -58, 207, 191, 111, 28, 44, -5, 198, -237, -14, 72, 6, -155, -156, -145, -121, -47, -35, 32, -116, -110, 109, -18, -14, 108, -176, 105, 122, 141, -43, -161, 178, -89, 12, 69, -44, -7, 44, 39, -35, 73, -145, -134, -188, 101, 127, 99, 23, 206, 64, -181, -113, 62, 45, -75, 130, 154, -173, 137, 2, -66, 29, -99, -233, 55, 113, -309, -160, -96, 141, -81, 122, 173, 45, -186, 22, -84, -7, -45, 104, 111, -82, 191, -57, -173, -201, -216, -27, 28, -89, 78, 79, 162, 121, 37, 102, 88, -143, -67, -57, -129, 20, 147, -32, 22, 35, -117, -69, 137, -71, -11, -73, 205, 21, -12, -126, -155, -1, -121, -193, 5, 18, -48, -8, 24, -37, 59, -72, 167, 16, -250, 61, 24, 121, -96, 117, -105, 124, 146, 113, -6, 208, -72, -91, 162, 75, 67, -21, -76, -77, 43, -84, -81, -121, -14, 167]
6883A67l20J48K11j90J7q1j0J9J27j40J77k28J17l2J95l01J34N6j57n7M42k44
6905E0k8P4P7q7j35N7L4p3PK25j95j58J04J02r9p4K06m0j13%K33j02%j19O0j08
6931a02L0JNn5R1j19J03J0M8K1J0j08J6K4n7K41k03r6L39j97J7J01j86N2J34l3
6957H7j40J39nl2j30R1q4K1L5J81o4n6j88J45J20k35P8K4J4K3j24K10p9q2Q3j4
6983A8J10j41J54L9j65N9l4j67O2J40j21j12L50m80K02j71L70N4j66R9k26p2K77
7006G9k39J97j44p7L08k6k00L28j14j18l2m4J14p3o8j63K95j52J59Lj1J74k31
7029c5RR1N9m8%m3M7l0K7m8j32J01J2j40R4J17J28l18o1K41q0R9j21l1q9J65j45
7056a31J85Mj15K09j25J6o8O5n4R0q4J78k95J25J77O2l59K61k18R3j23m1P2j3
$$ y = [167, -153, -5, 206, 16, 33, -48, -58, -39, 88, -52, 125, -103, 14, -18, 177, -124, 10, 66, -91, -148, 294, 50, 22, 96, 173, 86, -49, 8, 42, -31, -24, 201, 6, -152, -48, 54, -45, -119, 87, 47, -66, -66, 167, 65, 65, -54, 6, -102, -72, -71, -66, -121, -30, -149, -46, -36, 12, 33, 43, -65, -49, -25, -82, 159, -44, -140, 199, 2, 19, 120, -66, -14, 120, 87, -53, 86, 81, 49, -81, 10, -74, -53, -18, 163, 99, 43, -145, 0, 120, -115, -37, -13, 1, 24, -100, 110, 31, -51, 32, 18, 128, -13, 141, 180, 15, 74, 40, -127, -65, 75, -46, -158, 192, -288, -86, -257, 113, 167, 1, 100, -126, -198, 79, -160, 37, -107, -184, 124, 98, -102, 226, 112, -6, -38, -82, 32, -41, -109, -272, 23, -129, 30, 33, 22, 196, -35, -26, 65, 124, 76, 76, 33, 80, 50, 77, 29, -103, -2, 10, -130, -36, 81, 209, -109, -170, 71, -9, 90, -31, -62, -151, 14, -131, 54, 58, -57, 152, 27, 43, -25, 40, -14, 76, -8, 170, -125, 0, 177, 239, -120, 141, -77, 16, -107, -148, -76, -89]
7080h9k8J13L3k2j29P2K41k95K66L8l71nJ14Q3L9L1m0l4J9l0j18K86j31jn6Rk24
7107b29O7J94o2K09j33n0p3J42r7J79l74L33l5j22J0PN6j31K57l0m8L1j46J85
7131A40j37m4j76N6J74L9J26k72k0M67l56o6K9p3k1Q0J74j55M1O0l2J14r0p7K63
7156B44l45O6R7j64J7J16j09Q5m1P6J4J7l03K43R7J27k12p8J99k47J2J06m1q6
7180a10J73k01p9L61k40N1j15J11P5j04L70k31n3r8M2K8m5k5R8J80j01j88J20
7203A9pK1kn9K31p2mp3L1j50J63j44J19k6J6j39O9%RJ48Q9j55k35M6L4M8Rm1N0
7232ek07J08J94l19L59ml27K83q7O1J02k97K45Q1k29K8k5j3J24q8j09J34k8J45
7256A26j0J12r6j20N7k41J09J72P2k1j48Q1k32J50mO5j07P1j81MK57j84j10K53
$$ y = [-89, -117, -4, 29, 7, -122, -50, 191, -104, 162, 200, -171, -176, -62, 21, 60, 91, 51, 17, 36, 6, -112, 174, 43, 42, -14, -5, -229, -162, 32, -30, 179, 46, -4, -77, 65, -32, 147, -227, 106, 71, -51, -41, -34, 22, -109, 148, 118, 70, 101, -45, 140, 3, -41, -217, -161, 13, 52, 178, -94, -114, 353, -3, -69, -40, -113, -134, -54, 120, -35, 6, 66, 34, 148, 58, -19, 244, -101, -35, 62, -102, -85, 31, -78, 7, -34, 42, 56, 73, -230, 13, 110, 237, 25, -53, 146, -101, -89, 17, -24, -110, 63, -138, -217, 144, -96, -45, -160, -49, 26, -78, 292, 61, 8, -90, -48, -20, -65, -90, 8, 188, 87, -101, 19, 12, 33, 31, -28, 203, 131, 127, 54, 85, -65, 98, -46, 73, 47, 63, -76, -7, -7, 2, 150, 239, 84, -151, -105, -71, -23, -14, -55, -5, -212, -104, 90, -229, 130, 126, -201, 82, -5, 56, 158, -139, 106, 187, -42, -14, -39, -52, 72, -16, -125, 9, -19, 126, 116, 228, 132, 12, 69, -172, -63, 109, 181, 160, 12, 93, -139, 11, 7, 72, -35, 36, -145, -141, 116, -68, -178, 75]
7280G5n1p2%NK66m32K40L7j04k0M5J45j87Q7o2j81K47j59J87k0j06J30p8j86J50
7305d4L8k6J19r5R0j58P1mo3%m8J07L14k50p8P7K2k34J08K2K73o6k35J46m1j64
7331a19J83p2j92J98j1p2K85j43j08J54K4j12j07J61P4k41Q6r3J36j02N8J17j70
7354f6K6J55k97K02k02L6K71j99L28k24j16O2K1k6o1K70j99M0m0o4Q3L5pm3P8
7379F3m1p8j09K30j55J72j4j02O3J7o0j26K11j82j14K39M0n0n0m1J45J00j91J00
7403F7m9J3l9J21k03J16j5j93R6N4J0J3N8K14k42j15J7j50K15L9qj23L07j48q
7428D7O2j00P9j22k04K18J21p6K0jK19l17Q4J20j18j8MK0N3j07J25k20P2O8j82
7453a53J42o6J07L9k27L3J12R0J2k03P1N0qP5k2j16N5J09k44J98k43Q0P3J05l7
$$ y = [75, 24, -48, -48, -43, 223, -209, 31, 68, -36, -56, -11, 134, -53, 34, -28, -209, 38, -121, 66, 46, -60, 70, -8, -194, -44, -6, -32, 87, -8, 82, -76, -5, -9, -72, -72, -120, -13, 301, 51, -27, 50, 72, -162, -54, -32, 241, 175, -60, 86, 45, -119, 64, -8, -200, -2, -13, -85, 200, 57, -51, 103, 127, 15, -92, 69, 143, -98, -12, -105, 31, -71, -13, 104, -66, -40, 115, -182, 20, -182, -146, 125, -74, 254, 30, -86, -24, -3, -29, -90, 180, -19, 21, -19, -83, 0, 35, 28, -15, 63, 22, -56, -165, 65, -90, 82, 68, -34, 29, 46, -14, -140, 71, -111, -225, 14, 54, 4, -46, -87, 58, 158, -33, 67, 18, 31, -8, 113, -90, 26, 11, -182, -86, -32, -22, -9, 49, 263, 21, -94, -77, -227, -12, 27, 19, -104, 203, 55, 47, 109, 9, 88, -34, -238, -20, 101, 25, 45, 44, 263, -54, 30, 150, 32, 14, 18, 38, 91, -16, 109, -111, -39, 29, -153, -11, -77, 30, 69, -158, -125, -13, 77, 89, -114, -43, 7, -1, 74, 52, -64, -9, 100, -144, 54, -189, -109, -36, 69, 32]
7478C2l1R9j63OJ6J5J1j60K43p1L1n1m6R3j40N8J35k67J37R6NjR1j14O9p6q3M8
7506a8P1n4j57L49k75j5J39k31J36J48j6j60J14q4j91J68%J58j69j7o0Q1O0l6
7530e9J0m6J77j22J37J7q8m8j85K12l3J49k06K15q5j0o4J1J18j16J31j36j21K43
7554A01j12J3j64K07m4L3J31K8r0J20k31j5K2J10j80P1N9l7J82k20j32K24L1j64
7578e7K61m11M6J91K0j2j65K35m2RN9n0k04K94k83J68O2j01l1R6k9k56J34j09
7602a75J59R1j03L8M5j02K4J44po6R2l32L05r5l2l2Q7k66K56n7j85l2K01K2O4
7627D4j33K15j8j54P8j26J38j00J24k13K32o1r6N9nL5j32R2l1K7q3K07j5j58j08
7652a82N1j1N8J09lR6o4j8m9oj9K21k06l3O3j96K90k64m9J95J58j47J15j3j22
$$ y = [32, 1, 100, -63, -57, -41, -26, -15, -175, 68, -3, 28, -23, -69, 24, -116, -58, 77, -190, -53, 43, 48, 47, 138, 24, 93, 17, -66, -18, 53, -1, -158, 191, -84, -99, 40, -191, -55, 93, 77, -83, 31, -53, -244, -76, -76, 82, -87, -104, -164, -83, -23, -59, -49, -95, 82, -40, 97, 114, 26, -22, -207, 5, -28, 121, -85, 130, 45, 35, -29, -18, 100, -16, 115, -21, -142, 101, -11, 2, -162, 45, 1, 34, 165, 193, 103, 223, -8, -23, -1, 109, -71, 0, 59, 22, 204, -16, -148, 76, 107, -57, 204, -207, -161, 30, 50, 38, -127, 108, 66, 75, 134, 84, -120, 174, -109, 59, 121, 20, -11, 85, 56, -200, -66, -175, -16, 75, -28, 10, 55, -47, -23, 121, 114, 48, 140, -192, 113, 18, -14, -46, 41, -225, 31, -26, -211, -243, -42, -20, 44, -89, 126, 108, -46, 32, -94, 44, -56, 68, -145, 87, 26, -70, -11, -16, 19, -113, -21, -52, -25, -108, 99, 84, -74, -182, -131, -142, -84, 25, 22, 118, 54, 36, -13, -19, -38, 183, -23, -56, 7, -189, 101, -163, -212, -17, 141, -6, 109, 96, -26]
7677b6N3L1n3j31J88r3J36o9j47K62j76oj8R7j11J2J18Kq0k0J3J55k28J17K0k40
7703a94J63R3m9N6j27j46K07r9M2M8l4m8J83k3O1r9l4Pn9J10J93l50J8K93l05
7728i3K10r2k09J87m9k3l8Q4J04l00L57k8o7p5J23j6k28K15J47Jj23n2n6J07k34
7753a48L2J08L1N2k18qJ07Q9J20j26j10j72L56k43O5j3J88k6k8K50l65Q4q6J4
7777d7J4J25l2pN9k66J58K4r0n8K70p1m9L4j05J06j27j3J29j7k6J18k28J63o2
7802Bm4K66j59j15J50MNo0p9l6R5l0pk5M5o1M9J18j45K30k17k38K69j7N9j23p0
7829a34R7j5O6J64j18k00J28J02j0j11K9m1L0N0M3j84L6N7J18n6j11J44k25J88
7853D7k18J35P0mj79L42j63j72R7J80j08J5L0k88M1J99n6N3n5R2M9k06J83j39
$$ y = [-26, 27, 58, 5, -126, 62, -31, 105, 36, -111, 151, -25, -31, -49, 48, -63, -51, 67, 69, -11, -31, -18, 137, -91, 26, 46, -194, -31, 62, 13, 69, -58, -204, 3, -96, -54, -6, -40, -88, 95, 72, 133, 34, 0, 7, -52, 58, 251, -99, -81, 212, -93, 117, 25, -184, 3, -46, -69, -107, -23, 81, -219, 138, 110, 43, -32, 91, 75, -153, 62, 209, 210, 87, 35, -21, 86, -148, -116, -8, 23, 75, -143, -151, -44, 45, 165, 39, -71, -243, 113, -130, -65, -78, 110, 84, 56, 306, -59, 25, -61, -47, -33, 92, 60, 53, 112, -154, 4, 28, -62, -120, 150, 79, 30, 64, -41, 65, -62, -75, 54, 37, 11, 129, -99, 64, 2, -42, 224, 65, -50, 100, 104, 109, 49, -30, -66, 29, -1, -8, -33, 12, -49, 0, 118, -27, 203, -14, -252, 17, 0, 59, -64, -134, -37, -52, 14, 178, 60, -140, -12, 90, 80, -31, -2, -43, -13, 37, 80, -104, -68, -11, 107, 51, -60, 84, -141, 47, -171, -36, 34, 30, -149, 193, 30, -142, -45, 135, 27, 42, 72, -216, -175, 24, -32, 21, -34, 58, 107, -99, 84, -55]
7877e5J61j06p0P2J07k48K58M7j03J32j85Q9L31n07K33q9j84K31j28Q2j90R5P4
7900D7J00k78L3J30P6q3k24J35N6q2pL10l10q0L30j20J40j10k36K42j10jQ8n3
7924gK1j18K14P6k08jR4k11K96p0j80K02j59J34o8q7j09Q4j0J90j80k8JJ9N7N6
7950HL2J52k50J46j68j7J03K5m5rN5j21l4m3J96N6k78K06Q1p4J40j29qJK89k78
7976C6n1K7k4j25R5J38n9j3l8j14K05j07j99Q6K50J37k20j31L96n01L65p9q5p3
8000h4o7J72j0k28J63K38l49J68k2R0j49J90k27Q3J36L9j62L1l7M1j07K06q5o8
8024c8p0R1K31j56J5N5k85K74j11L9m1q1J9J63j00p7Q5r8%J47o0mn0L12k74J45
8050A31p0j14K43r8o6o7ON9m9r0J36pm9K08j31r4J39l0J2q3J6K7q2P8j35M4j0
$$ y = [-55, 106, 0, -70, 2, 109, -139, 119, 166, 63, 195, 10, 99, 430, -77, 156, 67, -117, 114, -14, 68, -122, -27, 47, 147, -131, -98, 32, 108, 25, -199, -64, -8, -90, -97, 213, -97, -177, 153, 33, 173, 63, -173, 69, -41, -42, 46, -7, 14, -104, 110, 186, -22, -23, 71, -140, 156, 86, -94, 108, -51, 83, 15, -72, -181, -97, -107, 83, -97, -125, -124, -105, -48, 8, 40, 192, -58, 88, -80, -97, 6, 31, -14, -23, 32, -89, -123, -166, 30, 86, -192, 14, 95, 21, 161, 32, 24, 25, 314, 36, -15, 12, -12, -137, -42, 96, 37, 24, -14, -128, 77, -30, -229, -143, 107, 244, 24, -107, 289, -212, 153, 74, -11, -84, -151, 21, 11, -217, -54, 184, -165, 3, -19, 71, -78, 112, -115, -32, 104, 143, -19, 12, -25, 16, -91, 115, 30, -38, -108, -17, 214, 58, 73, 128, -157, 117, 6, 45, 4, -77, -58, 105, 5, -72, 13, -85, -85, 62, 2, -2, -52, 260, -14, 131, 61, -53, 190, 92, 26, -41, -35, 24, -25, -115, 21, 14, -35, 173, 42, -52, 87, 57, 69, -14, 2, 29, -53, 25, -110, -66, -76]
8077g6J33pL2R7k37J22O9r9k8O8j84K48k47M4J12j08M1qJ32q9q2J56j7r4L4J7
8103B9J2Qo0k23K83j13K74l40O6K86k73M0r0o5K35r4j37J50n1m4P6M3k7K9P3k45
8129a58J80q6K70l89L18k09K74j82o6K4N4L8j03MQJ72q7q8J29j9j48KL3J1k4J65
8155A23j02J49j96j26K9M1R2J06j32Q6r6J56k85K97k2j78P9k3k6Q0k5J99j67j24
8179f5l2R9l0K61k22j24K29k71R6k11L31j74
$$ y = [-76, 57, 50, 82, 179, -58, 64, 133, 34, 6, 74, -110, 138, -109, -65, 47, -61, -20, -28, 104, 15, -67, 89, 72, -22, 12, 29, 41, 49, -11, -234, 49, -64, 210, -130, -64, 222, -51, -11, -101, -166, 69, -25, -162, -12, -63, -107, -31, 12, -15, 14, 87, -158, 22, -64, 206, -183, 135, -74, 200, 18, -48, -24, 30, 68, -35, -31, -23, 149, 62, -26, 103, 84, -64, -62, -29, -18, -42, 123, 21, 170, -26, -152, -123, -82, 10, 116, -16, 70, -26, 130, -155, 142, 120, -58, 21, -2, -28, 52, 27, 226, 59, -65, -97, 2, -28, 233, 11, -113, 116, -155, -59, -270, 61, -113]
8191a13
$$ Imaginary data points
##PAGE= N=2
##DATA TABLE= (X++(I..I)), XYDATA
0@%%%%%%%%%%%%%%%kJ0j6J6j6J6k4L2l4M2m8N6o9P8q9J04j20J37j55J75j99K23
37A17k50K82l16L51l91M37m85N37n95O57p24P99q81R69j066J177j298J429j577
56h28J745j935K151k400K693l039L459l983M652n546O804q737J2240l0398J00701
71G7579q1942n6661J02409q3850l9510M5007R3805j4153o9514R4201o8033j63931
83a64593J59825L2446r6985J11155K6642q8770k6788M3177O0744p4861L4788R0896
95A07676j60954j6864J13114q3756L0133R3906m1980m1904j6594L5362l1417l9435
107e2713J37528m0566j21846J13940k1971r5584Q8788M5585l1475m6603J8501
118f416L8082j03827L9334J18318j03934m68O5222q4915k564L6834N837O065k2709
$$ y = [0, 0, 0, 0, 0, 0, 0, 0, 0, 0, 0, 0, 0, 0, 0, 0, -2, 8, -8, 8, -8, 8, -16, 16, -18, 24, -24, 32, -37, 41, -48, 56, -64, 73, -82, 93, -106, 117, -133, 149, -167, 184, -207, 230, -255, 282, -313, 344, -380, 419, -462, 507, -559, 618, -680, 749, -828, 917, -1018, 1133, -1267, 1426, -1613, 1846, -2137, 2515, -3031, 3773, -4964, 7276, -23122, 77579, -4363, -61024, 41385, -42465, -81975, -36968, 56837, 42684, -26830, 67371, -662, -164593, -4768, 27678, -69307, 41848, 68490, -20280, -47068, -3891, 56853, -18008, 16780, 107676, -53278, -70142, 42972, -40784, -10651, 83255, 41275, -629, -17223, 18139, -13278, -52713, 84815, 44249, -77597, 36343, 14372, -81212, 7576, 53161, 21686, -24917, -6416, 31666, -72161, -32827, 85491, -18443, -18911, 46311, -38604, -41168, -4334, 1503, 7568, -15141]
131a5141M2637l4268n7390J05634k8189o2167J01262l6629p2319M2905J7081j019
143B397k4106M4996M3526j08266K8478P6698r7029K0274O0511n3699o276O555
155e941J6838k940k4231O6817k7462o0035P3804m0449m7245P3618k0824k3393
167b1443K0321J760Q160m0036L3249M0619q5381L2254M4345q0365K8168L4570
179A6221k6992J2360l227J9722j5365l0752O1086l2924l5129P3251m0746k5622
191b8117N4108k1594m380M414N053J3004n1741K8635L2249p0449L8241L0658n2055
204b1974K6872M213j1509R645k1694K6743j1545k8641M9425k9699j3018N2496
216C1314l9370M04L0008k9117Q064o905M142J5351m2880L3726J9121n5502M0030
$$ y = [-15141, 27496, -6772, -64162, 41472, 13283, -48884, 52378, 15749, -56570, -13665, 3416, 2397, -21709, 23287, 66813, -41453, -12975, 63723, -33306, -13032, 47479, -6220, -12496, -5941, 10897, 7957, -16274, 50543, 23081, -36954, 36850, -3599, -50844, 22774, 1950, -21443, -1122, 638, 8798, -31238, 2011, 42630, -42751, -10497, 33848, -46517, -18349, 16221, -10771, 1589, -1638, 18084, 2719, -28033, 33053, 129, -35000, 38251, -2495, -28117, 25991, 4397, 17, 4431, 9484, 22488, -29253, -618, 31631, -38818, -577, 30081, -21974, 4898, 9111, -2398, 7247, -14447, 12296, 751, -27890, 21535, -8164, -21182, 31314, -8056, -7652, 22356, -6761, 1303, -5602, -1460, 13891, -28989, 4737, 23858, -31644, 8386]
229H386J0665l5769K4192j0422K321L680k5973L5695j3220k2034M4024k8477l142
242a0074L1526l5049J6573Q101k3312K3497j7527M960J7986l6638L0770N528l8435
255b2094L7274q991j7175K3444k1275J3950J087k4986L4288j8936j3110L3741
267A7217l0300Q388J7049k9292K4541n539j3967K5676k4594J0505J3096l2123
279a9343K9448k800k2848L1117j8105qJ6185k6187K2610l880k1937L1640j9987
292d095l756K1812k8051J8555K386k4413K9434j5094p394K2984k5374J6178M286
305G458k4968L0473j3643j2195K6743k3213J0025Q801k3381K8452j1443j4280
317a1171K9483k3871L735J2566k4587K3139q538j5122L0058k1825J354J7642k5033
$$ y = [8386, 19051, -16718, 7474, -2948, -627, 3053, -22920, 12775, -445, -22479, 21545, -6932, -10074, 21452, -13597, 2976, 11077, -12235, 11262, -6265, -1305, 16681, -19957, 10813, 16341, -22094, 15180, 6189, -10986, 12458, -8817, 5133, 6220, -18766, 15522, -3414, -16524, 17217, -13083, -4695, 12354, -16938, 7603, 2064, -11903, 13773, -10821, -316, 12780, -19343, 10105, 7305, -15543, 15574, -2531, -2539, 13646, -12541, 10069, 6189, -15748, 15892, -4095, -7851, 13961, -14090, 4465, 6851, -17562, 11872, -3222, -10616, 12368, -13006, 3172, 7458, -17510, 12963, -680, -12875, 13868, -9345, 680, 9481, -13900, 14552, 3109, -11171, 18312, -5559, -1824, 10742, -13845, 9294, 756, -14366, 15692, -6133, -4779, 12863, -12170]
330a2170J8374m532j7331K7738k0596j547K1814k3993J6046J772j6880K6476j8891
343c720l869K2976k6436J2813O521j9757K4067j2876n855K2384k4677J0325P030
356H926k2794K4172j1673j0391K6621k3205N318J2370k1678J8349q893r280K4003
369A1845k3961P686J7488k6538K0146l56j6696K1808j6945J221J3384k1879K0061
382G264k940j5620K9776j9175m960K3063k4724O386M050j3612J7718j5691M168
395d297K0455k9286J6670J0775k7334J9879n219j1795J5025j5533J0718M289j5201
408a0854K6940j3784j1605K8172k5889j495J9725k0278Q378p72l154J4150k1482
421a1948J6232J3629l4844K1556L194k7935K0797k129k563Q897j1734J6788j0843
$$ y = [-12170, 6204, 1672, -15659, 12079, -8517, -10064, 11750, -12243, 3803, 5575, -11305, 15171, -3720, -7589, 15387, -11049, 1764, 8285, -11472, 12595, -281, -6136, 16248, -8429, 1896, 8926, -13868, 10304, -1369, -11760, 14861, -8344, -3026, 9344, -12334, 6015, -2878, -12158, 11845, -12116, -4430, 13058, -13480, 6666, 6310, -10386, 11422, -5523, -4302, 9082, -12797, 7264, 4324, -11296, 18480, -695, -5655, 17408, -7316, -930, 3120, -10492, 7226, -8465, -4297, 16158, -13128, 3542, 14317, -13017, 6862, 1643, -10152, 4873, -10660, 58, 4347, -10854, 16086, 2302, -9303, 18869, -7020, -8515, 11210, -9068, -690, -1462, -4616, 9534, -11948, 4284, 17913, -16931, 4625, 7819, -20116, 681, -1448, -4011, 4886, -6848, 9940, -903]
434i03j2675L1730k2530o356K8785k7529O66J6559r951J0696n755O654M842l2570
448a8337K2779P099l3134L1451L127k5087J5092k821J374p57l727K1474k7307
461h774j0477L1597l0535K487L5847k1669j030Q012q018J01j0551K3745J909l4147
475b1503L0567k301l5346L6361P614j6901J0623l989k183j7038K965L1418k7966
488g679K555L1440m1116j367K9094j6818L887Q241K39j1230k0881L0823q65k6601
502b0278M4332o810m0704K5053L1j2832J0803J1094O840k8903L310K5641l7240
515a9663J3248L7651l8709k678J7553j9396j242J1248J9766q984k1569L0090j8826
528a511l2267M6752k830k7441K5348k455j5951j503J7102J6783k8288J2559J9793
$$ y = [-903, -13578, 18152, -4378, -10734, 18051, -9478, -8812, 7747, -2204, 8492, 2737, 9391, 14233, -18337, 4442, 11541, -21593, 9858, 12985, -12102, 2990, 169, 1543, 786, -2941, 18533, -8774, -19251, 12346, -18189, -15702, 20145, -1524, -2554, 5458, -2560, -2459, -13010, 10735, 12644, -21503, 9064, 6763, -28583, 7778, 15392, -1509, 9114, 5125, 2942, -14096, -11131, 20287, -7679, -5124, 26316, -14800, -16167, 12927, -3891, -4, 8237, 8476, -2754, -23635, 7188, 6323, -20278, 24054, 17244, -23460, 1593, 1624, -11208, -405, 10689, 17529, -11374, -8064, 17577, -19663, -6415, 31236, -7473, -10151, 7402, -11994, -13236, -1988, 17778, 8794, -12775, 17315, -1511, -33778, 12974, 10144, -17297, 8051, 5596, -10355, -11858, 5244, 22027, -6261, 6298, 26091]
541B6091n1359R010L2741k8997R189K0716j1995j1511k569K3054j2237j6289M0692
554B6536k3702l5125L8328q521j7846K7897P104r585j5403J1361J0007l4236K4007
567H22K6045m6012J1548K2053l0022P043K0508J880j2603o883K2513k5012j6468
580b4588M7617j8307k3624L6277j3482k1825J5295J0957k265j6745J8912O121
592A4343m2803K4704K3657l8155J8663J8727k7418k002R469P525j1629o41L0954
605B5394k8390j7076M0489k2922j4993L4642j0204j5306M257P944j551j8102K7281
618A1463R058m1017K3685J1430l7787J9119J5501j5450r65M718Q404j8186n92
631a0619L4012k6656r766L4293k7333j1890K6075n725m879J701J0444l014k4310
$$ y = [26091, -25268, -16258, 16483, -12514, -3325, 17391, 5396, -6115, -8684, 14370, 2133, -14156, 26536, 2834, -32291, 6037, -2484, -20330, 7567, 14671, 5086, -10317, 1044, 11051, -23185, 822, 26867, -19145, -7597, 14456, -15566, -8523, 11985, 13865, 1262, -5621, 16892, -8120, -24588, 23029, 4722, -18902, 17375, 3893, -17932, -2637, 8320, 6055, -10690, 8222, 14343, -28460, -3756, 19901, -18254, 409, 19136, -8282, -10284, -815, 6710, -4919, -5560, 25394, -2996, -20072, 20417, -2505, -17498, 17144, 6940, -8366, -4109, 3835, 2284, -15818, 11463, 20521, -20496, 3189, 14619, -23168, -4049, 11452, -3998, -4963, -245, 8159, -10027, -10619, 23393, -3263, -13029, 21264, -6069, -17959, 8116, 2391, -2488, -787, 9657, 6643, -17667]
644a7667K5741O182l3635K7187N651l0414J4270O847o602m53L317J3377k1486
657g685l803K8312k6564k383L0026k1713m811J4555n864r29m123J3883%k4279
671a5378K3871O82k8061K6234K492j8675J2393r57j423n667j23J7458k0535l54
685h043K4023k6485J469K1217j8195K629O501k930Q21j0454J4911K74k0866K4922
699I794k279k1266K1430l307r840Q934l231N247q740j401J6848k0231K804J9424
713A4186k2540N394J1601j4338N758j272J308L154j3210J5404k044j7476K2273
726H198o048j2204J7725p892j499M180n771J0062j0189n18J5728j9344N583J2920
740A0931j9016J0157L047r228Q246p768M456K877j3779J6036m049j2711J8984
$$ y = [-17667, 8074, 14256, -19379, 7808, 13459, -16955, -2685, 4162, -2440, -2893, 424, 13801, -7685, -11488, 16824, -9740, -12123, 17903, -3810, -8621, 5934, 70, -859, -4982, 8901, 8901, -15378, 8493, 9175, -18886, 7348, 9840, -8835, 3558, 2601, 1178, -4489, -4612, 12846, -7689, -8043, 15980, -10505, -9036, 12181, -6014, -3385, 3116, 186, 1007, -9447, 5464, 5738, -15128, 9794, 7515, -13751, 7679, 4372, -5468, 3466, 235, 5482, -3258, -4659, 12189, -8042, -5238, 14186, -8354, -2960, 8641, -5697, 61, -1211, 97, 3251, -9959, 5445, 3401, -14075, 8198, 2150, -10054, 7671, -221, -1720, 2460, -3311, 6751, -3438, -3956, 11772, -7572, -1989, 10931, -8085, 2072, 5119, -4109, 4137, -3631, 825, 3702, -10077, 5959, 1910, -10801, 8183]
753H183r970m519J2376j0513N313k18o377J2377j1567J607J2595j6511Q447N977
767G200j4189J2115l969m028Q994j1092P473J937j2189J4977o749o966J4514j2294
781d266J853O851j1266J0044l821m933J2864j2743L784Q563j5134J1078o03r226
795f955J2925q730R06Q653j2608J0179o51r913J3907r561k028J1048j3238P469
809A403K462j0180J2595p630k409J0762j3541O353L848j2003J2548n439l962J1996
823F803j1596N016N063j2249J1644m234n972J2404j0906L432O905j2241J0449
836D518k213p409J1988j0431J387P966j2914R924p30q622J2632q666m34Q847j2499
851f656Q128R71r606J2941p583j152J0785j2694O964K992j0824J1382o107k939
$$ y = [8183, -1787, -6306, 6070, -4443, 870, 652, -5725, 6652, -4915, -3308, 9287, -7224, 1223, 7200, -6989, 5126, 1157, -2871, 6123, -4969, 2504, 4441, -7748, 7229, 480, -6486, 8028, -4266, -2413, 4438, -6828, 3216, -605, -5538, 7326, -5417, -1633, 6930, -8204, 2874, 2271, -6955, 5970, -2760, -1854, 6799, -5809, 4370, 3719, -6194, 7713, -1848, -3876, 7172, -6066, 1403, 3865, -6315, 6280, -1350, -3759, 7003, -6538, -185, 3663, -8340, 4208, -1231, -5193, 6803, -4793, 223, 5286, -6963, 4681, 447, -5525, 6879, -4027, -595, 6310, -5931, 4518, 2305, -5104, 6884, -3547, -2160, 5806, -7108, 2816, 2086, -6536, 6096, -2570, -3004, 5843, -6656, 1472, 2443, -7163, 5778, -1805, -2957, 7828, -4866, 2098, 5090, -5734, 5648, -459, -3398]
865c398J0431j2062O976L994j2207J2008m677o279J1315j0592K730N004j0842
878g599J0569l722n683J2950j1354K175Q000j3221Q524K1o979J0633p903K446
892a143P102j2313J0885j03j0610J3200o723l728R460r404O035J086p022J1496
906H218r751j306J1707j4451N504O230j2148Q312k395l146P496r064P313J375
920C894j3065J4068m821q821J4644p626j198O220p521O980m819k191J2274j4066
934f048L225J0111j6368Q302N220r003P720l869N17K089r778J2904k619j0970
948h567J7227p988p795J3655p078R32L575l927O261j0435K252J1354j6276Q601
962A791R358j7448P574K306o967N245l411N939l396j0657J5628q118r080J9857
$$ y = [-3398, 7033, -5029, 1947, 5941, -6266, 5742, 1065, -5214, 6101, -4491, -1761, 3243, -7599, 2970, -752, -6435, 6515, -4839, -2664, 5336, -7885, 639, 660, -6319, 4314, -3589, -1143, 5959, -6354, 4531, 4428, -6182, 7018, 295, -3433, 6027, -3377, 2658, 3744, -3278, 8218, -1533, -2839, 8868, -5583, -79, 6151, -5997, 2315, -80, -3226, 4270, -4794, 2519, 3894, -9171, 4897, 76, -8745, 5899, -1727, -2925, 3295, -4226, 2754, -2065, -4256, 8018, -6048, -2823, 7288, -9080, -778, 4442, -4561, 3159, -710, -193, 1896, -7882, 5022, 2403, -8567, 8660, 672, -7123, 6532, -546, 386, 3961, 34, 6295, -4140, -1888, 9466, -6810, 1791, 11149, -6299, 1275, 3581, -3386, 1859, -1552, 4387, 991, -9666, 5962, -2156, -11236, 8621]
976H621r297o516J0452p157M46o23K809P779j4616P494Q081k0188J2436R014j4362
991e627Q431J384n284J91k958J2248n980p100J8234j4408q934J8938r342k512
1005b719R448m298j179p056N866O469j5522J3723N888k2682J1132M817j2602Q972
1019B57L501n09n331m335J2154j1565k873K2719j5398o789J5394j1854k643Q437
1033A165K365J024r838Q222Q39j9279J8620O519j8605J3767J089j3109L948L099
1047a74O165n933j168J3339j8817l659K1554j3909l55J5111j0896m494M72M181
1061A417J550q782J4916q06k1982J6150J477j5624J5493L110q471j299n80N315
1075A884r789L411J8156j8984j586J6177j7455K57J4183m210j397k197N180l374
$$ y = [8621, -676, -7192, 3260, -3897, -3451, -4074, -1265, 6514, -8102, -608, 7473, -12715, -279, 8735, -5627, 2804, 4188, -1096, -905, -3863, 8385, 2405, -4695, 13539, -869, -9803, 9135, -207, -2719, 6729, 2431, 1252, -5804, 62, 6531, -8991, 4732, 10620, -12062, -930, 3887, -8715, 257, 3758, 3249, -2082, -6417, 5737, -5828, -8701, 14018, -1380, -8169, 7225, -4629, -7272, 1165, 3530, 4554, -5284, 2938, 3777, -15502, 3118, 9637, -8968, 4799, 5888, -7221, -3273, -174, 5991, 58, -1110, 12229, -6588, -10247, 11307, -2602, -2957, 12154, 1258, -3236, -2764, 1417, 2967, -5815, 9101, 8295, -13687, 2463, 3940, -11684, 3809, 6919, -1552, -2851, -3431, 1884, -7905, -4494, 13662, -5322, -6908, 9269, -8186, -7929, 6254, 2044, 647, -1550, 3630, 256]
1089B56j1937J9340Q2j7123J8159l000j5847J1167K168j895j795K025O623j6288
1103h065K342J6786j8249L938J5124j5993r42O885k612n82k624J1009m229j4240
1117a1452J8144m499j4253J9413j992j0691P215n78p54n206M438R785j6157M600
1131a987J2968j9944M818J2518j2057K287L663r47k964n214J2771m844j1050J8899
1145H917o861j2148J5388m222n605N912L93J857q411M163Q600j6377Q135J0774
1159A0515j7330O391O510r869L172L49L474k560o566J2901p419r202J7408p638
1173A36o655J1897n714k063J416K99N294r678N529P512j6226Q239P170j3296P550
1188A410K737n461K060k935N493k887o196J3639q135p082J4002q657k924Q829
$$ y = [256, -11681, 7659, 7741, -9382, 8777, 5777, -10070, 1097, 3265, 1370, -425, 1600, 8223, -8065, -5723, 11063, -7186, -3248, 11876, -4117, -5059, 1826, -786, -1368, -3992, 7017, 2788, -11452, 6692, 2193, -12060, 7353, 5361, -5330, 1885, 1307, 553, -4653, -215, 9570, -6587, -1987, 10981, -8963, -4145, 8373, -3684, -1397, 2266, 1319, -1645, -6859, 5912, 1068, -9982, 8917, 2056, -10092, 5296, 1074, -4531, 1381, 1774, 3631, -4780, -617, 7983, -8394, -259, 10515, -6815, -424, 6086, -3783, -611, -262, 3212, 652, -5914, 6987, -432, -9634, 7774, 136, -6519, 5378, -336, -2399, -983, -684, 4610, -5068, 461, 7973, -8253, -14, 7156, -6140, 1410, 4147, -1314, 746, -2189, 3304, 417, -5779, 7860, -275, -7357, 6645, -2012, -4936, 3893]
1202C893n380J671k045N20N392j0379O707O176j4133Q875K907r999P769j003j019
1217d8K041m948P756m558n598J3251q911k805J0426q968Q73M264m499M422m849
1232b151J618N116j1030P352L259j1039R416p92o192O729m179K325R18n493Q729
1247D586n711l515J0837q772M98P504q161L885J48l216N610o325K861M053j0120
1262e838P919O63q073Q963l800k220N242o283M495p25m802Q634o183j354Q591
1277E229r031L692L445o694O211l049j811O033p642M701K673q193Q077k357m610
1292c326P749o425J450L486p029O492k468l795Q180p015J222N541q304N617l37
1307A038m725P079n185N38N130p857N745N60o266P710m807j048N960p089M257
$$ y = [3893, -1487, 184, -1861, -1341, 4051, -6328, 379, 6555, -7578, 1297, 4204, -5795, 1974, 971, -48, 1993, -2955, 4801, 243, -5355, 7896, -1015, -3820, 6606, -2362, -1489, 2775, -1724, 2698, -2151, -533, 4583, -6447, 905, 4164, -6875, 2541, 1749, -4443, 2286, -1893, 432, 1350, -4143, 4586, -1125, -4640, 6197, -2575, -2077, 5427, -2734, 1151, 1299, -1917, 3693, -2632, 229, 4282, -5838, 2081, 2744, -5329, 3634, -166, -2386, 2856, -3427, 1068, 343, -4459, 4175, -2008, -3362, 5229, -3802, -110, 3335, -3359, 2852, -197, -2008, 4025, -3617, 1084, 3757, -4436, 3641, 1284, -3326, 4423, -2002, -552, 2934, -4095, 2397, -71, -3866, 4314, -2701, -1479, 4062, -4242, 1375, 1038, -3687, 3392, -1793, -1255, 3875, -3982, 1763, 2323, -3943, 3767, -1040, -2088, 3872, -3217, 1040]
1322A040J302o116P509m268k027O614p572L045K580o620O810k472k646O934o697
1337b584K601L067p320O474k024l741P597n863J636M348p038O056j235m762P164
1352D376n911J38N025p579N558L76n226P190n091p17N276p518M358L75n880P477
1368B227l963j503O753o807L554J948o022O570l457j975O394o758L132L396o654
1383c165O325j624l590O227n706J602K906o275O159j893l897P143n634J62M756
1398C496o447M047k79l996O117n306J019N112p550N091J161o798O711k929j595
1413b146M953n510M081J98n426P581m435k263P311o970J203L171n323M969j786
1428c92r37N106p149L663K726q087P124m16n090O208l793M82K718m202N844k850
$$ y = [1040, 2342, -3774, 3735, -533, -2560, 4054, -3518, -473, 2107, -4513, 2297, -175, -2821, 4113, -2584, 17, 3084, -4236, 2238, 214, -3527, 4070, -1793, -157, 4191, -2847, 3209, 1974, -2788, 4376, -1535, -1397, 3628, -3951, 1607, 1983, -3243, 3947, -1144, -1861, 3415, -4103, 255, 630, -5250, 2227, -1736, -3239, 3514, -3293, 261, 2209, -3813, 2757, -700, -2675, 3719, -3039, 93, 3489, -3165, 3160, 1536, -2054, 4173, -1533, 69, 2975, -3300, 2859, 966, -2931, 4212, -1422, -1260, 3496, -2951, 1096, 817, -3179, 2938, -2368, -1349, 3763, -3787, 1304, 2465, -4333, 2378, -551, -2146, 2807, -2703, 1378, 1576, -3850, 3731, -704, -2967, 4344, -2626, -1423, 1748, -3575, 1394, -392, -1329, 3777, -3372, 291, 3017, -5070, 2054, 1638, -3452, 2756, -1037, -555, 2163, -2039, 3805, 955]
1444I55l424P357p194j78P149o639K832J607m141L817m406K003L704p819O432
1459B055R2q562P780j336l068N577l259J102j392l376P067m949k37Q510q594Q25
1475a765N284o592L640J164j163K357o322M192R92p123R486j43p269P102l588
1490B52l134L360j725L918l707j556O425q441J592Q844q143K656L705o486J278
1505a162j029K163J992n326P324j690q654R703j395n274P711k948k164m21j479
1520b649M683n161K463P232j0590K101O240q711L536L869l263O00l031L488j550
1535g43m956J0822k925p154J0120m230n111O291j015P6j634M41L291q452L886
1550a293P235j0372N045N307r115K072J872j184P7j833N482l755n818J0519m544
$$ y = [955, -2469, 4888, -2306, -2484, 4665, -1974, 858, 2465, -1676, 2141, -2265, -262, 3442, -4377, 2055, 2147, -6415, 1365, 29, -3039, 2538, -721, 381, -1011, -4387, 2680, -2269, -2506, 6004, -2590, -1765, 3519, -3073, 567, 1731, 568, 2925, -3397, 795, 1787, -5336, 4150, 4007, -3262, 3840, 252, -2882, 478, -1247, 2671, -1036, -2592, 3833, -4608, -3016, 5828, -2315, 341, 4046, -2440, -1162, -2191, -28, 1964, -3362, 3962, 2272, -6382, 3321, 1926, -3348, 4363, 1415, -749, -1170, -2649, 2034, -3127, -664, 6568, -4022, -1921, 4319, -4392, -856, 3013, -250, 350, -2681, 807, -743, -5699, 5123, 2198, -4956, 5164, 934, -4177, 2114, 1099, 1175, -459, -18, 3273, -5179, -1293, 5942, -4430, 615, 5922, -3193, -1121, 751, -433, -356, -2189, 3293, -462, -6280, 4239, -305]
1565c05n029J0586l777l600L524j500N48l079L144M182r549N117M979j0450N683
1580D74M409o509K398K32l26k158k449P902m662m107J0702o860m055Q814m370
1595e65j145K498o8N46n526L942L690r167P265L782r575N410J628m431K046l7
1611B93K640l541k720P731o521k585J0467o333j987O228m269m59J6J661J335o350
1627d394N462J761r259P365K622p224N569K9k672N02j066M214m058j455Q204p567
1643a967j609Q779o536o8M676l151J42k427K525J178o649P079J365q752P135K97
1659B017n721M706m41m42r06j065M882n476l27Q501p819J68O360o334Q83K218
1675A204j004J209l201L592L11o638P233k96o738O978j689l912L398j510J773
$$ y = [-305, -5334, 5252, 1475, -2125, 1399, -101, 447, -2632, 512, 4694, -4855, 262, 5241, -5209, 474, 4883, -1626, 772, 1004, 678, -1480, -3929, 3973, -689, -4796, 5906, -954, -5009, 3805, -565, -1710, 788, 720, 1266, -4260, -318, 3372, -5795, 1470, 5252, -4323, 1087, 2715, -1716, 330, 293, 2933, -608, -3328, 4403, -2118, -4703, 5764, -569, -2556, 3672, -597, -1056, -1040, 621, 1956, -4394, 1068, 2829, -6430, 935, 3557, -3667, 1902, 1931, -741, -239, -1305, 2909, -1149, -2604, 5600, -1967, -3576, 5203, -1333, -1401, 3275, 124, 266, -2161, 364, 1542, -5107, 1972, 3337, -5415, 1720, 2017, -3704, 1002, 561, 119, -787, -1852, 3030, -2446, -2773, 5728, -2091, -1923, 4437, -1897, -1014, 1204, 200, 1409, -1792, 1800, 2111, -4527, 2706, 2410, -4328, 2650, 961, -2951, 447, -1063, 710]
1690G10j491o94N250o166l0O647p577J958M489n087J894K14k6J550l688M553k35
1707B271o264O884k068m534N977k167j088K206k179K929l024o43N360o560J511
1722a389M278o468L295K121l491L051j860Q65J028m698N209r11m761O871k901
1737B39k143M614l326J222N05k622L751m089J21M632n829K908K826n332L523m99
1753E01j835K777l506K118P52m353N548j887k644N838l627n39L010m202K889r78
1769a38j410M504m586J281L524n539L474Q28m127L966k674m13K628l795L477l2
1785I68l840N289l234j217M291m324J744J391l402L988k066p40M371n038K322
1800E03J798m976M146j109k230M515l599J496J823m271L902j566k626M278l791
$$ y = [710, -781, -1475, 3775, -2391, -2421, 4226, -3351, -1393, 3096, -1991, -97, 117, 91, 1641, -2047, 2506, 2271, -3993, 2891, 823, -3711, 2266, 99, -989, 1217, -962, 1967, -1057, -1700, 3660, -2900, -1389, 2889, -3579, -284, 1837, -1654, 1397, -463, 402, 1430, -3268, 1941, 1030, -3731, 3140, 239, -1904, 2710, -616, 606, 1111, -1511, 2240, -1849, -1728, 2904, -2925, -17, 2809, -2523, 1000, 501, -1334, 1443, -2063, 55, 807, -3546, 2002, 115, -2529, 3309, -318, -857, 2153, -2049, 840, -138, -1548, 2956, -1630, -349, 3175, -2364, 1110, 1938, -2189, 1777, -897, -1310, 1318, -2477, 1000, 968, -2872, 2417, -817, -2034, 2257, -2067, -323, 1068, -2334, 1654, -412, -1152, 3219, -1819, 503, 2301, -2675, 1471, 362, -1868, 2647, -952, 544, 2367, -1904, 1998, 432, -2194, 2084, -1707]
1815a707L53L132m300L428J53k807M192l653R8K857m941L492J56l184M759k550
1831e22k4L337m039K374M19l885L863k251j117L998m195K465J468l596L783j956
1847A22j748L780m142J360J791m092M097q99j852M095l452Q25K342m350L418p21
1863E74k652M567l447N59K787m218L060j58k855L864k897l26L082m194K494O41
1879H81l535M317k317j105L515m080K094J170l408M167k057j102L860m185J738
1894d7J758l793L786j098j929M067l541J538K033m473L707j179k846M265l320
1909a072L48K639l657L045q39k513M350l427J0L178m965K612J010l325M107j991
1925d90j76K517m097K842K09l526M856k187j680M096l845J374J652l059L387k274
$$ y = [-1707, -1354, 1778, -2522, 906, 1059, -1748, 2444, -1209, -1111, 1746, -3195, 297, 453, -2731, 2028, -522, -546, 2791, -1248, 1126, 1545, -2340, 1523, -728, -1845, 2153, -2042, 423, 1891, -1705, 2078, 122, -1626, 2154, -1988, -628, 1163, -2929, 1168, 269, -1583, 2512, -940, -115, 2227, -2123, 1295, 574, -2078, 2489, -958, -399, 2388, -1830, 1230, 1072, -1783, 2081, -816, -1142, 1940, -2254, 240, 881, -2654, 1663, -654, -1759, 1756, -2324, -230, 940, -2468, 1699, -358, -1460, 2400, -1785, -47, 1711, -2082, 1704, 606, -1323, 2744, -797, 741, 2774, -1699, 2008, 829, -2017, 2248, -1072, -724, 1915, -1742, 1303, 464, -2049, 2301, -1126, -1116, 2062, -2903, -291, 719, -2606, 1501, -490, -666, 1851, -2246, 596, 805, -2721, 2135, -52, -1732, 2364, -1481, -107, 1545, -1514, 1873, -401]
1941d01j176L805m568K019K524m506L523n27k366L221k884J464J268l746M085
1956A735j425k537M749k833l88L232l463J425k11j871L741l592J102L173n186
1971b349K949J174l914L663j512j275K107l304K642k14k787N299k712j812M779
1986B734l862L16K446l013K534j673q12L296m366K799K625n186M146k19l649L465
2002A581j984J03J131k878L599k142k195N661l870m42M546m166P73O70j876K459
2018I70k804J224K609n015L963J296m852N042q57k383K669k618J107k71k176M549
2034B453k839j430N246m764K35L663l440J401l61j345J816l717K796J787m919
2049c418M956J97m415M190j203j313J813j895K211j874j657N413m357N9N104m948
$$ y = [-401, -1577, 2228, -2340, -321, 2203, -2303, 1220, 693, -1673, 1548, -1336, 128, 1396, -2350, 1735, 310, -2227, 2522, -311, -699, 2533, -930, 495, 284, -1587, 2154, -1438, -336, 2837, -2349, 600, 1774, -2140, 1523, 11, -1264, 843, -2461, 181, -33, -2820, 2479, -233, -2045, 2734, -1128, -812, 1634, -1379, 1155, -518, -1330, 1966, -2400, 399, 3024, -2162, 1984, 1765, -1884, 1581, -403, -300, 831, -2047, 1552, -590, -2785, 2876, -994, -1436, 3110, -1056, -283, 387, -1489, 970, -1834, -610, 1999, -3016, 947, 2243, -2609, 2433, 1576, -807, 1862, -756, 351, 80, -2096, 2453, -386, -1816, 3430, -1334, -1099, 2564, -876, 525, 164, -1181, 635, -3082, -286, 1501, -3418, 1538, 1735, -2680, 1510, 307, -1006, 807, -1088, 1123, -751, -2408, 3005, -1352, -1293, 3811, -1137]
2065a137J040K109k931J647j293P15J455m264L651L47m957N356m53l164L881k120
2081a18o5J77j391L328l065l66M507n482J131M178m380K107J013j964J393k531
2097a528J505Q50m100N261r37m310N326k008j627L266j795O06p57j729L540m073
2113b510J061M773n395K137K385m263K264K08k39J314l288K753p31l929O092j503
2129A129k697M738l186j095J792j723K072j832l09L273n195J558L826m979L034
2144D06J222l380K055j732Q50J086k401L775j329l429N000k568j389M232k934
2159e36N88L28j629K718k557J271L149n302K226J469m389L387J73j899K045k273
2175a231J670M3k746M755k309k579M560l494l62L214k503J901n76j100K681l840
$$ y = [-1137, -97, 2012, -919, 728, -565, 150, 1605, -2659, 992, 1339, -3618, 1738, 1285, -1879, 2002, -118, -183, -6, -1397, 1931, -1134, -1500, 3007, -2475, -1344, 2834, -1546, 561, 1574, -390, 1003, -1528, -23, 827, -3273, 1988, 1051, -3259, 2067, 59, -1568, 1698, -97, 509, -248, -1977, 1563, -2510, -1449, 3324, -2071, 66, 2451, -1812, 452, 660, 421, 1735, -1553, 1200, 469, -3460, 2632, 1129, -1568, 3170, -16, -1111, 681, -1042, 1030, -802, -1111, 2162, -3033, -1475, 2351, -2628, 406, 1628, -1752, 303, -1429, -579, 507, -1894, 1881, 552, -2877, 2123, -445, -1834, 2398, -536, 52, 380, -1249, 1469, -1088, 183, 3332, -1970, 256, 1725, -2664, 723, 896, -1003, 1042, -1231, 439, 482, -2264, 2491, 182, -2397, 2163, -1331, -1693, 1521, -982, 919, 343, -757, 1924, -1916]
2191a916K087K236m743L209J62l659L469q78j49J592k861K434j266k222M446k798
2207h57p25L863l714P76J579k214K822j844m6K240m416K482J845l951M170q32
2223A178k333K682k407J032J029k506L076j862k097M308l252N53K881l641J841
2238D82l80j966K800k381J130K378m254L084j43k983L976j547p88K189k952J697
2254C42J52k002L653k176j024L211l680J399J568k950K565j170r67K522l444K114
2270A13J173l455L280q97k260L373k723R36J847k886L054j131j822L535l088N06
2286d45K504l872K426K43k081L152k086O6K058l474K061J37k766L384j695o92
2302a080K588k856J817M87k627L240k027j093L095l497J722J411k989L151q14
$$ y = [-1916, 171, 2407, -2336, 873, 1035, -2624, 845, -33, -182, 1410, -1451, 983, -283, -2505, 1941, -857, -1582, 2281, -1433, -657, 922, -1292, 1530, -314, -360, 1880, -2536, -54, 1791, -2160, 2010, 1178, -1155, 1527, -880, 152, 1181, -1325, 1751, -111, -2208, 2100, -1152, -599, 2282, -1359, 482, 102, -1864, 936, -1445, -315, 2063, -2191, 893, 750, -2233, 1743, 196, -592, 1597, -1355, 342, 494, -1508, 2145, -31, -1055, 2156, -1524, -125, 1443, -1507, 1058, -112, -1079, 1443, -2001, 113, 1286, -2169, 1111, 214, -2046, 1327, -1396, -460, 1387, -1499, 1555, 424, -1398, 2137, -951, -445, 2059, -1813, 613, 856, -1225, 1927, -159, -93, 1965, -1509, 552, 689, -2077, 1307, -388, -1080, 1508, -1348, 469, 956, -1671, 1569, -458, -1551, 1544, -1953, -231, 1180, -1809, 1342, 528]
2317E28j548K975l055J033J325l261K861q98j574L518k717N88J933l073K296n09
2333D22k032L047k593O7K481l187K264M38k503L373j972m27K400l064J943L63
2349A020k484K977j713p19K761k990J457J025k915K954j381j247K926k859Q14
2364c74J314l147K825r36j111K935k860J075J658l014K509n47j994L254k638N39
2380e12K223k975K124l1j837K765k051j74K098l127J874L99k307K909j569o59
2396h50K495k909J675O31k806K851j596q22K736k741J043J440k799K714r97j208
2412a143K878k493N66J497l058K633m03j758L003k301K80J684k881K449m88k021
2428a556L187k547J43K279l115K055K47k382K880j884J4J929k922K006O87k441
$$ y = [528, -1020, 1955, -1100, -67, 1258, -2003, 858, -40, -1614, 1904, -813, -225, 1708, -1365, 931, 422, -1610, 1437, -1156, -1089, 1392, -1795, 469, 907, -1596, 1777, -195, -622, 1778, -1286, 657, 1020, -1464, 1513, -200, -919, 1842, -1148, 309, 1334, -1581, 1373, -8, -1255, 1671, -1188, -374, 940, -2207, 618, -318, -1429, 1506, -1354, -279, 1379, -1635, 874, 327, -1667, 1587, -1051, -512, 1711, -1264, 860, 829, -1008, 1757, -294, -468, 1630, -1497, 377, 776, -1531, 1378, -191, -850, 1645, -1264, 411, 1042, -1764, 1087, -509, -1331, 1405, -1336, -293, 1147, -1652, 1062, 65, -1143, 1735, -758, -192, 1305, -1753, 880, 477, -1281, 1722, -579, -299, 1385, -1496, 953, 465, -1556, 1631, -916, -773, 1506, -1609, 446, 693, -1689, 1191, -693, -679, 1250, -1672, 334, 1021, -1420]
2444a420K806j346r32K524k632J335N15k427K928j362j026K924k936J015J499
2459A465k825K149o99j280K466k518R63J311k764K583m14j870L060k102j24J882
2475A283k774J969L4j937K896k096o4K328k819J724P27k461K196j484n44J999
2491I77k708J817Q60k821L212j311j384K786k267N77J007k110J966j044r13K987
2507A631k369P60J963l225K176k58j693K419j920M46J308k773K272k60j855L160
2523A782j720m19J551k587J343k6j421K661k171n6K192k895J719J349k417K241
2539A126j096q69J759k285J592P48k329K825j433j509L069k210P11J599k584J523
2555F37r63p51K389k451J185J645l236J951J07j737K414j380K51Q52k559J810
$$ y = [-1420, 1386, 40, -892, 1632, -1000, 335, 850, -1577, 1351, -11, -1037, 1887, -1049, -34, 1465, -1360, 789, 90, -1190, 1276, -1242, -279, 1032, -1732, 851, 437, -1433, 1627, -475, -599, 1283, -1491, 478, 512, -1425, 1471, -625, -689, 1639, -1180, 544, 1271, -1190, 1006, -478, -1022, 977, -1731, 86, 946, -1875, 1337, 26, -1358, 1428, -839, -262, 745, -1365, 601, -443, -1356, 1631, -738, 22, 1985, -1240, 936, 678, -1015, 1404, -516, -70, 1238, -1535, 737, 477, -1378, 1782, 62, -357, 1194, -1393, -50, -76, -1497, 1164, -1007, -1063, 1129, -1766, -47, 1302, -1115, 1126, 30, -839, 920, -1365, 227, 975, -1354, 1471, 38, -1471, 1598, -612, 99, 1698, -886, 637, -326, -1077, 1312, -1139, 46, 1691, -1545, 406, 513, -1224, 1190, -190, 61, 913, -1646, 164]
2571A64k20j635L521j873o81K227k426R40P50j514K223j950k63J682k828K028
2587A45J172k444K235o98j525J929j912J289N22k144K481j638j042L083j961N98
2603I0J410k301J238n36q36K254j926P75J110l005K336J20j698K638j659m35J230
2620H05k115J655L2j423K560j987p13K456k525J309R01j940J794j337n53K288
2636A207k292J492J040k722K086q07r94K577j538L45M14k035J969q72p20K645
2652A795k276OJ556k782J781J92r20J963k125L45J096k494K139M56j922K460j736
2669d66o71K126k132J842K98j848J982j548m61K303k179R17Q57k257J777q37m81
2686g78J824j763J205L93k591K310q04r65K584j807M3Q43j821J696l78p30K261
$$ y = [164, -56, -1691, 1830, -43, -724, 1503, -923, 17, 767, -747, 1476, -474, -737, 945, -1883, 145, 1317, -1127, 1108, 410, -1115, 814, -1098, 191, 713, -1431, 1050, -588, -1630, 1453, -508, 90, 1500, -801, 437, -99, -935, 1319, -607, 168, 1278, -1727, 609, 729, -969, 1669, 10, -425, 805, -1310, 345, 377, -1046, 1514, -473, -1186, 1270, -1255, 54, 955, -985, 809, -528, -1081, 1207, -1085, 407, 1447, -1275, 811, 4, -990, 1587, 49, 394, 808, -1227, 742, -130, -850, 1795, -481, -475, 1081, -1701, 80, 272, -648, 1315, -810, -465, 631, -1863, 276, 732, -1190, 1270, -466, -1137, 989, -1143, 699, 997, -851, 1131, -417, -878, 1425, -754, 163, 1020, -1237, 540, -297, -778, 1046, -717, 488, 881, -1710, 600, -204, -1169, 1415, -392, -349, 494, -1327, 369, -9, -739, 1522]
2703A522j963K4J396k296J721N40j575J888j747m5J329k092J762K18j758K313
2719A237j509o41J964k121J260M66j911K122j679r4K120k105J104P76k267J912
2735F34n95r01K186j853P81Q32k267J928m20j139K195j742J30J002j827J544k36
2752B52j023J737j534q2J566k323J647K59j531J935j274k29J753k108J502N9j897
2769a291K299j209n70K106k200J166P51k191K074q90q61J925k018Q69Q93k134
2785a281J976o44r61K053j729M66R01j830J649k25j563K229j574K78J387j961
2801h29J413Q8j397J939j399k7J387k039J099L66j680K072j227k57J646k267J267
2818A55L37j772J946j091n85J879j872Q52R00j906J918o75r56K002j938O73R78
$$ y = [1522, -441, -417, 979, -1317, 404, 944, -631, 1257, -490, -535, 794, -1298, 464, 682, -1076, 1237, -272, -913, 1051, -1070, 190, 656, -1255, 867, -812, -906, 1214, -891, 213, 989, -1278, 634, 39, -862, 1324, -529, 252, 1084, -1183, 745, 325, -814, 1381, -361, -231, 771, -1056, 488, 252, -771, 966, -568, -650, 916, -1407, 240, 499, -1032, 903, -371, -600, 1153, -955, 547, 606, -1291, 1008, -201, -771, 1335, -865, 301, 1052, -1139, 935, 45, -816, 1109, -909, -40, 853, -1281, 695, 51, -910, 1143, -586, -120, 781, -1049, 600, 375, -1188, 1041, -533, -255, 1132, -829, 584, 672, -725, 1214, -185, -212, 1175, -864, 235, 601, -1079, 993, -234, -491, 1155, -1112, 155, 492, -1280, 666, -425, -1010, 869, -1003, -151, 749, -1157, 761, 86, -870, 1132, -806, -133, 845]
2835H45k098J888l42j176K089j522J88J226k098J640j99j552K116j316k69J610
2851A030k307J512L25j611J769j060k11J513j989J077K32j487J949q57n40J836
2867A181j991J119M59j621J610o25q74J927k038P95P18j973J968n09q54J694j648
2884f62M77R04j795J415l30j071K079j645K55J439j898J280Rj445K011j374L5
2901c16J581k282J367K61j612J806r83m11J736j888Q92M37j676J907j053m62J613
2918I17j517M86P09j492J643p37p11J785j560N44O85j759J939o69r93J890j825
2935f65N35J166j970J634m40q41J425j471K98J047j663J165K7j568J897j070j80
2952f74J529j855Q79N26j532K073j049p38J929j969J059O82j816J777p24n95J684
$$ y = [845, -1253, 635, 293, -883, 1206, -316, -128, 1098, -1000, 640, 441, -1111, 1005, -311, -580, 1030, -1277, 235, 560, -1051, 718, -342, -553, 960, -1029, 48, 280, -1207, 742, -115, -655, 1181, -810, 309, 768, -853, 757, 132, -742, 1185, -853, -58, 660, -1313, 655, 146, -708, 986, -662, -185, 719, -1076, 339, 9, -1062, 1017, -628, -373, 1066, -832, 448, 457, -988, 1023, -351, -316, 1265, -1017, 350, 611, -1001, 805, -178, -589, 1147, -741, 151, 588, -1088, 819, -234, -696, 917, -600, -114, 595, -897, 746, 9, -702, 1083, -477, 67, 752, -1007, 932, 263, -730, 1160, -665, -130, 1036, -934, 700, 260, -581, 844, -627, -329, 718, -945, 220, 247, -1321, 576, -494, -674, 855, -1000, -121, 405, -1127, 946, -103, -841, 1088, -881, 178, 860, -956, 821, 97, -498, 1186]
2969A186j721P76Q85k014J701l69j284J767j272K14R31j627J479j53j420J842
2985I21j572J64J396k033J491qj289J841j413j44J371j480J006K55j529J838j040
3002b25p46J938j849R74N04j846J732p95m42J697j822P40O16j635J689l28q83
3019f81J663j646N28J147k028J704j52j147J773j470J43J196j780J460k01j056
3035e47J517j595P6J551j977J262J06j670J699j039j40J482j587R36J46j555J789
3052D54p07o23J823j772Q08L26j277J642o70n33J738j787Q30Q62k033J581j37
3069E25j216J689j557N36P53j520J587o42q42J627j283l72J505j805J164L6j036
3086h51J469j080K47J257j927J157L35j728J448n43l55J392j502N49L91j287J952
$$ y = [1186, -535, 241, 1126, -888, 813, 444, -840, 927, -345, -131, 800, -827, 652, 499, -921, 921, -651, -487, 909, -1124, 367, 359, -930, 911, -502, -646, 725, -755, 251, 506, -1023, 815, -225, -971, 967, -882, 92, 596, -1250, 482, -313, -755, 942, -880, -140, 476, -1159, 530, 202, -681, 982, -664, -136, 1011, -1017, 687, 535, -612, 1161, -309, -166, 1030, -750, 710, 509, -547, 970, -625, -549, 1002, -975, 287, 393, -1277, 422, -617, -757, 725, -862, 74, 220, -1335, 454, -253, -876, 947, -825, -17, 309, -968, 674, 4, -529, 1209, -578, 252, 1114, -919, 662, 525, -691, 998, -559, -23, 730, -790, 797, 155, -687, 940, -343, -715, 790, -1015, 149, 185, -851, 618, -462, -215, 1042, -885, 272, 607, -1121, 327, -216, -571, 821, -681, -132, 259, -1028, 924]
3103I24j000p83J906j886P03N94j346J377n05o23J622j688N90J023k052J743k89
3120C10j015J675j176n1J135j571J269k04j076J787j259j77J469j582O44L70j442
3137h94J355r49K15J121j903J336K65j778J839p32o85J750j654M44O71j221J559
3154G39p41o59J752j774L68J201j364J147m42p37J490j643N77R48j720J562k41
3171D63j531J681r93r7J201j420J050k49j158J719j156K10J309j842Q60M47j466
3188i72J693p64k91J153j467P67M80j740K075o39r29J626j534K17Q47j259J514
3205G77p23n83J394j731M55J345j857J256j27r07R93p26L04Q93j508J485m02j410
3223a072J771r72k14J592j540P81J35j253J336o48k0J253j992Q96M61j494J648
$$ y = [924, -76, -859, 1047, -839, -136, 458, -888, 489, -16, -639, 983, -705, -115, 908, -1144, 599, 310, -705, 970, -206, -257, 878, -693, 576, 372, -704, 1083, -176, -353, 1116, -466, 178, 548, -894, 461, -488, -273, 848, -1055, 281, 546, -1232, 607, -125, -810, 940, -714, -270, 401, -820, 739, -2, -661, 1091, -683, -315, 886, -478, 669, 227, -510, 980, -663, -86, 862, -858, 704, 463, -1068, 613, -380, -477, 724, -696, 354, 105, -1053, 666, -490, -280, 1029, -813, 47, 494, -972, 721, -43, -334, 819, -648, 119, 599, -1141, 934, 295, -634, 992, -542, -325, 522, -737, 777, 54, -529, 865, -866, -411, 934, -923, 333, 206, -701, 292, -434, -130, 763, -745, 740, 338, -1072, 699, -273, -487, 1105, -435, 346, 481, -772, 564, -84, -104, 1149, -843, 53, 514, -980, 668]
3240F68o61k35J101j654P04K70j287J901p40q51J776j664M68Q85j082Q47k29p27
3258e10J353j565P34J036j740J141j17j264J552q52m8J080j593J142j49j258J802
3275G44r79l70J295j409P48L32j105J439q39q5J154j610P80N41j491J547n08n10
3293c26J295j538P33M33j270J459n88j104J494j085M03P06j445J116j29p86J554
3310I22j396K26R41j729J448J52j394J712j185j9J017j255J061j37j180J642j164
3327c38R7J036j446Q41J80j169J242o20l91J336j386O69O45j586J340p65k98J382
3345G69j169L82O07j272J362m83q24J573j575M74J082j667J287k59j025J632j280
3362c86J58R79j421R89l5j188J812j278l4J192j577R43J08r61J509j066k85J286
$$ y = [668, 7, -228, 873, -781, -77, 193, -1094, 807, 67, -784, 992, -672, -204, 681, -401, 446, 217, -510, 843, -722, 12, 1048, -692, 449, 332, -932, 620, -232, -280, 800, -793, 349, 200, -1058, 744, -235, -605, 690, -719, 29, 361, -744, 695, -144, -229, 925, -685, 95, 636, -855, 692, 184, -326, 969, -569, 164, 597, -673, 786, 198, -906, 588, -497, -94, 612, -833, 283, 154, -632, 922, -474, -248, 693, -1036, 412, 564, -830, 882, -303, -322, 695, -560, 501, 364, -816, 826, -338, -241, 795, -651, 190, 370, -799, 443, -177, -568, 768, -618, 51, 696, -890, 450, -315, -613, 769, -400, -18, 589, -683, 679, 196, -628, 945, -630, -156, 926, -741, 546, 287, -738, 894, -386, -228, 751, -670, 319, 284, -904, 908, -370, -404, 788, -789, 154, 262, -699, 810, -256, -541, 745]
3380G45j424Q44L67j397J534p22l81J388j567Q00K56j265J353l84p54J276j307
3397f38M49N68j168J136k40q18J506j120J62R69j600J182k75r22J400o61k76R05
3415E59j111R80N5j256J773j006l09J159j299O46K64j139J228p48l04J329j633
3432h12R46J68j086J065l17o18J310j350M15P56j254J224l47q36J324r65K38J079
3450I40j452J046j65r35J251j017K12R01j557J234J05j161J309o30p1O89j335
3467f36P73J85j164J360o82k78J288j317N13N12j289J310o69k52R76j196O19N54
3485F07j365J181k47o61J128r58J68L65q77J123n11p63J480j339J97J310j487
3502f49Q43j7o85J239r94mJ034j344Q86J75j297J325m32m48R97r81M90Q9j022
$$ y = [745, -679, 165, 532, -865, 669, -53, -434, 954, -613, 187, 443, -822, 531, 147, -607, 669, -638, -189, 379, -789, 347, 107, -711, 795, -325, -163, 806, -794, 388, 113, -809, 591, -70, -346, 559, -552, 428, 483, -773, 1000, -6, -315, 844, -455, 191, 455, -684, 544, -204, -508, 821, -812, 134, 302, -784, 281, -36, -654, 656, -694, -279, 477, -777, 447, 100, -736, 588, -377, -139, 940, -512, 534, 369, -566, 685, -332, -120, 781, -776, 458, 563, -598, 711, 81, 10, 699, -636, 137, 322, -842, 518, -164, -442, 846, -471, 42, 554, -735, 575, -94, -346, 630, -566, 53, 607, -758, 423, 176, -485, 643, -315, -147, 218, -659, 464, -47, -810, 670, -669, -472, 838, -649, 194, 177, -508, 731, -263, -267, 767, -577, 309, 484, -813, 512, 80, -368, 629, -352, 138, 227, -795]
3521g95J446q00l35J231j496O96O81j215Q73k84m75J004j431P81O74j518J553
3538E90l83o96J239r45o9P73q28P43n52o53J402j094J63J288j327O73K25q76P88
3557D61m96P2N55j516J212Q7j337J377m26n65J202q63K59K31p94J034p73j94J451
3576I77j746O64R77j540R42o2m77P54r96P07K39j253J417l92j164J397n53l66
3594d75J042j024O86j87l63J276j630K69R61j318P31P45j344J015k87m79Q35r94
3612e41J102l06r71J458q48p40J533r71L20M64p44N51o65j0J191j411O66N93j494
3631h23O14M53p85J008o15K45P1q22J088l36n59J591j023q90J445r79J67N75n39
3650a14P84j074J71Q08j509J000Q11j533R95m63n69P17k78P51j49j024J098o47
$$ y = [-795, 651, -149, -484, 747, -749, -53, 628, -587, 286, 2, -473, 531, -900, -119, 555, -963, 590, 207, -489, 750, -195, -264, 509, -319, 424, -128, -781, 621, -473, -310, 978, -349, 324, 549, -327, 461, -35, 37, 592, -924, 288, 375, -962, 415, -11, -576, 626, -237, 22, 253, -541, 493, -280, -474, 977, -769, -105, 872, -668, 274, 212, -265, 489, -507, 200, 439, -814, 603, 211, -953, 444, -109, -475, 567, -457, 229, 42, -321, 955, -675, -406, 555, -763, -32, 713, -631, 384, 97, -382, 453, -541, 561, 255, -716, 742, -106, -846, 687, -284, 36, 500, -244, 307, -358, -368, 823, -588, 78, 671, -823, -209, 244, -541, 467, -148, 97, 168, -654, 434, 98, -461, 1130, 107, -783, 662, -317, -150, 425, -114, 670, -404, -233, 575, -934, 66, 877, -656, 339, -124, -693, 24, -254, 497, 348, -676, 422, -225]
3668b25m37J505j089K31O61r60N33m03q3J054j043M68M69j493J000K74j067J464
3686H59p54k13M1o22R45k91m74J317j208k70R93j133O64N71o20M28j99j46N81
3705D69j116R42L09j319J151j62o94Q62l20l4K73p23Q69q76k49J454j360K66R67
3724G09j302M53J80m49R15r37N04N21j519J230J39j182J168l16m36O80o15O03
3742C46k33m15J044r09j32J011j335O23O84j111Q13l85k88P89j209P90K90j231
3760h58J472n72o45J051o28n1Q91r63P86n25m14R86q94J32P88j071O82K08p37
3779c62R43p77M04K42j011R46l17o98J219o99j78O47q91P85q5m86Q18q36J63Q13
3799F40j072L99L16q77R82l13m25Q85q94M66J98p46P76k03n97J062r48J08N70
$$ y = [-225, -662, 843, -246, -15, 646, -314, 219, -184, -267, 787, -256, 212, 681, -812, 188, 462, -605, 859, 105, -108, -67, -689, 256, -35, -509, 808, -400, -670, 323, -810, -146, 425, -195, 233, 34, -112, 469, -647, 295, 604, -715, 436, 274, -420, 442, 122, 88, 361, -362, 507, -369, -618, 836, -524, -258, 709, -593, -140, 40, -409, 506, -431, 73, 594, -925, 305, 444, -738, 430, 114, -322, 358, -257, 346, 113, -302, 742, -167, -299, 712, -623, 0, 684, -427, 386, 1, -287, 502, -707, 83, 373, -858, 614, 42, -603, 448, -180, -231, 660, -303, 483, -42, -456, 530, -364, -232, 556, -515, 167, 375, -362, 581, -196, 208, 450, -561, 385, 68, -630, 589, -110, -288, 359, -532, 253, 168, -318, 500, -336, -173, 640, -432, -33, 283, -594, 388, 75, -350, 535, -359, 107, 305, -441, 335, 132, -465, 597, -351, -243, 327]
3818C27o82N77j51m41Q92q32k6Q33j046N50J69n69Q15n63J44O11j031O15l6o84
3838e28J062o38j20P95r74N76J53p19Q77m88k01O25j279O18K59n43O33j60m60
3857e12Q29o08K89L49p46Q81n12n15J120q52N5P07q83O05R2o80P96n64R0O38r18
3878c39O63j00o77R60n56k25P03q67L64K91o09Q92m04o15P93n36L34K45q78R83
3898D22n35l01J005r60L93K18o80O23j36m23P35p88L78M17q48R16k23l67N65n10
3918i9J54M07r02N37J13n01P10p08J97O87j020N87P9p98Q94k88k95Q23p85L94
3938A86J78r36Q69m86j86R79q75J38M75q07O47j70n76R33r49M25L66q27R23j44
3958A63n63Q96p18L69L61r56P78k09n45Q19o37J26P91j042O85N4o63O79n65p7
$$ y = [327, -355, 222, 71, -370, 522, -310, -336, 497, -549, 1, 170, -399, 416, -147, -3, 608, -423, 192, 156, -528, 534, -104, -224, 571, -403, 173, 326, -393, 484, -4, -205, 420, -859, -241, 18, -525, 108, -52, -512, 317, -291, -2, 347, -399, 482, -30, -545, 575, -277, -222, 485, -398, 207, 299, -381, 415, -149, -59, 579, -339, 324, 224, -453, 507, -49, -274, 429, -438, -74, 217, -392, 500, 96, -519, 274, -262, 72, 317, -561, 422, -113, -414, 591, -369, 24, 242, -438, 185, 49, -374, 361, -427, -49, 368, -480, 436, 213, -154, 411, -99, 55, 462, -440, 97, 210, -291, 419, -289, -92, 595, -425, 162, 241, -557, 337, 49, -246, 577, -208, 186, 364, -572, 297, -189, -375, 604, -271, -133, 342, -465, 182, 12, -564, 369, -580, -155, 211, -616, 307, 163, -400, 496, -222, 147, 508, -448, 330, 121, -424, 395, -242, -116, 675, -367, 318, 372, -291, 388, -177, -254]
3978b54M83o59N64Q8r99J264k71m13N21p07K06M03p02N21k48j25P02r52N32O27
3998E81q17N68k0m20M52o09L20J03q04Q07j09o79J170m24k24L90m88L78Nl96O32
4019D16p97J88O43p90M07L66o08N35k60j16N19n14M13k43p88R50k50k74R65q19
4039e7L2K45n92O55m42j95R30j257M23O95j228R10jl46L22j79j3K16n48R58n08
4060B0p63J214p97J23R03o39N4N2k75L17o18O44L79r83L61L50j011R18j26l82
4080b59O55m77J95k41m80R88n00j15Q15r84O8Q09o83L00K6r8M16j105P24J96p44
4101d94P61J69r82O77l5k43K74k66O93o81l58J001p11l59J357r38P4K24m00K84
4121D7k63L66J77p08M29L65j202J067L17j065Q08j93m10K56j30N20l64n04J119
$$ y = [-254, 229, -430, 134, 222, -777, 487, 216, -197, 324, -383, -177, 226, -476, 45, -203, -328, 374, -578, -46, 581, -236, 332, 312, -108, 344, -265, 55, 158, -646, 161, 52, -627, 543, 119, -105, 285, -203, 175, 180, -216, 416, -381, -193, 450, -340, 67, 433, -175, 360, 100, -16, 503, -11, 402, 159, -629, 321, 71, -203, 762, -57, -25, 220, -372, 283, -159, -354, 576, -681, -258, 437, -791, 119, 118, -228, 94, -85, -98, 118, -430, 528, 20, -743, 471, -326, -203, 700, 61, 115, 167, -108, 209, -409, 235, 614, -369, -8, 342, -669, 249, 123, -259, 396, -81, 114, -127, -607, 381, -119, -234, 581, -403, -335, 474, -209, 91, 117, 19, 435, -670, 54, 250, -494, 267, 436, -546, 131, 96, -147, 127, -139, 554, -127, -485, 516, -195, -554, 803, -135, -61, 163, -237, 47, -216, 150, 327, -381, 48, 413, -789, 278, 595, -470, 338, 145, -265, -9, -139, 381, 17, -487, 632]
4140F32r57n9R83j053L84K00k89K38m14L52J97r07R73M8j027R35j19n73O09j75
4160b2L43k66n35R68j053J81J226j197Q7P82r72M42J09l6J18m73M72J9q31J091
4180D53k77q08J049m68l51L97j24J83j75J55L84r63L64Q56j050L60O91j027M41
4199I0j55N8L08j095J179j13j104J314n83m33R39n91J95j79j11M46m05N7Q41r59
4219c01J60O95j014N73K85l14J28l20L05O7q46J092m59p41J301q52NM38k80K22
4239A44j59k24N40p72M11M99j031O16K90p51O43k18K0J67n18P49m59l41Q78n80
4259i6k83Q30n93Q0L05m32L50k88JP80r75L61K09o17O22q7m96N34j93J37R2n31
4281b90M79l35k33J053r38j39Q09p29K11J63j96M91p12O30L56j137N73J73o20
$$ y = [632, -325, -384, 599, -454, -70, 130, -159, 79, -335, 17, 214, -693, 280, 328, -699, 236, 117, -456, 153, -22, 321, 55, -480, 488, -565, -384, 842, -355, -268, 514, -458, -16, 93, 57, 175, -298, 174, 193, -638, 453, 176, -632, 417, -51, -402, -5, -129, 54, -121, 34, 418, -545, -181, 675, -375, -15, 676, -351, 90, -65, -7, 301, -794, 385, 272, -832, 482, -101, -534, 405, -186, 9, -170, -281, 165, -240, -183, 658, -301, -141, 554, -460, 113, 398, 84, 212, -108, 197, 264, -582, 510, 51, -690, 611, -241, -236, 202, -78, 144, -15, -239, 301, -471, -60, 439, -592, 24, 314, -437, 206, -12, 8, 175, -343, 406, -53, -394, 484, -96, -379, 451, -142, -62, 243, -189, 161, -127, -126, 654, -321, 40, 249, -368, 254, 167, -329, 205, 12, 149, 241, -290, 189, -146, -379, 674, -264, -403, 406, -323, -112, 51, -145, 346, -366, 264, 620, -517, 56, 229, -391]
4300c91N46k77m6N07o06L63k3n85P04l20j51O74o81K25L03n50P57l56j13N99p81
4321b02L29K38r60Q75p8m84P18n80K41J80m80L99k80l65P51n03k08O04p83O72
4341H4l0m81P88o39N7M90p34N00J73n90O10l08k8O39j017N92J79o55P45l24l30
4362b79P80o41K88M6o39O06l86o3N90n73L97J79p07N67k03k97N16o14L20L71n73
4383c15L55R9n13Q17o66J8O33p08L03K16p16N86n42M5O77n05K39J57o47R81l96
4404A18j77N45p18J99M24p11N66j17k78N43o04K40J37n00M69j46l35O56l62J02
4424E1K77q21M53K99o81Q06p08J00O54q73N74k26m46P00m79J60N01p41M15P0l23
4445b38N62j47l78P34q40L26J89n25N90j65l33P25n78j9N94p61N45k39n57P22
$$ y = [-391, 155, -122, -168, 339, -267, 96, 73, -512, 192, -128, -279, 395, -286, -61, 242, -308, 449, 93, -20, 579, -202, 127, 365, -595, 280, 202, -282, 436, -144, 97, 277, -203, 196, -84, -449, 302, -201, -409, 195, -588, 84, 54, -427, 361, -278, -221, 269, -465, 35, 208, -382, 228, -80, -108, 531, -486, 106, 285, -370, 375, 51, -279, 501, -140, 148, 194, -445, 161, -225, -288, 302, -271, 126, 305, -402, 165, -38, -335, 181, -433, -113, 258, -315, 40, 139, -374, 443, -223, -205, 428, -280, 23, 239, -477, 109, -433, -388, 289, -216, 23, 180, -467, 514, 118, -59, 486, -232, -33, 391, -320, 246, 129, -149, 394, -210, 30, 167, -333, 136, -10, -345, 311, -51, 51, 328, -493, -40, 259, -422, 384, -324, -224, 430, -443, 131, -95, -541, 159, -320, -160, 341, -400, 15, 85, -238, 324, 177, -201, 533, -307, 19, 208, -317, 273, 108, -225, 500, -78, -97, 497, -264, 281, 42, -515, 207]
4465B07m59K51K34o19P19p4m06M53l56j79L39m17M07l36j47P34m38kM77n74K38
4486E2j28j46N05o29K14M04p35M71M4m10L32J36l03N87p42M70j05k73M22j21k45
4507b00M27m26q8M65l94K29N7r8K74l40m3J69m76O98q5o73O49Q5k92K67m94K72
4529a7j53q5P33p05j14P25o74J47M37m98K95m6k59M27o43N34K10m49N64k09l39
4550a19L81k95K91L9o45P59o50M4Q54j008K65O19q68K45J63k61N26o18K53M32
4570D07r68N87O0n12O97j47n90P56m46J63R2r0M62p55J12N91p55L23N87q80L25
4591A9j53o0K86l88P33m73n45Q42l03l37N68k66J8R4k2J96l32L9M71n72J52M27
4613C94p25L32K19m31L25k56j1P4l65O85j53n40R70l52n25N93l99J81M0k02M73
$$ y = [207, -252, -1, 233, -386, 333, 259, -147, 306, -50, -229, 110, -307, 100, -236, -383, 351, -87, -89, 388, -186, 52, -76, -222, 283, -346, -132, 272, -463, 8, 52, -358, -26, 110, -193, 394, -348, 122, 17, -256, 166, 45, -200, 227, -199, -287, 178, -216, 13, 70, -28, 246, -94, -137, 32, -444, 254, 169, -504, 145, 230, -62, 205, -289, -17, -170, -255, 478, -227, -341, 384, -290, -143, 294, -204, 91, 45, -214, 213, -430, 104, 314, -135, 429, 220, -119, 262, -33, 258, 297, -348, 411, -239, -195, 659, -349, -84, 535, -333, -88, 75, -186, 340, -278, -25, 407, -561, 26, 86, -426, 271, 124, -466, 290, -156, 7, 99, 9, 471, -284, -172, 419, -336, -13, 574, -306, 19, -134, -194, 92, -296, 437, -36, -581, 261, -42, -379, 189, -77, -59, 35, 13, 209, -123, -84, 387, -185, -33, 394, -331, 1, 220, -211, 114, -142, -153, -79, -444, 241, 88, -452, 518, 166, -359, 234, -165, 16, 56, -146, 327]
4634C27o29O5M73p88O86M47j014M33K47m63K29k2K35j91k58O40l63m93P92m38
4654h5j87N32n09J03r3K39J67n44L18L25q44N09L78p15N45J4j69j9j31N80k65
4675A49n50R41o86l16R04m81r5L92j09R6l31K90R7q19M76L71q69O01L6m44M15
4696F8k26K13J8j79K46k36k36Q20q13K46P30p44J59J47j77l9j58K67K1n21N41
4717A47J17n08M95k7m11M09l48K20k34j31O31n66j13P83o87P0M55m40M0Q6P3L
4739F4n80P67l7o71O27O0l28J26J60l26K26o1L62l61k2J56l86OO31n61J1K11k23
4762a49nj26M07J32n09O06k29o01O33o1l62L93k4k06L1j29N73m83o6O20q91K60
4784a86L16k90K32j68p4K62m12N24p6n59P05r5o22P49l29n4M08n65L20p1o4K25
$$ y = [327, -302, -237, 236, -552, 134, 581, -433, 0, 247, -216, 13, -9, 226, 35, -223, 417, 54, -439, 353, -85, -272, 260, -249, -146, -239, 0, 167, -377, -59, 266, -578, -69, 309, -406, 139, 153, -16, -35, -166, 414, 149, -401, 540, -146, -462, 442, -39, -134, 258, 149, 245, -86, 204, 301, -518, -42, 329, -540, 61, 97, -347, 68, -158, 55, 73, -106, 140, -96, -332, 488, -325, -79, 651, -93, 66, 213, 36, -3, -161, 106, 127, -394, 147, 264, -244, 251, 224, -187, 222, -126, 94, -140, -271, 360, -206, -319, 464, -223, -153, 302, -138, -98, -12, 61, 64, -516, 251, 214, -457, 170, 230, -98, 28, 188, -138, 88, 27, 389, 28, 6, 162, -224, -218, 413, -148, -137, 74, -149, -154, -280, 127, 259, -250, 356, 127, -474, 159, 98, -264, 129, 105, -101, -70, -199, 374, -109, -175, 445, -446, -186, 130, -160, 72, -96, -170, 92, -320, 204, 128, -431, 274, 179, -443, 306, -23, -77, 331, -234, 86, 15, -49, 176]
4806A76m82L23L59o25M20q7n38M99o8J12j0m26L37R3l90O38m36r3N00m88J24K44
4828A82j01R6l45N7M40m59J25M81p92M34o9k17K83k02J64K00m70Q4K03l85N50
$$ y = [176, -306, 17, 376, -249, 171, 84, -454, 45, -23, 89, 79, -347, -10, 83, -307, 331, -105, -198, 302, -186, -62, 182, 81, 177, -168, -111, 329, -130, -5, 476, -316, 118, 49, -168, 115, -87, 77, 277, -193, -109, 94, -291, 259]
$$ [...]
8191A0
##END NTUPLES=NMR FID
##END=
