##TITLE=1H_68-2022
 CDCl3
 8 sc, 
 25.08.2022
##JCAMPDX= 6.0         $$ Bruker NMR JCAMP-DX V2.0
##DATA TYPE= NMR SPECTRUM
##DATA CLASS= NTUPLES
##ORIGIN= UXNMR, Bruker Analytische Messtechnik GmbH
##OWNER= root
$$ XWIN-NMR		Version 3.5
$$ Thu Aug 25 09:50:32 2022 Russian Standard Time (UT+4h)  she@DPX200
##.OBSERVE FREQUENCY= 200.1313499994
##.OBSERVE NUCLEUS= ^1H
##.ACQUISITION MODE= SIMULTANEOUS
##.ACQUISITION SCHEME= undefined
##.AVERAGES= 8
##.DIGITISER RES= 18
##SPECTROMETER/DATA SYSTEM= spect
##.PULSE SEQUENCE= zg30
##.SOLVENT NAME= CDCl3
##.SHIFT REFERENCE= (INTERNAL, CDCl3, 0, 15.7359)
##AUDIT TRAIL= $$ (NUMBER, WHEN, WHO, WHERE, WHAT)
$$ ##TITLE= Audit trail, XWIN-NMR		Version 3.5
$$ ##JCAMPDX= 5.01
$$ ##ORIGIN= Bruker BioSpin GmbH
$$ ##OWNER= she
$$ F:/spectra/data/she/nmr/H-F/1/pdata/1/auditp.txt
$$ ##AUDIT TRAIL=  $$ (NUMBER, WHEN, WHO, WHERE, WHAT)
(   1,<2022-08-25 09:49:20.68 +0400>,<she>,<DPX200>,
      <created by zg, POWCHK disabled, PULCHK disabled
       configuration hash MD5:
       00 E9 B6 7A A2 85 ED C7 34 08 36 98 17 FE 4E 26
       data hash MD5: 16K
       FC F9 FD 07 6A ED 0A F0 5B 9D 6A 79 34 63 70 D3>)
(   2,<2022-08-25 09:49:23.06 +0400>,<she>,<DPX200>,
      <Start of raw data processing
       efp BC_mod = 2 LB = 0.24 FT_mod = 6 PKNL = 1 PHC0 = -18036.1 PHC1 = 9.80069 SI = 16K 
       data hash MD5: 16K
       50 93 B3 9A 1C 86 5F 51 73 2D 29 60 65 FF 05 B0>)
(   3,<2022-08-25 09:49:39.79 +0400>,<she>,<DPX200>,
      <pk PHC0 = -0.8525829 PHC1 = 0.8 
       data hash MD5: 16K
       43 55 50 EF 2E 51 C7 FB E4 55 40 2A 10 22 A9 7F>)
(   4,<2022-08-25 09:49:43.10 +0400>,<she>,<DPX200>,
      <abs ABSG = 5 
       data hash MD5: 16K
       4B 49 E3 34 49 48 7F 54 7E D6 5F 2F C0 2A 57 61>)
$$ ##END=
$$ 
$$ hash MD5
$$ D0 56 57 A1 FD 9A 03 D9 04 FB BD 85 8A E6 94 5F
##$RELAX= 
##$RELAX= 
##$RELAX= 
##$RELAX= 
##$RELAX= 
##$RELAX= 
$$ Bruker specific parameters
$$ --------------------------
##$DU= <F:/spectra>
##$EXPNO= 1
##$NAME= <H-F>
##$PROCNO= 1
##$TYPE= <nmr>
##$USER= <she>
##$AMP= (0..31)
100 100 100 100 100 100 100 100 100 100 100 100 100 100 100 100 100 100 
100 100 100 100 100 100 100 100 100 100 100 100 100 100 
##$AQSEQ= 0
##$AQ_mod= 1
##$AUNM= <au_zg>
##$AUTOPOS= <>
##$BF1= 200.13
##$BF2= 200.13
##$BF3= 200.13
##$BF4= 200.13
##$BF5= 200.13
##$BF6= 200.13
##$BF7= 200.13
##$BF8= 200.13
##$BYTORDA= 1
##$CFDGTYP= 0
##$CFRGTYP= 5
##$CHEMSTR= <none>
##$CNST= (0..31)
1 1 145 1 1 1 1 1 1 1 1 1 1 1 1 1 1 1 1 1 1 1 1 1 1 1 1 1 1 1 1 1 
##$CPDPRG= <>
##$CPDPRG1= <>
##$CPDPRG2= <>
##$CPDPRG3= <>
##$CPDPRG4= <mlev>
##$CPDPRG5= <mlev>
##$CPDPRG6= <mlev>
##$CPDPRG7= <mlev>
##$CPDPRG8= <mlev>
##$CPDPRGB= <>
##$CPDPRGT= <>
##$D= (0..31)
0 1.2 0 0 0 0 0 0 0 0.06 0 0.03 0 0 0 0 0.0002 0 0 0 0 0 0 0 0 0 0 0 0 
0 0 0 
##$DATE= 1661406560
##$DBL= (0..7)
120 120 120 120 120 120 120 120 
##$DBP= (0..7)
150 150 150 150 150 150 150 150 
##$DBP07= 0
##$DBPNAM0= <>
##$DBPNAM1= <>
##$DBPNAM2= <>
##$DBPNAM3= <>
##$DBPNAM4= <>
$$ [...]
##$SUBNAM3= <"">
##$SUBNAM4= <"">
##$SUBNAM5= <"">
##$SUBNAM6= <"">
##$SUBNAM7= <"">
##$SUBNAM8= <"">
##$SUBNAM9= <"">
##$SW= 18.0517283424941
##$SWIBOX= (0..15)
0 0 2 0 0 0 0 0 0 0 0 0 0 0 0 0 
##$SW_h= 3612.71676300578
##$TD= 16384
##$TD0= 1
##$TE= 0
##$TE2= 300
##$TE3= 300
##$TEG= 300
##$TL= (0..7)
0 120 120 120 120 120 120 120 
##$TP= (0..7)
150 150 150 150 150 150 150 150 
##$TP07= 0
##$TPNAME0= <>
##$TPNAME1= <>
##$TPNAME2= <>
##$TPNAME3= <>
##$TPNAME4= <>
##$TPNAME5= <>
##$TPNAME6= <>
##$TPNAME7= <>
##$TPOAL= (0..7)
0.5 0.5 0.5 0.5 0.5 0.5 0.5 0.5 
##$TPOFFS= (0..7)
0 0 0 0 0 0 0 0 
##$TUNHIN= 0
##$TUNHOUT= 0
##$TUNXOUT= 0
##$USERA1= <user>
##$USERA2= <user>
##$USERA3= <user>
##$USERA4= <user>
##$USERA5= <user>
##$V9= 5
##$VALIST= <valist>
##$VCLIST= <CCCCCCCCCCCCCCC>
##$VD= 0
##$VDLIST= <DDDDDDDDDDDDDDD>
##$VPLIST= <PPPPPPPPPPPPPPP>
##$VTLIST= <TTTTTTTTTTTTTTT>
##$WBST= 1024
##$WBSW= 4
##$XGAIN= (0..3)
0 0 0 0 
##$XL= 0
##$YL= 0
##$YMAX_a= 225543
##$YMIN_a= -202762
##$ZGOPTNS= <>
##$ZL1= 120
##$ZL2= 120
##$ZL3= 120
##$ZL4= 120
##$ABSF1= 15.64221
##$ABSF2= -2.409637
##$ABSG= 5
##$ABSL= 3
##$ALPHA= 0
##$AQORDER= 0
##$ASSFAC= 0
##$ASSFACI= 0
##$ASSFACX= 0
##$ASSWID= 0
##$AUNMP= <proc_1d>
##$AZFE= 0.1
##$AZFW= 0.1
##$BCFW= 0
##$BC_mod= 2
##$BYTORDP= 0
##$COROFFS= 0
##$CY= -3
##$DATMOD= 1
##$DC= 0
##$DFILT= <>
##$DTYPP= 0
##$F1P= 0
##$F2P= 0
##$FCOR= 1
##$FTSIZE= 16384
##$FT_mod= 6
##$GAMMA= 0
##$GB= 0
##$INTBC= 1
##$INTSCL= 1.705223e-09
##$ISEN= 128
##$LB= 0.24
##$LEV0= 0
##$LPBIN= 0
##$MAXI= 10000
##$MC2= 0
##$MEAN= 0
##$ME_mod= 0
##$MI= 1.114404
##$NCOEF= 0
##$NC_proc= -7
##$NLEV= 6
##$NOISF1= 3.799351
##$NOISF2= 2.8
##$NSP= 0
##$NTH_PI= 0
##$NZP= 0
##$OFFSET= 15.73587
##$PC= 1
##$PHC0= -18036.95
##$PHC1= 10.60069
##$PH_mod= 1
##$PKNL= yes
##$PPARMOD= 0
##$PSCAL= 0
##$PSIGN= 0
##$REVERSE= no
##$SF= 200.130007137392
##$SI= 16384
##$SIGF1= 3
##$SIGF2= 2
##$SINO= 5.538805
##$SIOLD= 16384
##$SREGLST= <1H.CDCl3>
##$SSB= 0
##$STSI= 16384
##$STSR= 0
##$SW_p= 3612.71676300578
##$SYMM= 0
##$S_DEV= 0
##$TDeff= 16384
##$TDoff= 0
##$TI= <>
##$TILT= no
##$TM1= 0
##$TM2= 0
##$TOPLEV= 0
##$USERP1= <user>
##$USERP2= <user>
##$USERP3= <user>
##$USERP4= <user>
##$USERP5= <user>
##$WDW= 1
##$XDIM= 16384
##$YMAX_p= 397007405
##$YMIN_p= -752769
$$ End of Bruker specific parameters
$$ ---------------------------------
##NTUPLES= NMR SPECTRUM
##VAR_NAME=  FREQUENCY,     SPECTRUM/REAL,   SPECTRUM/IMAG
##SYMBOL=    X,             R,               I
##VAR_TYPE=  INDEPENDENT,   DEPENDENT,       DEPENDENT
##VAR_FORM=  AFFN,          ASDF,            ASDF
##VAR_DIM=   16384,         16384,           16384
##UNITS=     HZ,            ARBITRARY UNITS, ARBITRARY UNITS
##FACTOR=    0.220516191357247, 1,           1
##FIRST=     3149.21984772567, 0,            0
##LAST=      -463.496915280107, 0,           0
##MIN=       -463.496915280107, -752769,     0
##MAX=       3149.21984772567, 397007405,    0
$$ Real data points
##PAGE= N=1
##DATA TABLE= (X++(R..R)), XYDATA
$$ [...]
$$ plain form
6223 -293678 98845 452536 299485 340203 235268 -15126 -174682 39269 82971 6136
6213 6136 -24231 -112245 8638 216456 -56143 73117 217578 239095 -118369 -212622 121821
6202 121821 286147 4850 -16522 7215 -3774 135433 51687 -4846 -153849 -6081 -74844
6191 -74844 -17718 -54507 60086 253472 -5036 -352549 -182981 -125613 -102908 -323530 -467866
6180 -467866 -177471 -280098 -137512 -25517 -201426 101774 49079 -75652 5179 -78109
6170 -78109 -106693 -264415 -266251 -320122 -309555 -72788 -148635 -283 35236 -33125 22983
6159 22983 -297757 -342686 -292801 -213272 -229378 -400864 106934 264568 -174413 -141825 -109013
6148 -109013 104060 3637 -9226 118071 445066 539699 431062 213840 148310 -144991
$$ packed form
6223b93678L92523L53691j53051M0718j04935k50394j59556K13951M3702p6835
6213F136l0367q8014J20883K07818k72599J29260J44461K1517l57464r4253L34443
6202A21821J64326k81297k1372K3737j0989J39207q3746n6533j49003J47768o8763
6191g4844N7126l6789J14593J93386k58508l47513J69568N7368K2705k20622j44336
6180d67866K90395j02627J42586J11995j75909L03200n2695j24731Q0831q3288
6170g8109k8584j57722j836n3871J0567K36767p5847J48352L5519o8361N6108
6159B2983l20740m4929M9885P9529j6106j71486N07798J57634m38981L2588L2812
6148a09013K13073j00423j2863J27297L26995R4633j08637k17222o5530k93301
$$ plain form
6138 -144991 -75161 53219 -17432 -295023 -344229 -300561 245481 -66176 -127023 7976 -78496
6127 -78496 -37729 147773 208003 116653 -70536 -99930 126664 459748 -211603 -654217 -270180
6116 -270180 -32903 22990 311729 294324 -72657 -36789 13666 -193440 -62815 80744
6106 80744 -41061 154132 90393 39360 266785 220299 202278 90765 -39799 221547 -7541
6095 -7541 -14031 -180229 -113841 -181691 30613 43472 -87891 -160879 -18286 64506 189318
6084 189318 260664 296575 191882 534519 465202 140386 -73384 -66238 71812 -129064 22758
6073 22758 54505 -51395 -201225 -38371 -29696 84488 74683 306962 312600 -143471 134241
6062 134241 101116 -3035 212118 291863 236530 52532 -71785 -220493 -199577 -16180
$$ packed form
6138a44991O9830J28380p0651k77591m9206M3668N46042l11657o0847J34999q6472
6127g8496M0767J85502O0230r1350j87189k9394K26594L33084o71351m42614L84037
6116b70180K37277N5893K88739j7405l66981L5868N0455k07106J30625J43559
6106H0744j21805J95193o3739n1033K27425m6486j8021j11513j30564K61346k29088
6095g541o490j66198O6388o7850K12304J2859j31363p2988J42593Q2792J24812
6084A89318P1346L5911j04693L42637o9317l24816k13770P146J38050k00876J51822
6073B2758L1747j05900j49830J62854Q675J14184r805K32279N638m56071K77712
6062A34241l3125j04151K15153P9745n5333j83998j24317j48708K0916J83397
$$ plain form
6052 -16180 91806 102905 227691 -75947 -106190 -74296 152095 155848 -159347 -147886 -312631
6041 -312631 -261106 -293406 -261403 -181566 -153986 -209616 -28657 -164223 -104891 -121632 -32465
6030 -32465 -270805 -270814 -212832 -229357 -255299 -99303 -87071 10303 79424 -97185 -162127 -215277
6018 -215277 -175051 -76427 -179977 -168809 85202 164207 223547 254608 325649 320210 -20449
6007 -20449 -46447 2866 -175151 13732 -180633 -232195 -205223 85657 6741 -282147 -156715
5996 -156715 -209828 -204437 175099 300037 -84605 -149210 -248114 -35064 -187123 -72646 200527
5985 200527 -36766 -44538 130344 63681 159026 616373 390736 380 196913 90432
5975 90432 -79961 -66750 89691 13571 -208152 -163178 79279 338511 316215 231566 285257
$$ packed form
6052a6180J07986J1099J24786l03638l0243L1894K26391L753l15195J1461j64745
6041c12631N1525l2300L2003P9837K7580n5630J80959j35566N9332j6741Q9167
6030c2465k38340rN7982j6525k5942J55996J2232R7374O9121j76609o4942n3150
6018b15277M0226R8624j03550J1168K54011P9005N9340L1061P1041n439l40659
6007b0449k5998M9313j78017J88883j94365n1562K6972K90880p8916k88888J25432
5996a56715n3113N391L79536J24938l84642o4605r8904K13050j52059J14477K73173
5985B00527k37293p772J74882o6663R5345M57347k25637l90356J96533j06481
5975I0432j70393J3211J56441p6120k21723M4974K42457K59232k2296q4649N3691
$$ plain form
5964 285257 196166 362213 -12921 4853 66439 -192915 -268751 -322757 -110024 -43010 -41551
5953 -41551 -141082 119165 187410 922 -74149 -161532 -273217 24440 -187406 -315962 -142413
5942 -142413 76745 320869 358469 166731 450457 331739 171837 116178 180895 289615
5932 289615 302795 197359 -37943 -249022 143873 106513 -291205 -594392 -353024 -192194
5922 -192194 -307529 -197585 269274 275840 120587 -32532 -190275 63622 60107 35614 210619
5911 210619 -109147 -26754 -93218 -164744 -50620 11786 -341336 -77061 132908 139187 227413
5900 227413 185189 109554 285353 418939 112702 -21233 -136718 -15838 -86175 -138740
5890 -138740 -511865 -289501 24429 37059 193152 189413 -29649 292981 -4468 191416
$$ packed form
5964B85257q9091J66047l75134J7774O1586k59354p5836n4006K12733O7014J459
5953d1551r9531K60247O8245j86488p5071q7383j11685K97657k11846j28556J73549
5942a42413K19158K44124L7600j91738K83726j18718j59902n5659O4717J08720
5932B89615J3180j05436k35302k11079L92895l7360l97718l03187K41368J60830
5922a92194j15335J09944M66859O566j55253j53119j57743K53897l515k4493J75005
5911B10619l19766Q2393o6464p1526J14124O2406l53122K64275K09969O279Q8226
5900B27413m2224p5635J75799J33586l06237j33935j15485J20880p0337n2565
5890a38740l73125K22364L13930J2630J56093l739k19062L22630k97449J95884
$$ plain form
5880 191416 268780 21162 48092 48121 295384 388327 305497 -62527 -38525 137074 19145
5869 19145 154868 63268 36242 60794 -18175 176961 367119 309352 410878 445665 256162
5858 256162 283185 329870 420943 338967 177279 67594 -61017 -107319 -126771 -121334 -132567
5847 -132567 -115724 -62743 -33856 -26983 81999 510 17480 -104894 -224167 -275027 42285
5836 42285 -46698 -145705 -313348 -108234 -125403 -91618 -158110 -52319 -239922 -228784 15094
5825 15094 -226993 279482 46180 53330 119592 -198006 -498532 -261454 201851 174060 173004
5814 173004 135783 20052 -116345 -154629 -159108 -244754 11163 39938 -105738 -198321 28078
5803 28078 -21199 189427 120744 184903 284736 41402 -129731 194091 374308 287659 232435
$$ packed form
5880A91416P7364k47618K6930K9K47263R2943q2830l68024K4002J75599j17929
5869A9145J35723r1600k7026K4552p8969J95136J90158n7767J01526L4787j89503
5858B56162K7023M6685R1073q1976j61688j09685j28611m6302j9452N437j1233
5847a32567J6843N2981K8887O873J08982q1489J6970j22374j19273n0860L17312
5836D2285q8983r9007j67643K05114j7169L3785o6492J05791j87603J1138K43878
5825A5094k42087N06475k33302P150O6262l17598l00526K37078M63305k7791j056
5814A73004l7221j15731j36397l8284m479q5646K55917K8775j45676r2583K26399
5803B8078m9277K10626o8683O4159R9833k43334j71133L23822J80217q6649n5224
$$ plain form
5792 232435 427072 334039 51107 83918 -58884 70128 162669 422820 300004 305458 227475
5781 227475 207338 282063 350946 111639 265485 185059 78014 70377 37118 115092 222052
5770 222052 -57868 201678 278858 271296 312061 545498 409843 415109 377090 368086 133543
5759 133543 -433164 -453352 -257019 4596 -27666 153958 -57437 74678 161661 158622 203005
5748 203005 72781 289377 326165 56164 -130562 -143236 -2282 -110089 -118235 -71900 -20378
5737 -20378 39716 362172 326412 163715 63869 65619 170712 -90809 -405018 -119931 -224092
5726 -224092 9262 271498 483704 660937 692255 367276 145313 393892 453468 418324
5716 418324 19962 234010 120311 -140770 -1896 -276289 136010 345868 382588 333460
$$ packed form
5792B32435J94637r3033k82932L2811j42802J29012R2541K60151j22816N454p7983
5781B27475k0137P4725O8883k39307J53846q0426j07045p637l3259P7974J06960
5770B22052k79920K59546P7180p562M0765K33437j35655N266l8019r004k34543
5759A33543n66707k0188J96333K61615l2262J81624k11395J32115Q6983l039M4383
5748B03005j30224K16596L6788k70001j86726j2674J40954j07807q146M6335N1522
5737b0378O0094L22456l5760j62697r9846J750J05093k61521l14209K85087j04161
5726b24092K33354K62236K12206J77233L1318l24979k21963K48579N9576l5144
5716D18324l98362K14048j13699k61081J38874k74393M12299K09858L6720m9128
$$ plain form
5706 333460 100100 165051 109109 34785 -92811 -89113 174438 245828 504194 214492 22782
5695 22782 -269549 -162280 78271 155595 118072 116596 318961 598804 486729 80008 285063
5684 285063 193861 216883 367228 544554 608691 484679 657199 349205 397562 289270
5674 289270 434661 147750 -31409 126492 34749 84045 141595 165464 379093 210576
5664 210576 -92121 54855 250537 246510 406503 710197 768115 689378 488553 610179
5654 610179 375064 491526 450678 576474 660578 598801 324118 449624 434701 680864
5644 680864 255453 132975 235775 203823 348729 80563 -42489 9962 -212264 -174782
5634 -174782 -33630 203706 182302 196339 494026 434451 238904 -13857 40392 134307 158814
$$ packed form
5706C33460k33360O4951n5942p4324j27596L698K63551P1390K58366k89702j91710
5695B2782k92331J07269K40551P7324l7523j476K02365K79843j12075m06721K05055
5684B85063r1202K3022J50345J77326O4137j24012J72520l07994M8357j08292
5674B89270J45391k86911j79159J57901r1743M9296N7550K3869K13629j68517
5664B10576l02697J46976J95682m027J59993L03694N7918p8737k00825J21626
5654F10179k35115J16462m0848J25796Q4104o1777k74683J25506j4923K46163
5644F80864m25411j22478J02800l1952J44906k68166j23052N2451k22226L7482
5634a74782J41152K37336k1404J4037K97687n9575j95547k52761N4249R3915K4507
$$ plain form
5623 158814 501315 675765 262950 361959 445867 326361 213142 337706 523221 128422
5613 128422 -66089 105152 378710 392797 637990 697826 375898 658920 273672 328637
5603 328637 375947 401930 497428 185939 624907 793141 561699 490015 194496 94982 182304
5592 182304 538788 400980 520407 498383 264521 426791 477971 488865 565475 675647
5582 675647 272577 372434 240409 448415 492661 319179 423265 294680 158183 402390
5572 402390 355632 456618 796168 831279 501456 772617 260964 200444 474370 440620
5562 440620 481963 467654 448597 319672 495289 597795 263256 255514 348304 577438 570534
5551 570534 462429 355022 599848 703225 449767 168576 341838 429558 712467 538881
$$ packed form
5623A58814L42501J74450m12815R9009Q3908j19506j13219J24564J85515l94799
5613A28422j94511J71241K73558J4087K45193N9836l21928K83022l85248N4965
5603C28637M7310K5983R5498l11489M38968J68234k31442p1684k95519r9514Q7322
5592A82304L56484j37808J19427k2024k33862J62270N1180J0894P6610J10172
5582F75647m03070R9857j32025K08006M4246j73482J04086j28585j36497K44207
5572D02390m6758J00986L39550L5111l29823K71161n11653o0520K73926l3750
5562D40620M1343j4309j9057j28925J75617J02506l34539p742R2790K29134o904
5551E70534j08105j07407K44826J03377k53458k81191J73262Q7720K82909j73586
$$ plain form
5541 538881 288652 412319 414157 322952 483166 627907 641059 550981 550526 834672 513327
5530 513327 577570 256906 249737 227889 301140 140733 264181 247722 458857 618654 749498
5519 749498 362626 379090 724581 803109 596794 808304 578808 438191 459077 522385
5509 522385 482239 656995 479874 706932 672265 486170 554268 694254 524685 460096
5499 460096 645351 840301 929575 865186 869199 1011932 1257835 1091535 732174 557793
5489 557793 627788 838644 867160 941595 954691 902301 1003875 1237935 910965 972591 726766
5478 726766 701937 1027590 958893 1074085 857765 1016961 1028551 1186796 1225604 1305436 1340348
5467 1340348 1093638 1115799 1081385 1175566 1040340 652399 1295206 1702870 1488506 1545608
$$ packed form
5541E38881k50229J23667J838r1205J60214J44741J3152r0078m55K84146l21345
5530E13327O4243l20664p169k1848P3251j60407J23448j6459K11135J59797J30844
5519G49498l86872J6464L45491P8528k06315K11510k29496j40617K0886O3308
5509E22385m0146J74756j77121K27058l4667j86095O8098J39986j69569o4589
5499D60096J85255J94950Q9274o4389M013J42733K45903j66300l59361j74381
5489E57793O9995K10856K8516P4435J3096n2390J01574K34060l26970O1626k45825
5478G26766k4829L25653o8697J15192k16320J59196J1590J58245L8808P9832L4912
5467A340348k46710K2161l4414R4181j35226l87941O42807M07664k14364N7102
$$ plain form
5457 1545608 1797010 1427520 1369573 1476323 1611199 1675177 1833868 1644838 1925941 1760343
5447 1760343 1725598 1986300 2036239 1862492 1701810 1690072 2059215 2109189 2263225 2492700
5437 2492700 2389082 2352032 2459593 2682042 2747158 2734875 2590836 2422635 2630407 2896789
5427 2896789 2914973 2918654 3018794 3257266 3519884 3568418 3495123 3769100 3917363 3919326 3614141
5416 3614141 3993985 3941582 3967128 4257952 4243094 4636045 4686113 4741323 5183054 5233165 5419422
5405 5419422 5761527 5863398 6090347 6195737 6644587 6827369 7225321 7564880 7783383 7972025
5395 7972025 8395185 8927925 9153224 9625419 10116359 10448009 11206518 11851756 12591894 13331225
5385 13331225 14278026 15390208 16764630 18010157 19401114 21231919 23711186 26160044
$$ packed form
5457A545608K51402l69490n7947J06750J34876O3978J58691j89030K81103j65598
5447A760343l4745K60702M9939j73747j60682j1738L69143M9974J54036K29475
5437B492700j03618l7050J07561K22449O5116j2283j44039j68201K07772K66382
5427B896789J8184L681J00140K38472K62618M8534p3295K73977J48263J963l05185
5416C614141L79844n2403K5546K90824j4858L92951N0068N5210M41731N0111J86257
5405E419422L42105J01871K26949J05390M48850J82782L97952L39559K18503J88642
5395G972025M23160N32740K25299M72195M90940L31650P58509O45238P40138P39331
5385A3331225R46801J112182J374422J245527J390957J830805K479267K448858
$$ plain form
5377 26160044 29077694 32548518 36741471 41642962 47108221 52833682 58017564 61047371
5369 61047371 61113328 57902351 52649629 46358491 40098149 34935634 30717437 27288305
5361 27288305 24382957 22104226 19858082 18203614 16966170 15744734 14496348 13818590
5353 13818590 13109627 12522568 12100015 11498992 11145894 10968291 10677908 10457083 10073865
5344 10073865 9870696 9227129 8975881 8884276 8896710 8829489 9102946 8758537 8760660 8893728
5334 8893728 9055790 9254786 9152056 9141669 9203120 9363213 9795920 9844731 9945419 10387662
5324 10387662 10615124 10801610 10985907 11341806 11602035 11775502 12397981 12849414 13648030
5315 13648030 14481565 15090260 15861906 16671572 17539780 19056405 20945997 22771918 25023511
$$ packed form
5377B6160044K917650L470824M192953M901491N465259N725461N183882L029807
5369F1047371O5957l210977n252722o291138o260342n162515m218197l429132
5361B7288305k905348k278731k246144j654468j237444j221436j248386o77758
5353A3818590p08963n87059m22553o01023l53098j77603k90383k20825l83218
5344A0073865k03169o43567k51248r1605J2434o7221K73457l44409K123J33068
5334H893728J62062J98996j02730j0387O1451J60093M32707M8811J00688M42243
5324A0387662K27462J86486J84297L55899K60229J73467O22479M51433P98616
5315A3648030Q33535O08695P71646Q09666Q68208J516625J889592J825921K251593
$$ plain form
5306 25023511 27558926 30514599 34273704 38731194 43871105 49702057 55206158 59380048
5298 59380048 61435692 60476159 56549327 50426389 44139415 38111626 32824033 28653155
5290 28653155 25636215 22941811 20513458 18548028 16909338 15620389 14403746 13513395
5282 13513395 12641619 11865142 11207577 10696274 10101080 9471988 8916189 8397113 8058102
5273 8058102 7832790 7489686 6953798 6898553 6986980 6754543 6681383 6247203 6177106 5591407
5263 5591407 5761530 5425415 5112677 5071178 5059698 4900346 4613961 4321366 4337962 4500549
5253 4500549 4537682 4530311 4459579 4268966 4030206 3901555 3958020 4016691 3677397 3676377 3479639
5242 3479639 3310154 3443370 3466924 3255865 3146602 3531207 3423663 3380653 3418616 3289129
$$ packed form
5306B5023511K535415K955673L759105M457490N139911N830952N504101M173890
5298E9380048K055644r59533l926832o122938o286974o027789n287593m170878
5290B8653155l016940k694404k428353j965430j638690j288949j216643q90351
5282A3513395q71776p76477o57565n11303n95194o29092n55799n19076l39011
5273H058102k25312l43104n35888n5245Q8427k32437p3160m34180p0097n85699
5263E591407J70123l36115l12738m1499j1480j59352k86385k92595J6596J62587
5253D500549L7133p371p0732j90613k38760j28651N6465N8671l39294j020j96738
5242C479639j69485J33216K3554k11059j09263L84605j07544m3010L7963j29487
$$ plain form
5232 3289129 3594826 3537508 3350571 3277786 2954413 2738819 2967305 3023991 2896061 3078647
5222 3078647 3065248 3010351 3054922 2969755 2951535 3012706 3003818 3013639 2841776 3006296 2913100
5211 2913100 3084415 3133097 3060159 3033926 3065746 3011820 3131057 3260669 3201773 3105300 3045725
5200 3045725 3007517 2984995 3196941 3388545 3374169 2849647 3181073 3573465 3825275 3809241
5190 3809241 3664359 3587318 3632748 3697305 4012181 3906984 4138567 4449193 4596935 4662529
5180 4662529 4549174 4309309 4806462 4931480 5392497 5611276 5389941 5499377 5678200 5658873
5170 5658873 5695746 6085797 6250983 6580936 6874196 7055711 6998976 7351777 7672459 7745386
5160 7745386 8070005 8827212 9532871 9987791 10173913 10960602 11503388 12205841 13232468
$$ packed form
5232C289129L05697n7318j86937p2785l23373k15594K28486N6686j27930J82586
5222C078647j3399n4897M4571q5167j8220O1171q888R821j71863J64520r3196
5211B913100J71315M8682p2938k6233L1820n3926J19237J29612n8896r6473n9575
5200C045725l8208k2522K11946J91604j4376n24522L31426L92392K51810j6034
5190C809241j44882p7041M5430O4557L14876j05197K31583L10626J47742O5594
5180D662529j13355k39865M97153J25018M61017K18779k21335J09436J78823j9327
5170E658873L6873L90051J65186L29953K93260J81515n6735L52801L20682P2927
5160G745386L24619P57207P05659M54920J86122P86689N42786P02453J026627
$$ plain form
5151 13232468 13966477 15073040 16290406 17354239 18670446 20297350 21957893 23829699
5143 23829699 25312805 26558359 27804945 28324030 28518246 28197640 27485335 26687544 25176857
5134 25176857 24145072 23669745 22523935 22021857 21818253 21767672 21451404 21106437 21561654
5125 21561654 21924299 22399686 22952547 23489658 24466120 25548588 26523714 27946999 28992910
5116 28992910 30287788 31545662 33218730 34983535 36645070 37904082 38854445 39469160
5108 39469160 40355607 40862876 40767720 40778559 40203872 39247854 38611116 37824599 36079970 35120614
5098 35120614 33884217 32703438 31279830 30036180 28742763 27791791 26711173 25772429
5090 25772429 24904296 23908101 23297741 22453011 21898542 21753109 21829878 21882625 22126366 21940961
$$ packed form
5151A3232468P34009J106563J217366J063833J316207J626904J660543J871806
5143B3829699J483106J245554J246586N19085J94216l20606p12305p97791j510687
5134B5176857j031785m75327j145810n02078k03604n0581l16268l44967M55217
5125B1561654L62645M75387N52861N37111R76462J082468R75126J423285J045911
5116B8992910J294878J257874J673068J764805J661535J259012R50363O14715
5108C9469160Q86447N07269r5156J0839n74687r56018o36738p86517j744629r59356
5098C5120614j236397j180779j423608j243650j293417r50972j080618r38744
5090B5772429q68133r96195o10360q44730n54469j45433P6769N2747K43741j85405
$$ plain form
5080 21940961 22228423 23043547 23971384 25059726 26083486 27425823 28815391 30027879 30597732
5071 30597732 30852066 30717041 29964993 28659453 26939388 25039271 23358926 21639091 19961942
5062 19961942 18374811 16819641 15695755 14497867 14014897 13456586 12669106 12042528 11500784
5053 11500784 10845945 10504478 10248624 9818396 9887454 9709033 9513212 9240560 8726823 8666975
5043 8666975 8433206 8515356 8215508 8490561 8545196 8449849 8688193 8347166 8189532 8383644
5033 8383644 8348919 8327821 8513350 8381461 8514595 8594200 8442549 8655342 9299426 9593405
5023 9593405 9533679 10093831 10391640 10435982 10705003 11067074 11416332 11850801 12342462 12816726
5013 12816726 13556152 14103214 14853411 15574393 16926446 17993909 19271021 20594062 21727722
$$ packed form
5080B1940961K87462Q15124R27837J088342J023760J342337J389568J212488N69853
5071C0597732K54334j35025p52048j305540j720065j900117j680345j719835j677149
5062A9961942j587131j555170j123886j197888m82970n58311p87480o26578n41744
5053A1500784o54839l41467k55854m30228O9058j78421j95821k72652n13737n9848
5043H666975k33769Q2150k99848K75053N4635r5347K38344l41027j57634J94112
5033H383644l4725k1098J85529j31889J33134P9605j51651K12793O44084K93979
5023I593405n9726N60152K97809M4342K69021L62071L49258M34469M91661M74264
5013A2816726P39426N47062P50197P20982J352053J067463J277112J323041J133660
$$ plain form
5004 21727722 22975392 24082730 24969159 25535882 26419359 26739012 26864101 26975815 26924139
4995 26924139 26954461 26603707 26430359 25947029 25556337 25273298 24986936 25330955 25634077 25836328
4985 25836328 26182158 26501112 27323774 28204337 29074788 30070931 31126387 32009503 33041570
4976 33041570 34275652 35187572 35892874 37012324 37972776 38179174 38812899 39189127 39311033
4967 39311033 39136664 38751367 38222749 37000759 36458849 35815687 34806503 33862415 32854692
4958 32854692 31578820 30489043 29545675 28439463 27058749 26405922 25439927 24534188 24033823
4949 24033823 23450875 22743625 22302270 22529061 22447007 22677817 22786644 23002807 23360095 24062517
4939 24062517 24850463 25625530 26706134 27477280 28207599 28793521 28521873 28136444 27439615
$$ packed form
5004B1727722J247670J107338Q86429N66723Q83477L19653J25089J11714n1676
4995B6924139L0322l50754j73348m83330l90692k83039k86362L44019L03122K02251
4985B5836328L45830L18954Q22662Q80563Q70451R96143J055456Q83116J032067
4976C3041570J234082R11920P05302J119450R60452K06398O33725L76228J21906
4967C9311033j74369l85297n28618j221990n41910o43162j009184r44088j007723
4958C2854692j275872j089777r43368j106212j380714o52827r65995r05739n00365
4949B4033823n82948p07250m41355K26791q2054K30810J08827K16163L57288P02422
4939B4062517P87946P75067J080604P71146P30319N85922k71648l85429o96829
$$ plain form
4930 27439615 26541078 24742815 23217806 21442007 19579979 17818601 16299029 15188336
4922 15188336 14086653 13038147 12259490 11517637 10764093 9762607 9164912 8746878 8208408
4913 8208408 7768131 7509630 6880126 6640332 6491999 6034942 5923665 5716154 5534149 5682983
4903 5682983 5745234 5126937 4669336 4469432 4641864 4190961 3760148 3976600 4124752 3812984
4893 3812984 3567172 3294001 2762257 2795047 2840301 2980181 3096555 3069447 2732964 2613252
4883 2613252 2802885 2751021 2738562 2336612 2250442 2183034 2502826 2702543 2655878 2376848
4873 2376848 2184717 1995751 1958284 1922183 1975155 1833487 1740133 1861890 1909803 1643921
4863 1643921 1728583 1641783 1405460 1619031 1338396 1332574 1269421 1354325 1491491 1549107 1674227
$$ packed form
4930B7439615q98537j798263j525009j775799j862028j761378j519572j110693
4922A5188336j101683j048506p78657p41853p53544j001486n97695m18034n38470
4913H208408m40277k58501o29504k39794j48333m57057j11277k07511j82005J48834
4903E682983O2251o18297m57601j99904J72432m50903m30813K16452J48152l11768
4893C812984k45812k73171n31744L2790M5254J39880J16374k7108l36483j19712
4883B613252J89633n1864j2459m01950q6170o7408L19792J99717m6665k79030
4873B376848j92131j88966l7467l6101N2972j41668r3354J21757M7913k65882
4863A643921Q4662q6800k36323K13571k80635n822o3153Q4904J37166N7616J25120
$$ plain form
4852 1674227 1314455 1376705 1695044 1492611 1396429 1368726 1202966 984833 946129 1009416
4842 1009416 1239453 1173128 1104317 1157706 1164660 1152013 1195829 1150630 1078642 1083691 1007228 910832
4830 910832 1209736 1331875 852092 1056893 960328 883349 886395 933070 1106600 1355007 1073177
4819 1073177 996584 982086 856318 1014201 889372 809210 849368 949436 609522 694709
4809 694709 891557 1071231 1024883 1002086 682195 348297 372420 480878 731269 594358
4799 594358 846234 821628 411754 232166 216757 480541 699894 680640 699842 1053377
4789 1053377 714581 283749 253884 433986 775175 875557 742079 643309 619076 617383
4779 617383 705748 495999 275391 209901 269352 502859 293215 82755 219013 434712
$$ packed form
4852A674227l59772O2250L18339k02433r6182k7703j65760k18133l8704O3287
4842A009416K30037o6325o8811N3389O954j2647M3816m5199p1988N049p6463r6396
4830I10832K98904J22139m79783K04801r6565p6979L046M6675J73530K48407k81830
4819A073177p6593j4498j25768J57883j24829q0162M0158J00068l39914Q5187
4809F94709J96848J79674m6348k2797l19891l33898K4123J08458K50391j36911
4799E94358K51876k4606m09874j79588j5409K63784K19353j9254J9202L53535
4789A053377l38796m30832k9865J80102L41189J00382j33478r8770k4233j693
4779F17383Q8365k09749k20608o5490N9451K33507k09644k10460J36258K15699
$$ plain form
4769 434712 543630 595709 512928 230062 409103 775425 567930 443884 236279 340269
4759 340269 470965 294584 371324 572918 640789 590556 202054 220226 183097 147151 -6883
4748 -6883 -154848 186059 405348 555800 637239 469054 431705 283132 -36806 27391 108765
4737 108765 255102 306708 343448 633677 583566 296734 338467 287792 328078 223158 87816
4726 87816 121055 223639 132236 -29444 -28825 24698 -171338 102856 271265 19342 -337929
4715 -337929 38009 289935 262584 -54229 -9477 81680 64258 355243 377627 74012 -12774
4704 -12774 193780 -156658 -270345 -42493 25010 10279 177535 132001 273363 251605 256234
4693 256234 62884 -209752 69698 76262 368677 27756 -104723 318303 341758 509349
$$ packed form
4769D34712J08918N2079q2781k82866J79041L66322k07495j24046k07605J03990
4759C40269J30696j76381P6740K01594O7871n0233l88502J8172l7129l5946j54034
4748f883j47965L40907K19289J50452Q1439j68185l7349j48573l19938O4197Q1374
4737A08765J46337N1606L6740K90229n0111k86832M1733n0675M0286j04920j35342
4726H7816L3239J02584r1403j61680O19N3523j96036K74194J68409k51923l57271
4715c37929L75938K51926k7351l16813M4752R1157j7422K90985K2384l03615q6786
4704a2774K06554l50438j13687K27852O7503j4731J67256m5534J41362k1758M629
4693B56234j93350k72636K79450O564K92415l40921j32479M23026K3455J67591
$$ plain form
4683 509349 372655 233943 -46496 -1920 123695 -79078 206104 124348 248388 129834
4673 129834 74194 291157 405772 168828 225924 393637 280385 -78459 -87336 436141
4663 436141 395552 357818 493942 596387 561101 663271 365755 179788 388013 555494
4653 555494 184104 282991 252226 394518 427123 525388 552649 499623 149002 80321 220459
4642 220459 301985 309021 243398 293820 393449 10615 67472 -14531 -32817 460119 658860
4631 658860 505104 432810 350103 485547 588297 485159 270513 397314 300859 259921
4621 259921 244769 278564 517933 -85750 220643 45652 121584 -43256 -150567 -215616
4611 -215616 -90028 -265235 -267168 126013 192774 175854 -161848 -163605 243613 195096 -216434
$$ packed form
4683E09349j36694j38712k80439M4576J25615k02773K85182q1756J24040j18554
4673A29834n5640K16963J14615k36944N7096J67713j13252l58844q877N23477
4663D36141m0589l7734J36124J02445l5286J02170k97516j85967K08225J67481
4653E55494l71390R8887l0765J42292L2605R8265K7261n3026l50621o8681J40138
4642B20459Q1526P036o5623N0422R9629l82834N6857q2003j8286M92936J98741
4631F58860j53756p2294q2707J35444J02750j03138k14646J26801r6455m0938
4621B59921j5152L3795K39369o03683L06393j74991P5932j64840j07311o5049
4611b15616J25588j75207j933L93181O6761j6920l37702j757M07218m8517m11530
$$ plain form
4600 -216434 -146808 111019 -60827 -30993 -30688 239614 604136 373784 278562 203297 -136976
4589 -136976 -55027 155129 206252 -50647 222143 443116 -53740 -233105 -204930 51262
4579 51262 19303 102542 121356 230391 -223683 -200197 174308 283083 368737 472568 352341
4568 352341 348487 147580 -35303 -155639 18540 489567 346334 225237 270997 80725
4558 80725 -139680 -70890 85055 314751 243236 182531 -12802 -158077 -204864 109296 273331
4547 273331 249469 -222764 -220461 191267 29811 13177 140396 -74568 -50566 1612 182838
4536 182838 99412 101845 27079 166495 343471 322970 97142 -23115 -215202 -248002 -263273
4525 -263273 -9162 154092 321649 437220 352387 241883 -49253 -81064 -163240 -132394
$$ packed form
4600b16434O9626K57827j71846K9834L05K70302L64522k30352r5222p5265l40273
4589a36976Q1949K10156N1123k56899K72790K20973m96856j79365K8175K56192
4579E1262l1959Q3239J8814J09035m54074K3486L74505J08775Q5654J03831j20227
4568C52341l854k00907j82883j20336J74179M71027j43233j21097M5760j90272
4558H0725k20405O8790J55945K29696p1515o0705j95333j45275m6787L14160J64035
4547B73331k3862m72233K303M11728j61456j6634J27219k14964K4002N2178J81226
4536A82838q3426K433p4766J39416J76976k0501k25828j20257j92087l2800j5271
4525b63273K54111J63254J67557J15571q4833j10504k91136l1811q2176L0846
$$ plain form
4515 -132394 -92780 -71723 66545 48757 -72402 140056 124436 -233405 -397397 -255211
4505 -255211 -14338 78893 135789 24760 108053 211901 217166 -61214 -360558 -220819 -557322
4494 -557322 -113757 -201308 -201668 -55651 -150958 -86765 168855 60141 39512 220094 268690
4483 268690 111941 147008 56654 -139574 -223984 66933 -69013 -175754 -7619 245909
4473 245909 -97487 -65542 135432 129811 -375791 -303499 359306 137660 253822 630923
4463 630923 343120 323868 119043 336595 -30699 -281835 -191655 -508383 -463213 -44262
4453 -44262 528387 248572 -96806 92497 217555 -365999 -498728 -88629 277649 254806
4443 254806 116393 -35452 42323 -193830 -376834 -320701 -169738 -249791 -272772 -193404 -24016
$$ packed form
4515a32394L9614K1057J38268j7788j21159K12458j5620l57841j63992J42186
4505b55211K40873R3231N6896j11029Q3293J03848N265k78380k99344J39739l36503
4494e57322M43565q7551l60J46017r5307O4193K55620j08714k0629J80582M8596
4483B68690j56749L5067r0354j96228q4410K90917j35946j06741J68135K53528
4473B45909l43396L1945K00974n621n05602P2292O62805k21646J16162L77101
4463F30923k87803j9252k04825K17552l67294k51136R0180l16728M5170M18951
4453d4262N72649k79815l45378J89303J25058n83554j32729M10099L66278k2843
4443B54806j38413j51845P7775k36153j83004N6133J50963q0053k2981P9368J69388
$$ plain form
4432 -24016 65461 -43828 -355150 -227289 59158 124818 -241877 -276941 -358391 -417778 -161862
4421 -161862 103517 -341809 -233662 -311728 -60490 47564 167385 -48655 -170601 -318744
4411 -318744 -43455 166027 -84614 -26824 -96694 -335645 -462642 -274960 115595 174712
4401 174712 176804 162382 -104296 89714 52838 3112 -36364 -191504 157860 63072 81128
4390 81128 119073 -80424 -140115 -39419 245983 -175320 -114537 -72952 7404 -323463 -333699
4379 -333699 -208921 -292838 -102391 -47966 -127500 -141420 -96320 289140 61190 103979 78690
4368 78690 -144397 -32283 234850 -224322 -450245 -152328 117500 62613 46903 -69607
4358 -69607 -110796 -69640 11728 150944 7195 120781 167773 -177903 -552476 -263520 -147073
$$ packed form
4432b4016Q9477j09289l11322J27861K86447O5660l66695l5064q1450n9387K55916
4421a61862K65379m45326J08147p8066K51238J08054J19821k16040j21946j48143
4411c18744K75289K09482k50641N7790o9870k38951j26997J87682L90555N9117
4401A74712K092j4422k66678J94010l6876m9726l9476j55140L49364r4788J8056
4390H1128L7945j99497n9691J00696K85402m21303O0783M1585Q0356l30867j0236
4379c33699J24778q3917J90447N4425p9534j3920M5100L85460k27950M2789k5289
4368G8690k23087J12114K67133m59172k25923K97917K69828n4887j5710j16510
4358f9607m1189M1156Q1368J39216j43749J13586M6992l45676l74573K88956J16447
$$ plain form
4347 -147073 75222 70158 -85598 -109565 -216518 52788 112225 58059 -58143 -230856 -476
4336 -476 -96600 -80048 -105650 -178597 26395 -190697 -282043 -99947 174254 364493 461644
4325 461644 246733 694 -210672 153176 25458 82515 367502 245759 15698 -39529
4315 -39529 91209 297548 252391 -143976 -212056 105052 362733 143497 118990 176539 -14885
4304 -14885 -45797 127721 -221992 -155012 51831 -2673 -70688 -38386 39045 144917 71013
4293 71013 -60918 -32514 58770 53112 56921 -19894 287574 347406 -94317 -239948 79345
4282 79345 -58990 -337411 -45527 44566 9213 193608 91580 167820 226157 293836 262517
4271 262517 282366 166140 -26994 21010 233631 209238 362881 312016 70520 -34586
$$ packed form
4347a47073K22295n064j55756k3967j06953K69306N9437n4166j16202j72713K30380
4336d76r6124J6552k5602p2947K04992k17092r1346J82096K74201J90239R7151
4325D61644k14911k46039k11366L63848j27718N7057K84987j21743k30061n5227
4315c9529J30738K06339m5157l96367o8080L17108K57681k19236k4507N7549j91424
4304a4885l0912J73518l49713O6980K06843n4504o8015L2302P7431J05872p3904
4293G1013j31931K8404R1284n658L809p6815L07468N9832m41723j45631L19293
4282G9345j38335k78421K91884R0093l5353J84395j02028P6240N8337O7679l1319
4271B62517J9849j16226j93134M8004K12621k4393J53643n0865k41496j05106
$$ plain form
4261 -34586 -67072 82876 225821 -17275 21628 139558 -51282 47288 148991 -34337
4251 -34337 -57742 138546 -83174 60630 161960 66774 -111729 -85462 27891 314979
4241 314979 285289 362358 182968 325186 148854 145043 376495 266598 -115731 113708
4231 113708 -129659 -327018 -146747 -35966 166287 336797 332216 394775 558356 335234
4221 335234 232113 85985 -1213 -364933 -282253 -156476 82664 -60331 98270 -92892
4211 -92892 -3399 -128541 -157691 -154933 -257499 7298 -140968 -347146 50099 320719 259544
4200 259544 -194542 -99501 157334 156333 -280780 -136020 -284735 -196567 211705 -4602
4190 -4602 119144 -9635 333346 289531 229975 122585 137342 17138 222245 216098 134737
$$ packed form
4261c4586l2486J49948J42945k43096L8903J17930j90840R8570J01703j83328
4251c4337k3405J96288k21720J43804J01330r5186j78503K6267J13353K87088
4241C14979k9690P7069j79390J42218j76332l811K31452j09897l82329K29439
4231A13708k43367j97359J80271J10781K02253J70510m581O2559J63581k23122
4221C35234j03121j46128q7198l63720Q2680J25777K39140j42995J58601j91162
4211i2892Q9493j25142k9150K758j02566K64797j48266k06178L97245K70620o1175
4200B59544m54086R5041K56835j001m37113J44760j48715Q8168M08272k16307
4190d602J23746j28779L42981m3815n9556j07390J4757j20204K05107o147q1361
$$ plain form
4179 134737 117196 4947 -41005 397717 379486 245503 115643 133156 -265831 -206444 -42610
4168 -42610 -389253 -553034 -424916 42893 246545 405690 152785 97193 109271 156360
4158 156360 -64936 -196418 -348284 -314054 -313533 -132860 86879 43433 121967 169846 246225
4147 246225 250064 318362 74349 18885 176014 -68732 -226331 -129705 117241 -165852 -48626
4136 -48626 -114859 -235970 -172096 -103168 136214 619 -30477 263950 258707 62904 -116103
4125 -116103 -292357 -10927 -27963 258049 209679 -74831 -79963 -159800 85960 372002 272954
4114 272954 152228 41440 7338 -61808 72692 45937 181823 114740 -66855 171509
4104 171509 25198 12228 -178344 -229634 -50437 18470 55268 -293866 -111372 -12931 140900
$$ packed form
4179A34737j7541j12249m5952M38722j8231j33983j29860J7513l98987N9387J63834
4168d2610l46643j63781J28118M67809K03652J59145k52905n5592J2078M7089
4158A56360k21296j31482j51866L4230N21J80673K19739m3446P8534M7879P6379
4147B46225L839O8298k44013n5464J57129k44746j57599R6626K46946k83093J17226
4136d8626o6233j21111O3874O8928K39382j35595l1096K94427n243j95803j79007
4125a16103j76254K81430j7036K86012m8370k84510n132p9837K45760K86042r9048
4114B72954j20726j10788l4102o9146J34500k6755J35886o7083j81595K38364
4104A71509j46311j2970j90572n1290J79197O8907L6798l49134J82494R8441J53831
$$ plain form
4093 140900 143042 160592 86777 -117628 -246490 115159 357183 -56117 132958 383384
4083 383384 426235 -40762 89637 140756 155252 413112 166180 166593 205557 329652 298645
4072 298645 259066 143381 45781 358390 289194 347906 439251 334295 185062 -25299 -99320
4061 -99320 49918 148093 35879 74872 226080 357773 134356 216101 228371 -9481 50544
4050 50544 73424 456179 233660 141282 355154 528580 365618 139471 117051 186901 398309
4039 398309 450039 460896 -25069 -193504 104140 211128 117924 -261077 48514 74985
4029 74985 272465 413372 217684 109907 -61564 -109404 264717 66974 131228 397277
4019 397277 143969 -33665 62645 -47374 -51830 -71653 -255529 30492 335071 452734
$$ packed form
4093A40900K142J7550p3815k04405j28862L61649K42024m13300J89075K50426
4083C83384M2851m66997J30399N1119J4496K57860k46932M13L8964J24095l1007
4072B98645l9579j15685r7600L12609o9196N8712R1345j04956j49233k10361p4021
4061i9320J49238R8175j12214L8993J51208J31693k23417Q1745J2270k37852O0025
4050E0544K2880L82755k22519r2378K13872J73426j62962k26147k2420O9850K11408
4039C98309N1730J0857m85965j68435K97644J06988r3204l79001L09591K6471
4029G4985J97480J40907j95688j07777j71471m7840L74121j97743O4254K66049
4019C97277k53308j77634R6310j10019m456j9823j83876K86021L04579J17663
$$ plain form
4009 452734 337359 252109 371695 177424 341003 239248 -14127 298907 302910 293142 62164
3998 62164 354913 610564 608667 304992 279687 404175 434515 586726 561255 520401 658044
3987 658044 487017 728125 751164 490095 523136 468888 206119 217214 545318 743895
3977 743895 754280 198132 -41176 400627 372229 380736 168834 413489 144562 345091
3967 345091 607810 772234 480857 506804 645705 630365 801598 474288 535911 532328 396077
3956 396077 229287 73797 372763 505961 232340 332180 85757 258656 576834 299098
3946 299098 76378 262106 163479 99603 223953 -107657 -52481 324954 113612 52169
3936 52169 -9173 44679 389640 213086 136362 134181 205541 457474 533133 394850 98024
$$ packed form
4009D52734j15375q5250J19586j94271J63579j01755k53375L13034M003r768k30978
3998F2164K92749K55651j897l03675k5305J24488L0340J52211k5471m0854J37643
3987F58044j71027K41108K3039k61069L3041n4248k62769J1095L28104J98577
3977G43895J0385n56148k39308M41803k8398Q507k11902K44655k68927K00529
3967C45091K62719J64424k91377K5947J38901j5340J71233l27310O1623l583j36251
3956C96077j66790j55490K98966J33198k73621R9840k46423J72899L18178k77736
3946B99098k22720J85728r8627o3876J24350l31610N5176L77435k11342o1443
3936E2169o1342N3852L44961j76554p6724k181P1360K51933P5659j38283k96826
$$ plain form
3925 98024 212250 234177 625609 492804 73798 65036 221055 395396 505944 417252 455606
3914 455606 390856 104348 101250 283247 307872 556515 114560 148516 202275 237345 410951
3903 410951 253203 270172 311366 11161 -96389 175022 322603 214632 430055 653772
3893 653772 349186 457461 700437 767049 577643 290294 451844 562248 314200 409354
3883 409354 382629 383185 425934 718335 788513 725660 606482 946731 475870 15285 350783
3872 350783 268419 214495 245324 588104 534057 416428 673207 570050 870093 686751
3862 686751 291420 296166 306425 489449 454281 537745 531895 391104 347766 448318 671882
3851 671882 638107 847217 733195 566168 690259 514902 329662 431790 477889 664110
$$ packed form
3925I8024J14226K1927L91432j32805m19006q762J56019J74341J10548q8692L8354
3914D55606o4750k86508l098J81997K4625K48643m41955L3956N3759L5070J73606
3903D10951j57748J6969M1194l00205j07550K71411J47581j07971K15423K23717
3893F53772l04586J08275K42976O6612j89406k87349J61550J10404k48048R5154
3883D09354k6725N56M2749K92401P0178o2853j19178L40249m70861m60585L35498
3872C50783q2364n3924L0829L42780n4047j17629K56779j03157L00043j83342
3862F86751l95331M746J0259J83024l5168Q3464n850j40791m3338J00552K23564
3851F71882l3775K09110j14022j67027J24091j75357j85240J02128M6099J86221
$$ plain form
3841 664110 711626 682675 853775 937316 911158 831976 993571 855691 857829 742499 735342
3830 735342 827333 881607 980568 969447 905016 921600 846772 956821 1069851 816054 613515
3819 613515 731117 894909 1094564 1066317 975719 732971 810161 1142217 1245143 1418863
3809 1418863 1538931 1774911 1495334 1302818 1503402 1650924 1692245 1711153 1968869 1962189
3799 1962189 1919393 1839258 1733744 1918377 2065205 1913844 1854429 1927390 2185621 2288737
3789 2288737 2340524 2565939 2149285 1986316 2282881 2410721 3062908 3040450 2600601 2643374
3779 2643374 2947156 2981685 3130582 3520169 3684189 3409375 3278190 3461553 3498599 3546474
3769 3546474 3474990 3995213 4023733 4253235 4474972 4684472 4992358 5209396 5272936 5669866
$$ packed form
3841F64110M7516k8951J71100Q3541k6158p9182J61595j37880K138j15330p157
3830G35342R1991N4274R8961j1121o4431J6584p4828J10049J13030k53797k02539
3819F13515J17602J63792J99655k8247r0598k42748P7190L32056J02926J73720
3809A418863J20068K35980k79577j92516K00584J47522M1321J8908K57716o680
3799A962189m2796q0135j05514J84633J46828j51361n9415P2961K58231J03116
3789B288737N1787K25415m16654j62969K96565J27840O52187k2458m39849M2773
3779B643374L03782L4529J48897L89587J64020k74814j31185J83363L7046M7875
3769C546474p1484N20223K8520K29502K21737K09500L07886K17038O3540L96930
$$ plain form
3759 5669866 5935013 5968715 6614515 7311878 7502659 7503618 7538279 8046220 8346562 8730656
3749 8730656 9296509 9406099 10016018 10543591 11304046 12080889 12876752 13789388 14796523
3740 14796523 16012512 17455082 19504794 21859301 24455152 27621593 31324979 35787452
3732 35787452 41659366 49479535 59030678 68967121 77810027 82551322 79105950 68588862
3724 68588862 56642863 46176646 37917077 31782180 27302430 23959467 20988899 18927869
3716 18927869 16687863 15073603 13937328 13085503 12114726 11259694 10681099 9937892 9435520
3707 9435520 8917099 8483629 8110386 7883842 7186023 6802964 6365665 6274957 6136286 5937970
3697 5937970 5764080 5251761 4988164 4816522 4856770 4766424 4452017 4212679 4357291 4349505
$$ packed form
3759E669866K65147L3702O45800O97363J90781R59L4661N07941L00342L84094
3749H730656N65853J09590O09919N27573P60455P76843P95863R12636J007135
3740A4796523J215989J442570K049712K354507K595851L166441L703386M462473
3732C5787452N871914P820169R551143R936443Q842906M741295l445372j0517088
3724F8588862j1945999j0466217q259569o134897m479750l342963k970568k061030
3716A8927869k240006j614260j136275q51825r70777q55032n78595p43207n02372
3707I435520n18421m33470l73243k26544o97819l83059m37299r0708j38671j98316
3697E937970j73890n12319k63597j71642M0248r0346l14407k39338J44612p786
$$ plain form
3687 4349505 4286512 3968401 3618559 3776368 3715431 3736350 3337965 3338184 3118974 2926944 3006678
3676 3006678 3095203 2959956 2859057 2743938 2877794 2753662 2464476 2214695 2495630 2506543
3666 2506543 2659834 2766891 2548175 2378894 2287678 2557942 2207848 2062347 2107165 2297379
3656 2297379 2072766 1947585 2077272 2072997 2015161 2032689 1940303 1638112 1642586 1851529 1689025
3645 1689025 1729923 1526400 1548347 1710488 1674789 1459420 1662439 1724838 1656875 1700338 1586612
3634 1586612 1400764 1385646 1497342 1739762 1619501 1578848 1769027 1818073 1960892 1804627
3624 1804627 1672909 1702189 1721532 1800731 1768635 1666541 1494983 1517758 1359104 1489866
3614 1489866 1596796 1780616 1654828 1786454 1639488 1492770 1594639 1389093 1465498 1616460
$$ packed form
3687D349505o2993l18111l49842J57809o0937K0919l98385K19k19210j92030P9734
3676C006678Q8525j35247j00899j15119J33856j24132k89186k49781K80935J0913
3666B506543J53291J07057k18716j69281r1216K70264l50094j45501M4818J90214
3656B297379k24613j25181J29687m275n7836J7528r2386l02191M474K08943j62504
3645A689025M0898k03523K1947J62141l5699k15369K03019O2399o7963M3463j13726
3634A586612j85848j5118J11696K42420j20261m0653J90179M9046J42819j56265
3624A804627j31718K9280J9343P9199l2096j02094j71558K2775j58654J30762
3614A489866J06930J83820j25788J31626j46966j46718J01869k05546P6405J50962
$$ plain form
3604 1616460 1377338 1642135 2000678 1786266 1785411 1631365 1659870 1591292 1630905 1695557 1855559
3593 1855559 2210742 2136228 2190817 2235813 2122726 1986656 1831273 2253557 2245626 2041308
3583 2041308 1833886 1938026 2237417 2488212 2571587 2403247 2419482 2165735 2139869 2081104
3573 2081104 2125833 2520422 2532204 2683299 2922987 2698096 2801674 2735684 2788325 3000182
3563 3000182 3060273 2813630 2773466 2986725 3203595 3368908 3261840 3625489 3807750 3682077
3553 3682077 3539026 3395023 3715483 3950289 3907642 4330376 4158464 4472095 4683426 4344027
3543 4344027 4168486 4350876 4396017 4648781 4634568 4622985 4721185 5038196 5207440 5347561
3533 5347561 5660273 5516206 5668813 5632035 5930357 6169527 6383649 6315435 6353310 6771181
$$ packed form
3604A616460k39122K64797L58543k14412q55j54046K8505o8578L9613O4652J60002
3593A855559L55183p4514N4589M4996j13087j36070j55383M22284p931k04318
3583B041308k07422J04140K99391K50795Q3375j68340J6235k53747k5866n8765
3573B081104M4729L94589J1782J51095K39688k24891J03578o5990N2641K11857
3563C000182O0091k46643m0164K13259K16870J65313j07068L63649J82261j25673
3553C682077j43051j44003L20460K34806m2647M22734j71912L13631K11331l39399
3543D344027j75541J82390M5141K52764j4213j1583R8200L17011J69244J40121
3533E347561L12712j44067J52607l6778K98322K39170K14122o8214L7875M17871
$$ plain form
3523 6771181 7096263 7360518 7502342 7717263 7746953 7990127 8017323 8313342 8662353 9031358
3513 9031358 9379827 9481290 9659785 10329590 10553171 10797087 10824070 10824234 10868009 11402460
3503 11402460 11869827 11897778 12088432 12523533 12707001 12926217 13239793 13748837 13988232 14301637
3493 14301637 14594240 15157540 15683421 15982557 16559288 17046792 17574174 17603776 18146507 18584140
3483 18584140 19314718 20265163 20345563 20627059 21478849 21732621 21986599 22304993 22455868 22617698
3473 22617698 22972306 23248878 23528541 23704290 23891181 23788386 23877790 23944576 24408971 24440638
3463 24440638 24647308 25120108 25275479 25649418 25885090 26300631 26514344 26585022 26923274 27544977
3453 27544977 27949962 28227207 28569752 28401245 28545499 29037423 29414413 29687051 29977982
$$ packed form
3523F771181L25082K64255J41824K14921K9690K43174K7196K96019L49011L69005
3513I031358L48469J01463J78495O69805K23581K43916K6983J64M3775N34451
3503A1402460M67367K7951J90654M35101J83468K19216L13576N09044K39395L13405
3493A4301637K92603N63300N25881K99136N76731M87504N27382K9602N42731M37633
3483A8584140P30578R50445Q0400K81496Q51790K53772K53978L18394J50875J61830
3473B2617698L54608K76572K79663J75749J86891j02795Q9404O6786M64395L1667
3463B4440638K06670M72800J55371L73939K35672M15541K13713P0678L38252O21703
3453B7544977M04985K77245L42545j68507J44254M91924L76990K72638K90931
$$ plain form
3444 29977982 29805724 29775560 30081733 29998674 29875501 29769049 29793631 29535497 29348352 29192857
3434 29192857 29093755 28860383 28835532 28703648 28484354 28121891 27987259 27756501 27357254 27082609
3424 27082609 27283841 27259110 26703409 26664676 26599287 26266309 25816851 26056263 26142784 26173658
3414 26173658 26044598 25658455 25211524 25156361 24834141 24835338 24289217 24149896 24010393 23771986
3404 23771986 23287251 22974141 22614686 22248504 21984789 21291894 20897822 20892474 20582914 20165701
3394 20165701 20040294 19765407 19243443 19053832 19116855 19053840 18493840 18148704 17973302 17866024
3384 17866024 17796196 17772889 17231868 17307631 17502046 17314252 16852535 16555283 16431329 16195649
3374 16195649 16285116 16341906 16170591 15915651 16229123 15973201 15855970 15947387 15964978 15547901
$$ packed form
3444B9977982j72258l0164L06173q3059j23173j06452K4582k58134j87145j55495
3434B9192857r9102k33372k4851j31884k19294l62463j34632k30758l99247k74645
3424B7082609K01232k4731n55701l8733o5389l32978m49458K39412Q6521L0874
3414B6173658j29060l86143m46931n5163l22220J197n46121j39321j39503k38407
3404B3771986m84735l13110l59455l66182k63715o92895l94072n348l09560m17213
3394B0165701j25407k74887n21964j89611O3023o3015n60000l45136j75402j07278
3384A7866024o9828k3307n41021P5763J94415j87794m61717k97252j23954k35680
3374A6195649Q9467N6790j71315k54940L13472k55922j17231R1417J7591m17077
$$ plain form
3364 15547901 15765023 15708533 15816306 15843687 15891278 16216633 16031676 16211739 16755489 16828079
3354 16828079 16797880 16620179 17199995 17398156 17695405 18029193 18496191 18654048 18851825 19341326
3344 19341326 19947937 20533996 20828118 20978391 21342063 21715039 22367489 22760556 23391590
3335 23391590 23887327 24320894 24558960 25299599 26074272 26888537 27758396 28708644 29422087
3326 29422087 30259510 31464738 32149157 32880179 34083557 35385967 36331161 37573710 38813043
3317 38813043 39929281 40777021 41659017 42805101 43876730 44931081 45962760 46808671 47741836
3308 47741836 49186431 50433040 51362546 52573468 53286633 54821474 56051345 57126436
3300 57126436 58616119 60122717 61895998 63733912 65758851 67792429 69943134 72165877
$$ packed form
3364A5547901K17122n6490J07773K7381M7591L25355j84957J80063N43750P2590
3354A6828079l0199j77701N79816J98161K97249L33788M66998J57857J97777M89501
3344A9341326O06611N86059K94122J50273L63672L72976O52450L93067O31034
3335B3391590M95737M33567K38066P40639P74673Q14265Q69859R50248P13443
3326B9422087Q37423J205228O84419P31022J203378J302410R45194J242549J239333
3317C8813043J116238Q47740Q81996J146084J071629J054351J031679Q45911R33165
3308D7741836J444595J246609R29506J210922P13165J534841J229871J075091
3300E7126436J489683J506598J773281J837914K024939K033578K150705K222743
$$ plain form
3292 72165877 74548719 77009866 79727191 82404048 84993378 88021095 90865570 93403090
3284 93403090 96032545 98801415 101561807 104039754 106850793 109606573 112176635 115218532
3276 115218532 118170605 121471074 124839571 128482803 131941122 135661282 139822694 144656491
3268 144656491 149371502 154477265 159935745 165428392 171537985 177782950 184264573 191276596
3260 191276596 198466331 206206218 214769910 223651836 233009783 242716580 253246522 264545331
3252 264545331 276325338 288573125 301675345 315726674 330126269 344656012 358516666
3245 358516666 370717703 381563119 390365218 396015157 397007405 393826023 386329887 375458913
3237 375458913 362791657 349105428 335546563 322645524 311205233 300394515 290941625
$$ packed form
3292G2165877K382842K461147K717325K676857K589330L027717K844475K537520
3284I3403090K629455K768870K760392K477947K811039K755780K570062L041897
3276A15218532K952073L300469L368497L643232L458319L720160M161412M833797
3268A44656491M715011N105763N458480N492647O109593O244965O481623P012023
3260A91276596P189735P739887Q563692Q881926R357947R706797J0529942J1298809
3252B64545331J1780007J2247787J3102220J4051329J4399595J4529743J3860654
3245C58516666J2201037J0845416Q802099N649939R92248l181382p496136j0870974
3237C75458913j2667256j3686229j3558865j2901039j1440291j0810718r452890
$$ plain form
3230 290941625 282299460 274762540 267360931 261258499 255730588 250661702 246215705 242110833
3222 242110833 238452504 235424101 232593431 230091331 228072985 226339403 225533359 225149504
3214 225149504 225306935 225582657 226206639 226664187 226975841 227317927 227023095 226140133 225407617
3205 225407617 224175045 222643484 221125378 219524160 217674068 215817184 213166821 210558791
3197 210558791 208238387 205331305 202352323 198555429 194975445 191552855 188281800 184857266
3189 184857266 181680169 178607865 175353249 172725654 170148001 167528597 164972551 162167437
3181 162167437 159982695 157342510 154566944 151574047 148203247 145216737 142062100 138767470
3173 138767470 135412028 132102170 128301085 124965539 121950967 119037862 116015104 113384587
$$ packed form
3230B90941625q642165p536920p401609o102432n527911n068886m445997m104872
3222B42110833l658329l028403k830670k502100k018346j733582q06044l83855
3214B25149504J57431K75722O23982M57548L11654L42086k94832q82962p32516
3205B25407617j232572j531561j518106j601218j850092j856884k650363k608030
3197B10558791k320404k907082k978982l796894l579984l422590l271055l424534
3189A84857266l177097l072304l254616k627595k577653k619404k556046k805114
3181A62167437k184742k640185k775566k992897l370800k986510l154637l294630
3173A38767470l355442l309858l801085l335546l014572k913105l022758k630517
$$ plain form
3165 113384587 110644415 108509669 106539931 103815081 100767400 98466199 96413182 93794079
3157 93794079 91410372 89102269 86785742 84655405 82536321 80083505 78014126 75612822
3149 75612822 73319582 71314688 69328516 67670981 65788844 64040490 62437779 61204824
3141 61204824 59823777 58326004 56758689 55403078 54287194 53642807 52444018 51078180
3133 51078180 49872505 48958333 47970574 46924511 45896655 44854526 43969562 43170299 42400219
3124 42400219 41532477 40630924 40076213 39198811 38607406 38025494 37062650 36195324 35379486
3115 35379486 34676671 34134287 33241277 32741071 32604601 31765919 30958313 30576589 29515918
3106 29515918 29183686 28792006 28075457 27576950 27077556 26624907 26012540 25717571 25165106
$$ packed form
3165A13384587k740172k134746j969738k724850l047681k301201k053017k619103
3157I3794079k383707k308103k316527k130337k119084k452816k069379k401304
3149G5612822k293240k004894j986172j657535j882137j748354j602711j232955
3141F1204824j381047j497773j567315j355611j115884o44387j198789j365838
3133E1078180j205675r14172r87759j046063j027856j042129q84964p99263p70080
3124D2400219q67742r01553n54711q77402n91405n81912r62844q67326q15838
3115C5379486p02815n42384q93010n00206j36470q38682q07606l81724j060671
3106B9515918l32232l91680p16549m98507m99394m52649o12367k94969n52465
$$ plain form
3097 25165106 24441749 23676768 23375852 23115411 22589403 22146592 21781909 21441114 20898568
3088 20898568 20258146 19867606 19314638 18950065 18456921 18424192 17794353 17194266 17073829 16862193
3078 16862193 16539194 16308482 15782211 15259404 15031484 14847990 14121176 13827939 13710298
3069 13710298 13546307 13412504 12963221 12747015 12287661 12249859 12446329 11958074 11217591 11099659
3059 11099659 10947813 10565402 10731051 10603055 10223609 9725902 9712672 9440675 9175240 9180216
3049 9180216 9197446 8849353 8486288 8467724 8371785 8237474 8245089 7775468 7707675 8146566 7984583
3038 7984583 8013029 8026483 7755341 7684434 7642279 7333671 7330885 7436098 7175067 7006902 7268819
3027 7268819 7337087 7192212 7290893 7106363 7019604 7184020 7232253 6972839 7091410 7290825
$$ packed form
3097B5165106p23357p64981l00916k60441n26008m42811l64683l40795n42546
3088B0898568o40422l90540n52968l64573m93144l2729o29839o00087j20437k11636
3078A6862193l22999k30712n26271n22807k27920j83494p26814k93237j17641
3069A3710298j63991j33803m49283k16206m59354l7802J96470m88255p40483j17932
3059A1099659j51846l82411J65649j27996l79446m97707j3230k71997k65435M976
3049I180216J7230l48093l63065j8564r5939j34311P615m69621o7793M38891j61983
3038G984583K8446J3454k71142p0907m2155l08608k786J05213k61031j68165K61917
3027G268819O8268j44875R8681j84530q6759J64416M8233k59414J18571J99415
$$ plain form
3017 7290825 7068099 7382377 7472167 7645622 7250998 7544088 7835574 7528184 7308046 7728125
3007 7728125 7834605 7748711 7723486 7924763 8131458 7870983 7720716 7965999 7894548 8230551
2997 8230551 8592558 8403989 8518587 8779894 9003639 9155565 9390968 9374458 9621740 9959046
2987 9959046 10289173 10570525 10934224 11050585 11223554 11035125 11127130 11417273 11845330 12062894
2977 12062894 12294348 12629818 13103610 13329892 13674042 13973445 14192460 14875790 15316299
2968 15316299 15475928 15744543 16179513 16838719 17071024 17723754 18220027 18612571 19006878
2959 19006878 19380143 20118305 21079903 21710119 22224532 23168723 24163618 25043335 25834873
2950 25834873 26474057 27925193 29212547 30367552 31805993 33059224 34425724 36256714
$$ packed form
3017G290825k22726L14278Q9790J73455l94624K93090K91486l07390k20138M20079
3007G728125J06480q5894k5225K01277K06695k60475j50267K45283p1451L36003
2997H230551L62007j88569J14598K61307K23745J51926K35403j6510K47282L37306
2987I959046L30127K81352L63699J16361J72969j88429R2005K90143M28057K17564
2977A2062894K31454L35470M73792K26282L44150K99403K19015O83330M40509
2968A5316299J59629K68615M34970O59206K32305O52730M96273L92544L94307
2959A9006878L73265P38162R61598O30216N14413R44191R94895Q79717P91538
2950B5834873O39184J451136J287354J155005J438441J253231J366500J830990
$$ plain form
2942 36256714 38536015 40475084 42725920 45051197 47957942 51093947 54343860 57682520
2934 57682520 61702152 66203287 71017615 75940775 80617575 84716762 88275769 91068593
2926 91068593 92962423 93614649 93300250 92543776 91906311 90638356 89770135 89071721 88780788
2917 88780788 88408764 88014959 88115575 88786473 89414871 90722092 92576027 95056865 97747092
2908 97747092 101061358 105743306 111318272 118612891 127429874 137367781 147721779 156936207
2900 156936207 162760176 164898711 163563258 159010194 150277380 138210657 125127820 113695389
2892 113695389 103974246 95830604 89536897 84164450 79456439 75746691 72398430 69628240
2884 69628240 67729854 66101047 64373600 63279411 62797928 62771802 62745140 62903731 63756670
$$ packed form
2942C6256714K279301J939069K250836K325277K906745L136005L249913L338660
2934E7682520M019632M501135M814328M923160M676800M099187L559007K792824
2926I1068593J893830O52226l14399p56474o37465j267955q68221o98414k90933
2917H8780788l72024l93805J00616O70898O28398J307221J853935K480838K690227
2908I7747092L314266M681948N574966P294619Q816983R937907J0353998R214428
2900A56936207N823969K138535j335453m553064q732814j2066723j3082837j1432431
2892A13695389r721143q143642o293707n372447m708011l709748l348261k770190
2884F9628240j898386j628807j727447j094189m81483k6126k6662J58591Q52939
$$ plain form
2875 63756670 65151151 66821864 68184897 69704137 71215049 72783442 73714781 73645082 72709519
2866 72709519 70873326 67772106 63671581 59014048 54502164 50003914 45904159 42211108
2858 42211108 38758692 36051706 33458804 31312802 29379783 27654984 26212615 24894264
2850 24894264 23240857 21725978 21004482 20350592 19394424 18303105 17725570 16901568 16087486
2841 16087486 15258723 14887369 14337514 13642485 13180029 12908481 12652253 12045380 11548284
2832 11548284 10743309 10365601 9981773 9721841 9232858 9062251 8875653 8467842 8352440
2823 8352440 8315843 8076639 7719092 7525025 7285300 7090550 6777120 6585591 6601658 6450971
2813 6450971 6043789 6001413 5811443 5597140 5910255 6083698 5583777 5018795 4877982 4503106
$$ packed form
2875F3756670J394481J670713J363033J519240J510912J568393R31339o9699r35563
2866G2709519j836193l101220m100525m657533m511884m498250m099755l693051
2858D2211108l452416k706986k592902k146002j933019j724799j442369j318351
2850B4894264j653407j514879p21496o53890r56168j091319n77535q24002q14082
2841A6087486q28763l71354n49855o95029m62456k71548k56228o06873m97096
2832A1548284q04975l77708l83828k59932m88983j70607j86598m07811j15402
2823H352440l6597k39204l57547j94067k39725j94750l13430j91529J6067j50687
2813F450971m07182m2376j89970k14303L13115J73443m99921n64982j40813l74876
$$ plain form
2803 4503106 4286534 4307043 4399263 4233546 4180834 4085549 4027802 3949911 3800277 3600231 3859449
2792 3859449 3505311 3139393 3642591 3612394 3054242 2944290 2932499 3069335 3003701 3157790
2782 3157790 3105542 3169125 3195309 2893602 2869803 2684569 2538443 2500442 2614683 2499678
2772 2499678 2372037 2501700 2385447 2422979 2544148 2454824 2196773 2284724 2366186 2098499
2762 2098499 2086143 2380392 2388827 2185541 2273311 2135006 2106719 2175039 2259441 2032140 2432335
2751 2432335 2218485 1603657 1525833 1809899 1758403 1562431 1740291 1640555 1683284 1619403
2741 1619403 1709836 1512287 1098276 1373899 1445250 1413787 1339661 1248358 1286207 1198841 967210
2730 967210 1172290 1425499 1310175 1027555 863753 825441 894453 1100842 1193569 1089440
$$ packed form
2803D503106k16572K0509R2220j65717n2712r5285n7747p7891j49634k00046K59218
2792C859449l54138l65918N03198l0197n58152j09952j1791J36836o5634J54089
2782C157790n2248O3583K6184l01707k3799j85234j46126l8001J14241j15005
2772B499678j27641J29663j16253L7532J21169q9324k58051Q7951Q1462k67687
2762B098499j2356K94249Q435k03286Q7770j38305k8287O8320Q4402k27301M00195
2751B432335k13850o14828p7824K84066n1496j95972J77860r9736M2729o3881
2741A619403R0433j97549m14011K75623P1351l1463p4126r1303L7849q7366k31631
2730I67210K05080K53209j15324k82620j63802l8312O9012K06389R2727j04129
$$ plain form
2720 1089440 1046932 1117076 1504461 1323016 938367 1229267 992216 658068 725705 1051357
2710 1051357 1390405 1172522 1075816 1088644 1060218 845457 910474 965865 898661 436329 654840
2699 654840 972441 828010 962905 924656 859833 648900 573691 493737 468710 495962 677040
2688 677040 779500 729206 730270 429229 271171 536587 761031 705069 516143 535574 550714
2677 550714 482176 314756 493878 608605 867470 826434 767655 847980 879454 878057 591907
2666 591907 484776 497241 671003 625950 609191 588949 442922 605266 807507 476376
2656 476376 428184 458065 219404 65172 174577 478598 669560 797267 883193 975220
2646 975220 657842 599833 882038 1005767 917052 689299 760768 1125135 868313 678444
$$ packed form
2720A089440m2508P0144L87385j81445l84649K90900k37051l34148O7637L25652
2710A051357L39048k17883r6706J2828k8426k14761O5017N5391o7204m62332K18511
2699F54840L17601j44431J34895l8249o4823k10933p5209p9954k5027K7252J81078
2688F77040J02460n0294J064l01041j58058K65416K24444n5962j88926J9431J5140
2677E50714o8538j67420J79122J14727K58865m1036n8779Q0325L1474j397k86150
2666E91907j07131J2465J73762m5053j6759k0242j46027J62344K02241l31131
2656D76376m8192K9881k38661j54232J09405L04021J90962J27707Q5926R2027
2646I75220l17378n8009K82205J23729q8715k27753P1469L64367k56822j89869
$$ plain form
2636 678444 829478 793758 944229 610962 698425 550887 489194 671425 572874 666982 510109
2625 510109 499371 748169 956937 973763 902862 899829 1152388 1218512 1290960 1040621 1047544
2614 1047544 1086522 994914 674002 832841 870370 457429 417451 317016 368002 585926
2604 585926 388466 462135 498889 647880 409594 353206 219758 141864 220272 291405 647993
2593 647993 600584 217720 111681 214025 34345 276038 404364 497472 530909 421517
2583 421517 441505 825600 517632 488603 290644 175994 552661 687270 432452 511982
2573 511982 418962 395221 324759 419043 539455 634936 215699 38076 164986 120088 36517
2562 36517 9792 -93902 -264212 -411659 -307234 -107980 -211262 -283506 -133699 -186552
$$ packed form
2636F78444J51034l5720J50471l33267Q7463j47538o1693J82231r8551R4108j56873
2625E10109j0738K48798K08768J6826p0901l033K52559O6124P2448k50339O923
2614A047544L8978r1608l20912J58839L7529m12941l9978j00435N0986K17924
2604E85926j97460P3669L6754J48991k38286n6388j33448p7894P8408P1133L56588
2593F47993m7409l82864j06039J02344j79680K41693J28326R3108L3437j09392
2583D21517J9988L84095l07968k9029j97959j14650L76667J34609k54818P9530
2573E11982r3020k3741p0462R4284J20412R5481m19237j77623J26910m4898q3571
2562C6517k6725j03694j70310j47447J04425J99254j03282p2244J49807n2853
$$ plain form
2552 -186552 31724 523692 279300 282986 310933 456044 325201 283253 129843 281403
2542 281403 -233094 -319723 -64416 267802 -126930 -295751 -67619 62062 119992 73403
2532 73403 12913 162480 207363 226770 283886 60501 154699 -92374 161965 250131 -48584
2521 -48584 148027 149264 155875 180346 -163294 -127158 98713 121058 -84824 85798 287374
2510 287374 204785 322305 175445 332179 95241 27479 204234 54577 -71913 -116638
2500 -116638 -57737 36664 -287602 -58014 141454 18900 305669 -51898 -38786 87902
2490 87902 151352 155493 121865 123849 204409 113433 -2429 -69243 178661 2280 -69053 -284493
2478 -284493 -405153 -194044 -173806 -128390 268816 222469 225816 442788 174363 -8651 -156041
$$ packed form
2552a86552K18276M91968k44392L686K7947J45111j30843m1948j53410J51560
2542B81403n14497q6629K55307L32218l94732j68821K28132J29681N7930m6589
2532G3403o0490J49567M4883J9407N7116k23385R4198k47073K54339Q8166k98715
2521d8584J96611J237O611K4471l43640L6136K25871K2345k05882J70622K01576
2510B87374q2589J17520j46860J56734k36938o7762J76755j49657j26490m4725
2500a16638N8901R4401l24266K29588J99468j22554K86769l57567J3112J26688
2490H7902O3450M141l3628J984Q0560r0976j15862o6814K47904j76381p1333k15440
2478b84493j20660K11109K0238M5416L97206m6347L347K16972k68425j83014j47390
$$ plain form
2467 -156041 158925 54425 22782 15894 -264933 -304371 -273064 -116312 -146529 -147331 -333197
2456 -333197 -212610 -66500 -90720 -425405 -60064 -150117 -41741 210141 409905 163796
2446 163796 -60671 17575 195393 126102 177022 -89947 -44980 180493 -57128 10593 121464
2435 121464 253804 200862 296231 -244896 -276363 -241024 105590 -85451 209765 72146
2425 72146 -65012 201584 92827 -150027 -127736 -43461 72887 211514 187015 -22653
2415 -22653 -39334 225246 238075 32723 50934 -32431 5986 -73742 -150598 -57971 102729
2404 102729 271031 37686 82143 16341 -60241 -153154 -76418 -169692 121230 5552 79415
2393 79415 82796 37907 164037 1641 186264 310269 304466 73434 -1778 39620 145563
$$ packed form
2467a56041L14966j04500l1643o888k80827l9438L1307J56752l0217q02j85866
2456c33197J20587J46110k4220l34685L65341r0053J08376K51882J99764k46109
2446A63796k24467P8246J77818o9291N0920k66969M4967K25473k37621O7721J10871
2435A21464J32340n2942R5369n41127l1467L5339L46614j91041K95216j37619
2425G2146j37158K66596j08757k42854K2291Q4275J16348J38627k4499k09668
2415b2653j6681K64580J2829k05352J8211q3365L8417p9728p6856R2627J60700
2404A02729J68302k33345M4457o5802p6582r2913P6736r3274K90922j15678P3863
2393G9415L381m4889J26130j62396J84623J24005n803k31032p5212M1398J05943
$$ plain form
2382 145563 158903 251601 242709 199044 575294 473252 310480 319192 358902 413837 270692
2371 270692 373805 279975 547438 600588 533548 359520 332684 240556 216792 120474 78104
2360 78104 326261 89338 -48236 -48190 -233584 -332759 73604 137766 100837 182732 114271
2349 114271 366956 258754 331798 335605 73621 -162631 -200817 -147642 -59644 -25177 99315
2338 99315 182306 62375 47000 53686 350581 67939 282505 224837 151810 223609 -104996
2327 -104996 -25360 -212183 -362629 -231186 -237785 -6802 15488 -14769 146602 249451 159835
2316 159835 -352121 -474331 -81028 -65903 -275584 -97571 175979 532893 353216 206378
2306 206378 423935 441988 87231 -69386 53707 432706 496359 269840 281375 198111
$$ packed form
2382A45563J3340R2698q892m3665L76250j02042j62772Q712L9710N4935j43145
2371B70692J03113r3830K67463N3150o7040j74028k6836r2128k3764r6318m2370
2360G8104K48157k36923j37574M6j85394r9175M06363O4162l6929Q1895o8461
2349A14271K52685j08202P3044L807k61984k36252l8186N3175Q7998L4467J24492
2338I9315Q2991j19931j5375O686K96895k82642K14566n7668p3027P1799l28605
2327a04996P9636j86823j50446J31443o599K30983K2290l0257J61371J02849q9616
2316A59835n11956j22210L93303J5125k09681J78013K73550L56914j79677j46838
2306B06378K17557J8053l54757j56617J23093L78999O3653k26519J1535q3264
$$ plain form
2296 198111 210670 186044 -68272 -315078 -40719 101962 122842 -115177 -107319 10380 272139
2285 272139 467714 62875 -78608 206954 227753 487960 403208 258472 -78661 -277748
2275 -277748 -1678 -399430 36616 258648 75256 166328 286437 129171 103743 223482
2265 223482 222825 269532 298824 372816 235722 -134919 299189 459418 61259 -45551 -65952
2254 -65952 298615 336833 165129 199849 311975 -74048 19973 220813 279030 359459 160401
2243 160401 281518 731280 587441 314516 219728 392777 576718 411890 304753 544251
2233 544251 462305 367096 548217 366390 493420 412919 290575 502551 753237 612767
2223 612767 612589 568535 684678 533649 545872 643625 774143 814149 1014453 1309751 854287
$$ packed form
2296A98111J2559k4626k54316k46806K74359J42681K0880k38019P858J17699K61759
2285B72139J95575m04839j41483K85562K0799K60207q4752j44736l37133j99087
2275b77748K76070l97752M36046K22032j83392R1072J20109j57266k5428J19739
2265B23482o57M6707K9292P3992j37094l70641M34108J60229l98159j06810k0401
2254f5952L64567L8218j71704L4720J12126l86023R4021K00840N8217Q0429j99058
2243A60401J21117M49762j43839k72925r4788J73049J83941j64828j07137K39498
2233E44251q1946r5209J81121j81827J27030q0501j22344K11976K50686j40470
2223F12767j78m4054J16143j51029J2223R7753J30518M0006K00304K95298m55464
$$ plain form
2212 854287 855948 690410 530211 751000 723965 677600 759745 731778 714436 623676 678499
2201 678499 518260 632769 715390 829430 748751 1173244 995727 655914 1046487 756801
2191 756801 766946 807839 849905 989668 1175745 1225092 994924 1376364 1417336 1701544 1664381
2180 1664381 1720652 1734310 1956938 2122421 2135133 2241482 2423741 2789400 2726623 2575580
2170 2575580 2508601 3058101 3396782 3323876 3181202 2776759 2490545 2746707 2989659 3252346
2160 3252346 3149731 3290403 3368504 3613379 3566809 3805291 3841372 4010133 4204464 4568537
2150 4568537 4427464 4642439 4757808 4877303 5020770 5149145 5490198 5845520 6036678 6226246
2140 6226246 6804123 7004573 7061174 7606299 7802040 7916577 8407089 8874095 9582662 9741771
$$ packed form
2212H54287J661j65538j60199K20789k7035m6365Q2145k7967j7342r0760N4823
2201F78499j60239J14509Q2621J14040q0679M24493j77517l39813L90573k89686
2191G56801J0145M0893M2066J39763J86077M9347k30168L81440M0972K84208l7163
2180A664381N6271J3658K22628J65483J2712J06349J82259L65659o2777j51043
2170B575580o6979N49500L38681p2906j42674m04443k86214K56162K42952K62687
2160C252346j02615J40672P8101K44875m6570K38482L6081J68761J94331L64073
2150D568537j41073K14975J15369J19495J43467J28375L41053L55322J91158J89568
2140F226246N77877K00450N6601N45125J95741J14537M90512M67006P08567J59109
$$ plain form
2130 9741771 10473208 11432169 11723086 12448743 13066339 13549799 14383239 15281530 16333821
2121 16333821 17493116 18714627 20255077 22095118 23549804 24794301 26328533 28561144
2113 28561144 31371085 34731742 39292317 44283104 50886414 59667019 72036268 88677227
2105 88677227 109874212 130672951 146872934 145841581 119454635 91616980 71412122
2098 71412122 57604169 47622052 40581188 35128689 30827767 27580700 25084803 23261383
2090 23261383 21787049 20939173 20006803 18739433 17213939 15764051 14422780 13503103 12227809
2081 12227809 11466635 10596197 9966630 9360883 9052874 8656389 8189340 7688638 7489024
2072 7489024 7480732 7132139 6682510 6095521 5910638 5849161 5308168 5113013 5121039 4854057
$$ packed form
2130I741771P31437R58961K90917P25657O17596M83460Q33440Q98291J052291
2121A6333821J159295J221511J540450J840041J454686J244497J534232K232611
2113B8561144K809941L360657M560575M990787O603310Q780605J2369249J6640959
2105H8677227K1196985K0798739J6199983j031353k6386946k7837655k0204858
2098G1412122j3807953r982117p040864n452499m300922l247067k495897j823420
2090B3261383j474334q47876r32370j267370j525494j449888j341271r19677j275294
2081A2227809p61174q70438o29567o05747l08009l96485m67049n00702j99614
2072G489024q292l48593m49629n86989j84883o1477n40993j95155Q026k66982
$$ plain form
2062 4854057 4742967 4458852 4212394 4369877 4315082 4317438 4068583 4285736 3798502 3800517
2052 3800517 3459991 3222104 3149284 2908081 2983012 3083176 2736602 2843987 3141161 2947062
2042 2947062 2760025 2568574 2529749 2205715 2343432 2124837 2197435 2053464 1642782 1731774
2032 1731774 1907219 1892303 1700597 1656134 1470103 1327620 1469803 1223495 1456961 1579907
2022 1579907 1499196 1422701 1345038 1255396 1223000 1385413 1304299 1117010 976844 1055172 1301320
2011 1301320 1288448 1260334 1135779 1153386 1206348 1165876 1119084 1231018 978986 898289 892062
2000 892062 926757 621712 404876 661503 583313 712893 880211 578834 449398 436684
1990 436684 435812 588155 780608 680679 364947 417873 575817 715045 884699 979278 627839
$$ packed form
2062D854057j11090k84115k46458J57483n4795K356k48855K17153m87234K015
2052C800517l40526k37887p2820k41203P4931J00164l46574J07385K97174j94099
2042B947062j87037j91451l8825l24034J37717k18595P2598j43971m10682Q8992
2032A731774J75445j4916j91706m4463j86031j42483J42183k46308K33466J22946
2022A579907q0711p6495p7663q9642l2396J62413q1114j87289j40166P8328K46148
2011A301320j2872k8114j24555J7607N2962m0472m6792J11934k52032q0697o227
2000H92062L4695l05045k16836K56627p8190J29580J67318l01377j29436j2714
1990D36684q72J52343J92453r9929l15732N2926J57944J39228J69654R4579l51439
$$ plain form
1979 627839 799830 811048 636247 646176 337328 333513 398703 315177 159866 9812 309800
1968 309800 171334 144684 -132713 53578 84731 219452 378773 313801 487465 557543
1958 557543 476694 526936 605607 481701 864030 773631 446034 443601 512146 181317 281273
1947 281273 275963 19239 228115 111849 -108785 132360 63619 -285095 -241196 -118549
1937 -118549 320868 465222 384274 396187 435013 293377 147298 355096 285273 62064
1927 62064 -44637 -216800 -135451 118611 207609 192040 99238 181906 -124190 -318692 -332652
1916 -332652 -310165 -213562 80075 85536 -90844 179392 342397 145204 54532 -71934 -129772
1905 -129772 163731 226498 265387 232045 -2496 31597 277777 23357 -219533 -259944 -392084
$$ packed form
1979F27839J71991J1218j74801R929l08848l815O5190q3526j55311j50054K99988
1968C09800j38466k6650k77397J86291L1153J34721J59321o4972J73664P0078
1958E57543q0849N0242P8671j23906L82329r0399l27597k433O8545l30829R9956
1947B81273n310k56724K08876j16266k20634K41145o8741l48714M3899J22647
1937a18549M39417J44354q0948J1913L8826j41636j46079K07798o9823k23209
1927F2064j06701j72163Q1349K54062Q8998j5569r2802Q2668l06096j94502j3960
1916c32652K2487R6603K93637N461j76380K70236J63005j97193r0672j26466n7838
1905a29772K93503O2767L8889l3342k34541L4093K46180k54420k42890m0411j32140
$$ plain form
1894 -392084 -108802 77543 -55722 -267769 -401096 -183668 -14022 -146473 232827 91547
1884 91547 -115993 80994 167671 36897 -25577 -119600 -228915 -87168 -257653 -501648
1874 -501648 -166598 38043 96821 -113351 -185621 -200090 -339794 -556013 -661864 -185408
1864 -185408 -183695 18775 -347156 -602667 -344440 -240043 -171782 -59453 -224889 -383715
1854 -383715 -344149 -308743 -272507 -314722 -272168 -273691 -352570 -277093 -289916 -175410 -105593 -92994
1842 -92994 -112781 76645 201160 249908 264856 306568 301329 523046 787201 486367 63843
1831 63843 190979 497630 451156 388002 276925 180668 359661 378956 1086 226915 198887
1820 198887 160359 199666 -128854 -84134 -15630 -231640 -197555 -352112 -171282 -38550 192188
$$ packed form
1894c92084K83282J86345j33265k12047j33327K17428J69646j32451L79300j41280
1884I1547k07540J96987Q6677j30774o2474r4023j09315J41747j70485k43995
1874e01648L35050K04641N8778k10172p2270j4469j39704k16219j05851M76456
1864a85408J713K02470l65931k55511K58227J04397O8261J12329j65436j58826
1854c83715L9566L5406L6236m2215M2554j523p8879P5477j2823J14506O9817J2599
1842i2994j9787J89426J24515M8748J4948M1712n239K21717K64155l00834m22524
1831F3843J27136L06651m6474o3154j11077r6257J78993J9295l77870K25829k8028
1820A98887l8528L9307l28520M4720O8504k16010L4085j54557J80830J32732K30738
$$ plain form
1809 192188 -25740 -36431 40996 -104038 -403625 -426021 -246386 -255212 -98698 35164 403142
1798 403142 431218 145907 -211299 38780 73537 53550 -111012 27964 14447 -25240 -105105
1787 -105105 263945 31918 79379 -413872 -474525 -137454 -82432 29004 225740 304041
1777 304041 138561 121754 179251 196773 -248296 -257169 -133118 -91845 -84099 127568 17366
1766 17366 -204634 -159454 18941 -243653 -340184 -426155 -221864 -248100 -417469 -339177 -327331
1755 -327331 -149065 155657 -202759 -156747 -244100 51159 -22675 107999 -173618 -289148
1745 -289148 -41879 -108993 -470163 -175959 -64681 -83128 -93296 95432 186583 54339
1735 54339 247458 27368 182775 -94124 -209556 11715 72801 16641 -133119 -257031
$$ packed form
1809A92188k17928j0691P7427j45034k99587k2396J79635q826J56514J33862L67978
1798D03142K8076k85311l57206K50079L4757j9987j64562J38976j3517l9687p9865
1787a05105L69050k32027M7461m93251o0653L37071N5022J11436J96736P8301
1777C04041j65480j6807N7497J7522m45069q873J24051M1273P746K11667j10202
1766A7366k22000M5180J78395k62594r6531q5971K04291k6236j69369P8292J1846
1755c27331J78266L04722l58416M6012q7353K95259p3834J30674k81617j15530
1745b89148K47269o7114l61170K94204J11278j8447j0168J88728R1151j32244
1735E4339J93119k20090J55407k76899j15432K21271O1086n6160j49760j23912
$$ plain form
1725 -257031 -55486 -130451 -75295 -184442 -328818 -120000 44910 74855 -55243 -246563
1715 -246563 -174877 -90254 11728 107957 185764 -37722 30416 -84847 -213353 -332614 -211165
1704 -211165 -303399 -367207 -116232 -82362 -31526 5415 -36133 -64400 -104743 54185 -19212
1693 -19212 -147859 57760 29261 1743 79396 166406 9097 -82859 9448 -101884 -198512
1682 -198512 -77914 -55229 24795 -68376 1215 66763 -99886 -25842 -63723 -135890 -147422
1671 -147422 -334020 -186191 -73703 34387 205847 38608 39424 -208553 -330405 -363012
1661 -363012 -468336 -307187 -406055 -297142 -756 -388824 -585469 -324095 16483 -102657
1651 -102657 -228288 -629794 -441000 -315009 15112 137919 164277 241603 41438 87558
$$ packed form
1725b57031K01545p4965N5156j09147j44376K08818J64910K9945j30098j91320
1715b46563P1686Q4623J01982R6229P7807k23486O8138j15263j28506j19261J21449
1704b11165r2234o3808K50975L3870N0836L6941m1548k8267m0343J58928p3397
1693a9212j28647K05619k8499k7518P7653Q7010j57309r1956R2307j11332r6628
1682a98512J20598K2685Q0024r3171O9591O5548j66649P4044l7881p2167j1532
1671a47422j86598J47829J12488J08090J71460j67239Q16k47977j21852l2607
1661c63012j05324J61149r8868J08913K96386l88068j96645K61374L40578j19140
1651a02657j25631m01506J88794J25991L30121J22807K6358P7326k00165M6120
$$ plain form
1641 87558 -220158 -295066 -200274 -185285 77880 -133269 -251845 -57358 77941 -16878 -44176
1630 -44176 228169 -45569 -293675 62569 283074 369590 204712 -31746 12859 -232422
1620 -232422 -143398 -159541 -242192 -263806 -259035 -42866 -123454 82713 368395 153505 -12170
1609 -12170 -204365 -141812 -371451 -107970 -136316 -250164 -208662 122780 145927 638365 577754
1598 577754 248820 -155930 -460536 -371795 -372707 -313903 -440123 -617623 -455798 -253764 -219952
1587 -219952 -79241 4159 -124377 -94248 -201002 -69207 738 -190445 -205140 -256723 -276695
1576 -276695 -205557 92002 -67588 44985 -232381 -414095 -310751 -311761 -320826 -208166 39197
1565 39197 -14477 137094 143847 -37020 14328 25628 -223674 106778 164636 -24534 19114
$$ packed form
1641H7558l07716p4908R4792J4989K63165k11149j18576J94487J35299r4819k7298
1630d4176K72345k73738k48106L56244K20505Q6516j64878k36458M4605k45281
1620b32422Q9024j6143q2651k1614M771K16169q0588K06167K85682k14890j65675
1609a2170j92195O2553k29639K63481k8346j13848M1502L31442K3147M92438o0611
1598E77754l28934m04750l04606Q8741r12N8804j26220j77500J61825K02034L3812
1587b19952J40711Q3400j28536L0129j06754J31795O9945j91183j4695n1583j9972
1576b76695P1138K97559j59590J12573k77366j81714J03344j010r065J12660K47363
1565C9197n3674J51571O753j80867N1348J1300k49302L30452N7858j89170M3648
$$ plain form
1554 19114 -185869 -33657 109166 -152139 -345308 -141393 -117458 232195 -59226 -292868
1544 -292868 -373894 -129556 22620 -390605 -436675 -3809 170231 353370 33781 -41166
1534 -41166 96970 319322 48652 -476082 -467484 -661924 -472491 -83159 176345 47786
1524 47786 -138130 121339 154033 11 182646 458744 143169 267652 214469 -134171
1514 -134171 -153891 -351370 -330769 -279471 -164524 -144099 -3428 48651 58791 -170636 -233776
1503 -233776 24743 -2615 10719 -228232 -354081 -288674 -274625 -35765 -310964 -337395 -367902
1492 -367902 -122210 -40826 -125725 14698 212335 117995 -89932 -305093 -72004 -208411
1482 -208411 -218413 -110380 -256702 -282514 -47978 -81411 -652583 -300814 -213883 -222682 -240785
$$ packed form
1554A9114k04983J52212J42823k61305j93169K03915K3935L49653k91421k33642
1544b92868q1026K44338J52176m13225m6070M32866J74040J83139l19589p4947
1534d1166J38136K22352k70670n24734Q598j94440J89433L89332K59504j28559
1524D7786j85916K59469L2694j54022J82635K76098l15575J24483n3183l48640
1514a34171j9720j97479K0601N1298J14947K0425J40671N2079J0140k29427o3140
1503b33776K58519k7358J3334k38951j25849O5407J4049K38860k75199k6431l0507
1492c67902K45692Q1384q4899J40423J97637r4340k07927k15161K33089j36407
1482b08411j0002J08033j46322k5812K34536l3433n71172L51769Q6931q799j8103
$$ plain form
1471 -240785 -203479 -79252 -148258 -327398 -377120 73541 101113 -19054 -76449 -308899 -387283
1460 -387283 -488171 -196146 66203 -52082 65626 -197012 -325645 204342 7864 -33610
1450 -33610 -97509 -126914 62688 -176471 -450624 -243084 -32981 -155515 -368867 -482380
1440 -482380 -485277 -431967 -259723 -89372 -2814 21487 -256533 -521929 -299490 -157796 63428
1429 63428 35239 -139997 6250 136119 -98193 -28828 81175 87122 -54394 -8606 -275425
1418 -275425 -424469 -393320 -229872 -144535 -343139 -215365 -240289 -319247 -326044 9877 -17282
1407 -17282 -117803 -178397 -157545 -127815 -57330 -104349 -173058 -274770 -425137 -459111 -177398
1396 -177398 -257899 -191200 -268704 -222388 -54966 -219561 -93427 -93445 -22239 -216109 -236402
$$ packed form
1471b40785L7306J24227o9006j79140m9722M50661K7572j20167n7395k32450p8384
1460c87283j00888K92025K62349j18285J17708k62638j28633N29987j96478m1474
1450c3610o3899k9405J89602k39159k74153K07540K10103j22534k13352j13513
1440d82380k897N3310J72244J70351Q6558K4301k78020k65396K22439J41694K21224
1429F3428k8189j75236J46247J29869k34312O9365J10003N947j41516M5788k66819
1418b75425j49044L1149J63448Q5337j98604J27774k4924p8958o797L35921k7159
1407a7282j00521o0594K0852K9730P0485m7019o8709j01712j50367l3974K81713
1396a77398q0501O6699p7504M6316J67422j64595J26134j8P1206j93870k0293
$$ plain form
1385 -236402 -191241 -354622 -67190 -143400 -38461 42015 -170533 28382 335835 461974
1375 461974 108523 -145818 -369420 -202491 -199446 -14040 16234 75652 287936 131844
1365 131844 -159264 -219129 -52187 -26811 50208 211201 -64576 -9864 107658 162301 120690
1354 120690 12024 -90930 56847 -208023 -198323 -92982 -19866 245250 -19641 44698
1344 44698 -29458 3978 168811 -42480 189637 525950 118423 110365 -11513 -42263 -60258
1333 -60258 242672 303143 26593 -130068 -79857 -33796 108680 23205 96630 76213 -179239
1322 -179239 -478497 -238454 -96534 -159083 -329897 -212506 -110418 -11961 -159432 -377253
1312 -377253 -157269 -169273 -187905 -193366 100651 -5892 -41681 -346705 -198178 -277925 -243445
$$ packed form
1385b36402M5161j63381K87432p6210J04939Q0476k12548J98915L07453J26139
1375D61974l53451k54341k23602J66929L045J85406L0274N9418K12284j56092
1365A31844k91108n9865J66942K5376P7019J60993k75777N4712J17522N4643m1611
1354A20690j08666j02954J47777k64870R700J05341P3116K65116k64891O4339
1344D4698p4156L3436J64833k11291K32117L36313m07527q058j21878l0750j7995
1333f0258L02930O0471k76550j56661N0211M6061J42476q5475P3425k0417k55452
1322a79239k99258K40043J41920o2549j70814J17391J02088R8457j47471k17821
1312c77253K19984j2004j8632n461K94017j06543l5789l05024J48527p9747L4480
$$ plain form
1301 -243445 -194238 -295368 -105397 95171 117052 -34407 3154 150882 21600 162465
1291 162465 -160758 -163590 -264428 -258070 -308917 -342164 -463826 -399832 -252528 -345125 -231361
1280 -231361 -196816 -59194 13138 -81304 -186450 -192355 -154033 -215755 -162019 102531 35867
1269 35867 -96334 -407034 -27006 44055 -7593 -89697 219552 253300 7622 -258182 -20571
1258 -20571 -68756 -237280 -276788 -118388 195403 375210 235540 209020 -230277 -234801 48147
1247 48147 -16986 164930 162821 390226 183712 -279742 -58532 33505 -13076 -49676 50903
1236 50903 3271 101968 126738 79217 57295 7400 84426 17825 -200874 -221903 -85167
1225 -85167 12966 124732 -130279 -25350 -266230 -476035 -135871 113094 -134001 -230730
$$ packed form
1301b43445M9207j01130J89971K00568K1881j51459L7561J47728j29282J40865
1291A62465l23223k832j00838O358n0847l3247j21662O3994J47304r2597J13764
1280b31361L4545J37622P2332r4442j05146n905L8322o1722N3736K64550o6664
1269C5867j32201l10700L80028P1061n1648q2104L09249L3748k45678k65804K37611
1258b0571m8185j68524l9508J58400L13791J79807j39670k6520m39297m524K82948
1247D8147o5133J81916k109K27405k06514m63454K21210R2037m6581l6600J00579
1236E0903m7632R8697K4770m7521k1922m9895P7026o6601k18699k1029J36736
1225h5167R8133J11766k55011J04929k40880k09805L40164K48965k47095r6729
$$ plain form
1215 -230730 -59328 87921 -264208 -277707 -169780 -246138 -296646 -354844 -244595 37820
1205 37820 -20394 -64654 -188139 -6340 -291343 -195802 -216003 -19624 48834 195066 124366
1194 124366 381914 315693 273155 275367 -138440 -252395 -281826 -236070 -354843 -162594 -335270
1183 -335270 -249778 -172540 -16105 53903 -253536 -260180 -123205 85398 2598 -294023 -175651
1172 -175651 -501285 -290162 -65781 96416 -77382 -143080 -249765 -385705 -329200 -261616
1162 -261616 -71847 -119891 -33125 2058 28031 -147298 58119 113261 81751 -30989 -12390
1151 -12390 -243414 -259670 -16372 89913 450375 526066 352263 21770 -92815 -160396
1141 -160396 -29387 -36080 23275 -93807 -115363 39590 238461 -71108 157038 207335 -38510
$$ packed form
1215b30730J71402J47249l52129j3499J07927p6358n0508n8198J10249K82415
1205C7820n8214m4260j23485J81799k85003R5541k0201J96379O8458J46232p0700
1194A24366K57548o6221m2538K212m13807j13955k9431M5756j18773J92249j72676
1183c35270Q5492P7238J56435P0008l07439o644J36975K08603q2800k96621J18372
1172a75651l25634K11123K24381J62197j73798o5698j06685j35940N6505O7584
1162b61616J89769m8044Q6766L5183K5973j75329K05417N5142l1510j12740J8599
1151a2390k31024j6256K43298J06285L60462P5691j73803l30493j14585o7581
1141a60396J31009o693N9355j17082k1556J54953J98871l09569K28146N0297k45845
$$ plain form
1130 -38510 -309866 -348032 -71052 -115740 -319373 -243426 84458 259233 16233 -211762
1120 -211762 -262833 9934 -25972 -57827 -9056 -27752 -173295 -222793 -289193 -100288 43388
1109 43388 -260648 -166224 -288541 -387556 -430342 -181872 -43838 -129872 65348 -36808 -283283
1098 -283283 -139261 -7707 38746 -203281 -103050 -1456 155895 128573 51656 103750
1088 103750 -221053 -253912 -279165 -415915 -371027 -353568 -435996 -315735 -278115 -126659 -30722
1077 -30722 -4292 203270 -42271 -213919 39399 30589 -208669 -145406 -191748 -287572 -265290
1066 -265290 51988 17077 -49899 100787 349343 129020 -76559 219994 63666 -82852
1056 -82852 -49486 196730 213338 -34262 103827 123523 -116539 -344332 -350405 -226910 -19482
$$ packed form
1130c8510k71356l8166K76980m4688k03633P5947L27884J74775k43000k27995
1120b11762n1071K72767l5906l1855M8771j8696j45543m9498o6400J88905J43676
1109D3388l04036R4424j22317r9015m2786K48470J38034q6034J95220j02156k46475
1098b83283J44022J31554M6453k42027J00231J01594J57351k7322p6917N2094
1088A03750l24803l2859k5253j36750M4888J7459q2428J20261L7620J51456R5937
1077c0722K6430K07562k45541j71648K53318q810k39258O3263m6342r5824K2282
1066b65290L17278l4911o6976J50686K48556k20323k05579K96553j56328j46518
1056h2852L3366K46216J6608k47600J38089J9696k40062k27793o073J23495K07428
$$ plain form
1045 -19482 19906 175105 2751 -293921 -268199 -291525 -200862 2400 -277406 -317702 -30040
1034 -30040 54853 218819 -211908 -31124 -6359 121764 -64863 -118318 -47683 -1888 148409
1023 148409 -293592 -328720 -83540 -141154 -121920 585 75508 363367 98275 -56927
1013 -56927 -52289 -240798 -20785 141123 -268786 -101431 -54899 18502 40662 47306 -64161
1002 -64161 185732 -68961 -16663 -32095 -202416 5272 -173742 -263349 138142 -139555
992 -139555 -225439 183679 262313 157030 -98412 -186443 -18882 171384 52517 -61059
982 -61059 -362024 -363381 -330359 -196643 27276 33238 201876 354010 328608 241723 106771
971 106771 47256 58737 -27343 136813 95669 -110315 -54812 -131114 5879 64906 -44013
$$ packed form
1045a9482L9388J55199j72354k96672K5722k3326R0663K03262k79806m0296K87662
1034c0040Q4893J63966m30727J80784K4765J28123j86627n3455P0635M5795J50297
1023A48409m42001l5128K45180n7614J9234J22505P4923K87859k65092j55202
1013e6927M638j88509K20013J61908m09909J67355M6532P3401K2160O644j11467
1002f4161K49893k54693N2298j5432j70321K07688j79014q9607M01491k77697
992a39555q5884M09118P8634j05283k55442q8031J67561J90266j18867j13576
982f1059l00965j357L3022J33716K23919N962J68638J52134k5402q6885j34952
971A06771n9515J1481q6080J64156m1144k05984N5503p6302J36993N9027j08919
$$ plain form
960 -44013 -54781 72294 131135 6530 52921 91538 -157592 29777 -2037 -29281 -117999
949 -117999 -28806 99526 269361 239298 111212 -126659 93956 -39393 157803 -102751
939 -102751 158929 419316 250814 353531 -102753 -203248 -13322 155425 -229597 -465120
929 -465120 -210190 22557 134095 234136 290145 -77760 -3799 173393 104408 -149752
919 -149752 -29192 -139932 -52114 216710 -38920 -90471 39978 -90214 -210802 12287
909 12287 -128508 -188903 -193978 124232 22417 86696 73091 79245 -27046 -136821 -25559
898 -25559 321772 471340 462412 339783 372138 262971 87467 -87822 -256114 -177681 -256923
887 -256923 -214423 -86161 432845 257464 123784 200264 60767 -27530 -27550 24375 -8569
$$ packed form
960d4013j0768J27075N8841j24605M6391L8617k49130J87369l1814k7244q8718
949a17999Q9193J28332J69835l0063j28086k37871K20615j33349J97196k60554
939a02751K61680K60387j68502J02717m56284j00495J89926J68747l85022k35523
929d65120K54930K32747J11538J00041N6009l67905P3961J77192o8985k54160
919a49752J20560j10740Q7818K68824k55630n1551J30449j30192j20588K23089
909A2287j40795o0395n075L18210j01815O4279j3605O154j06291j09775J11262
898b5559L47331J49568q928j22629L2355j09167j75504j75289j68292P8433p9242
887b56923M2500J28262N19006j75381j33680P6480j39497q8297k0N1925l2944
$$ plain form
876 -8569 -253511 -255312 164616 5182 -228024 -14401 40292 -22724 98805 -99341 -272408
865 -272408 -160758 -80574 84285 172746 78345 36876 -213159 -106493 -134451 -236610 -314999
854 -314999 74541 103481 137365 164338 157781 106219 -43957 89280 -20444 125140 407530
843 407530 514631 195828 200822 134433 -203847 -166878 -221262 -98263 59670 -219890 10027
832 10027 138530 -298022 43539 5164 -377629 -386347 -69496 156872 235262 326207 143199
821 143199 38986 247656 117090 -107194 -26838 -119143 -183728 -211892 -123913 -172308 -136768
810 -136768 -17476 44606 64292 22576 -144430 -435846 -267139 -352706 -104629 56654 167220
799 167220 318637 454897 122959 -36855 284199 -85105 -141743 -127207 148928 -47648
$$ packed form
876h569k44942j801M19928j59434k33206K13623N4693o3016J21529j98146j73067
865b72408J11650Q0184J64859Q8461r4401m1469k50035J06666k7958j02159p8389
854c14999L89540K8940L3884K6973o557n1562j50176J33237j09724J45584K82390
843D07530J07101l18803M994o6389l38280L6969n4384J22999J57933k79560K29917
832A0027J28503m36552L41561l8375l82793q718L16851K26368P8390R0945j83008
821A43199j04213K08670j30566k24284Q0356r2305o4585k8164Q7979m8395L5540
810a36768J19292O2082J9686m1716j67006k91416J68707q5567K48077J61283J10566
799A67220J51417J36260l31938j59814L21054l69304n6638J4536K76135j96576
$$ plain form
789 -47648 156677 328336 213106 166798 249850 146263 50921 -235576 -312739 -218146 123179
778 123179 158638 -88160 -19275 563246 405600 129113 179865 10862 317247 375250 397365
767 397365 119925 225541 389950 342360 447726 250765 1204 -60925 35316 47413 60032
756 60032 171346 202757 171692 -49857 -166008 133805 261667 -70588 30874 225966
746 225966 289388 324920 -64809 170598 310836 179657 76124 254302 38944 -120843
736 -120843 -175460 -200892 109734 218364 433120 116414 181752 340173 333389 -151775 -43348
725 -43348 89190 26365 118839 -201233 5871 401373 -64327 -109184 24882 88080 -190237
714 -190237 -59004 -245130 -119522 -119013 4537 223007 83149 -60332 -40265 108171 91652
$$ packed form
789d7648K04325J71659j15230m6308Q3052j03587r5342k86497p7163R4593L41325
778A23179L5459k46798O8885N82521j57646k76487N0752j69003L06385N8003K2115
767C97365k77440J05616J64409m7590J05366j96961k49561o2129R6241J2097J2619
756F0032J11314L1411l1065k21549j16151K99813J27862l32255J01462J95092
746B25966O3422L5532l89729K35407J40238j31179j03533J78178k15358j59787
736a20843n4617k5432L10626J08630K14756l16706O5338J58421o784m85164J08427
725d3348J32538o2825R2474l20072K07104L95502m65700m4857J34066O3198k78317
714a90237J31233j86126J25608N09J23550K18470j39858j43481K0067J48436j6519
$$ plain form
703 91652 102592 31280 -93203 -261623 148408 233065 398984 370835 416407 434297 345641
692 345641 183732 438848 298352 294524 296855 -46924 -217760 -460549 -95189 162468 174518
681 174518 100110 53177 74031 -254645 -308019 -327130 -103070 41434 35086 86098 87875 -64594
669 -64594 88439 57892 -32144 185806 173997 -29814 211916 124738 35267 -239980 38808
658 38808 -78338 5664 -43569 -154589 -43501 -98786 -48238 37542 -134245 -244036 168982
647 168982 -84814 15251 -94261 -101035 -65222 54077 302615 299823 355308 139205 -11692
636 -11692 15553 -282652 -113267 -66604 45612 54129 29271 -205125 -101672 -92151 -79081
625 -79081 122646 63618 15471 -89634 112520 389002 646835 460994 125517 -55501
$$ packed form
703I1652J0940p1312j24483j68420M10031Q4657J65919k8149M5572J7890q8656
692C45641j61909K55116j40496l828K331l43779j70836k42789L65360K57657J2050
681A74518p4408m6933K0854l28676n3374j9111K24060J44504o348N1012J777j52469
669f4594J53033l0547r0036K17950j1809k03811K41730q7178q9471k75247K78788
658C8808j17146Q4002m9233j11020J11088n5285N0548Q5780j71787j09791M13018
647A68982k53796J00065j09512o774L5813J19299K48538k792N5485k16103j50897
636a1692K7245k98205J69385M6663J12216Q517k4858k34396J03453R521J3070
625g9081K01727n9028m8147j05105K02154K76482K57833j85841l35477j81018
$$ plain form
615 -55501 171516 229889 161827 107855 265965 293218 -22999 205956 -53484 -111068 -175966
604 -175966 -315890 -324930 241024 175966 23485 -73635 10062 191227 88145 -167092 -31053
593 -31053 18092 -198488 -28726 450211 606873 76964 50065 125740 347297 426271 275615
582 275615 125562 78680 156010 261751 87027 437968 450308 328258 177559 216275 538861
571 538861 443091 349228 31773 -88470 -93910 20721 362825 88078 -356155 -275710 -16135
560 -16135 -109008 -143687 11231 52860 -84361 -168688 116232 200315 184937 276474 111082
549 111082 -26630 28329 10545 184691 203401 -162564 -22977 -21996 -103589 -96989 -101846 -60853
537 -60853 -132265 451450 385451 302376 128738 -7477 124303 -107980 -208510 -15795 242950
$$ packed form
615e5501K27017N8373o8062n3972J58110K7253l16217K28955k59440n7584o4898
604a75966j39924r040N65954o5058j52481r7120Q3697J81165j03082k55237J36039
593c1053M9145k16580J69762M78937J56662n29909k6899P5675K21557P8974j50656
582B75615j50053m6882P7330J05741j74724L50941J2340j22050j50699L8716L22586
571E38861r5770r3863l17455j20243n440J14631L42104k74747m44233Q0445K59575
560a6135r2873l4679J54918M1629j37221q4327K84920Q4083j5378R1537j65392
549A11082j37712N4959j7784J74146J8710l65965J39587R81q1593O600m857M0993
537f0853p1412N83715o5999q3075j73638j36215J31780k32283j00530J92715K58745
$$ plain form
526 242950 274372 229142 12742 -100289 -232008 -202369 159667 246706 127916 -78828 -127142
515 -127142 322734 131420 100850 155028 242873 416294 328168 231863 226115 -96522 114587
504 114587 -5546 -206878 -60119 80298 108438 -34825 355478 292264 -282194 -208280
494 -208280 82564 225562 43241 -389364 -87652 146678 356944 309727 176405 148361
484 148361 220659 -105964 -328184 -166520 -94721 118948 223700 347383 283274 338357 337276
473 337276 88026 125632 78606 -153155 69974 231960 304738 105390 -118369 174266
463 174266 81601 84641 159157 181433 122890 -29628 178811 -4204 -17259 -81522 54593
452 54593 150180 -16736 -88598 53470 -41392 -124664 -229221 -447295 -136181 -6518 52907
$$ packed form
526B42950L1422m5230k16400j13031j31719K9639L62036Q7039j18790k06744m8314
515a27142M49876j91314l0570N4178Q7845J73421q8126r6305n748l22637K11109
504A14587j20133k01332J46759J40417K8140j43263L90303o3214n74458P3914
494b08280K90844J42998j82321m32605L01712K34330K10266m7217j33322k8044
484A48361P2298l26623k22220J61664P1799K13669J04752J23683o4109N5083j081
473C37276k49250L7606m7026k31761K23129J61986P2778j99348k23759K92635
463A74266r2665L040P4516K2276n8543j52518K08439j83015j3055o4263J36115
452E4593R5587j66916p1862J42068r4862q3272j04557k18074L11114J29663N9425
$$ plain form
441 52907 96736 164546 199955 142409 132117 33584 254771 394363 302600 268706 252541 167688
429 167688 151500 209971 216949 304852 180063 110410 227147 267095 44760 112598 174246
418 174246 321426 201345 -56479 82227 153255 285867 356511 377103 218012 278478 -9460
407 -9460 -21050 69252 129252 229225 161148 264821 102118 680013 704616 522707 626914
396 626914 608980 400759 296568 337303 467637 183979 -51224 131398 437252 201705
386 201705 13996 415000 433538 325257 558038 355850 -14742 -41762 132555 446633
376 446633 331743 170393 188369 388811 442487 487501 189705 194371 365679 246344 90858
365 90858 59759 344952 518646 659363 792307 735618 281427 347625 275507 154626 -25700
$$ packed form
441E2907M3829O7810L5409n7546j0292r8533K21187J39592r1763l3894j6165q4853
429A67688j6188N8471O978Q7903j24789o9653J16737L9948k22335O7838O1648
418A74246J47180j20081k57824J38706P1028J32612P0644K0592j59091O0466k87938
407i460j1590R0302O0000R9973o8077J03673j62703N77895K4603j81909J04207
396F26914j7934k08221j04191M0735J30334k83658k35203J82622L05854k35547
386B01705j87709M01004J8538j08281K32781k02188l70592k7020J74317L14078
376D46633j14890j61350J7976K00442N3676M5014k97796M666J71308j19335j55486
365I0858l1099K85193J73694J40717J32944n6689m54191O6198p2118j20881j80326
$$ plain form
354 -25700 -86831 259782 555401 368396 375485 47797 257 -48383 355620 536125 489144
343 489144 404317 280702 290225 -7334 164997 496552 468466 428228 418173 113015 404370
332 404370 223410 258401 330434 240179 86879 319187 383168 474497 569786 182318 18786
321 18786 286498 183098 205208 10043 -101305 -18431 -106936 -161327 82898 235242 408683
310 408683 363804 290293 356709 617574 474948 327214 455828 210387 349420 401378 364878
299 364878 102743 4166 182819 89853 248331 369244 419603 528130 628018 442525 146869
288 146869 107112 59693 551968 460859 129354 74396 44702 90860 142734 57602 277772
277 277772 372892 363063 409416 327809 445682 168740 331714 399485 604970 586111 325126
$$ packed form
354b5700o1131L46613K95619j87005P089l27688m7540m8640M04003J80505m6981
343D89144q4827j23615R523k97559J72331L31555k8086m0238j0055l05158K91355
332D04370j80960L4991P2033r0255j53300K32308O3981R1329R5289l87468j63532
321A8786K67712j03400K2110j95165j11348Q2874q8505n4391K44225J52344J73441
310D08683m4879p3511O6416K60865j42626j47734J28614k45441J39033N1958l6500
299C64878k62135r8577J78653r2966J58478J20913N0359J08527R9888j85493k95656
288A46869l9757m7419M92275r1109l31505n4958k9694M6158N1874q5132K20170
277B77772R5120r829M6353q1607J17873k76942J62974O7771K05485j8859k60985
$$ plain form
266 325126 189307 609113 722291 606338 654772 434522 473211 677909 243084 -309324
256 -309324 -112547 405260 190248 16040 406678 523098 331388 358731 393532 37059
246 37059 112983 292228 319324 172874 411950 584783 297452 225670 384281 495893 447470
235 447470 368573 428922 405545 330664 248194 107233 384320 474429 523852 703344 534145
224 534145 315470 328506 480040 288182 400389 231797 197355 480034 459562 320102
214 320102 79591 23994 64180 -80648 120821 108279 76264 117166 221521 287093 213481
203 213481 328011 103892 102159 779367 737219 499244 398994 443276 668580 402601 272753
192 272753 315726 226983 198213 282195 375864 287654 353535 216018 227653 88261 253708
$$ packed form
266C25126j35819M19806J13178j15953M8434k20250L8689K04698m34825n52408
256c09324J96777N17807k15012j74208L90638J16420j91710K7343L4801l56473
246C7059P5924J79245K7096j46450K39076J72833k87331p1782J58611J11612m8423
235D47470p8897O0349k3377p4881q2470j40961K77087R0109M9423J79492j69199
224E34145k18675J3036J51534j91858J12207j68592l4442K82679k0472j39460
214C20102k40511n5597M0186j44828K01469j2542l2015M0902J04355O5572p3612
203B13481J14530k24119j733O77208m2148k37975j00250M4282K25304k65979j29848
192B72753M2973q8743k8770Q3982R3669q8210O5881j37517J1635j39392J65447
$$ [...]
##END NTUPLES=NMR SPECTRUM
##END=
