##TITLE=1H_67-2023Bay
 CDCl3
 8 sc, 
 6.9.2023
##JCAMPDX= 6.0         $$ Bruker NMR JCAMP-DX V2.0
##DATA TYPE= NMR FID
##DATA CLASS= NTUPLES
##ORIGIN= UXNMR, Bruker Analytische Messtechnik GmbH
##OWNER= root
$$ XWIN-NMR		Version 3.5
$$ Wed Sep  6 14:24:30 2023 Russian Standard Time (UT+4h)  she@DPX200
##.OBSERVE FREQUENCY= 200.13135
##.OBSERVE NUCLEUS= ^1H
##.DELAY= (6, 6)
##.ACQUISITION MODE= SIMULTANEOUS
##.ACQUISITION SCHEME= undefined
##.AVERAGES= 8
##.DIGITISER RES= 18
##SPECTROMETER/DATA SYSTEM= spect
##.PULSE SEQUENCE= zg30
##.SOLVENT NAME= CDCl3
##.SHIFT REFERENCE= (INTERNAL, CDCl3, 0, 15.7039)
##AUDIT TRAIL= $$ (NUMBER, WHEN, WHO, WHERE, WHAT)
$$ ##TITLE= Audit trail, XWIN-NMR		Version 3.5
$$ ##JCAMPDX= 5.01
$$ ##ORIGIN= Bruker BioSpin GmbH
$$ ##OWNER= she
$$ F:/spectra/data/she/nmr/H-F/1/audita.txt
$$ ##AUDIT TRAIL=  $$ (NUMBER, WHEN, WHO, WHERE, WHAT)
(   1,<2023-09-06 14:23:07.53 +0400>,<she>,<DPX200>,
      <created by zg, POWCHK disabled, PULCHK disabled
       configuration hash MD5:
       00 E9 B6 7A A2 85 ED C7 34 08 36 98 17 FE 4E 26
       data hash MD5: 16K
       6B 9C E3 F8 CA 32 6A 07 09 D4 00 8B 8D 9F 47 B7>)
$$ ##END=
$$ 
$$ hash MD5
$$ 30 4C 53 C2 08 F1 BB DE D0 09 34 A0 16 A4 B0 95
##$RELAX= 
##$RELAX= 
##$RELAX= 
##$RELAX= 
##$RELAX= 
##$RELAX= 
$$ Bruker specific parameters
$$ --------------------------
##$DU= <F:/spectra>
##$EXPNO= 1
##$NAME= <H-F>
##$PROCNO= 1
##$TYPE= <nmr>
##$USER= <she>
##$AMP= (0..31)
100 100 100 100 100 100 100 100 100 100 100 100 100 100 100 100 100 100 
100 100 100 100 100 100 100 100 100 100 100 100 100 100 
##$AQSEQ= 0
##$AQ_mod= 1
##$AUNM= <au_zg>
##$AUTOPOS= <>
##$BF1= 200.13
##$BF2= 200.13
##$BF3= 200.13
##$BF4= 200.13
##$BF5= 200.13
##$BF6= 200.13
##$BF7= 200.13
##$BF8= 200.13
##$BYTORDA= 1
##$CFDGTYP= 0
##$CFRGTYP= 5
##$CHEMSTR= <none>
##$CNST= (0..31)
1 1 145 1 1 1 1 1 1 1 1 1 1 1 1 1 1 1 1 1 1 1 1 1 1 1 1 1 1 1 1 1 
##$CPDPRG= <>
##$CPDPRG1= <>
##$CPDPRG2= <>
##$CPDPRG3= <>
##$CPDPRG4= <mlev>
##$CPDPRG5= <mlev>
##$CPDPRG6= <mlev>
##$CPDPRG7= <mlev>
##$CPDPRG8= <mlev>
##$CPDPRGB= <>
##$CPDPRGT= <>
##$D= (0..31)
0 1.2 0 0 0 0 0 0 0 0.06 0 0.03 0 0 0 0 0.0002 0 0 0 0 0 0 0 0 0 0 0 0 
0 0 0 
##$DATE= 1693995786
##$DBL= (0..7)
120 120 120 120 120 120 120 120 
##$DBP= (0..7)
150 150 150 150 150 150 150 150 
##$DBP07= 0
##$DBPNAM0= <>
##$DBPNAM1= <>
##$DBPNAM2= <>
##$DBPNAM3= <>
##$DBPNAM4= <>
##$DBPNAM5= <>
##$DBPNAM6= <>
##$DBPNAM7= <>
##$DBPOAL= (0..7)
0.5 0.5 0.5 0.5 0.5 0.5 0.5 0.5 
##$DBPOFFS= (0..7)
0 0 0 0 0 0 0 0 
##$DE= 6
##$DECBNUC= <off>
##$DECIM= 32
##$DECNUC= <off>
##$DECSTAT= 4
##$DIGMOD= 1
##$DIGTYP= 9
##$DL= (0..7)
0 120 120 120 120 120 120 120 
##$DP= (0..7)
150 150 150 150 150 150 150 150 
##$DP07= 0
##$DPNAME0= <>
##$DPNAME1= <>
##$DPNAME2= <>
##$DPNAME3= <>
##$DPNAME4= <>
##$DPNAME5= <>
##$DPNAME6= <>
##$DPNAME7= <>
##$DPOAL= (0..7)
0.5 0.5 0.5 0.5 0.5 0.5 0.5 0.5 
##$DPOFFS= (0..7)
0 0 0 0 0 0 0 0 
##$DQDMODE= 0
##$DR= 18
##$DS= 0
##$DSLIST= <SSSSSSSSSSSSSSS>
$$ [...]
##$SUBNAM2= <"">
##$SUBNAM3= <"">
##$SUBNAM4= <"">
##$SUBNAM5= <"">
##$SUBNAM6= <"">
##$SUBNAM7= <"">
##$SUBNAM8= <"">
##$SUBNAM9= <"">
##$SW= 18.05172834244
##$SWIBOX= (0..15)
0 0 2 0 0 0 0 0 0 0 0 0 0 0 0 0 
##$SW_h= 3612.71676300578
##$TD= 16384
##$TD0= 1
##$TE= 0
##$TE2= 300
##$TE3= 300
##$TEG= 300
##$TL= (0..7)
0 120 120 120 120 120 120 120 
##$TP= (0..7)
150 150 150 150 150 150 150 150 
##$TP07= 0
##$TPNAME0= <>
##$TPNAME1= <>
##$TPNAME2= <>
##$TPNAME3= <>
##$TPNAME4= <>
##$TPNAME5= <>
##$TPNAME6= <>
##$TPNAME7= <>
##$TPOAL= (0..7)
0.5 0.5 0.5 0.5 0.5 0.5 0.5 0.5 
##$TPOFFS= (0..7)
0 0 0 0 0 0 0 0 
##$TUNHIN= 0
##$TUNHOUT= 0
##$TUNXOUT= 0
##$USERA1= <user>
##$USERA2= <user>
##$USERA3= <user>
##$USERA4= <user>
##$USERA5= <user>
##$V9= 5
##$VALIST= <valist>
##$VCLIST= <CCCCCCCCCCCCCCC>
##$VD= 0
##$VDLIST= <DDDDDDDDDDDDDDD>
##$VPLIST= <PPPPPPPPPPPPPPP>
##$VTLIST= <TTTTTTTTTTTTTTT>
##$WBST= 1024
##$WBSW= 4
##$XGAIN= (0..3)
0 0 0 0 
##$XL= 0
##$YL= 0
##$YMAX_a= 91926
##$YMIN_a= -124851
##$ZGOPTNS= <>
##$ZL1= 120
##$ZL2= 120
##$ZL3= 120
##$ZL4= 120
##$ABSF1= 10
##$ABSF2= 0
##$ABSG= 5
##$ABSL= 3
##$ALPHA= 0
##$AQORDER= 0
##$ASSFAC= 0
##$ASSFACI= 0
##$ASSFACX= 0
##$ASSWID= 0
##$AUNMP= <proc_1d>
##$AZFE= 0.1
##$AZFW= 0.1
##$BCFW= 1
##$BC_mod= 2
##$BYTORDP= 1
##$COROFFS= 0
##$CY= 11.3945322036743
##$DATMOD= 1
##$DC= 2
##$DFILT= <>
##$DTYPP= 0
##$F1P= 15.7292609196834
##$F2P= 12.9074282941183
##$FCOR= 0.5
##$FTSIZE= 0
##$FT_mod= 4
##$GAMMA= 1
##$GB= 0.15
##$INTBC= 1
##$INTSCL= 1
##$ISEN= 128
##$LB= 0.24
##$LEV0= 0
##$LPBIN= 0
##$MAXI= 10000
##$MC2= 0
##$MEAN= 0
##$ME_mod= 0
##$MI= 1.114404
##$NCOEF= 0
##$NC_proc= 0
##$NLEV= 6
##$NOISF1= 3.799351
##$NOISF2= 2.8
##$NSP= 1
##$NTH_PI= 0
##$NZP= 0
##$OFFSET= 15.70392
##$PC= 1
##$PHC0= -21044.02
##$PHC1= 15.45271
##$PH_mod= 1
##$PKNL= yes
##$PPARMOD= 0
##$PSCAL= 0
##$PSIGN= 0
##$REVERSE= no
##$SF= 200.130013532006
##$SI= 16384
##$SIGF1= 3
##$SIGF2= 2
##$SINO= 400
##$SIOLD= 16384
##$SREGLST= <1H.CDCl3>
##$SSB= 0
##$STSI= 0
##$STSR= 0
##$SW_p= 3612.71676300578
##$SYMM= 0
##$S_DEV= 0
##$TDeff= 0
##$TDoff= 0
##$TI= <>
##$TILT= no
##$TM1= 0
##$TM2= 0
##$TOPLEV= 0
##$USERP1= <user>
##$USERP2= <user>
##$USERP3= <user>
##$USERP4= <user>
##$USERP5= <user>
##$WDW= 1
##$XDIM= 8192
##$YMAX_p= 0
##$YMIN_p= 0
$$ End of Bruker specific parameters
$$ ---------------------------------
##NTUPLES= NMR FID
##VAR_NAME=  TIME,          FID/REAL,        FID/IMAG
##SYMBOL=    X,             R,               I
##VAR_TYPE=  INDEPENDENT,   DEPENDENT,       DEPENDENT
##VAR_FORM=  AFFN,          ASDF,            ASDF
##VAR_DIM=   8192,          8192,            8192
##UNITS=     SECONDS,       ARBITRARY UNITS, ARBITRARY UNITS
##FACTOR=    0.0002768,     1,               1
##FIRST=     0,             0,               0
##LAST=      2.2672688,     0,               0
##MIN=       0,             -124851,         0
##MAX=       2.2672688,     91926,           0
$$ Real data points
##PAGE= N=1
##DATA TABLE= (X++(R..R)), XYDATA
$$ [...]
2682a308L010k766J077J219k898K263l22j618K931k417K76J599k807K719j57j778
$$ -1308 1702 -1064 13 1232 -1666 597 275 -1343 1588 -829 -553 1046 -1761 958 801 -977
2698i77K702k207k32K108k829K071L21k359K767j671p46K710k742J220Q55k737
$$ -977 1725 -482 -714 1394 -1435 636 957 -1402 1365 -306 -1052 1658 -1084 136 991 -1746
2714a746K688j416r42K955k367J013R05k908K598r21j220K848k328N36J575k802
$$ -1746 942 -474 -1416 1539 -828 185 1090 -1818 780 -141 -1361 1487 -841 -305 1270 -1532
2730a532K286M9j773K652k059j25J792k639J933K43k168K893j938l18K288k856
$$ -1532 754 803 -970 1682 -377 -502 1290 -1349 584 827 -1341 1552 -386 -704 1584 -1272
2746a272J648N84k666K634j440p39K564k346J211Q61k510K396j047j134K643k263
$$ -1272 376 960 -1706 928 -512 -1251 1313 -1033 178 1039 -1471 925 -122 -1256 1387 -876
2762h76R16J139k451K425o21j647K479k088L60J783k853K012Q2k055K829j873
$$ -876 40 1179 -1272 1153 532 -1115 1364 -724 -364 1419 -1434 578 660 -1395 1434 -439
2778d39l23J939k724J921N9j913K468j463n96K555k536J383O71k310K332j272
$$ -439 -762 1177 -1547 374 433 -1480 988 -475 -1071 1484 -1052 331 1002 -1308 1024 -248
2794b48q83K657k232R44J151k706K332q29j231K452k092M67J226k493K256k00
$$ -248 -1131 1526 -706 238 1389 -1317 1015 186 -1045 1407 -685 -218 1008 -1485 771 571
2810E71j907K828k174J33J723k608J642J18j808K662j680l2J966k545J355M84
$$ 571 -1336 1492 -682 -549 1174 -1434 208 326 -1482 1180 -500 -532 1434 -1111 244 728
2826G28k256K494j268n34K454k481J362O47k397K394r98j247K446k404R26J288
$$ 728 -1528 966 -302 -836 1618 -863 499 1146 -1251 1143 145 -1102 1344 -1060 -134 1154
2842A154k404K096l16j640K487k161J99J436k601K093K29j851K751j790j10J640
$$ 1154 -1250 846 530 -1110 1377 -784 -585 851 -1750 343 572 -1279 1472 -318 -428 1212
2858A212k486J739O7j864K438j573p6K225k441J292K97k147K201j066r84K216
$$ 1212 -1274 465 532 -1332 1106 -467 -543 1682 -759 533 830 -1317 884 -182 -1166 1050
2874A050k184R39J161k136K219j124j264K234j951N56J496k242K013k73j427K475
$$ 1050 -1134 -195 966 -1170 1049 -75 -1339 895 -1056 -500 996 -1246 767 494 -933 1542
2890A542j901K0J678k679J810K10j898K561j332m00J969k496J445K71k384K459
$$ 1542 -359 -339 1339 -1340 470 680 -1218 1343 11 -389 1580 -916 529 800 -1584 875
2906H75j089n71K092k310J171P83k417K222r93r21K382k361P93J274k024K098
$$ 875 -214 -785 1307 -1003 168 951 -1466 756 -237 -1158 1224 -1137 -344 930 -1094 1004
2922A004o26j087K162k247M74J402k361K121k91j484K624k042j14J702k515J759
$$ 1004 378 -709 1453 -794 -320 1082 -1279 842 551 -933 1691 -351 -465 1237 -1278 481
2938D81k2k270K776j225k31J692k323J403L71k259K457j211o58K116k097J145
$$ 481 459 -1811 965 -260 -491 1201 -1122 281 652 -1607 850 -361 -1019 1097 -1000 145
2954A45R71k326K218p88j063K287k235M54J437k272J973m78j315K610k211J44
$$ 145 1116 -1210 1008 220 -843 1444 -791 -337 1100 -1172 801 323 -992 1618 -593 -449
2970d49J514k599J851l01j098J931j355J39J547k284J238M09k092K449j129o41
$$ -449 1065 -1534 317 16 -1082 849 -506 -367 1180 -1104 134 543 -1549 900 -229 -870
2986h70K144k201J324O58k008K114j213r04K198k043O67J302k127J677k64j338
$$ -870 1274 -927 397 1055 -953 1161 -52 -956 1242 -801 -134 1168 -959 718 454 -884
3002h84K216k327O49J328k611K225k62j657K511j707R8J547k184J360K07j853
$$ -884 1332 -995 -346 982 -1629 596 334 -1323 1188 -519 -421 1126 -1058 302 509 -1344
3018a344K481j615K58J829k587J247O63k077K288r48o23J898k346R98M76j966
$$ -1344 1137 -478 -220 1609 -978 269 932 -1145 1143 195 -428 1470 -876 122 598 -1368
3034a368K531q82j239K231k262N57J259j956J717m56j383K281k033O93J656k408
$$ -1368 1163 281 -958 1273 -989 -432 827 -1129 588 132 -1251 1030 -1003 -310 1346 -1062
3050a062J902l88j582J814j202K79J506k214J715o9j913K444j235q65K192j840
$$ -1062 840 452 -1130 684 -518 -239 1267 -947 768 699 -1214 1230 -5 -870 1322 -518
3066e18N38L39j603K249j129n77K061k426P70J072k130K049m60r81J749j906O69
$$ -518 20 359 -1244 1005 -124 -701 1360 -1066 -296 776 -1354 695 235 -746 1003 -903 -234
3083b34J244k017K017m90j978K476j535j39J811k054J704m15j429K233j928R8
$$ -234 1010 -1007 1010 520 -1458 1018 -517 -656 1155 -899 805 390 -1039 1194 -734 -636
3099f36K154k786J512L18j988K102p55m44J591k117J147M70k151K691j024j194
$$ -636 1518 -1268 244 562 -1426 676 -79 -523 1068 -1049 98 568 -1583 1108 84 -1110
3115a110K476j879Q9J375j717J652n09j256K290k190M68J818k343J623P3j972
$$ -1110 1366 -513 -424 951 -766 886 377 -879 1411 -779 -311 1507 -836 787 860 -1112
3131a112J855j458K33J388j907J741m78j819K759j538o20K305k281Q47L78j532
$$ -1112 743 -715 -482 906 -1001 740 262 -1557 1202 -336 -956 1349 -932 -85 293 -1239
3147a239K093r76o0J812k691Q26J175k211K113j46j153J582j883P79R11k068K240
$$ -1239 854 -122 -182 1630 -1061 -235 940 -1271 842 696 -457 1125 -758 21 932 -1136 1104
3164A104p06j859K474j740l8J846j640J110k68j446K020j579L52J961k834J657
$$ 1104 398 -1461 1013 -727 -765 1081 -559 551 283 -1163 857 -722 -370 1591 -1243 414
3180D14L37k177K242p31n07J745k106J149J00j896K367q19r85K403k361L51J151
$$ 414 751 -1426 816 85 -422 1323 -783 366 466 -1430 937 118 -867 1536 -825 -474 677
3197F77j689J647n41j014J883k246P05J959k638K058j18j737J997j518N0J529
$$ 677 -1012 635 94 -920 963 -1283 -578 1381 -1257 801 683 -1054 943 -575 -525 1004
3213A004j813J178p1j446K231j191l99K075k266Q06O97j690J696j060j51J761
$$ 1004 -809 369 298 -1148 1083 -108 -507 1568 -698 108 805 -885 811 -249 -400 1361
3229A361k298J041P21k414K323n60j191J903j752Q34O32j749J953n76j296K261
$$ 1361 -937 104 825 -1589 734 174 -1017 886 -866 -32 600 -1149 804 228 -1068 1193
3245A193j965J41J846k114J276m2j047J614j234k3J671k650J640N96k033K002
$$ 1193 -772 -631 1215 -899 377 335 -712 902 -332 -355 1316 -1334 306 902 -1131 871
3261H71q35o66J729k046J121M97j936K164j094q20K297k180O81J228j934J604
$$ 871 36 -630 1099 -947 174 671 -1265 899 -195 -1015 1282 -898 -217 1011 -923 681
3277F81p63j022K345j934O48J278k374K045n20j259K016j424j53J359k000J500
$$ 681 -82 -1104 1241 -693 -45 1233 -1141 904 384 -875 1141 -283 -436 923 -1077 423
3293D23j72j272J985j340m53J989k246J140M29j714J973j031n65J953k324J497
$$ 423 251 -1021 964 -376 -829 1160 -1086 54 483 -1231 742 -289 -854 1099 -1225 272
3309B72O95j972J926p38j057J960j905P97J072k042J746l18j305J938j575J69
$$ 272 967 -1005 921 183 -874 1086 -819 -22 1050 -992 754 436 -869 1069 -506 -337
3325c37J236j730J260Q8j548K035j637K23J523k327J413L85j834K027r89m67J848
$$ -337 899 -831 429 517 -1031 1004 -633 -410 1113 -1214 199 584 -1250 777 -212 -679 1169
3342A169j916R85L56j634J871r22o25J885j707N72R77j928J683o81r02J750j738
$$ 1169 -747 238 594 -1040 831 -91 -716 1169 -538 34 1011 -917 766 85 -817 933 -805
3359h05N03J216j942J557j64j362J808j411N9J504k155J529J03j486K013j335
$$ -805 -302 914 -1028 529 365 -997 811 -600 -541 963 -1192 337 440 -1046 967 -368
3375c68K9J469j854R00M86j657J946r46o21J832j815Q22P08j794J479n21r02J958
$$ -368 -339 1130 -724 176 662 -995 951 5 -616 1216 -599 223 931 -863 616 95 -807 1151
3393A151j758N53Q05j878J595m74r91J962j602J03J388j853J342kj408K020j158
$$ 1151 -607 -54 751 -1127 468 -6 -997 965 -637 -534 854 -999 343 341 -1067 953 -205
3410b05l66J768k020J194J52j448K003j313m48J662j826J059M57j650J552o37
$$ -205 -571 1197 -823 371 523 -925 1078 -235 -683 979 -847 212 669 -981 571 -66
3426f6o83J737k001R84O77j628J753o92q19J761j704N83R88j879J684m05j102
$$ -66 -749 988 -1013 -29 648 -980 773 81 -738 1023 -681 -98 890 -989 695 290 -812
3443h12K101j435k09J381j895J541l46j317K113j252j37J504k054R32M87j579
$$ -812 1289 -146 -355 1026 -869 672 326 -991 1122 -130 -267 1237 -817 115 602 -977
3459i77J648r35m10J516j989R76O90j583J897q10q37J741j616M25Q65j506J437
$$ -977 671 -264 -674 842 -1147 -171 519 -1064 833 23 -814 927 -689 -264 601 -905 532
3476E32l90q64J801j482M35J100k093J228K08j376J574j188K73J026j750J536
$$ 532 142 -722 1079 -403 32 1132 -961 267 475 -901 673 -515 -242 784 -966 570
3492E70j98j583K142j291l19J740j780P08N21j196J324p87m02J548j814Q11P24
$$ 570 372 -1211 931 -360 -679 1061 -719 -11 510 -686 638 -149 -551 997 -817 -6 718
3509G18j763J565k50q17J471j121J99P99j868J601n24j106K195j611m5J443j646
$$ 718 -1045 520 270 -547 924 -197 2 801 -1067 534 10 -1096 1099 -512 -557 886 -760
3526g60P84Qr79J697j368Q0J480j927J122O60j658J392l77n81J246j522J054K67
$$ -760 24 32 -947 750 -618 -538 942 -985 137 797 -861 531 154 -427 819 -703 351 618
3544F18j545K034j105p09J682j315K43J066j780J172m51n51J510j743O87J166
$$ 618 -927 1107 2 -707 975 -340 -97 969 -811 361 -90 -641 869 -874 -187 979
3560I79k108J536R3j556J663j078J80R02j552J623l75j265K058j281n47J894j714
$$ 979 -1129 407 500 -1056 607 -471 -291 611 -941 682 307 -958 1100 -181 -728 1166 -548
3577e48N59M24r65J030p08J9J242j932R98P94k164J625M3j082J484j084j3O93
$$ -548 11 435 -530 500 -208 -189 1053 -879 119 913 -1251 374 417 -665 819 -265 -278 415
3595D15j535J933q01r31K067j793j48J372j179R57J49p87R87j454M40J151j727
$$ 415 -1120 813 12 -919 1148 -645 -793 579 -600 357 506 -281 706 -748 -308 843 -884
3612h84J449M01k238J912o51m27J049p58L92k16j370K112j004n11K263j757k03
$$ -884 565 966 -1272 640 -11 -438 611 -147 245 29 -1341 771 -233 -744 1519 -238 -441
3629d41J041j506R40j41j25J118j567M61P60j647J891L56j922J464j008m57J065
$$ -441 600 -906 34 -107 -232 886 -681 -220 540 -1107 784 1140 -782 682 -326 -783 282
3646B82p64J385m00j023J576j775k18J985j545N45L65j335Q85m82K52J194j716
$$ 282 -482 903 503 -520 1056 -719 -937 1048 -497 48 413 -922 -37 -519 -267 927 -789
3663g89J091M12k292J958j9r51J355q52j10L35p58J327n43n59J569j792M6J302
$$ -789 302 714 -1578 380 361 -590 765 -87 -197 138 -620 707 164 -395 1174 -618 -572 730
3681G30j514R40M39q76P62j048J76J016j562J615j08j728J707n76n79J271r04
$$ 730 -784 156 595 -281 481 -567 -391 625 -937 678 570 -1158 549 -27 -606 665 -239
3698b39N01J17j176J464q16l54J747j853M15R83j507Q74K10o78R36j198N49O15
$$ -239 262 379 -797 667 -149 -503 1244 -609 -194 789 -718 156 366 -312 624 -574 -25 590
3716E90j487J316m0j261J744j070l59J132j164P37J07q62J565j294k50J712j906
$$ 590 -897 419 379 -882 862 -208 -567 565 -599 138 245 -617 948 -346 -596 1116 -790
3733g90P84N36j041J021n57k07J122j600J219J7j640J981o07q93J370j027K29
$$ -790 -6 530 -511 510 -47 -254 868 -732 487 504 -1136 845 238 -655 715 -312 -83
3750h3O60j106J118o84n43J391j471N38R25j605P88M33r27J106o88O6Q82j373
$$ -83 577 -529 589 -95 -638 753 -718 -180 745 -860 -72 361 -566 540 -148 -82 800 -573
3768e73R16J11j453J646o60o24J311j002L89K10r56J326j047j35J282j519Q59
$$ -573 343 454 -999 647 -13 -637 674 -328 61 271 -685 641 -406 -541 741 -778 81
3785H1M45j138R80k21o65J031r54M02N56j288J207l58p98J453q13j47Q76j198
$$ 81 526 -612 368 147 -518 513 -441 -39 517 -771 436 78 -720 733 -80 -227 649 -549
3803e49R58m5q39J317j008j27J189j486N13N43j141J110o45k01J003j291P78L19
$$ -549 409 364 -475 842 -166 -293 896 -590 -77 466 -675 435 -210 -411 592 -699 79 398
3821C98j189J299n54n35J325j377O69M55j253J257k86o14J375j210J7J084j389
$$ 398 -791 508 -46 -581 744 -633 36 491 -762 495 209 -405 970 -240 -223 861 -528
3838e28R94k05r08J310q79LJ006j445P92J55j054J528q77k85R20j244O44M90j059
$$ -528 466 261 -647 663 -216 -213 793 -652 140 295 -759 769 -108 -393 527 -717 -73 417 -642
3857f42J173o59m59J334j520N93N41j077J319n45o35J363j044K45O63j221R72
$$ -642 531 -128 -587 747 -773 -180 361 -716 603 58 -577 786 -258 -13 650 -571 401
3874D01l37o99J365j158J91R83j509R91J27j045J150q68k11J215j252Q29J72j033
$$ 401 64 -635 730 -428 -237 746 -763 228 355 -690 460 -408 -619 596 -656 173 345 -688
3892f88J354o56k76Q35j141P99K70j373J388m28n33J358j239M39K63j081J178
$$ -688 666 10 -266 569 -572 227 497 -876 512 84 -449 909 -330 109 372 -709 469
3909D69l40n81J075r82K38O37j294J236l91o30J061q10PJ005j359J013L57j213
$$ 469 129 -452 623 -359 -121 516 -778 458 67 -563 498 -312 -305 700 -659 354 711 -502
3927e02J341r83k03J087j275M11N68j070J195m57n24J086j155O11K99j306J261
$$ -502 839 -144 -347 740 -535 -124 444 -626 569 112 -412 674 -481 130 429 -877 384
3944C84l89o90J499j054J35P06j349J302o28n87J235q13r0R05j078R78j00j047
$$ 384 -5 -695 804 -250 -115 591 -758 544 -84 -671 564 -249 -339 566 -512 466 366 -681
3962f81J424j136L10P18j148P90J44j056J211o41l55J159j309O54oq96J234n55
$$ -681 743 -393 -83 635 -513 277 421 -635 576 -65 -420 739 -570 84 78 -818 416 -139
3980a39m36J230j159M06P05j423J157l47n46J024j142R21N68j464J242p5j026
$$ -139 -575 655 -504 -98 607 -816 341 -6 -552 472 -670 251 819 -645 597 522 -504
3997e04J210j036Q6P49j064R28l4p52J053q83l39J402j367M32M74j054J024l16
$$ -504 706 -330 -244 505 -559 369 335 -417 636 -247 -586 816 -551 -119 355 -699 325 9
4015Il22R25j352R45L63j404J190l45n95J128p63J8P21p04O84m13o29J427j321
$$ 9 -313 612 -740 205 568 -836 354 9 -586 542 -221 -203 518 -186 498 85 -544 883 -438
4034d38J76J022j318P84J52p70Q26q66K36P60j448J149J93j197J300l10p52J048
$$ -438 -262 760 -558 226 378 -392 434 -432 -196 564 -884 265 458 -739 561 251 -501 547
4052E47r37N28L8p83J039n81l13J506j361L88P35j374O11Nm48Q24q93P60K15j472
$$ 547 -390 138 176 -607 432 -149 -462 1044 -317 71 806 -568 43 48 -400 424 -469 291 506 -966
4072i66J645l0j270J369p67n39P15o55P98k85m92J217j175n8J215j443P22O23
$$ -966 679 649 -621 748 -19 -558 157 -498 300 15 -477 740 -435 -493 722 -721 1 624
4090F24j129Q81l87j62O61r36Q99p5j144J394o31q40J559o79L6J27p19P80l80
$$ 624 -505 376 -11 -173 488 -448 451 376 -768 626 -5 -845 714 35 71 198 -521 259 -121
4109a21l03J452j683K87J076j687R52M87o85P68p69J98K74j162J413qj296J554
$$ -121 -424 1028 -655 -368 708 -979 -27 460 -225 543 -226 -28 246 -916 497 489 -807 747
4127G47o48p13J233p56M12M7n77N56p61k3J209j497N86J027j597Q91j3m63P04
$$ 747 99 -614 619 -137 275 322 -255 301 -460 -483 726 -771 -185 842 -755 136 123 -340 364
4146C64o06N77o8j147J425l01j068J869j121k93P13j043Q37o8l66J213j224J8
$$ 364 -242 335 267 -880 545 244 -824 1045 -76 -369 344 -699 138 70 -296 917 -307 -289
4164b89J129j704R90N08j380R26k75j13M11o68Q54j06j153J472p51o11J531j116
$$ -289 840 -864 126 634 -746 180 -95 -208 203 -465 389 283 -870 602 -149 -760 771 -345
4182c45N2P63p52N40m26k00J334j563N23Q43j698J087M44j018R87o38j8L99r27
$$ -345 -293 470 -282 258 -168 -368 966 -597 -74 769 -929 158 602 -416 571 -67 -85 314 -613
4201f13J037k97j078J706r31m27J239q83N5L35k06M63q81M50P24j472J026M65
$$ -613 424 127 -951 755 -176 -603 636 -247 -192 143 -63 400 -481 -31 693 -779 247 712
4219G12j537J133J1p03R84p93K27K87j030J368q69n88J698j096l83J176j167O23
$$ 712 -825 308 319 -384 600 -193 34 321 -709 659 -210 -798 900 -196 -579 597 -570 53
4237E3j39q3P74j103K97Q35j488J069J80j183J247m91j62N85p57P03j8j072J614
$$ 53 -86 -169 605 -498 -201 634 -854 215 395 -788 459 -32 -194 391 -366 337 319 -753 861
4256H61q30n33J460j286J06Q48j079P03l43k85J072j334O05O32j552J297q8r13
$$ 861 31 -502 958 -328 -222 626 -453 250 -93 -378 694 -640 -35 597 -955 342 254 -659
4274f59P88k86j23O37j002Q36j43q83J562q95k33J388j482M96M29r47J021q40
$$ -659 129 -157 -280 357 -645 191 48 -835 727 -168 -401 987 -495 1 430 -517 504 -336
4292c36L02P80j353P45K77j212J265l69o59J097j196N67N25j055J151o26o00J568
$$ -336 -34 746 -607 138 415 -797 468 99 -560 537 -659 -92 433 -622 529 -97 -697 871
4310H71j362J96R08j105Q35j76o85J167r57Q5Q87j363J067O2r84R96m68k20Q63
$$ 871 -491 -295 613 -492 343 167 -518 649 -308 -223 664 -699 368 430 -554 442 -26 -246 617
4329F17j160N58L30j108J221o31m76J430j441N90N67r54O54m50k95J214j120M25
$$ 617 -543 15 345 -763 458 -173 -649 781 -660 -70 497 -457 197 -253 -548 666 -454 -29
4347b9N45j311J061O3p33J029q92L8P04r41Q64j52o34J157q96o2J071j588Q74
$$ -29 516 -795 266 329 -404 625 -267 -229 475 -466 398 246 -388 769 -127 -189 882 -706 168
4366A68o3p62J046o00l20J178j207M03N87j141J235o88k04Q62q28L70N36j135
$$ 168 105 -657 389 -211 -531 647 -560 -157 430 -711 524 -164 -368 494 -334 36 572 -563
4384e63R86k41p35J108j090J84P34q57R31j54o58J023j072J31P94j103Q98q3p58
$$ -563 423 182 -553 555 -535 -351 383 -474 457 303 -355 668 -404 -273 521 -582 316 233 -525
4403e25J043o56k40R47j055M58L86j004J232m88n26J168j286N06P30j262J046
$$ -525 518 -138 -378 569 -486 -28 358 -646 586 98 -428 740 -546 -40 690 -572 474
4420D74n80l11J042j067M13N69j265J030l61m81J158p29j31O63p08M56m6o36R77
$$ 474 -106 -417 625 -442 -29 540 -725 305 -56 -537 621 -108 -239 424 -284 172 126 -510 467
4439D67q11K94O53j066N61L60q46P88m10l37J107j285P42m1q60J225n38m31Q97
$$ 467 -344 -50 603 -463 98 458 -388 400 -10 -347 760 -525 217 176 -684 541 3 -428 469
4458D69r61N04L98q19O69m26l72J097r47L65L44q26Q54j59p82R74o70R4O77r99
$$ 469 -492 12 410 -409 260 -166 -538 559 -388 -23 321 -505 349 190 -592 382 -288 -194 483 -516
4478e16Q59P2r65J141p41j23R30j194P87K7o59Q54n59l58R88r26N4O69j261J231
$$ -516 343 415 -550 591 -150 -273 657 -537 250 277 -382 472 -87 -445 543 -383 -329 340 -921 310
4498C10p3o17R52j060L73N87j125J111j67r37J271q99L1P77q14N58k75n01J025
$$ 310 237 -380 572 -488 -115 472 -653 458 291 -646 625 -274 -243 534 -280 278 3 -498 527
4517E27r34J54R22j096N07L06j058R68m18nO19j083Q62j36p98J288o19m54J164
$$ 527 -407 -253 669 -427 80 386 -672 296 -122 -127 492 -591 271 135 -663 625 6 -448 716
4536G16j101L42L09q12Q03k64j32N20q86L93Q50j432R53Ln86P84o71J29L85p51
$$ 716 -385 -43 266 -546 257 -7 -139 381 -505 -112 738 -694 259 262 -324 460 -211 -82 303 -448
4556d48R93k75j102J606j014l25J050p57K39K15o69Q23o83J38R79j383P58O85
$$ -448 545 270 -832 774 -240 -565 485 -272 -33 182 -487 336 -347 -209 770 -613 145 830
4574H30j451R66k8p19P76n87M50J24r60J313p39m98J449j137j31R53r49L44m8
$$ 830 -621 345 317 -402 374 -213 237 361 -599 714 -25 -523 926 -211 -342 611 -338 6 -42
4593d2k82P51r90O50N29j406J045L17j402J167l80j9L65p28Q83l06p96J157m96
$$ -42 -324 427 -563 87 616 -790 255 572 -830 337 -43 -62 303 -425 458 152 -644 513 17
4612A7n18J577j246j49O98o55N75l45l2P33j222M31Q07j666J203J96j079R56k52
$$ 17 -501 1076 -170 -319 379 -276 299 -46 -78 655 -567 -136 671 -995 208 404 -675 281 29
4631B9n2J83m11P47l91o69J243q28l17J148q60P1N09n65M92o16K47O46j201Q22
$$ 29 -23 160 -251 496 105 -564 679 -149 -466 682 -178 -107 402 -163 329 -287 -40 606 -595 227
4651B27L20j257J025q5p20Q56m20K79%n86J058r72j68J229j149q8Q70p04J10L24
$$ 227 547 -710 315 230 -490 366 -54 225 225 -361 697 -275 -443 786 -363 -451 419 -285 -175 149
4671A49k80O40r58O61K81j349J156L65j430J057j33m90N37m92N25j35o17J164
$$ 149 -131 509 -449 212 493 -856 300 665 -765 292 159 -331 206 -286 239 104 -513 651
4689F51q46m39J542j352J43Q93q94J99J80j59L92r14O88N27j325J131j25j025
$$ 651 -195 -634 908 -444 -301 592 -302 -103 77 -82 310 -604 84 611 -714 417 292 -733
4707g33J089l01j23K80m04N61n18k85J261r85l20J213j248J98O40o07K45KjN22
$$ -733 356 55 -68 212 -192 369 -149 -434 827 -158 -478 735 -513 -315 325 -282 -37 -35 -36 486
4727D86j202J110l6j274J219p9o97R46n98K78M0o77J158p02k69J066j264J39J126
$$ 486 -716 394 358 -916 303 224 -473 473 -125 153 193 -484 674 -28 -297 769 -495 -356 770
4746G70j105M72%l35N27p25K72O01j263J164j82r83J296m16n37P74m86L12o5o67
$$ 770 -335 137 137 -198 329 -396 -124 477 -786 378 196 -787 509 93 -444 330 -156 156 91 -576
4766e76J322j099r0J399j252L29O64j138N99j62j31N62q42N35P3p54R54j27q53
$$ -576 746 -353 -443 956 -296 33 697 -441 158 -4 -135 427 -415 120 193 -561 393 266 -587
4785e87J143p74J39M29n85M60l32m67J154r14j40J152j103M37M93r32O73l44l9
$$ -587 556 -218 -79 350 -235 225 -107 -574 580 -334 -474 678 -425 12 505 -427 246 -98 -137
4804a37N08n98M81Q4q16J189o58m87R73q94J68O48o97P44m96n00J087j011L42
$$ -137 371 -227 254 338 -478 711 53 -434 539 -355 -187 461 -236 508 12 -488 599 -412 -70
4823g0L86r25O23K04m92N28m98N0N10q84J139m05q28J217o02n5O98q45L58K41
$$ -70 316 -609 14 218 -274 254 -244 -194 316 -568 571 166 -662 555 -47 -102 596 -249 109 350
4843C50p25Q97o06k56R75j071L57O84j055P29m28LM86p95M44K39p18Q85l72n41
$$ 350 -375 522 -84 -340 635 -436 -79 605 -450 279 -149 -146 340 -455 -11 228 -490 395 23 -518
4863e18J002m02l56P39p77M03j23l37P36o31K08L78p57L64L77q60R79l57k79N84
$$ -518 484 82 -274 465 -312 91 -32 -369 367 -264 -56 322 -435 -71 306 -554 425 68 -211 373
4883C73q88L89M58o79P35l96l62J008r39L02K32p86P97k83m13J057r05K20M46
$$ 373 -515 -126 332 -347 388 -8 -370 638 -301 1 233 -553 244 -39 -452 605 -300 -80 366
4902C66o82N64m8p19O73m24L46M06j130J058j23q16J218r08j24O58q94N07J17
$$ 366 -316 248 200 -519 154 -270 76 482 -648 410 287 -529 689 -219 -343 315 -579 -72 45
4921D5o68J095p39p8Q28r49M37L50q37J014n09l26P74o47J07M32q08P97m31j73
$$ 45 -623 472 -267 -345 483 -466 -29 321 -516 498 -11 -337 437 -210 -103 329 -479 318 -113 -286
4941b86O84n29J52L45n64L24k7o72R39o40J86L70p05P05Q7p72O55l79j37P22r83
$$ -286 398 -131 21 366 -198 126 99 -573 366 -274 -88 282 -423 282 369 -403 252 -127 -264 458 -525
4962e25P29R4p18Q23n35k24R40o76j1N49q94P10j90m56P52o55K00N79j141Q41
$$ -525 204 298 -420 403 -132 -356 584 -92 -103 446 -448 262 72 -384 368 -287 -87 492 -649 192
4982A92k34o09J034p19o0P83o32N41n2p52J040q41J10O40p06M81K5p54Q70m07
$$ 192 -42 -651 383 -336 -396 387 -245 296 244 -508 532 -309 -199 441 -265 216 241 -513 357 -50
5002e0j41O41p52M60K31j058J046l38l28O85m04k2J29o03R25m14m75J067p21l48
$$ -50 -191 450 -302 158 389 -669 377 39 -289 396 -8 -30 99 -504 421 7 -468 599 -122 -470
5022d70J040q85N24Jn39N76n29K83K80p39O06K42r57R26l97l01O26o19M67j12
$$ -470 570 -315 209 210 -329 247 -282 1 281 -458 148 390 -567 359 -38 -339 287 -332 135 23
5042B3n43J144r11j1R35j079K26O56q48O21l08j35O10o81L19O72j326R49Q1r02
$$ 23 -520 624 -287 -298 637 -442 -216 440 -408 213 -95 -230 380 -301 18 690 -636 313 394 -508
5062e08Q58l95J1K42m07O93l00n20R76r40oR75j026L23M57o50K38l26K68N21r24
$$ -508 350 -45 -34 208 -199 494 194 -326 650 -290 -296 679 -347 -24 433 -217 21 -305 -37 484 -440
5083d40O63P1r59P61p1m07R55n63L8J03n69P79p23J0J183j121K9Q79r47L82L9
$$ -440 223 294 -665 96 25 -382 573 10 48 151 -418 361 -362 -352 831 -290 -261 618 -329 53 92
5104I2j52L92p01L20L59q92O86K10j063J127k54p10Q44m13K10K2k81P34o97m9
$$ 92 -60 332 -369 -49 310 -582 104 314 -749 378 124 -586 258 -155 55 77 -204 530 -167 -216
5124b16R56j135J60Q62j111M70K54k62K64m76O39j03r72J003j83q17J193n34l17
$$ -216 740 -395 -235 627 -484 -14 240 -22 242 -234 405 302 -670 333 150 -667 526 -8 -325
5143c25O22n24L80l27N0Q17j237K58R39r98K74N32n40Q9J7J07J86q17R53n5j228
$$ -325 297 -227 153 -174 -124 693 -544 -286 653 -345 -71 461 -79 10 27 134 320 -497 456 401 -827
5164h27J327m78m94R32m43j29J93m20M66m60r2R34r87J89J012j167L28N74p77
$$ -827 500 22 -472 460 17 -112 81 -339 127 -333 -425 509 -478 -289 723 -444 -116 458 -319
5183c19M17k76K78J88r99J116j14j244J538m05n11P49l09j19L38m41M65p95L40
$$ -319 98 -178 100 288 -711 405 291 -953 585 180 -331 418 109 -10 328 -113 352 -443 -103
5202a03Q55j116K35O95j048N20j48j73M69n19O51r4r86J111j71r97J350o35k59
$$ -103 752 -364 -129 566 -482 38 -110 -283 186 -333 318 224 -762 349 178 -819 531 -104 -363
5221c63P49p22M91k53J9N26p19J2Q68j250M33Q28j106P24l28q0N09o20N55l05
$$ -363 386 -336 155 -98 -79 447 -272 -260 608 -642 -209 619 -487 237 -91 -171 338 -282 273 -32
5241c2o65J264n11n32R98m13m71P95p47M89l84o1R28j070M61N30j167O71L53p17
$$ -32 -697 567 56 -476 522 109 -362 433 -314 175 -209 -270 658 -412 49 579 -588 83 436 -281
5261b81N65m33rL31p73J024m31m45R37o12m01R55n67J14L47o92P65p33K85M54
$$ -281 284 -149 -158 173 -600 424 -7 -452 485 -127 -528 427 -140 -26 321 -371 394 -339 -54 400
5281D00q54M73N68r90N95%n44N78k15jL09j052J273m10n64J201j048J22M97q27
$$ 400 -454 19 587 -403 192 192 -352 226 11 10 319 -733 540 130 -434 767 -281 -159 338 -489
5301d89O12lk59O88r08J59P02j031N91L23q09P17m27j37O76p59N94L3q48J052
$$ -489 123 120 -139 549 -359 -200 502 -529 62 385 -424 293 -134 -271 405 -354 240 273 -575 477
5321D77l85m66R05p68M03K45p25N01k81j42O76p81J41O75q67L82K69r20J039n65
$$ 477 92 -374 531 -237 166 411 -314 187 -94 -236 440 -341 -200 475 -392 -10 259 -661 378 -187
5341a87m5N92p09O39k40n58R58n55k46P45o58M08Kn46R54p83k0O94j050Q75p3
$$ -187 -232 360 -349 290 50 -508 450 -105 -351 394 -264 144 146 -400 554 -229 -249 445 -605 270 197
5362A97p93Q94j23m68P42q75K87L84r13J034n01l28R42q71J62M35n57M43k8l73
$$ 197 -596 298 175 -293 449 -426 -139 245 -668 366 -135 -463 479 -392 -230 205 -352 91 63 -310
5382c10Q17q02R7O99p84N12J6q81R67l25j44N46r03N13J28o26Q02l97j14O33j047
$$ -310 507 -295 -198 501 -283 229 245 -636 331 6 -138 408 -495 18 146 -480 322 -75 -189 444 -603
5403f03M51L22n27O60l19l74Q95q21J11N77p59O43p2p72J185p87J60L05m50L99
$$ -603 -152 170 -357 303 -16 -390 505 -316 -205 372 -387 256 184 -588 597 -190 -30 275 -175 224
5423B24r8o47R20n80p9N43n59M38J03o91Q22m10k76N31o39L71K86m63O32k31m85
$$ 224 126 -521 399 -181 -260 283 -276 162 265 -426 396 -14 -290 241 -398 -27 259 -204 428 197 -288
5444b88P44q50K07L81o35P83k11n35P68o13J95M43p97O37j06n65Q49o87L10M05
$$ -288 456 -394 -187 194 -441 342 131 -404 364 -249 -54 389 -408 229 123 -442 407 -280 30 435
5464D35q15N33J03r46J044m96k79Q75p97M95J15q79J173p52j06Q95r77L47M41
$$ 435 -380 153 256 -690 354 -142 -421 454 -343 152 267 -612 561 -191 -297 598 -379 -32 409
5483D09o10M21O4o56Q46m77n8N71r44N99J00p21J017q00RM96o66O73k01n73O72
$$ 409 -201 220 284 -372 474 -3 -61 510 -434 165 265 -456 561 -239 -230 266 -400 273 72 -501 171
5504A71m07p0N51p69O22J27n45P09n64jN94q35O25J53r44J107n35l38P17n78R1
$$ 171 -236 -306 245 -524 98 225 -320 389 -175 -176 418 -417 208 361 -583 524 -11 -349 368 -210 -119
5525a19M57n31L70p5m38R86p73j19R53j262O36K07p22Q56o35J6M06o99O51o0m09
$$ -119 338 -193 177 102 -336 650 -123 -242 711 -551 85 292 -430 426 -209 -193 213 -486 165 105 -304
5546c04R56o89j71N18m65J58P3k85O52n53j04Q97j068L12O73j224P90l97k84P54
$$ -304 652 -37 -208 310 -155 3 76 -209 443 -110 -214 683 -385 -73 600 -624 166 -231 -515 239
5566B39o90P03j2p53N86J44p85J079l01m29P15r03N07J02n73R74r88K82R09j287
$$ 239 -451 252 240 -513 73 217 -568 511 210 -219 496 -407 100 202 -371 603 -385 -103 806 -481
5586d81N34M82q34M87r3j69L36q91Q64k9o57Q83m98n96J266p95K5N68p66O60l01
$$ -481 53 535 -299 188 95 -74 262 -629 235 206 -451 432 -66 -662 604 -191 -166 402 -364 296 -5
5607ek41P09r21L44P96j058N14J16l74M33q55M49K41n41O59j01q06J273o91j90
$$ -5 -246 463 -458 -114 682 -376 138 254 -120 313 -542 -93 148 -393 266 165 -641 632 -59 -249
5627b49O43n93K6K42m27O60o14k6Q25r16L07P31j180N70L48p46O34m20K93J31
$$ -249 394 -199 -173 69 -358 302 -312 -338 487 -429 -122 609 -571 -1 347 -399 235 -185 108 239
5647B39o72P61l75m93J061p68j33P78p36L98k15p1N37n99J33O68j053N54M28j124
$$ 239 -433 328 -47 -540 521 -247 -380 398 -338 60 -155 -226 311 -288 -155 513 -540 14 442 -682
5667f82Q85n8j41K09n94M12J06o39J118m11o01J019o87j32M59n04K54k18L4N11
$$ -682 203 145 4 213 -381 31 137 -502 616 205 -396 623 -64 -196 263 -241 13 -205 -171 340
5687C40r32N04N73j041P34O6p07N58q0j73L98q14J066n13o10J318q27l28J175
$$ 340 -592 -88 485 -556 178 244 -463 95 15 -158 240 -574 492 -21 -631 687 -140 -468 707
5706G07p78O1K29j97J54l78J20M90p84L45M69q35O69j43l75M60m27M80j23n09
$$ 707 -71 -10 219 22 176 -202 -82 408 -376 -31 438 -397 272 129 -246 214 -213 267 144 -365
5726c65P07l23o40J202n69m46R12r25N70J08k78L50m72K21N54q87N31K36r62P62
$$ -365 342 19 -621 581 12 -434 478 -447 123 231 -47 303 -169 52 606 -281 250 486 -476 286
5746B86L8n98P68o78M21j41o81J159o89l64J005p54J9O12q15N98k88LN40p63J97
$$ 286 324 -274 494 -184 237 96 -585 574 -115 -479 526 -228 -209 403 -412 186 -102 -99 441 -322 -125
5767a25O87j194P54ln51Q04k95j96N64p56O60k17m79R85o45j27Q21j156L51L89
$$ -125 562 -632 122 119 -432 372 77 -119 445 -311 349 132 -347 638 -7 -134 687 -469 -118 271
5787B71m72L28l58K7N79r74P95K97r74Q74k02m65M76l54J12J48n21N40j65k94
$$ 271 -201 127 -231 -204 375 -599 196 493 -481 393 191 -274 202 -152 -40 108 -413 127 -38 -332
5807c32Q20n60j67P59p59J98K19n13N31m74K27M89r08P20K1p97Q35j70n77P79
$$ -332 488 -72 -239 520 -239 -41 178 -335 196 -278 -51 438 -470 250 271 -526 309 139 -438 341
5827C41n71L54J54o28P11l81j97N68n63J04M83o08L98m7l18Q17o99O6L70p49O21
$$ 341 -230 124 278 -350 361 -20 -217 351 -212 -108 375 -233 165 118 -200 617 -82 -16 354 -395 226
5848B26j0p61R74o64J30N34q57N74j51n52P34k98k40Q47p22J23L88n01N07l53
$$ 226 216 -545 429 -235 -105 429 -428 146 -5 -557 177 -121 -361 486 -236 -113 275 -226 281 -72
5868g2j71O41p21L52M35q20N68q6n01Q33o18LL80o21O50l71k00Q25p94K89M65
$$ -72 -243 398 -323 29 464 -356 212 126 -375 458 -160 -157 223 -398 252 -119 -319 506 -288 1 466
5889D66r10M24J47l34L58k42n1M64p72O85j01n91P57l62p8L48n35M23J50o83P05
$$ 466 -444 -20 127 -207 151 -91 -142 322 -450 235 134 -457 300 -62 -140 208 -327 96 246 -437 268
5910B68k31l50P45o89O6O38p83M39q7m73R40p51K41L33p30N03Q3m89N08l14j78
$$ 268 37 -313 432 -257 -191 447 -336 103 16 -457 483 -268 -27 306 -424 79 162 -327 181 -133 -311
5931c11R70r77M07J33o66P58k93k85O88p69M99J23n15P28m82l26N82n13J06M49
$$ -311 659 -318 89 222 -444 314 21 -264 424 -345 154 277 -238 490 8 -318 264 -249 -143 306
5951C06o64M91j89k59Q40q85K97L19o24N41k01k08M45l88N5N71n10L44l5n11P08
$$ 306 -358 133 -56 -315 525 -360 -63 256 -368 173 -28 -236 209 -179 -124 447 -63 281 246 -265 443
5972D43n40r5O33p77O00k3o04M31p8k79M33m14K68j92l21P72l29j03M61n15M13
$$ 443 -97 -192 441 -336 264 241 -363 68 -10 -289 144 -270 -2 -194 -515 257 -72 -175 286 -229 184
5993A84J64q00N07m5k16M71l28P4L85q37Q18l49l10P41o17J9N79p67N70N0n35
$$ 184 348 -452 55 10 -206 265 -63 11 396 -441 377 28 -282 459 -158 -139 440 -327 243 293 -242
6014b42O20m78r8N21q93O14J64n88P41m72m6L00k79K51R2o86Q55l22l21N79l91
$$ -242 378 -100 -198 323 -570 44 208 -380 361 -111 -157 143 -136 115 207 -479 376 54 -267 312 -79
6035g9j33O59o89N59k88m31Q41o38K5N42p46N54l5m44M78l78R0J26l30L85Q7n61
$$ -79 -212 447 -242 317 29 -402 439 -199 -174 368 -378 176 141 -303 175 -203 -113 13 -317 68 155 -406
6057d06Q59n39%K96l54J37J81k53K09o8j86N78p70L28N09q65O48j74l41O00m88
$$ -406 453 -86 -86 210 -144 -7 174 -79 130 62 -124 454 -316 12 521 -344 304 130 -211 389 -99
6078i9J4M28n77M75j02n93Q30m38l38P03o73L45M2l57O62n59k7Q20r44M62K92
$$ -99 -85 343 -234 241 139 -454 376 -62 -400 303 -370 -25 17 -340 322 -237 -264 556 -388 74 366
6099C66p70N60l0j48L64m25OL30q11P78l01k31R12p46j21N56n97K70M7k93O50
$$ 366 -404 156 126 -22 342 -83 -77 253 -558 220 -81 -312 600 -146 -267 289 -308 -38 9 -284 366
6120C66o68J47M06r11R30J20q16P08k78q4L15l22N26l09k69O03p02n2N65n69L00
$$ 366 -302 -155 251 -660 270 390 -426 282 4 -80 235 -87 439 130 -139 464 -238 -290 275 -294 6
6141FK16n35L17o7j79O03q55M31M10j013Q98q8m48N07q8J36j31l47M74o7m98J008
$$ 6 222 -313 4 -63 -242 361 -494 -63 347 -666 232 144 -304 203 115 251 120 -227 247 180 -318 690
6163F90p93o9N21p42L67J91k96K93l67j50M95l87M26j8p53P81m8m22O04m54K4
$$ 690 -103 -172 349 -393 -26 165 -131 162 -205 -355 140 -247 179 161 -592 189 141 -281 323 -131 -107
6184a07J91l39O22m74j77R10j015K31O54p17N6L55k31K33m95L66M07q70O48N1
$$ -107 84 -255 367 -107 -284 626 -389 -158 496 -221 -165 190 -41 192 -303 63 470 -400 248 299
6204B99p14O53l37o3M41p29N96j07n21R13o65O2P00q85L87N7m51O67m46L2O15
$$ 299 -415 238 -99 -162 279 -450 146 39 -482 431 -234 -172 528 -357 30 87 -364 303 -143 -111 504
6225E04p31N36J08p79N92J55o98P46m18k43K96l08N54l44k80O12o64K35M69n30
$$ 504 -227 309 417 -362 230 385 -313 433 15 -228 68 -240 314 -30 -310 302 -362 -127 342 -188
6245a88K12K14p44N84k76K79K82q44N99K50q81R43k89l93N76m46K23R9l81N32
$$ -188 24 238 -506 78 -198 81 363 -481 118 368 -513 430 141 -252 324 -122 101 200 -181 351
6265C51k96l81P78q04L34M63p08L82J35o65N17m03J11M26o50O31J81q73R45l07
$$ 351 55 -326 452 -352 -18 445 -263 119 254 -411 106 -297 -186 240 -410 221 402 -471 474 167
6285A67k18L38m97K86N4m63O19l57j41P35q04K56J86l37L80j78l32P31r22O14
$$ 167 -51 287 -210 76 130 -333 286 -71 -212 523 -281 -25 161 -176 204 26 -306 425 -497 117
6305A17J36o56N98r4p66R58l20r7K09k94M18L7l41N71o73j59P24n15L38m2m02
$$ 117 253 -403 195 101 -665 293 -27 -124 85 -209 209 246 -95 476 -197 -356 368 -147 191 149 -253
6326b53N09k83J62K41o97N13k30m21Q20l96m38Q22m94L07k2n76N60m00OL17l38
$$ -253 256 -27 135 376 -321 192 -38 -459 361 -35 -473 349 -145 162 140 -436 124 -276 -270 47 -291
6347b91K93N06p33N55j82m77M37k99j0L48n67P33j89l77N02l60L7K64m59M40o8
$$ -291 2 508 -225 330 148 -329 108 -191 -201 147 -420 313 124 -253 249 -111 -74 190 -269 171 103
6368A03m60O93n37K51M31q05N49r7n89O53m38k30P71n27K54M39q39O66k21l39
$$ 103 -357 336 -201 50 481 -324 225 128 -461 192 -246 -476 295 -232 22 461 -378 288 67 -272
6388b72O87m96j9L21l78M29k23m68N82o37L49M10o23M26j19l98P25m04RN99p90
$$ -272 415 -81 -100 221 -157 272 49 -419 163 -474 -125 285 -338 88 -31 -429 296 -108 -99 500 -290
6409b90L15J59m68N84m62P7M49o37M35J1n68O89k61j97N10o68M49L80p52N48j42
$$ -290 25 184 -284 300 -162 -85 364 -273 162 173 -395 294 33 -164 346 -322 127 507 -245 303 161
6430A61n29O25k84j94N02n72M60n9m55N99l26N0K72n76L06N5n03Q27l75r2K26
$$ 161 -368 257 -27 -221 281 -291 169 110 -345 254 -72 -22 250 -326 -20 35 -468 359 -16 -108 118
6451A18k37J98R2m55M57j65l71P64m56J1K63o12N41k08j21M42n21J52L01n67M57
$$ 118 -119 79 171 -284 173 8 -363 401 -55 -44 219 -393 148 -60 -181 261 -260 -108 193 -374 83
6472H3q1m11P29n64K5L95o63N76p4j76L90j32j39M14n46K33J07o24P46m68J3M70
$$ 83 2 -409 320 -244 -219 176 -487 89 15 -161 229 97 -42 372 -174 59 166 -458 288 -180 -167 303
6494C03l79r5M25o11O28m14j61P40r09K99L83o25O21j80m16O61l23l03O57n43
$$ 303 -76 -171 254 -357 271 -143 -304 436 -473 -174 209 -416 205 25 -391 270 -53 -356 301 -242
6514b42K75Q4m56P66m75NL06m57K21J6k68N91l10k00N06p22M28J64o31O49j17
$$ -242 33 117 -339 427 -48 -43 263 -194 27 43 -225 366 56 -144 362 -360 68 232 -399 250 133
6535A33k40K97m64J69L70n20N62k24k94P55q92K40L47p12N96Nm60P38n25k8O50
$$ 133 -107 190 -274 -105 265 -255 307 83 -211 544 -348 -108 239 -473 123 128 -332 406 -119 -147 503
6556E03q18L95R2n89P03m64kM52o65L52J92l67M86n31Q6M87o76K98M23p74N68
$$ 503 -315 80 172 -417 286 -178 -180 272 -393 -41 151 -216 270 -261 -175 312 -364 -66 357 -417 151
6577A51k51j75N99o67L83J77o29N41m8l02P48o33Q3L08n57M33j32l61Q02q47K77
$$ 151 -100 -275 324 -343 40 217 -412 129 81 -221 527 -106 -23 285 -272 161 29 -332 470 -377 -100
6598a00N72r77M41N39q89O95m06j97N38m44N48J27o56K18Q5k82M73m82R2L28n08
$$ -100 472 -505 -64 475 -414 281 -125 -322 216 -228 320 447 -209 9 94 -188 285 -197 -105 223 -285
6619b85M89k87k54O90o40J34M96p61L48J1j40M10n09J65M03o82M46n9n20R28k40
$$ -285 204 -83 -337 353 -287 -153 343 -418 -70 -59 -199 211 -298 -133 270 -412 34 -25 -545 383 143
6640A43k69K38k49J66Nm33P04l67j44P49q66L75L98p44N60j25l34L93m15M5M33
$$ 143 -126 112 -137 29 34 -399 305 -62 -206 543 -323 52 450 -294 266 141 -193 200 -215 -170 263
6661B63o66O63j68l35N97m10k26N58m74K26m6l85R49n94j04P38r87K81L11p01
$$ 263 -403 260 92 -243 354 -56 -282 276 -198 28 -18 -403 546 -48 -152 586 -401 -120 191 -510
6681e10O89j25j27L67o59N21R6o41J011n76l62O52n72L19J40k78K53l61o5N95
$$ -510 179 54 -73 294 -365 156 252 -389 622 46 -316 336 -236 83 223 -55 198 -163 -228 367
6701C67o44K37N11p56L58O9k82M41l02M1J78m65M13p9m18O37k47k66N46m58j6
$$ 367 -277 -40 471 -285 73 142 -140 301 -1 40 218 -247 166 87 -331 306 59 -207 339 -119 -135
6722a35K22k15N15p13J71N11p82L09M85p38O66l03k48K66k86L06K52m92O26m03
$$ -135 87 -128 387 -326 -155 356 -426 -117 368 -370 296 -7 -255 11 -275 31 283 -209 417 14
6742A4l74N64k62l53O24l48K47n8l75P95o25M6O45q86J54L15l56M10k11l10M14
$$ 14 -360 204 -58 -411 213 -135 112 54 -321 474 -151 -105 540 -346 -192 123 -233 177 -34 -344 70
6763G0l36L17P7m19Q41p63n6M23l30K80J4m05N57k59l20O73o14L04K90n42L74
$$ 70 -266 51 128 -291 550 -213 -269 154 -176 104 118 -287 270 11 -309 364 -250 54 344 -198 176
6784A76j04l61N48k69K1K33m97M63j64l85O63m12j77N69m69qK55l31M77k11j90
$$ 176 72 -289 259 -10 11 244 -253 210 46 -339 324 -88 -265 304 -165 -173 82 -249 228 17 -173
6805a73L34n28M38K39o58M24j09k86N80k93J3J29m32O60k40m45N52l55l9K68j78
$$ -173 161 -367 71 310 -348 76 -33 -319 261 -32 -19 110 -322 338 98 -347 205 -150 -189 79 -99
6826i9M7M1j73N36m33P8K53o14L29K53m67N04q0l94O35p84M14j2l73P51j00m66
$$ -99 -52 -11 -184 352 -81 -3 250 -364 -35 218 -249 255 175 -219 416 -368 46 34 -339 412 312 -154
6848a54M75m72m1M39l82L06k67k78O74n77K51L55p32N93j2o56O68k81J21L97o73
$$ -154 321 -151 -192 247 -135 171 -96 -374 300 -277 -26 329 -403 190 178 -478 190 -91 30 427 -246
6869b46M40j1m87O25n01p4O29m70J15K57n57L13l38J60N35p58N40J6m67N70j68
$$ -246 194 183 -304 321 -180 -254 375 -95 20 277 -280 33 -305 -145 390 -368 172 188 -279 291 123
6890A23l76O22m28N2J04l76M93j87m21O16m08J61L33p63O40k4m48N36k28j71M86
$$ 123 -253 369 -59 -7 97 -279 214 27 -394 222 -186 -25 308 -455 185 161 -287 249 21 -150 336
6911C36n79L26P3m66M89k05k10L74m13L06P5m95N79m64J08M44o94L08M01p16O68
$$ 336 -243 83 156 -310 179 -26 -236 138 -275 31 106 -389 190 -274 -166 278 -416 -108 293 -423 245
6932B45k48k87N80n36K57K94l15J58J00k91K21l21K67j02l35M22J39n24M74j84
$$ 245 -3 -290 290 -246 11 305 -10 148 248 -43 178 -143 124 22 -313 109 248 -276 198 14
6952A4m9L58o63M48Pl59K86m4mJ56k71l7K98l85O02k82k95L84m65J86M21n01O36
$$ 14 -35 323 -340 108 115 -244 42 -2 -6 150 -121 -158 140 -245 357 75 -220 164 -301 -115 306 -195 441
6975D41l62l20O34o56J12L86m28L83j44j38N02n21r1O64q00N19o4k81N37m07k84
$$ 441 79 -241 393 -263 -151 235 -193 190 46 -92 410 -111 -202 462 -338 181 117 -164 373 -34 -318
6996c18L90l23K08J68m08N01l30j19O87p62L09K94m54N38m03k47L03k17K14Q2
$$ -318 72 -251 -43 125 -283 218 -112 -231 456 -306 3 297 -157 381 -22 -269 34 -183 31 113
7016A13l60M12j04m76O23l13j96M94n20L88N0m30M94j85j81L92m54K95O2m83O14
$$ 113 -247 165 61 -415 208 -105 -301 193 -327 61 111 -319 175 -10 -191 201 -253 42 104 -379 235
7037B35l65k1M59p12L68K42n20N85k98k3M57o94K79K87o93M61k14j60O80m04k8
$$ 235 -130 -151 308 -404 -36 206 -314 271 -27 -50 407 -287 -8 279 -414 47 -167 -327 353 -51 -79
7058g9K96l37L26j07k19M22l49J33N1o32N60j5k42O48n33m8L84k49J98l2l47L74
$$ -79 217 -120 206 99 -120 302 -47 86 137 -495 65 50 -192 456 -77 -125 259 10 208 176 -171 203
7080B03k09J6L26m93K09J52l32O6J36l76M92l34K66R8m19M49j08l49M74l40j34
$$ 203 -6 10 336 -157 52 204 -128 -62 74 -302 190 -144 122 220 -199 250 142 -207 267 -73 -207
7101b07M10l14K45k16q8M66l87J21K33n12L09p7l57O87l59j05L70n65L60K6l50
$$ -207 203 -111 134 -82 -170 296 -91 30 263 -249 60 -17 -374 313 -46 -151 219 -346 14 40 -310
7122c10N86l26k10N61m88L42J90n27M46k33l87N14l22L72O7m49L67n1l68L43k01
$$ -310 276 -50 -260 301 -187 155 345 -182 264 31 -356 158 -164 208 275 -174 193 142 -226 117 -84
7143h4M0J62l07L53l5n18P10j77l15M74n29J53J86k43L91l04J86J54o03J82M68
$$ -84 -44 118 -189 164 129 -389 321 144 -171 303 -226 -73 113 -130 261 -43 143 297 -306 -124 344
7164C44n27M29k53k68M50j59J86O9l89L36k15l13L01j51O0K57m31L80l11K5M15
$$ 344 -183 246 -7 -275 175 16 202 271 -118 218 3 -310 -9 -160 -100 157 -274 106 -205 -180 235
7185B35l04p9L29m48K02L63p38N08P3j88M31n51K01K50o33O12l54RL04m42R6L25
$$ 235 -69 -148 181 -267 -65 298 -440 68 141 -47 384 -167 34 284 -349 263 -91 -82 222 -220 -124 201
7207B01k95L46k70l34N18l56K09J85m18L47j31k88N04l04n9L36l58M65k79l86
$$ 201 -94 252 -18 -352 166 -190 19 204 -214 133 2 -286 218 -86 -145 191 -167 298 19 -367
7227c67P05k63k10M67o03K45K8k41K70j5j30K14n16L43M07n23L98k02r9K14k46
$$ -367 338 75 -135 332 -271 -26 2 -239 31 16 -114 100 -416 -73 334 -189 209 7 -92 122 -124
7248a24k7J97J22J24k59l15N98m92j03M44m43L11Q8j56J87l54L50M2l78J35O8
$$ -124 -151 46 168 292 33 -282 316 -176 -279 165 -278 33 121 -35 152 -202 148 190 -188 -53 15
7269A5j72J94j61p5M67m52K39o5m26O08j84mJ76m30L71R0l60K81j59j74N40n60
$$ 15 -157 37 -124 -199 268 -184 55 -10 -436 172 -12 -16 160 -270 101 191 -169 112 -47 -221 319 -241
7291b41L52J14n76N22J0l60M40k74J55N6l44L27q3m87O74k33j89N30n53K65j9
$$ -241 111 225 -351 171 181 -179 261 -13 142 198 -146 181 98 -389 285 52 -137 393 -160 105 86
7312H6k81K46j02k23N55n26L68r4j99M40n01J42L36m32K04J34m85M02P3m03N56
$$ 86 -195 51 -51 -274 281 -245 123 29 -170 270 -231 -89 247 -185 19 153 -332 70 143 -260 296
7333B96o84L55J47l88M06p5k4Q2l24l9K69l47L67J06k68K96j04j57K68m55L58
$$ 296 -388 -33 114 -274 132 57 33 115 -209 -248 21 -326 41 147 -121 175 71 -86 182 -273 85
7354H5P5k37L84j71j03L13l60M12j81o01M91n6l33M39m4j90L40o76M81p8j66K77
$$ 85 160 -77 307 136 33 346 -14 398 217 -384 107 51 -282 157 113 -77 263 -413 68 -10 -176 101
7376A01p2q0J12l50J70J37k93N64l66j14M34m78K27M1j33L13m70K84K61n27J65
$$ 101 29 -51 61 -289 -119 18 -275 289 -77 -191 243 -235 -8 33 -100 213 -257 27 288 -239 -74
7397g4K51n60Q59o57j6M85n09P9M09m04K06k11pL93m23Q4K81m14L65l9l19M44
$$ -74 177 -383 476 -181 -197 288 -221 -142 267 -137 69 -142 -149 244 -179 -95 186 -228 137 98 -221 223
7419B23l60P7K91n75K54J41k59L34k63J3K30l28M68j94j96L36q4k16L18l31J03
$$ 223 -137 -60 231 -344 -90 51 -208 126 -137 -124 106 -222 246 52 -144 192 108 -108 210 -121 -18
7440a8K04n74O77j34k12J88l57J04K99n68O32j31k25M83m66J69K36n35K01J31
$$ -18 186 -388 289 155 -57 131 -226 -122 177 -391 241 110 -115 368 -98 71 307 -228 -27 104
7460A04j34L63m12l60O17k43L95j83o21O62l12K3M09m78J41J5k80L92r9l17O73
$$ 104 -30 333 -79 -439 178 -65 330 147 -474 188 -124 -101 308 -170 -29 -14 -294 98 -1 -318 355
7481C55n98J16L18m99N17k62K2L35l38L3L10n32K19J53l56M60k76J3J5j9M1P4
$$ 355 -243 -127 191 -308 209 -53 -31 304 -34 -1 309 -223 -4 149 -207 253 -23 -10 5 -14 27 101
7503A01k91L23l07j10O68o49M55p5m47N73ln83O23m55P3K82l89L82Q1m19N18n89
$$ 101 -190 133 -174 -284 384 -265 190 115 -332 241 238 -345 278 -177 -104 178 -211 171 252 -167 351 -238
7525b38K17L26o70N76k41n3J88k54J13K60l42L19j18l58N47m88J80N03p59M82
$$ -238 -21 305 -365 211 -30 -83 105 -149 -36 224 -118 201 83 -275 272 -216 -36 467 -292 190
7545A90m5k92M51l91o9K13k28L36l3k22K94j97l65O10n46M47R1m27L39l0l6J62
$$ 190 145 -147 304 -87 -156 57 -171 165 132 -90 204 7 -358 252 -294 153 244 -183 156 126 90 252
7567B52k58J29N9n15M34m6m78P68l21N1ml59K23J70k54J84J18j70K35l28K13R1
$$ 252 -6 123 182 -333 101 55 -423 345 24 75 71 -288 -65 105 -149 35 153 -17 218 -110 103 194
7589A94l39M19l62J8J91k87Q4K63o16M69j18k50M50j86KN03o19J62j09j77L26
$$ 194 -145 274 -88 -70 121 -166 -82 181 -435 34 -84 -334 116 -70 -68 435 -184 -22 -131 -308 18
7610A8k24J79K69o49N29j38k54M41k51O2L13o35L17J0l40N36j53p4L66n87J40
$$ 18 -206 -27 242 -407 122 -16 -270 171 -80 -18 295 -340 -23 -13 -353 183 30 -44 322 -265 -125
7631a25K43m77M85km57O31m85N7L15l53M08l24j46K89k58J34L88n34M59j49m76
$$ -125 118 -359 126 124 -333 298 -187 -130 185 -168 240 -84 -230 59 -199 -65 323 -211 248 99 -377
7652c77L47r9j00L55l48K88jk65L42m03J07L93n67N06j14l38M73k52j67N06m88
$$ -377 -30 -129 -229 126 -222 66 65 -200 142 -261 -154 239 -328 178 64 -274 199 -53 -220 286 -202
7673b02K66Pk02O17m45RJ81m21K94P1l17K72k19j18K65j38J08K72k66J02p7l14
$$ -202 64 71 -131 486 41 50 231 -190 104 175 -142 130 -89 -207 58 -80 28 300 34 136 59 -255
7695b55M54k33k06M99m01J99M5l08L60k70k0K51n05L88K02l48K07rj88L99l76
$$ -255 199 -34 -240 259 -142 57 102 -206 154 -116 -136 115 -390 -2 200 -148 59 50 -138 261 -115
7716a15L41R8m97K96j32j50M69l65k2K45j59M6l3l54L68k03K11j5k33j8L41m05
$$ -115 226 324 -173 123 -9 -159 310 -55 -77 168 9 55 22 -332 36 -167 44 29 -204 -222 119 -286
7738b86M18l98r2O55m41K72p9l25N42j85j81K54k22K32K4l83K66j63J07K78m14
$$ -286 132 -266 -358 297 -144 128 49 -276 266 81 -100 154 -68 164 188 -195 71 -92 15 293 -121
7759a21J08J36k06L99j50m82N30m86J76K51l85L81q5l48N46l68rJ75r2J16n9n
$$ -121 -13 123 -83 316 166 -316 214 -272 -96 155 -230 151 66 -282 264 -104 -113 62 -30 86 27 22
7781B2j0k26J63J85k70J37k6k99N29j52k82O79m72L7q3j78L12j09n4K77k15QJ79
$$ 22 12 -214 -51 134 -136 1 -25 -324 205 53 -229 450 -22 15 -68 -246 66 -43 -97 180 -35 -27 152
7804A52n60O51l51k29N22k00J88N3k60K00m0l29M89k23q7J56k09J21J46l55L21
$$ 152 -408 243 -108 -337 185 -15 173 226 -34 166 126 -203 286 63 -24 132 -77 44 190 -165 156
7825A56j11k09L22l09k3K56k34L61k00p0J98j12l2L2j35K96l32L8L42l91L5L78
$$ 156 45 -164 158 -151 -174 82 -152 209 9 -61 137 25 -7 25 -110 186 -146 -108 234 -157 -122 256
7847B56m14N42m95m4K63k70R0K01m15N37j61k80L12k76k0L48k45J62J98m87K98
$$ 256 -158 384 -111 -155 108 -162 -72 129 -286 251 90 -190 122 -154 -174 174 -71 91 289 -198 100
7868A00l0j54K47k58J87N0n77O74j80j90L80l39J18J54l45K16j04k13P20n06m1
$$ 100 70 -84 163 -95 92 142 -435 239 59 -131 249 -90 28 182 -163 53 -51 -264 456 -50 -91
7889i1K40m80L75P2m99N87k58j45M12l26K07k2k99M55k57k20L14l1m9J05l14M53
$$ -91 149 -331 44 116 -383 204 -54 -199 213 -113 94 72 -227 228 -29 -249 65 34 -15 90 -224 229
7911B29l19pL20l82K09J55k86L29k79nK69k38l1Q0k56L11J4k03M00n29J30J75
$$ 229 -90 -97 223 -159 50 205 -81 248 -31 -36 233 -5 -36 44 -212 99 113 -90 310 -219 -89 86
7933H6j52K27j38j46L50m12K74r0m5K05r7j43O1r7j32M38n08K90J17l10M35l47
$$ 86 -66 161 23 -123 227 -185 89 -1 -46 159 62 -81 -20 -117 -249 189 -319 -29 88 -222 213 -134
7955a34n1L95m02k4N54m34K31q2l10M27l84Q5M59o01K95J22l66N62m72l0J98k60
$$ -134 -185 210 -192 -216 338 -96 135 53 -257 170 -214 -129 330 -271 24 146 -220 342 -130 -160 38 -222
7977b22L73j6l07L96l45r2M19l84K91k20j07K23j79M4L10l76L16M6l94M84m73
$$ -222 151 135 -172 224 -121 -213 206 -178 113 -107 -214 9 -170 -126 184 -192 124 170 -224 260 -213
7998b13m1L87j84O2Q6j58K14M9l67K97rj47K62m74L31q8n4K16l77P1K89k17J91
$$ -213 -254 133 -51 11 97 -61 153 202 -165 132 123 -24 238 -236 95 7 -47 169 -208 -137 152 -65 126
8021A26J85o80N37k51j05N47m94M3K19k86L10k41k22M70j59j57L17k81J85Q9j85
$$ 126 311 -369 168 -83 -188 359 -135 -92 127 -159 151 -90 -312 158 -1 -158 159 -122 63 152 -33
8042c3K67m24N3L05l04K75l7k32L59k66rK12l55J23J17j46K75k81M4L09l87L56
$$ -33 234 -190 -137 168 -136 139 102 -130 229 -37 -46 166 -189 -66 51 -95 180 -101 -57 252 -135 221
8064B21l1l00K80k06m1M20o00J92K40n64M54N7l77M35l99J28J91k67K79k4l13
$$ 221 190 -110 170 -36 -77 343 -257 -65 175 -389 65 122 -255 180 -219 -91 100 -167 112 88 -225
8085b25L39j24q9N0o6P7K59m26L05r9R9m9k32J69qo4J90n5j61L79o15L24K37m48
$$ -225 114 -10 -99 -49 -115 -38 221 -205 100 1 100 51 -181 -12 -20 -84 106 51 -110 269 -346 -22 215 -233
8109b33K89n9n1K71m26K33K20m11L36m2l10M90n78L07K14n43M27L5n30M70k16
$$ -233 56 -3 -54 217 -209 24 244 -167 169 127 -183 307 -271 36 250 -293 134 169 -361 109 -107
8130a07J7J34l26M01J45l36O0N2P2m4n50L79M12n30L65j5j32L63n75L35N1n20
$$ -107 -90 44 -282 119 264 -72 -12 40 112 68 -482 -103 309 -221 144 129 -3 360 -215 120 171 -349
8152c49N24j55j92K27j66L01k6l09K92k3k84K69k35J78n5k9K53k32j3J51j54k13
$$ -349 175 20 -172 55 -111 190 164 -145 147 124 -160 109 -126 52 -3 -32 221 -11 -24 127 -27 -240
8174b40L06k40J83Jl75O53k89k09M79m33L18j10j58J21m4k87K88
$$ -240 66 -174 9 10 -365 288 -1 -210 269 -164 154 44 -114 7 -37 -324 -36
8191c6
$$ Imaginary data points
##PAGE= N=2
##DATA TABLE= (X++(I..I)), XYDATA
0@%%%%%%%%%%%%%%%%JrJ6j6J6j6K2l0L2l8M6n2O0p0Q0r1J06j21J36j53J73j94
$$ 0 0 0 0 0 0 0 0 0 0 0 0 0 0 0 0 0 1 -8 8 -8 8 -8 14 -16 16 -22 24 -28 32 -38 42 -49 57 -64 72 -81 92 -102
38a02K18k46K73l05L41l77M15m59N09n62O21o85P55q30R12j006J110j224J355
$$ -102 116 -130 143 -162 179 -198 217 -242 267 -295 326 -359 396 -434 478 -528 582 -642 713
57G13j502J667j860K084k349K670l066L570m238N164o553Q963k1351Q2024q0315
$$ 713 -789 878 -982 1102 -1247 1423 -1643 1927 -2311 2853 -3700 5263 -16088 65936 -14379
72a4379k9356Q6379p8174p404K5277N1151k305p3666P6636k4801j34209J26737
$$ -14379 -43735 42644 -35530 -42934 -17657 33494 31189 -42477 34159 9358 -124851 1886
84A886L4530p3101P4078l859l6556r900j7508O5549l8933j2906P6739r9602k143
$$ 1886 36416 -36685 37393 33534 -3022 -12922 -30430 35119 -3814 -16720 60019 -39583 -41726
97d1726R6277p3567K5898N7354n4388j7801k5501L0998J1759n5322R3021l615
$$ -41726 54551 -19016 6882 64236 9848 -7953 -33454 -2456 9303 -46019 47002 43387
109D3387r5374Q3477j6817n6715P3325j7388k2874p55r889L8659n0239K3743Q5367
$$ 43387 -51987 31490 14673 -42042 31283 13895 -8979 -9734 -19623 19036 -31203 -7460 77907
122G7907r9897o29O6334p8896Q177L3783q905J2171l6129L6778P337o7602P7730
$$ 77907 -21990 -22619 43715 -35181 -27004 6779 -2126 10045 -26084 10694 18031 -49571 28159
135B8159n281p5178P1761j7823m4184M4136k105J5501j7750q016N4323o5539m488
$$ 28159 22878 -52300 19461 1638 -42546 1590 -515 14986 -2764 -10780 43543 -21996 -26484
148b6484P0368o6786J1847M2313m7427K5363K606q422J9473l6874L3517k777n8803
$$ -26484 43884 -22902 -11055 31258 -16169 9194 11800 3378 22851 -14023 19494 16717 -42086
161d2086O6951j0867n0245O0809j6602j7372J9527k0318K4279k4954j1636M9604
$$ -42086 24865 13998 -36247 24562 7960 -9412 10115 -10203 14076 -10878 -22514 27090
173B7090n4492J0475N1322o3555K3766L0342m1967J8644n784O086P136m1945M9733
$$ 27090 -27402 -16927 34395 -29160 -5394 24948 -17019 1625 -4159 1927 9063 -32882 16851
186A6851j343n2509O2814j3597l4782M3811k5282m65J0634k0208L1137k8387k474
$$ 16851 15508 -37001 25813 12216 -22566 21245 -4037 -4502 6132 -14076 17061 -11326 -13800
199a3800M6661n5267J4191M0460n2274J9540R824k1915K1368k3459J6773J4550
$$ -13800 32861 -22406 -8215 32245 -20029 -489 9335 -12580 8788 -14671 2102 16652
211A6652m0529M2098o449l5978M9978k5769j6529L5832k8405R813L289j4771L3236
$$ 16652 -23877 18221 11772 -24206 25772 3 -16526 19306 -9099 714 4003 -10768 22468
224B2468l1704J133L7347m9491J6599K0053m0320K9620n240j4135K6716k5487
$$ 22468 -9236 -8103 29244 -20247 -3648 16405 -23915 5705 465 -13670 13046 -12441
236a2441J7138N640l4231M1128j7334k6535M5927k6846k551K5370k5551K2692
$$ -12441 4697 10337 -23894 17234 -100 -26635 19292 -7554 -10105 15265 -10286 12406
248A2406p589j6417L3485l2972M251K6785m0718K6987P644l0376L3009j5619o483
$$ 12406 4817 -11600 21885 -11087 -6836 19949 -20769 6218 13862 -16514 16495 876 -5607
261e607K0363l2281K1469K376l0739L8215j5817j1513L2559l0441J1725J2013
$$ -5607 14756 -17525 3944 6320 -24419 13796 -2021 -13534 19025 -11416 309 12322
273A2322l1318K7773j1013j2150L0469k8205J2979J7944l3977K7658m936k1127
$$ 12322 -18996 8777 -2236 -14386 16083 -12122 857 18801 -15176 12482 7546 -13581
285a3581K9270k5071M312K0314l1045K4782l86k1527L0788k4491j673K3375l3598
$$ -13581 15689 -9382 -5070 15244 -15801 8981 8595 -12932 17856 -6635 -8308 15067 -18531
298a8531J8809N764k3553L0867j7491m784K6984l2288J4458Q574k6868K8773j3324
$$ -18531 278 6042 -17511 13356 -4135 -8919 18065 -14223 235 8809 -18059 10714 -2610
311b610q883L0242k8684J1665J3603k9607K6163r739j5717K9734k5328O032J7403
$$ -2610 -11493 18749 -9935 1730 15333 -14274 11889 2150 -13567 16167 -9161 -3129 14274
324A4274k8359K4228n145j9719L0374k3571p80K1049k8166K0222J100k0944K9818
$$ 14274 -14085 10143 4998 -14721 15653 -7918 -8698 12351 -15815 4407 5507 -15437 14381
337A4381j8680l971K2542k8076J6727M818k3572K9236j3940q226K5706k6266J1418
$$ 14381 -4299 -8270 14272 -13804 2923 7741 -15831 13405 -535 -8761 16945 -9321 2097
350B097R343k5841K5326r866j1226K5768k5517R443J3338k9583K4617m632j8085
$$ 2097 11440 -14401 10925 1059 -10167 15601 -9916 -473 12865 -16718 7899 3267 -14818
363a4818K6864k0003L702J5566k6306K2089l229j9059K9203k0462j150K3149k7506
$$ -14818 12046 -7957 -4255 11311 -14995 7094 3865 -15194 14009 -6453 -7603 15546 -11960
376a1960J5953N084j9998K3358j5641j675K0653k9454J7006Q265k6914K6966r083
$$ -11960 3993 9077 -10921 12437 -3204 -4879 15774 -13680 3326 11591 -15323 11643 2560
389B560j2220K2234k2097P801P647k1434K5192j1778j0884K8940k6144L452J9581
$$ 2560 -9660 12574 -9523 -1722 5925 -15509 9683 -2095 -12979 15961 -10183 -6731 12850
402A2850k5428J5340q26j2409K1184j9453Q790J5998k9145K2388N74k5569K7245
$$ 12850 -12578 2762 1936 -10473 10711 -8742 48 16046 -13099 9289 9863 -15706 11539
415A1539j1148o956J8393j7981J3074k466j6029K8717k0636p388K8440k9757N537
$$ 11539 391 -6565 11828 -6153 6921 4455 -11574 17143 -3493 -10881 17559 -12198 -6661
428f661J5942k0868J7315n035m917J5398k5876J5302Q978l0792K9616j676k2788
$$ -6661 9281 -11587 5728 693 -4224 11174 -14702 600 9578 -21214 8402 6726 -16062
441a6062K6479j0871k435J0280j5055J7695j2159j2000L0858k6146qK9060k8655
$$ -16062 10417 -454 -2889 7391 -7664 10031 -2128 -14128 16730 -9416 -9424 19636 -9019
454i019P669J1167j7419J1377j0684N488J0149k7150K5540M518l1099L1629m190
$$ -9019 -1350 9817 -7602 3775 -6909 -1421 8728 -18422 7118 11636 -19463 12166 7976
467G976k0689K1234r617J003J616r228K2483j9476l634L3144l2501J479K5888
$$ 7976 -12713 8521 -1096 -93 1523 -7705 14778 -4698 -8332 24812 -7689 -6210 19678
480A9678k9913O384Q617q011R533j4221J3935L545l1575L1107o91l0421L2269
$$ 19678 -10235 -3851 4766 -3245 6288 -7933 6002 9547 -22028 9079 8388 -22033 10236
493A0236p958j8114J7065o409P957m698l876K3664l1447q39L3338l3235Q106K5931
$$ 10236 2278 -15836 1229 -5180 2777 -1921 -5797 17867 -13580 -14419 18919 -14316 -6210 19721
507A9721k5382M583K599j318N924j5098K3249k825l3922L4013n271k6259L5447
$$ 19721 -5661 -1078 1521 203 6127 -8971 14278 11453 -22469 11544 6273 -19986 15461
520A5461m851j5134P580p190P333j2976M157K8576l4223K432K8215l6480R455
$$ 15461 10610 -4524 3056 -4134 3199 -9777 -5620 22956 -11267 -8835 19380 -17100 -7645
533g645K3685j8393L939l188J949j321j7770L3101k206l0775L5301j1783k7485
$$ -7645 16040 -2353 1586 -1602 347 -974 -18744 14357 12151 -18624 16677 4894 -22591
546b2591K9137l090n285M575m467R371k2971O212L0161l4159R548K5109l8386
$$ -22591 6546 3456 -1829 2746 -1721 7650 -15321 -9109 21052 -13107 -3559 21550 -16836
559a6836O904J6327j1345P328l827J1054o774k3824L3494o150k5118L8542j1446
$$ -16836 -9932 6395 -4950 2378 -1449 9605 2831 -20993 12501 6351 -18767 19775 8329
572H329k3177K1356o018o37O48K804J3765k9594N774K5800l6155J3726K5272l1408
$$ 8329 -14848 6508 490 -147 501 3305 17070 -12524 -6750 19050 -17105 -3379 21893 -9515
586i515N815P376q331K545n909J9402p510k3912L2793j2675k2574L7075r599j4554
$$ -9515 -3700 3676 -4655 -2110 -8019 11383 3873 -20039 12754 79 -22495 14580 4981 -9573
600i573J5321p177J529p230O004J9376k9744R479K1491l6949J3765J9574k2859
$$ -9573 5748 -1429 100 -7130 -1126 18250 -11494 -2015 19476 -17473 -3708 15866 -6993
613f993R009K047l246j277j2313K4637p991k1320L4274j6042k0949L0871j0368
$$ -6993 2016 4063 817 -460 -12773 11864 3873 -17447 16827 785 -20164 10707 339
626C39o964J0995m629M784j5106O478J9495k9755J4825J9479l4780J3229J2140
$$ 339 -6625 4370 -259 4525 -10581 -4103 15392 -14363 462 19941 -14839 -1610 10530
639A0530j7652R562p27M004l573j5214K5016j0306j7185L3439j5639j5462K2685
$$ 10530 -7122 2440 1713 5717 2144 -13070 11946 1640 -15545 17894 2255 -13207 9478
652I478j2527j858N555j624R782j8674O893J6491l0096J6240J6058k8595J4062
$$ 9478 -3049 -4907 648 -976 8806 -9868 -2975 13516 -16580 -340 15718 -12877 1185
665A185M363j2297Q535n381J0553l142j5393K4770j3642j4761K9950j5997p177
$$ 1185 5548 -6749 1786 -3595 6958 3816 -11577 13193 -449 -15210 14740 -1257 -8434
678h434J7791j3058L162j338j348J3051k0352Q987J3891k8974J6772R415k1539
$$ -8434 9357 -3701 -539 -1877 -3225 9826 -10526 -1539 12352 -16622 150 9565 -11974
691a1974J5680r75n949O426r820J3346m256j3283K4971j4590r957K4779j6646
$$ -11974 3706 2731 -3218 3208 -6612 6734 2478 -10805 14166 -424 -10381 14398 -2248
704b248n02J2084j2272Q005o582j127J3249k0298J0679J0605k4133J6147K506
$$ -2248 -2750 9334 -2938 5067 -1515 -2642 10607 -9691 988 11593 -12540 3607 6113
717F113j6167J4469p188k45N665j2900J5699n965j1725K3246j5027m619J8465
$$ 6113 -10054 4415 -2773 -3018 2647 -10253 5446 -519 -12244 11002 -4025 -8644 9821
730I821j6951N326N520j0341J2778r830J358J2941k0068J2128O285k0127J7245
$$ 9821 -7130 -1804 3716 -6625 6153 -3677 -2319 10622 -9446 2682 8967 -11160 6085
743F085l126r886J4356j1711N667M391j4158J6804p953r385J9855j5841P68J2903
$$ 6085 2959 -6927 7429 -4282 1385 5776 -8382 8422 469 -8916 10939 -4902 -4134 8769
757H769j5778J0175j33q534J4298j3076K761J1050j9084J2934K398j4932J7020
$$ 8769 -7009 3166 3033 -5501 8797 -4279 -1518 9532 -9552 3382 5780 -9152 7868
770G868q018l892J2196j4776Q509J487j3508J6986r766n012J6359j5884N489P518
$$ 7868 -150 -4042 8154 -6622 1887 3374 -10134 6852 -2914 -7926 8433 -7451 -1962 5556
784E556j5039J3318n336o396J4913j4621O039Q901j6673J4672j946j0605J6291
$$ 5556 -9483 3835 -1501 -7897 7016 -7605 -1566 7335 -9338 5334 3388 -7217 9074
797I074j1860J098J0154j5429J2565q69j1186J6962j1584j556J2697j6840R285
$$ 9074 -2786 -1688 8466 -6963 5602 4733 -6453 10509 -1075 -2631 10066 -6774 2511
810B511K371j3264J5506q765l412J3570j6007P962M550j5098J5054o446o046J4841
$$ 2511 4882 -8382 7124 -1641 -5053 8517 -7490 472 5022 -10076 4978 -1468 -7514 7327
824G327j3841N516P130j4799J3973m338q292J5526j3282L012R385j5416J2326
$$ 7327 -6514 -998 6132 -8667 5306 968 -7324 8202 -5080 -2068 7317 -8099 4227
837D227j215r887J5383j1836K13J0813j6017J0860Q71j1946J5933r678k244J2706
$$ 4227 3012 -6875 8508 -3328 -3115 7698 -8319 2541 3412 -8534 7399 -2279 -4523 8183
851H183j5292Q398L164j3230J5480p992l989J4596j5241O857O118j4538J3922
$$ 8183 -7109 1289 4453 -8777 6703 -1289 -5278 9318 -5923 934 7052 -7486 6436
864F436n321o686J4461j3784M595P442j5159J3399l321r443J5405j2049O71R480
$$ 6436 1115 -5571 8890 -4894 -299 7143 -8016 5383 2062 -7381 8024 -4025 -3354 6126
878F126j4430J1153j542r692J5445j1568pJ2300j5931R511K974j2678J4010p241
$$ 6126 -8304 2849 1307 -8385 7060 -4508 -4515 7785 -8146 1365 4339 -8339 5671 -1570
892a570k406J1989j4316Q835L486j4308J5803o010p199J4606j2357L205N906j2575
$$ -1570 -3976 8013 -6303 2532 6018 -8290 7513 1503 -5696 8910 -3447 -242 5664 -6911
906f911J2572n785n641J5083j5193L164J0188j6509J0778R29r681J2255r546K166
$$ -6911 5661 -124 -5765 9318 -5875 -2711 7477 -9032 1746 2675 -7006 5249 -4297 -2131
920b131Q262j4951J3280p25j3562J7340q727m595J3468j1571O124J534r074J3161
$$ -2131 6131 -8820 4460 3735 -9827 7513 -1214 -5809 7659 -3912 2212 3746 -5328 7833
934G833j0938j153J4738j7660O415Q675j5817J0923j217n481R479j1193O632K519
$$ 7833 -3105 -4258 10480 -7180 -765 7910 -7907 3016 1799 -3682 5797 -5396 1236 3755
948C755j4768J7273m280j1484J8235j0095l306J0402j0078P346k581m931J3264
$$ 3755 -11013 6260 1980 -9504 8731 -1364 -4670 5732 -4346 3000 419 -4512 8752
961H752j5034L510J3943j9218R673O617j5045R367l363j705O385j0929J1838j773
$$ 8752 -6282 -2772 11171 -8047 1626 8243 -6802 2565 -798 -2503 3882 -7047 4791 3018
975C018j4443J9803q254r670J8136j1134j594O484p327Q719o702O80J3509j9261
$$ 3018 -11425 8378 124 -9546 8590 -2544 -4138 2346 -4981 3738 -2964 -2284 11225 -8036
989h036O752J1455k0398J1665N608j1618Q627m789K127K216j0773J6189o051j3438
$$ -8036 -1284 10171 -10227 1438 7046 -4572 4055 -734 1393 3609 -7164 9025 2974 -10464
1003a0464K0447j1528p665J6801r150R26K751n113P438j1702M264J2665j9977
$$ -10464 9983 -1545 -9210 7591 -1559 -633 2118 -2995 4443 -7259 -2995 9670 -10307
1016a0307J0029R563k0056J1242L969q128P001n563N502k267j0864J9518q714
$$ -10307 -278 9285 -10771 471 4440 -3688 3313 -2250 3252 985 -9879 9639 925
1029I25j0040K1482j2724o731J3368q906K721m43j034Q304j5457P439J0817k1304
$$ 925 -9115 12367 -357 -7088 6280 -2626 95 -348 -1382 6922 -8535 -1096 9721 -11583
1043a1583J2883P281j7993J0618L90m540M493o075J0751n169j0385K0266j2023
$$ -11583 1300 8581 -9412 1206 1596 -2944 1549 -4526 6225 1056 -9329 10937 -1086
1056a086q403K0766j2437l050J0052o715L711n416K589Q314j7638J0565Q955k1436
$$ -1086 -9489 11277 -1160 -4210 5842 -873 2838 -2578 11 8325 -9313 1252 10207 -11229
1070a1229J3402M707j4819R712j237o98M25o981J3007q802q000K1917j3243o125
$$ -11229 2173 6880 -7939 1773 536 -162 263 -6718 6289 -2513 -10513 11404 -1839 -7964
1084g964J7716j2984j297O574l596N672q533N317P518j9456J3375P492j9869J3862
$$ -7964 9752 -3232 -4529 2045 -1551 4121 -4412 905 8423 -11033 2342 9834 -10035 3827
1098C827J683j2093P412k971M379j098o494J5566j2546p966K0362j4256k503J5321
$$ 3827 5510 -6583 829 -2142 2237 1139 -5355 10211 -2335 -10301 10061 -4195 -6698 8623
1112H623j1076J115J742j498O443j0822Q557O401k0803J3807M413j6751J4794
$$ 8623 -2453 -1338 404 -1094 5349 -5473 3084 9485 -11318 2489 6902 -9849 4945
1125D945Q72p531M840n357N625m669n864J7031j3042n249J8373j5136j64J1996
$$ 4945 5817 -1714 3126 -2231 3394 -1275 -7139 9892 -3150 -8399 9974 -5162 -5326 6670
1139F670r165K479k261m24N217j2765J1614N555j7464J5263R86j4626J2470k780
$$ 6670 -2495 -16 -2277 -2701 2516 -10249 1365 6920 -10544 4719 5705 -8921 3549 769
1153G69k903L701n345R209o440m421J7225j3582k353J5123j5168J819O449p296
$$ 769 -2134 1567 -3778 5431 -1009 -5430 11795 -1787 -4140 10983 -4185 -2366 4083 -3213
1167c213N560m265K946N630j3941J1355K019j6462J4318j911r628J1222m676J300
$$ -3213 2347 -1918 1028 6658 -7283 4072 6091 -10371 3947 2036 -7592 3630 -1046 254
1181B54K095o250J0854q662m361J4835j4454O70J2186j2125N322L032n247N956
$$ 254 2349 -3901 6953 -1709 -6070 8765 -5689 -5019 7167 -4958 364 3396 -1851 4105
1195D105q340L840M333j3800J2316R93j2640J4195m108n378Q736p220M076r82
$$ 4105 -4235 -395 3938 -9862 2454 3447 -9193 5002 894 -4484 4252 -2968 1108 126
1209A26o455J2019q940j391J4141j3084L330P606j1366O544j662l071P498r549
$$ 126 -6329 5690 -3250 -4641 9500 -3584 -254 7352 -4014 2530 868 -2203 5295 -4254
1223d254O553M004j2693J2445k099r756J1572p289j831O218p961P824k495n355
$$ -4254 2299 6303 -6390 6055 3956 -5800 5772 -1517 -3348 2870 -5091 2733 238 -5117
1237e117J2031j0587m43J0197j2975N485L805q743Q877m141l66P316j0475P208
$$ -5117 6914 -3673 -4116 6081 -6894 -1409 2396 -6347 2530 -1611 -1977 5339 -5136 2072
1251B072J519j1027J1796m064n371J0860p865K365L953q186Q676m840m333J0737
$$ 2072 3591 -7436 4360 296 -5075 5785 -2080 285 4238 -3948 4728 -112 -4445 6292
1265F292j0362K100P876j1027P590J22o541Q883p584J347N676j0556Q680L21q623
$$ 6292 -4070 -1970 5906 -5121 2469 2591 -3950 4933 -2651 -1304 4372 -6184 2496 2817 -5806
1280e806J1671o308k280Q577r648N035J563q176J0133o079k125R882j0816M312
$$ -5806 5865 -443 -2723 5854 -3794 1241 2804 -5372 4761 -1318 -3443 6439 -4377 -65
1294f5M198j0104Q951l463m022Q720q688L459M402r586R369k474n796J0081p857
$$ -65 4133 -5971 2980 -483 -4505 4215 -4473 -1014 3388 -6198 3171 697 -5099 4982 -2875
1309b875R04O410r137P285l95o212J0027p430%P509j0212O300J114p687R406n411
$$ -2875 -1971 4439 -4698 2587 2192 -4020 6007 -1423 -1423 6086 -4126 2174 3288 -4399 5007 -404
1325d04j818P790r441N041K099q782R214m698l215Q682r095L736M009q865Q673
$$ -404 -2222 5568 -3873 1168 3267 -5515 3699 -999 -4214 4468 -4627 -891 3118 -5747 2926
1340B926k718m781R469q487K243N437r588Q283j336n599R575p077Q02O158r657
$$ 2926 208 -4573 4896 -3591 -1348 4089 -5499 2784 1448 -4151 5424 -1653 -851 5307 -4350
1355d350O706j47p184R827o370o45P428r141N368J185p842Q996n130k309Q364
$$ -4350 2356 2209 -4975 4852 -1518 -2163 5265 -3876 1492 2677 -5165 3831 -1299 -3608 4756
1370D756r023M725L105q353Q650l509m050Q505q368K985M077q271Q313k301m821
$$ 4756 -4267 458 3563 -4790 3860 351 -3699 4806 -3562 -577 3500 -4771 3542 1241 -3580
1385c580R013p606Q54N347r047O705p86n228Q792o655N71O339r737N873Q91p564
$$ -3580 5433 -2173 -1319 4028 -5019 1686 900 -4328 4464 -2191 -1620 4719 -5018 855 1746 -5818
1401e818Q696m716r19O976p893N482J374p725R054m930l275Q916q283L285M126
$$ -5818 2878 -1838 -2757 4219 -3674 1808 3182 -4543 4511 -419 -3694 5222 -3061 224 4350
1416D350p523P424l275k906P600r179L050M320r847Q090m41n549Q300n679J1L743
$$ 4350 -3173 4251 976 -1930 5670 -3509 -459 3861 -5986 2104 1663 -3886 4414 -1265 -1254 2489
1432B489q258P162j453n589J0136o597j091Q190q168M010J715o240O426n330L0
$$ 2489 -5769 1393 -60 -5649 4487 -2110 -3201 4989 -3179 831 2546 -3694 2732 -2598 -2568
1447b568P258q807O537K981r670P743k815m429O878n505K813J705o590Q526l933
$$ -2568 4690 -4117 2420 5401 -4269 3474 659 -3770 3108 -2397 416 2121 -4469 4057 124
1462A24l640J0238q779n70N958q562M863R90k528P083p141K003M168j0256P903
$$ 124 -3516 6722 -2057 -2627 3331 -5231 -368 622 -1906 5177 -1964 39 4207 -6049 1854
1477A854J615q713Q660l286l014N937m725N154j015n923Q051p717k504J0376p915
$$ 1854 3469 -5244 3416 130 -2884 3053 -1672 3482 2467 -3456 4595 -3122 -5626 4750 -3165
1492c165K153N643p413L791k073j174N516p894M913K757j0658R381Q82o518Q430
$$ -3165 -1012 4631 -2782 1009 -1064 -2238 3278 -4616 297 3054 -7604 1777 2659 -3859 4571
1507D571l427j712J959n422O337k800k933J0519q583r93Q907r295K650L506n344
$$ 4571 1144 -568 1391 -4031 2306 -494 -3427 7092 -1491 -2484 6423 -2872 -222 3284 -2060
1522b060L464m138J497M434q131Q092J646j0689R174k225o562P109l265J367J120
$$ -2060 1404 -2734 -1237 3197 -4934 3158 4804 -5885 3289 1064 -5498 1611 -1654 -287 833
1537H33l475P224n855j825J0121r954M09P592q916L493K017k881M330n062L820
$$ 833 -2642 4582 -1273 -3098 7023 -2931 -2522 5070 -3846 -353 1664 -1217 3113 -1949 1871
1552A871K069j0158Q622l76r221J0167k072m316N481l406K376j520k970Q119q003
$$ 1871 3940 -6218 2404 2028 -7193 2974 902 -3414 2067 -1339 1037 -483 -3453 4666 -3337
1567c337p26J0107j0345K429O962p194L432l76j320K528o120O009J214q802J0055
$$ -3337 -4063 6044 -4301 -1872 5090 -2104 1328 952 -368 2160 -3960 2049 3263 -5539 4516
1582D516j324p953R004l370k890M089l752L796m040j336Q802q916J319Q388j0405
$$ 4516 3192 -4761 4243 873 -2017 2072 -1680 2116 -1924 -3260 5542 -3374 -2055 6333 -4072
1597d072K984M133o298L607j529J247K082o779P409j83q451J0425k877o367P994
$$ -4072 -1088 3045 -3253 354 -1175 72 2154 -4625 2784 2601 -5850 4575 1698 -4669 3325
1612C325m176k00K029k781N176n190n57Q023r778K273O785r482L881K375m242
$$ 3325 -851 -1051 978 -1803 3373 -1817 -2374 5649 -4129 -1856 4929 -4553 -672 1703 -2539
1627b539L853l184K939J061p160Q567j764p335R992l781m129O772l891J616J38
$$ -2539 1314 -1870 1069 2130 -5030 3537 1773 -5562 4430 649 -3480 3292 -599 1017 1155
1642A155k108N636o648M04P320r883L709N059q242M421N6k230L078m691M672j34
$$ 1155 -953 4683 -1965 -1561 5759 -4124 -415 4644 -3598 823 879 -1351 1727 -2964 1708 1574
1658A574p627Q740k757n445R214m387j718M472m152K998j784j272O516p501J588
$$ 1574 -6053 2687 -70 -5515 3699 -688 -2406 2066 -2086 912 -872 -2144 4372 -3129 -1541
1673a541O425r008M666L413o302M487k040q39K549n274N794n19o233Q916m056
$$ -1541 4884 -4124 542 3955 -2347 2140 100 -739 1810 -3464 2330 1811 -4422 4494 438
1688D38l963P411n123K85K762m135M095l503j38O470p657L141M543q665M674J065
$$ 438 -3525 3886 -1237 -952 1810 -2325 1770 -1733 -1871 4599 -3058 83 4626 -4039 635 1700
1704A700m479M939l174J487J836n633O503j880n046P990n040k473N924n423K698
$$ 1700 -2779 2160 -1014 473 2309 -3324 3179 1299 -3747 4243 -797 -3270 2654 -2769 -71
1719g1J419l415M953n018L40N046p461M175L016p202N751j076k541M963m395K904
$$ -71 1348 -2067 2886 -2132 -1792 3254 -4207 -32 2984 -4218 1533 457 -2084 2879 -1516 1388
1735A388P92n824O521k872l350P843n206O2M050n592L569p58k829N625n840J217
$$ 1388 2180 -3644 2877 5 -3345 4498 -708 -646 3404 -2188 1381 623 -2206 3419 -2421 -1204
1751a204M367p171M882J476n489N846l624j204L980n054M138N01m823O519l500
$$ -1204 3163 -4008 874 2350 -3139 2707 -917 -2121 1859 -3195 943 1444 -3379 3140 -360
1766c60k218O507n959K153K481n266M702k103j726N567n765K142L154o838N388
$$ -360 -2578 3929 -2030 123 2604 -2662 2040 -63 -1789 3778 -1987 155 3309 -3529 1859
1781A859j330l580O008m556N58L226n527M809n70m042O361m711m23M912o102L761
$$ 1859 529 -3051 2957 -1599 -1041 2185 -3342 1467 897 -3145 3216 -1495 -1918 2994 -3108 653
1797F53R64m514N878l616r61N089o062L300J520n156N618k544k415N527n170K164
$$ 653 1617 -2897 2981 -635 -1596 3493 -2569 731 2251 -2905 2713 169 -2246 3281 -1889 275
1813B75K196n816N480j931l085N938n109J338L137n671M638p06l332N615m445
$$ 275 2471 -3345 2135 204 -2881 3057 -2052 -714 2423 -3248 1390 684 -2648 2967 -1478
1828a478M61M031n808L954M71m400N816l566m58M394o123L757Q87n229N790l204
$$ -1478 -1017 3014 -2794 1160 1631 -2769 3047 -519 -977 3417 -2706 1051 1938 -3291 2499 -705
1844g05j432N084n449K553J845n278N247k245k495N389n043J887K842n768N066
$$ -705 -2137 2947 -2502 51 1896 -3382 1865 -380 -2875 2514 -2529 -642 2200 -3568 1498
1859A498j076k936N678m640P62L536n852M633j83l848O017m277k4M302n758L383
$$ 1498 422 -2514 3164 -1476 -714 2822 -3030 1603 1420 -2428 3589 -688 -712 3590 -2168 1215
1875A215M47m549N456l258r15M368n323L221J168n059N305k676k001N146n063
$$ 1215 1662 -2887 2569 -689 -1604 2764 -2559 662 1830 -3229 2076 -600 -2601 2545 -2518
1890b518J977K516m995N218k076k458N374n094J309L386n734M513m70k987N272
$$ -2518 -541 1975 -3020 2198 122 -2336 3038 -2056 -747 2639 -3095 1418 948 -2039 3233
1905C233m637P54L356n765M144p0m301N807l482m77M232n196L084O98m264N390
$$ 3233 -1404 -650 2706 -3059 1085 1015 -3286 2521 -961 -1438 2794 -2402 682 1380 -2884 2506
1921B506l339j380N280n429K753K273n171M549j778k072M541m647K166K105n336
$$ 2506 -833 -2213 3067 -2362 391 2664 -2507 2042 264 -1808 2733 -1914 252 2357 -2979
1936b979N203j334l402N631m162J48L063n289L925q03k804N797m615L60M044n881
$$ -2979 2224 890 -2512 3119 -1043 -895 2168 -3121 804 1 -2803 2994 -1621 -1261 2783 -3098
1952c098L112J235m251N016l091l97M038n168L577J418n328N777k623k640N407
$$ -3098 14 1249 -3002 2014 -1077 -1474 2564 -2604 973 2391 -2937 2840 217 -2423 2984
1967B984m479J881J923m188M149k352j743N409n815J731L303o038M004l54k843
$$ 2984 -1495 386 2309 -1879 2270 -82 -1825 3584 -2231 -500 2803 -3235 769 415 -2428
1982b428M292l389J184K453n429M787p32m273O285l254j190M289m514K432P75
$$ -2428 1864 -1525 -341 2112 -3317 1470 738 -3535 2750 -504 -1694 2595 -1919 513 1288
1997A288l233M866l994l53M852o119K795K562n148M090j305k071L889m195K477
$$ 1288 -1945 2921 -1073 -1426 3426 -2693 102 2664 -2484 1606 301 -1770 2119 -2076 401
2012D01J200n008N462j793l502O224l858k30L106l941L141j130j929N083m961
$$ 401 1601 -3407 2055 262 -3240 2984 -874 -1104 2002 -1939 1202 72 -1857 3226 -1735
2027a735J121M377o581L546J406m398M354k220o69K781m621L923k01m207O020
$$ -1735 -614 3763 -2818 728 2134 -2264 2090 -130 -799 1982 -2639 1284 1083 -3124 2896
2042B896l125k774N893m697Q91K249l524L539k094j051M722n464K167L508o095
$$ 2896 -229 -3003 2890 -1807 -916 1333 -2191 1348 -746 -1797 2925 -2539 -372 3136 -2959
2057b959M052M71l496M185k961J059J886m623M845j282m114O181l671j313M771
$$ -2959 1093 1564 -1932 2253 -708 351 2237 -2386 2459 1177 -2937 3244 -427 -1740 3031
2072C031m755K048N39k962M081l423K13M355o260L061K090n650M684n03k325L598
$$ 3031 -1724 324 863 -2099 1982 -1441 -1228 3127 -3133 -72 2018 -3632 1052 549 -1776 1822
2088A822l452K070Q09m440N695k077l160O021m429j32L575l894K778m39k297M118
$$ 1822 -1630 440 1249 -3191 2504 427 -2733 3288 -1141 -1273 2302 -1592 1186 747 -1550 2568
2104B568m803J479L689o063L962J114m851M494j729q41L167m005L101m55m063
$$ 2568 -2235 -756 2933 -3130 832 1946 -2905 1589 -140 -981 2186 -1819 1282 827 -3236
2119c236N820k643k075N870m963R03K228l772L512j822o86L810n274K127K934
$$ -3236 2584 -59 -2134 3736 -1227 -324 1904 -1868 1644 -178 -864 2946 -2328 -201 2733
2134B733n892M412Nl760M125k758Q2K288l962M195j185l425N767m025o10M711
$$ 2733 -3159 1253 1258 -2502 1623 -1135 -1053 1235 -2727 1468 283 -3142 2625 -1400 -2010 2701
2150B701m661J985J011k872L824k808M11L588n722L099J665n134M999j242k470
$$ 2701 -1960 25 1036 -1836 1988 -820 -409 3179 -2543 556 2221 -2913 2086 844 -1626
2165a626L991l400J626J062l764M518k493k494N143m341M90L873m450K586m47
$$ -1626 2365 -1035 591 1653 -2111 2407 -86 -2580 2563 -1778 -1288 2585 -1865 721 274
2180B74k355M389l763J228K465n259L546Q08l804M813j893j220K645l977K504
$$ 274 -2081 2308 -1455 -227 2238 -3021 525 1333 -2471 2342 449 -771 1874 -2103 401
2195D01M27l251N344l368j523M673m783J572K425l856L437k167j630L811l868
$$ 401 828 -2423 2921 -447 -1970 2703 -2080 -508 1917 -1939 1498 -669 -2299 1512 -2356
2210b356K369K552n271M038r84l325M703k462O16K319m237L386q39k709N566l621
$$ -2356 13 2565 -2706 1332 348 -2977 1726 -736 -120 2199 -2038 1348 509 -2200 3366 -255
2226b55j09L079m989K309J171l101M212k380n83K828m835K842J415m220M648j838
$$ -255 -364 2715 -2274 35 1206 -1895 2317 -63 -646 2182 -2653 189 1604 -2616 2032 194
2242A94k430L835l394J665J723l649L852k177k028M693l660R20L184m706L201
$$ 194 -2236 1599 -1795 -130 1593 -2056 1796 -381 -2409 2284 -1376 -456 2728 -1978 1223
2257A223o57k471M145l140M78K742m885L424l8l236M716k567q16K810m121K692
$$ 1223 566 -1905 2240 -900 -422 2320 -2565 859 821 -2415 2301 -266 -1082 1728 -2393 299
2273B99N53l138M372k449j182M051m338J758J836l945L921j652j470L781l496
$$ 299 852 -2286 2086 -363 -1545 2506 -1832 -74 1762 -2183 1738 86 -1384 2397 -1099
2288a099J255K027m277L718r35k578M313l457N02K599m448L547n89k792M185l314
$$ -1099 156 2183 -2094 1624 689 -1889 2424 -1033 -531 2068 -2380 1167 578 -2214 1971 -1343
2304a343L2L232m440K906L80l357M246k621l35L180l930K529Q52l525M145k023
$$ -1343 -1311 1921 -2519 387 767 -2590 1656 -965 -1300 1880 -2050 479 1331 -2194 1951 -72
2320g2j341L860l926J589J595l846L948j480j985M034l591R82K295m349L455n61
$$ -72 -1413 2447 -1479 110 1705 -2141 1807 327 -1658 2376 -1215 -233 2062 -2287 1168 607
2336F07k583M019l330N98K497m153L329o8l165M357k810l28L232l938K553L91
$$ 607 -1976 2043 -1287 -689 1808 -2345 984 916 -2249 2108 -702 -1030 2202 -1736 817 1208
2352A208l032L823k425o50L573m129J614J550l901L882j619j678L915l951J552
$$ 1208 -1824 1999 -426 -1076 2497 -1632 -18 1532 -2369 1513 -106 -1784 2131 -1820 -268
2367b68J684l927L660j280k038L890k938Q92K000l842L121l28k503M048k992K54
$$ -268 1416 -2511 1149 -131 -2169 1721 -1217 -325 1675 -2167 954 626 -1877 2171 -821 -567
2383e67K828l953K742L23l120L984k630m70L222l889J900J006l471L819j787j401
$$ -567 2261 -1692 1050 1373 -1747 2237 -393 -863 2359 -1530 370 1376 -2095 1724 -63 -1464
2399a464L590l718J485J462l708L469j292j601L698l452J116K019l808L164m85
$$ -1464 2126 -1592 -107 1355 -2353 1116 -176 -1777 1921 -1531 -415 1604 -2204 960 475
2414D75k396L907k912L76K537l960K913J11k962L903k440n49L246l908K065O04
$$ 475 -1921 1986 -926 -550 1987 -1973 940 1051 -1911 1992 -448 -997 2249 -1659 406 1010
2430A010k817L613k188q65L109l613K019R91l506L583j505j205L497l452J425
$$ 1010 -1807 1806 -382 -1247 1862 -1751 268 1259 -2247 1336 -169 -1374 2123 -1329 96
2445I6J598l629L396r87k194L842l302O98K528l986K956m46k306L878k923Q2K483
$$ 96 1694 -1935 1461 474 -1720 2122 -1180 -482 2046 -1940 1016 570 -1736 2142 -781 -699 1784
2462A784l805K530K40k873L610k074n09K826l494K070O03l042L653j845j031L423
$$ 1784 -2021 509 749 -2124 1486 -588 -1097 1729 -1765 305 908 -2134 1519 -326 -1357 2066
2478B066l339J580J331l275L108j347j483L491l395J088K120l544L015o89k254
$$ 2066 -1273 307 1638 -1637 1471 124 -1359 2132 -1263 -175 1945 -1599 1416 727 -1527
2493a527L162k610R6K168l438L015n9k764L694k404n57K852l548K040M95k472
$$ -1527 1635 -975 -879 1289 -2149 866 807 -1957 1737 -667 -1224 1628 -1920 120 615 -1857
2509a857L375j915m00K989l539J719J094l514L449j604r38L106k891J252J224
$$ -1857 1518 -397 -797 2192 -1347 372 1466 -2048 1401 -203 -1141 1965 -926 326 1550
2524A550l428K956r00j881L454k950N05K059l072K619k28k076L179k770K58K059
$$ 1550 -1878 1078 178 -1703 1751 -1199 -694 1365 -1707 912 684 -1392 1787 -983 -725 1334
2540A334l391K496O51k785L450j848m98K422l022J829M27k983L248j915q63L558
$$ 1334 -2057 439 1090 -1695 1755 -93 -591 1831 -1191 638 1065 -1918 1330 -585 -1448 2110
2556B110k997J257J043l611K958j282j071L177k765J002J304l281K849m56j599
$$ 2110 -887 370 1413 -2198 760 -522 -1593 1584 -1181 -179 1125 -2156 693 237 -1362
2571a362L372k973J85J681k847L022J12k228L195k781k61K398k927K320M65k760
$$ -1362 2010 -963 -778 903 -1944 1078 1190 -1038 2157 -624 -885 1513 -1414 906 1371 -1389
2587a389K821k021k78K882l105J655N69l404K896j326j025L400k472J072Q91l119
$$ -1389 1432 -589 -867 2015 -1090 565 1134 -2270 626 -700 -1725 1675 -797 275 1166 -1953
2603a953K639p88j470L482k722K81J797k973K591Q0j702K704k682n8K115l179
$$ -1953 686 -102 -1572 1910 -812 -531 1266 -1707 884 964 -738 1966 -716 -774 1341 -1838
2619a838K525M22k457L117k241o73K592k874J844L32k621K978j420r14L193l083
$$ -1838 687 1109 -1348 1769 -472 -1145 1447 -1427 417 749 -1872 1106 -314 -1228 1965 -1118
2635a118J141J372l195K616r25j112L113k731Q95J456k742K402n73j839L047k787
$$ -1118 23 1395 -1800 816 -109 -1221 1892 -839 56 1512 -1230 1172 599 -1240 1807 -980
2651i80N89J858k979K314r8k265L065k366R6K113l008J902K05k221L147j748n40
$$ -980 -391 1467 -1512 802 704 -1561 1504 -862 -766 1347 -1661 241 446 -1775 1372 -376 -916
2668i16K577k844J071Q15k541L170j235r21K626k625R11J326k787K633r79j478
$$ -916 1661 -1183 -112 703 -1838 1332 97 -824 1802 -823 88 1414 -1373 1260 281 -1197
2684a197K462k449R83J455k456K140n61k068K827k181N28J917l022K232r7k081
$$ -1197 1265 -1184 -201 1254 -1202 938 377 -1691 1136 -1045 -517 1400 -1622 610 513 -1568
2700a568K822j434k65K249l176J654L48k002K695j276m17K307k983J134R87k589
$$ -1568 1254 -180 -445 1804 -1372 282 630 -1372 1323 47 -370 1937 -1046 88 1075 -1514
2716a514K806j196j107K504k754R56J458k638K288p27j684K699k287N86J865k655
$$ -1514 1292 96 -1011 1493 -1261 -305 1153 -1485 803 76 -1608 1091 -1196 -610 1255 -1400
2732a400K058o3k169K571j532o6K024k833J985K30k027K598j384o37K391k616
$$ -1400 658 595 -1574 997 -535 -601 1423 -1410 575 805 -1222 1376 -8 -645 1746 -870
2748h70J146N54k291K565j260o67K358k683J111R87k470K558q44j425K518k299
$$ -870 276 830 -1461 1104 -156 -823 1535 -1148 -37 950 -1520 1038 194 -1231 1287 -1012
2764a012N90J611k649K403m98j684K709k026J03J988k847K032k24j652K563j728
$$ -1012 -422 1189 -1460 943 445 -1239 1470 -556 -453 1535 -1312 720 496 -1156 1407 -321
2780c21j58J904k739J593M22k447K866j451o21K264k565J317P86k445K622j180
$$ -321 -479 1425 -1314 279 701 -1746 1120 -331 -952 1312 -1253 64 850 -1595 1027 -153
2796a53j089K521k260R55J207k395K412j056j036K347k233N43J393k243J955j54
$$ -153 -1242 1279 -981 -26 1181 -1214 1198 142 -894 1453 -780 -237 1156 -1087 868 714
2812G14j721K529j884j06J800k792J956k86j856K714j419l57K077k707J525M69
$$ 714 -1007 1522 -362 -468 1332 -1460 496 210 -1646 1068 -351 -708 1369 -1338 187 656
2828F56k272K527j215n15K374k525J221Q39k328K483j060j376K503k109O52J320
$$ 656 -1616 911 -304 -819 1555 -970 251 1090 -1238 1245 185 -1191 1312 -797 -145 1175
2844A175k353K181o93j349K469k019J16J667k678J738L2j523K518j739PJ784k538
$$ 1175 -1178 1003 310 -1039 1430 -589 -473 1194 -1484 254 286 -1237 1281 -458 -451 1333 -1205
2861a205J529K08k220K668j240m28K347k658J509P38k476K259j104r28K338k225
$$ -1205 324 532 -1688 980 -260 -688 1659 -999 510 1248 -1228 1031 -73 -1001 1337 -888
2877h88R18J171k170K001q80j441K603k387L52J587k433K018k24j406K605j890
$$ -888 30 1201 -969 1032 152 -1289 1314 -1073 -721 866 -1567 451 227 -1179 1426 -464
2893d64j8J615k556J724J47j636K439j490j75J913k369J360K69k054K362j307
$$ -464 -482 1133 -1423 301 448 -1188 1251 -239 -414 1499 -870 490 759 -1295 1067 -240
2909b40n83K138k296J106R89k206J961r09j067K103k111Q86J007k300K209o26
$$ -240 -823 1315 -981 125 1114 -1092 869 -40 -1107 996 -1115 -229 778 -1522 687 61
2925F1r44K458k273K35J580k595J844J98j521K323j658k2J930k764J525K15k023
$$ 61 -883 1575 -698 -463 1117 -1478 366 564 -957 1366 -292 -314 1616 -1148 377 592 -1431
2942a431K481j368m70K279k521J125P60k277K388j325o54K009k248J150R98k236
$$ -1431 1050 -318 -788 1491 -1030 95 855 -1422 966 -359 -1013 996 -1252 -102 896 -1340
2958a340K201q40j262K339j911N56J371k532K347l55j659K555j691k02J686k381
$$ -1340 861 21 -1241 1098 -813 -257 1114 -1418 929 574 -1085 1470 -221 -423 1263 -1118
2974a118J602M7j761K420j749o6J964k473J336M73k106K388j284n85J971k316
$$ -1118 484 531 -1230 1190 -559 -625 1339 -1134 202 675 -1431 957 -327 -912 1059 -1257
2990a257J489O67k149K352j000j128K241j903P27J199k603K134o37p97K102k103
$$ -1257 232 899 -1250 1102 102 -1026 1215 -688 39 1238 -1365 769 132 -665 1437 -666
3006f66P10J164k548J753J1j668K494j779P9J281k165J689R1j789K213j423m30
$$ -666 44 1208 -1340 413 424 -1244 1250 -529 -450 831 -1334 355 446 -1343 870 -553 -983
3023i83K044k202J341N73j737J893j119n13K148k382J220Q56k471K201o01j017
$$ -983 1061 -1141 200 773 -964 929 -190 -703 1445 -937 283 1139 -1332 869 268 -749
3039g49J909j520L43Q10j928J672m83j272K812k060k7J501k159J426J69j289J903
$$ -749 1160 -360 -17 793 -1135 537 54 -1218 1594 -466 -493 1008 -1151 275 444 -845 1058
3056A058j593jJ564k485J846N83k171K177r74r60J930j709J069N69k219K326j195
$$ 1058 -535 -536 1028 -1457 389 972 -1199 978 4 -956 974 -735 334 903 -1316 1010 -185
3073a85q53K436k189N94J132k182J528l32r45K125j702N34J295k864K011O6j612
$$ -185 -1038 1398 -791 -197 935 -1247 281 -51 -996 1129 -573 -39 1256 -1608 403 469 -1143
3090a143K245j242j69J186j941J646m4j437K444j663p40K180k414J276O80j543
$$ -1143 1102 -140 -309 877 -1064 582 538 -899 1545 -118 -858 1322 -1092 184 864 -679
3106f79J518j215l55J739k184J188J052k653K221n84j296K147j259L96Q11k061
$$ -679 839 -376 -731 1008 -1176 12 1064 -1589 632 48 -1248 899 -360 36 847 -1214
3122a214J911p23j088K578k071K26J659k145J100M00j229J870j794K18J261k477
$$ -1214 697 -26 -1114 1464 -607 -381 1278 -867 233 633 -596 1274 -520 -302 959 -1518
3138a518J808N91k083K347j219j145J881j661J071N39j727K264j644o08K396k098
$$ -1518 290 881 -1202 1145 -74 -1219 662 -999 72 611 -1116 1148 -496 -1104 1292 -806
3154h06P41J618k783J478k98p83K085j688J014P15k937K408m73j423K336j208
$$ -806 -65 1553 -1230 248 -50 -833 1252 -436 578 1293 -1644 764 291 -1132 1204 -4
3170dn20J259j937J492j3j265K581k312j66K000k550J363R83j589J545j145l06
$$ -4 -524 735 -1202 290 277 -988 1593 -719 -885 1115 -1435 -72 911 -678 867 -278 -584
3187e84J513j861J521M58k514K476j025j288K435j378N19P86j801J474j138n09
$$ -584 929 -932 589 1047 -1467 1009 -16 -1304 1131 -247 272 1058 -743 731 -407 -916
3203i16K343k142L84J322k440J388N44j596K147j525J83J069k073J726M7j647
$$ -916 1427 -715 -331 991 -1449 -61 483 -1113 1034 -491 -308 761 -1312 414 461 -1186
3219a186K434j086j196K111j665R59L38j350J708j023r44K419k370R45J269k472
$$ -1186 1248 162 -1034 1077 -588 371 709 -641 1067 44 -900 1519 -851 94 1363 -1109
3235a109J672l55j083J644j482N19J034k201K211n73j568K213j299l54J454j844
$$ -1109 563 208 -875 769 -713 -194 840 -1361 850 277 -1291 922 -377 -731 723 -1121
3251a121J460R6j314K160j935J12J792k470J483L74j709J952j091k71J533j846
$$ -1121 339 435 -879 1281 -654 -542 1250 -1220 263 637 -1072 880 -211 -482 1051 -795
3267g95J134L66j970K207q25j046K110j893L70J100j732J712q05p75J991k044
$$ -795 339 705 -1265 942 117 -929 1181 -712 -342 758 -974 738 -67 -842 1149 -895
3283h95M56J418k096J593K96j564J648j379M09J134j944J359K04j739K229j175
$$ -895 -439 979 -1117 476 772 -792 856 -523 -114 1020 -924 435 639 -1100 1129 -46
3299d6n51J756j954R47M06j700J855j001m08J661j882R60N99j799J794p24r82
$$ -46 -597 1159 -795 152 558 -1142 713 -288 -696 965 -917 43 642 -1157 637 -87 -1069
3316a069K011j784Q06R93j905J493k13j212J954j451m8J546k092J558M8j527K075
$$ -1069 942 -842 -36 957 -948 545 332 -880 1074 -377 -425 1121 -971 587 635 -892 1183
3333A183j363k07J471k238J554Q5j643J970j015m65J599j872J179M17j797J999
$$ 1183 -180 -387 1084 -1154 400 485 -1158 812 -203 -668 931 -941 238 655 -1142 857
3349H57q80r10K061j805O56R47j930J630m01r30J751j609K63J420k281J741j46
$$ 857 -23 -933 1128 -677 -21 926 -1004 626 225 -705 1046 -563 -300 1120 -1161 580 434
3366D34j327K007j625O5J277j959J370K6j495K155j187k20J565j887R36O54j802
$$ 434 -893 1114 -511 -446 831 -1128 242 268 -1227 928 -259 -479 1086 -801 135 789 -1013
3383a013J753o77o47J763j856R24P71k145J932n44p27J585j760O07Q40j859J732
$$ -1013 740 63 -584 1179 -677 247 1018 -1127 805 261 -466 1119 -641 -34 806 -1053 679
3400F79n23j079K104j878M14J294k112J417j44j472K175j273n7J554j939J255
$$ 679 156 -923 1181 -697 -283 1011 -1101 316 172 -1300 875 -398 -455 1099 -840 415
3416D15K24j710J929q47n22J588j540P95L61j616J777p95o63J696j729M33R67
$$ 415 639 -1071 858 11 -511 1077 -463 332 693 -923 854 59 -604 1092 -637 -204 763
3433G63j807J528l41j197K009j668M30J142k111J643j69j297K138j499j4J424
$$ 763 -1044 484 143 -1054 955 -713 -283 859 -1252 391 222 -1075 1063 -436 -450 974
3449I74j793J160J09j381J854j071l14J554j750R49M87j653J550r99k08J465j850
$$ 974 -819 341 450 -931 923 -148 -462 1092 -658 291 778 -875 675 -324 -532 933 -917
3466i17J004N05j775J857n11r98J567j260K15R03j697J630o45p03J900j371qJ146
$$ -917 87 592 -1183 674 163 -835 732 -528 -313 590 -1107 523 -122 -825 1075 -296 -304 842
3484H42j808J399J49j352J552j273J84J353j956J250L17j544J713j134k76J319
$$ 842 -966 433 582 -770 782 -491 -307 1046 -910 340 657 -887 826 -308 -584 735
3500G35j642J084J93j235J656j063m40J946j907M43R47j764J535n38n07J527j488
$$ 735 -907 177 370 -865 791 -272 -712 1234 -673 -230 717 -1047 488 -50 -557 970 -518
3517e18O59P04j956J792j97j572J895r32l38J033j108J248o05j069J997j612q0
$$ -518 141 845 -1111 681 484 -1088 807 -125 -463 570 -538 710 105 -964 1033 -579 -659
3534f59J606j762Q91L50j284J331m02n75J412j796R78O11j839K169r42q49J713
$$ -659 947 -815 76 426 -858 473 71 -504 908 -888 90 701 -1138 1031 89 -760 953
3551I53j163K15O32j397J327o70n17J736j759M14J211j725Q21J47j104J389q88
$$ 953 -210 5 637 -760 567 -103 -620 1116 -643 -229 982 -743 78 225 -879 510 -378
3568c78R1P14j520J508P3j629K046p04q57J399j324N53L38r73J700j209m31J898
$$ -378 -287 427 -1093 415 488 -1141 905 201 -656 743 -581 -28 310 -663 1037 -172 -603 1295
3586A295k128P01J389k083J166j80r42J344j096Q93N33j784J561o47j519K225
$$ 1295 -833 -132 1257 -826 340 160 -782 562 -534 359 892 -892 669 22 -1497 728
3602G28r22k78J168j296P63k92n24J881j353p8J225j962R39P84j564J699n77l80
$$ 728 -194 -472 696 -600 163 -129 -653 1228 -125 -203 1022 -940 -1 783 -781 918 341 -39
3620c9L11r81R53J41j169J730r98r89J572r65J17J095j150P64j004l33J493j425
$$ -39 272 -709 244 385 -784 946 -52 -1041 531 -434 -317 778 -372 392 -612 -945 548 -877
3638h77J056J247k159Q67J67j178J473o34K53N31j711J124R4j087K141p16r93
$$ -877 179 1426 -733 134 301 -877 596 -38 215 746 -965 159 253 -834 1307 591 -402
3655d02J214j549K77O76o86J352j227j87J464j986Q52J305j943J271l96q55R55
$$ -402 812 -737 -460 216 -470 882 -345 -532 932 -1054 -202 1103 -840 431 35 -820 135
3672A35o23Q84L55j539J764r32j355K281j104j39J298j289L52m6o17J514j206
$$ 135 -488 396 751 -788 976 44 -1311 970 -134 -273 1025 -264 88 42 -575 939 -267
3689b67J46J162k140J084O02j630J701n22o93R08j080J000Rj139J831j053p37
$$ -267 -121 1041 -1099 -15 587 -1043 658 136 -557 351 -729 271 280 -859 972 -81 -818
3706h18J865j335l8J049j004N14m59l08J431j583N85R79j713J102K79j349J280
$$ -818 1047 -288 -326 723 -281 233 -226 -534 897 -686 -101 878 -835 267 546 -803 477
3723D77o67M2O42j328J244k33r69J816j241m38J513j384M79M21j052J130p90K34
$$ 477 -190 -148 494 -834 410 177 -792 1024 -217 -655 858 -526 -47 374 -678 452 -338 -104
3741a04R58j533Q76N85j568J428l31j087J377q70L79J78q05J197n39r84J738j342
$$ -104 854 -679 197 782 -786 642 311 -776 601 -269 110 288 -517 680 141 -843 895 -447
3759d47j39J241j158P64r9p06J262j109O5J056j761J340J33j321J519l87m65Q73
$$ -447 -586 655 -503 261 162 -544 718 -391 -326 730 -1031 309 442 -879 640 253 -212 661
3777F61j096R73m6j187J512q72m74J590j478K52Q86j235P28p1n75J104j275M36
$$ 661 -435 538 492 -695 817 -55 -529 1061 -417 -165 721 -514 214 143 -432 672 -603 -167
3795a67M69j192J244q0j111J509j080J72Q11j381J252m73n23J479j091m3J058
$$ -167 302 -890 354 274 -837 672 -408 -236 575 -806 446 -27 -550 929 -162 -205 853
3812H53j200L65O20j103R66m87l51J028j304P50K97j225J274l16q10J146r99M17
$$ 853 -347 18 638 -465 501 14 -337 691 -613 137 434 -791 483 167 -643 503 -496 -79
3830g9M00r51J142o41m23J414j121J67R94j648R98J77j169J303p87r7J049j399
$$ -79 321 -630 512 -129 -552 862 -259 -92 902 -746 252 429 -740 563 -224 -321 728 -671
3848f71Q92L02j182J399o79k75O65j042O90K76j190J313n08n23J325j346M11P46
$$ -671 221 523 -659 740 61 -214 451 -591 99 375 -815 498 -10 -533 792 -554 -143 603
3866F03j230J036k52n21J092j035L02O42j266J232m15p83J465j335L00O33r10
$$ 603 -627 409 157 -364 728 -307 -5 637 -629 603 188 -595 870 -465 -165 468 -442
3883d42P70J27j190J584j257R4R93j401P29K19j094J501p96j70J101j396Q20M17
$$ -442 328 455 -735 849 -408 -314 679 -722 7 226 -868 633 -163 -333 768 -628 192 609
3901F09j344J116j96o99J385j248K75P54j352J137m57m24J360j225K83P27j479
$$ 609 -735 381 185 -514 871 -377 -102 652 -700 437 -20 -444 916 -309 -26 701 -778
3918g78J035N1q43R71p45P7P94j246P24L00j224J383o15l48J218j216N19N39j171
$$ -778 257 308 -535 436 -309 -232 562 -684 40 340 -884 499 -116 -464 754 -462 57 596 -575
3937e75J071m36l52J054j229M99N93j307Q96k39n82J161r92K51N19j067J196l74
$$ -575 496 60 -292 762 -467 32 625 -682 214 -25 -607 554 -438 -187 332 -735 461 87
3955H7r64J511r39j2Q62r19O31R5q93J255r69j75R16j184P75K46q98J320q03r1
$$ 87 -877 634 -305 -317 545 -374 257 352 -541 714 -255 -430 486 -698 77 323 -575 745 -58 -149
3975a49Q22j471R44J32r24J162n85m40J302j034K05O23j070Q28m68m02J077j064
$$ -149 673 -798 146 278 -646 516 -69 -509 793 -241 -36 587 -483 345 -123 -525 552 -512
3993e12K58P22j121R69pr09J209p18QL77r66J209k41r80J548r00m68J256j144
$$ -512 -254 468 -653 316 309 -600 609 -109 -101 276 -690 519 278 -702 846 -54 -522 734 -410
4012d10M29N2o59R18p26j56J395j602P29N51j496J222k30o78R48m96M81K34j055
$$ -410 19 71 -588 330 -396 -552 843 -759 -30 521 -975 247 17 -661 287 -209 272 506 -549
4031e49J253n45r56J538r55k24R36q62Q18l93k34J056j254K12Q56j682J191L06
$$ -549 704 159 -797 741 -214 -438 498 -364 454 61 -173 883 -371 -159 697 -985 206 512
4049E12j374J223m13k11P67j027P33j37r51J589j008m49J540j109j21J143r67
$$ 512 -862 361 -52 -263 504 -523 210 73 -878 711 -297 -746 794 -315 -436 707 -260
4066b60O29l72k58J028j354O74Q01j687J389j78j053Q93l08k0N42j213J066l36
$$ -260 369 -3 -261 767 -587 87 888 -799 590 412 -641 252 -56 -76 466 -747 319 -17
4084a7q95J864j161j36J255j398J52M87o43R70q16K89R29j602J007M35j334J193
$$ -17 -912 952 -209 -345 910 -488 -336 151 -492 478 -338 -49 880 -722 285 720 -614 579
4102E79k53p21O65n95L57J98n29J354j085r07J607j072P3J199j250N09n5o42J119
$$ 579 326 -395 270 -325 32 230 -299 1055 -30 -937 670 -402 -329 870 -380 129 74 -568 551
4121E51j230P29Q74j876J106L33j397J214N2n84N76n40N29l85n18J393r69l93
$$ 551 -679 50 924 -952 154 487 -910 304 356 -228 348 -192 337 -48 -566 827 -142 -535
4139e35J388j297l1J139q30M19l59q3P22j711J269O89j683J362k2j519J391j44
$$ -535 853 -444 -475 664 -166 253 -106 -189 533 -1178 91 780 -903 459 437 -1082 309 165
4157A65l09O34q08J035q14n34J490j135m8J373j368Q7O01q22O92m28L28M56j650
$$ 165 -144 490 -318 717 -97 -631 859 -276 -324 1049 -319 -232 369 -453 239 -189 139 595 -1055
4176a055J411J26j501J423J77j424J083l31K2J59o18J214q64n05J659j496n3J332
$$ -1055 356 482 -1019 404 581 -843 240 -91 -69 90 -528 686 -178 -683 976 -520 -573 759
4194G59j100M21J54n63Q39p35N29K61j447J382%j378J475m80o13R31o68N15m88
$$ 759 -341 80 234 -329 510 -225 304 565 -882 500 500 -878 597 117 -496 435 -233 282 -206
4213b06k08J075q59m42J573j558L89Q91j279R33m26j88P41q99O45K00j067J346
$$ -206 -414 661 -198 -640 933 -625 -236 655 -624 309 -117 -305 436 -463 182 382 -685 661
4231F61k64r06J206p28k48P91p89P54m26m64J043j054q4J305j404O82K78r28N82
$$ 661 397 -509 697 -31 -279 512 -277 477 51 -413 630 -424 -508 797 -607 75 353 -575 7
4250Gj27o9O03j001R44R4j295J454l36p09J084q14O7N57q23R82o12l94J249j374
$$ 7 -120 -189 414 -587 357 451 -844 610 274 -435 649 -165 -98 459 -364 618 6 -388 861 -513
4270e13L49O90j081Q39M7o01P20o75K67L64j342J287j88p64J209q32m35J180q99
$$ -513 -164 526 -555 284 331 -270 450 -225 42 406 -936 351 163 -601 608 -224 -659 521 -378
4289c78M26K32p11R95p72j79J253j260M13L15j089J033O6q95J168j134M50N30
$$ -378 48 280 -431 564 -208 -387 866 -394 19 334 -755 278 344 -551 617 -517 -67 463
4307D63j313J136k52p65J155o19r9P58r55N20p0l85J245j182J44J077j446P13
$$ 463 -850 286 34 -731 424 -195 -294 464 -491 29 -41 -426 819 -363 -219 858 -588 125
4325A25K13j001J340p73j1P76j059P46P2r71J060m92m95J189r28J26K72o78Q16
$$ 125 338 -663 677 -96 -107 669 -390 356 428 -543 517 25 -470 719 -209 -83 189 -489 327
4344C27m29l41J059j068J15P61j058Q32N0p22J049p98q5J026j275R36j6r01J224
$$ 327 -102 -443 616 -452 -337 424 -634 198 248 -474 575 -223 -308 718 -557 379 363 -538 686
4363F86p51n2Q46j162P64J19q96R65o89j15R81j103M02M29j071Q67j78n48R10
$$ 686 -65 -117 729 -433 331 450 -446 519 -170 -285 696 -407 -5 424 -647 220 42 -506 404
4382D04r90L90P19j038R50l15q74J404j028L05O00r75P04N8q25J139q25J09P93
$$ 404 -586 -196 523 -515 435 120 -754 650 -378 -73 527 -448 256 314 -511 628 -197 -88 705
4401G05j171M84J91q34J060m82l46J015j192O88n0p12J243p36m00J181j115M70
$$ 705 -466 18 209 -625 435 -47 -393 622 -570 118 68 -644 599 -137 -537 644 -471 -1
4419aM47j084Q52j40n48J218j037J91P56j241Q89L7q31J061p47K1P71r49M43R0
$$ -1 446 -638 214 74 -474 744 -293 -102 654 -587 302 339 -492 569 -178 -157 614 -335 108 198
4439A98q67J122p29J1P94j105M48K20o44J127p77j27J024j211P19K66j155R43
$$ 198 -669 453 -276 -265 529 -576 -128 92 -552 575 -202 -329 695 -516 203 469 -686 257
4457B57j71m68J070j073L89L36q53J067n71n82J199r65k2P53q19M77O8o60J106
$$ 257 86 -382 688 -385 4 340 -513 554 -17 -599 600 -365 -387 366 -453 24 92 -568 538
4476E38q36J42P79j135P21K71j090J121n31k00P86j066N89L32q46Q93o94p8R69
$$ 538 -298 -156 623 -512 209 480 -610 511 -20 -220 566 -500 89 421 -425 468 -226 -304 665
4495F65j003L05P21j170O13l77l30J279j328M38O67j143J014l06q39J173p65K20
$$ 665 -338 -33 688 -482 131 -246 -576 703 -625 -187 480 -663 351 45 -794 379 -386 -166
4513a66P00j029Q35l73m18J285r87r5R89j323P03M16r03Q43o40J47O00j083M87
$$ -166 534 -495 340 -33 -451 834 -153 -248 741 -582 121 537 -366 477 -163 -16 584 -499 -12
4532a2M65j175J254k37p28J011q05K36K98q23J005m26n90J210r84J77P70j099
$$ -12 453 -722 532 295 -433 578 -227 9 307 -516 489 63 -527 683 -301 -124 646 -453
4550d53N76K05n61O65o90J46P10j285J039Q8j147J410n76n20O81o74N74k01n27
$$ -453 123 328 -233 432 -258 -112 598 -687 352 440 -707 703 127 -393 288 -386 188 -13 -540
4569e40J255r98p8J068j254M19O55j016O87k71j53N91r71J053j59j003J278j12
$$ -540 715 -283 -361 707 -547 -128 527 -489 198 -73 -226 365 -606 447 288 -715 563 451
4587D51j073J093k48m72O49o63O00m57k29R37j047qJ182j296M73M34r02O21j19
$$ 451 -622 471 223 -249 400 -263 337 -120 -349 588 -459 -467 715 -581 -108 326 -576 45 -74
4606g4R6K23q99J170p1j351J576n64p85J257o77j41N74n36Q24j060J96J133j337
$$ -74 22 245 -654 516 445 -906 670 106 -679 578 -99 -240 334 -202 622 -438 -242 891 -446
4625d46K55J034j383L90M30p36P91p68N79K18j073J244n11p92J293n73m26P97
$$ -446 -191 843 -540 -150 280 -456 335 -433 146 364 -709 535 24 -768 525 -48 -474 323
4643C23m44J74N7l06M68n71J29J178j795M51J218j617Q94K8l33L25o74P70j77
$$ 323 -121 53 110 -196 272 -299 -170 1008 -787 -336 882 -735 159 187 -146 179 -495 275 98
4662I8r25J747p59r15J216o08k73O08n65N19j04n53J212j247K65R15j249O13M70
$$ 98 -827 920 161 -754 462 -146 -419 189 -376 143 39 -514 698 -549 -284 631 -618 -5 465
4681D65j017R16o5k15J38p83J019j47r71J386o03o92R96n72j30N16m87N32o07
$$ 465 -552 364 299 84 222 -561 458 311 -660 726 123 -569 427 -145 -275 241 -246 286 -321
4700c21p5J211j597O73Q06j341Q36P1n24N78l70K98J58q23Q63l21p97J439q38
$$ -321 -396 815 -782 -109 697 -644 192 263 -261 317 -53 245 403 -420 443 122 -675 764 -74
4719g4k49R06q16K78P3m56P48p43J60Q31j182M40P13j360R25j35n10N79l27M82
$$ -74 -323 583 -233 45 118 -338 410 -333 -173 658 -524 -84 629 -731 194 59 -451 128 -199 283
4739B83j37n89J060o70o48J450q92j46P73p08M45k31k53Q58r74M62M05j058P75
$$ 283 146 -443 617 -53 -701 749 -143 -289 484 -224 221 -10 -263 595 -379 83 488 -570 205
$$ [...]
8191C3
##END NTUPLES=NMR FID
##END=
