##TITLE=1H_67-2023
 CDCl3
 8 sc, 
 5.9.2023
##JCAMPDX= 6.0         $$ Bruker NMR JCAMP-DX V2.0
##DATA TYPE= NMR FID
##DATA CLASS= NTUPLES
##ORIGIN= UXNMR, Bruker Analytische Messtechnik GmbH
##OWNER= root
$$ XWIN-NMR		Version 3.5
$$ Tue Sep  5 14:17:55 2023 Russian Standard Time (UT+4h)  she@DPX200
##.OBSERVE FREQUENCY= 200.13135
##.OBSERVE NUCLEUS= ^1H
##.DELAY= (6, 6)
##.ACQUISITION MODE= SIMULTANEOUS
##.ACQUISITION SCHEME= undefined
##.AVERAGES= 8
##.DIGITISER RES= 18
##SPECTROMETER/DATA SYSTEM= spect
##.PULSE SEQUENCE= zg30
##.SOLVENT NAME= CDCl3
##.SHIFT REFERENCE= (INTERNAL, CDCl3, 0, 15.7039)
##AUDIT TRAIL= $$ (NUMBER, WHEN, WHO, WHERE, WHAT)
$$ ##TITLE= Audit trail, XWIN-NMR		Version 3.5
$$ ##JCAMPDX= 5.01
$$ ##ORIGIN= Bruker BioSpin GmbH
$$ ##OWNER= she
$$ F:/spectra/data/she/nmr/H-F/1/audita.txt
$$ ##AUDIT TRAIL=  $$ (NUMBER, WHEN, WHO, WHERE, WHAT)
(   1,<2023-09-05 14:16:51.53 +0400>,<she>,<DPX200>,
      <created by zg, POWCHK disabled, PULCHK disabled
       configuration hash MD5:
       00 E9 B6 7A A2 85 ED C7 34 08 36 98 17 FE 4E 26
       data hash MD5: 16K
       61 00 52 F9 66 F5 EB F7 91 B7 9A 75 6D 8C 99 E1>)
$$ ##END=
$$ 
$$ hash MD5
$$ A1 6C A1 45 CB B7 73 00 05 CF 41 B0 C9 73 4F BB
##$RELAX= 
##$RELAX= 
##$RELAX= 
##$RELAX= 
##$RELAX= 
##$RELAX= 
$$ Bruker specific parameters
$$ --------------------------
##$DU= <F:/spectra>
##$EXPNO= 1
##$NAME= <H-F>
##$PROCNO= 1
##$TYPE= <nmr>
##$USER= <she>
##$AMP= (0..31)
100 100 100 100 100 100 100 100 100 100 100 100 100 100 100 100 100 100 
100 100 100 100 100 100 100 100 100 100 100 100 100 100 
##$AQSEQ= 0
##$AQ_mod= 1
##$AUNM= <au_zg>
##$AUTOPOS= <>
##$BF1= 200.13
##$BF2= 200.13
##$BF3= 200.13
##$BF4= 200.13
##$BF5= 200.13
##$BF6= 200.13
##$BF7= 200.13
##$BF8= 200.13
##$BYTORDA= 1
##$CFDGTYP= 0
##$CFRGTYP= 5
##$CHEMSTR= <none>
##$CNST= (0..31)
1 1 145 1 1 1 1 1 1 1 1 1 1 1 1 1 1 1 1 1 1 1 1 1 1 1 1 1 1 1 1 1 
##$CPDPRG= <>
##$CPDPRG1= <>
##$CPDPRG2= <>
##$CPDPRG3= <>
##$CPDPRG4= <mlev>
##$CPDPRG5= <mlev>
##$CPDPRG6= <mlev>
##$CPDPRG7= <mlev>
##$CPDPRG8= <mlev>
##$CPDPRGB= <>
##$CPDPRGT= <>
##$D= (0..31)
0 1.2 0 0 0 0 0 0 0 0.06 0 0.03 0 0 0 0 0.0002 0 0 0 0 0 0 0 0 0 0 0 0 
0 0 0 
##$DATE= 1693909010
##$DBL= (0..7)
120 120 120 120 120 120 120 120 
##$DBP= (0..7)
150 150 150 150 150 150 150 150 
##$DBP07= 0
##$DBPNAM0= <>
##$DBPNAM1= <>
##$DBPNAM2= <>
##$DBPNAM3= <>
##$DBPNAM4= <>
##$DBPNAM5= <>
##$DBPNAM6= <>
##$DBPNAM7= <>
##$DBPOAL= (0..7)
0.5 0.5 0.5 0.5 0.5 0.5 0.5 0.5 
##$DBPOFFS= (0..7)
0 0 0 0 0 0 0 0 
##$DE= 6
##$DECBNUC= <off>
##$DECIM= 32
##$DECNUC= <off>
##$DECSTAT= 4
##$DIGMOD= 1
##$DIGTYP= 9
##$DL= (0..7)
0 120 120 120 120 120 120 120 
##$DP= (0..7)
150 150 150 150 150 150 150 150 
##$DP07= 0
##$DPNAME0= <>
##$DPNAME1= <>
##$DPNAME2= <>
##$DPNAME3= <>
##$DPNAME4= <>
##$DPNAME5= <>
##$DPNAME6= <>
##$DPNAME7= <>
##$DPOAL= (0..7)
0.5 0.5 0.5 0.5 0.5 0.5 0.5 0.5 
##$DPOFFS= (0..7)
0 0 0 0 0 0 0 0 
##$DQDMODE= 0
##$DR= 18
##$DS= 0
##$DSLIST= <SSSSSSSSSSSSSSS>
$$ [...]
##$SUBNAM2= <"">
##$SUBNAM3= <"">
##$SUBNAM4= <"">
##$SUBNAM5= <"">
##$SUBNAM6= <"">
##$SUBNAM7= <"">
##$SUBNAM8= <"">
##$SUBNAM9= <"">
##$SW= 18.05172834244
##$SWIBOX= (0..15)
0 0 2 0 0 0 0 0 0 0 0 0 0 0 0 0 
##$SW_h= 3612.71676300578
##$TD= 16384
##$TD0= 1
##$TE= 0
##$TE2= 300
##$TE3= 300
##$TEG= 300
##$TL= (0..7)
0 120 120 120 120 120 120 120 
##$TP= (0..7)
150 150 150 150 150 150 150 150 
##$TP07= 0
##$TPNAME0= <>
##$TPNAME1= <>
##$TPNAME2= <>
##$TPNAME3= <>
##$TPNAME4= <>
##$TPNAME5= <>
##$TPNAME6= <>
##$TPNAME7= <>
##$TPOAL= (0..7)
0.5 0.5 0.5 0.5 0.5 0.5 0.5 0.5 
##$TPOFFS= (0..7)
0 0 0 0 0 0 0 0 
##$TUNHIN= 0
##$TUNHOUT= 0
##$TUNXOUT= 0
##$USERA1= <user>
##$USERA2= <user>
##$USERA3= <user>
##$USERA4= <user>
##$USERA5= <user>
##$V9= 5
##$VALIST= <valist>
##$VCLIST= <CCCCCCCCCCCCCCC>
##$VD= 0
##$VDLIST= <DDDDDDDDDDDDDDD>
##$VPLIST= <PPPPPPPPPPPPPPP>
##$VTLIST= <TTTTTTTTTTTTTTT>
##$WBST= 1024
##$WBSW= 4
##$XGAIN= (0..3)
0 0 0 0 
##$XL= 0
##$YL= 0
##$YMAX_a= 305842
##$YMIN_a= -352012
##$ZGOPTNS= <>
##$ZL1= 120
##$ZL2= 120
##$ZL3= 120
##$ZL4= 120
##$ABSF1= 10
##$ABSF2= 0
##$ABSG= 5
##$ABSL= 3
##$ALPHA= 0
##$AQORDER= 0
##$ASSFAC= 0
##$ASSFACI= 0
##$ASSFACX= 0
##$ASSWID= 0
##$AUNMP= <proc_1d>
##$AZFE= 0.1
##$AZFW= 0.1
##$BCFW= 1
##$BC_mod= 2
##$BYTORDP= 1
##$COROFFS= 0
##$CY= 11.3945322036743
##$DATMOD= 1
##$DC= 2
##$DFILT= <>
##$DTYPP= 0
##$F1P= 15.7292609196834
##$F2P= 12.9074282941183
##$FCOR= 0.5
##$FTSIZE= 0
##$FT_mod= 4
##$GAMMA= 1
##$GB= 0.15
##$INTBC= 1
##$INTSCL= 1
##$ISEN= 128
##$LB= 0.24
##$LEV0= 0
##$LPBIN= 0
##$MAXI= 10000
##$MC2= 0
##$MEAN= 0
##$ME_mod= 0
##$MI= 1.114404
##$NCOEF= 0
##$NC_proc= 0
##$NLEV= 6
##$NOISF1= 3.799351
##$NOISF2= 2.8
##$NSP= 1
##$NTH_PI= 0
##$NZP= 0
##$OFFSET= 15.70392
##$PC= 1
##$PHC0= -21047.35
##$PHC1= 10.85272
##$PH_mod= 1
##$PKNL= yes
##$PPARMOD= 0
##$PSCAL= 0
##$PSIGN= 0
##$REVERSE= no
##$SF= 200.130013532006
##$SI= 16384
##$SIGF1= 3
##$SIGF2= 2
##$SINO= 400
##$SIOLD= 16384
##$SREGLST= <1H.CDCl3>
##$SSB= 0
##$STSI= 0
##$STSR= 0
##$SW_p= 3612.71676300578
##$SYMM= 0
##$S_DEV= 0
##$TDeff= 0
##$TDoff= 0
##$TI= <>
##$TILT= no
##$TM1= 0
##$TM2= 0
##$TOPLEV= 0
##$USERP1= <user>
##$USERP2= <user>
##$USERP3= <user>
##$USERP4= <user>
##$USERP5= <user>
##$WDW= 1
##$XDIM= 8192
##$YMAX_p= 0
##$YMIN_p= 0
$$ End of Bruker specific parameters
$$ ---------------------------------
##NTUPLES= NMR FID
##VAR_NAME=  TIME,          FID/REAL,        FID/IMAG
##SYMBOL=    X,             R,               I
##VAR_TYPE=  INDEPENDENT,   DEPENDENT,       DEPENDENT
##VAR_FORM=  AFFN,          ASDF,            ASDF
##VAR_DIM=   8192,          8192,            8192
##UNITS=     SECONDS,       ARBITRARY UNITS, ARBITRARY UNITS
##FACTOR=    0.0002768,     1,               1
##FIRST=     0,             0,               0
##LAST=      2.2672688,     0,               0
##MIN=       0,             -352012,         0
##MAX=       2.2672688,     305842,          0
$$ Real data points
##PAGE= N=1
##DATA TABLE= (X++(R..R)), XYDATA
$$ [...]
2201A511k366J51k318K358K613k304N73j262o57L163q32M98L31k630J755O22r36
2218B70J132k690J86K254j549J287j407j955K781k88O78J014l384N67R18k88K647
2235B173k224j662J104j115J969J108k612J706r43L61K358k057L46K05j376K933
2251B274j104j791K90j851K159K095k433M43j878q18L950k91K01o77l421J959
2267h93J457j11J515l348p52K018n71K522j032k564J906l78J728J429l444l50
2283h68K58R2L724k117k568k06r39L419J673k332o05k410M87M177J77l39k299
2300f76k963K905J937K43K67m008K16K422K67K073k049k862J900M09K365N65m272
2317a261j41L09J240L283k545k792m08p04M437J620k678r47k872J369M350l53
$$ plain form
2201 1511 -855 -704 -3022 -664 1949 -355 218 -1044 -1701 1462 630 1128 1459 -1171 584 1206 270
2218 270 1402 -1288 -1102 1152 -397 890 -517 -2472 309 21 699 1713 -1671 -1104 -186 -474 2173
2235 2173 -51 -1713 -609 -1724 245 1353 -1259 447 -496 -135 2223 166 512 717 -659 2274
2251 2274 1170 -621 -331 -2182 -23 2072 -361 82 -1796 -2614 1336 1045 1246 569 -2852 -893
2267 -893 564 453 1968 -1380 -2132 -114 -685 1837 805 -1759 147 -231 1497 2926 -518 -868
2283 -868 -610 -518 3206 1089 -1479 -1685 -2624 795 2468 136 -469 -2879 -2392 1785 1962 1623 -676
2300 -676 -3639 -734 1203 1446 1713 -2295 -2079 343 610 2683 634 -2228 -328 81 2446 3011 -1261
2317 -1261 -1402 -1093 147 3430 885 -1907 -2315 -3019 1418 3038 360 -587 -3459 -2090 2260 1907
2333A907l52k402k538L124J279O92j18l999Q97J726O35K130l018k031J931K71
2349A34K408k90m078L97J66J443L095l151j800o85j15M155R21k431q41k130J807
2366i95L348j236J64k540j420L231L48M67k19l285J427J744j66J553l469p81K239
2383D10q8J872j221l027P26L47J525K087l500q14K6Q8L552o58j822k77j430K186
2401a8J991j674L46j896k15L036o58L8o53k261K436Q27m37M68k838K48K209l63
2419E86J044j683k638J836L85J430R26l539N6P07L04K953j901j356M86j080K503
2436A019Q71k234M79j406Q73K444j331k56q88j155K817R8r83L5k573J350J998
2453A158n15N39k194j378K269p7J552l88k862J141M30N43J917k327p70O46o04
$$ plain form
2333 1907 1555 -847 -3385 -261 1018 1710 1592 -2407 -1510 216 851 2981 -37 -2068 -137 134
2349 134 2542 2252 -1826 -1429 -1263 180 3275 124 -1676 -2361 -2476 1679 2600 169 -672 -2802 -995
2366 -995 2353 1117 1281 -1259 -2679 552 900 1367 1148 -2137 -710 1034 868 2421 -1048 -1829 410
2383 410 322 2194 973 -2054 -1328 -981 544 2631 -869 -1683 -1657 -1569 1983 1325 -497 -774 -2204 -18
2401 -18 1973 299 645 -1251 -1466 1570 912 950 297 -1964 472 1299 862 1330 -1508 -1260 949 586
2419 586 1630 -53 -2691 -855 -470 960 1886 -1653 -1597 -890 -586 2367 466 -890 -404 -1484 1019
2436 1019 1890 -344 135 -1271 -398 2046 715 459 -429 -1584 1233 1331 348 383 -2190 -840 1158
2453 1158 643 1182 -1012 -2390 -121 -198 1354 966 -1896 -755 -325 218 2135 -192 -962 -316 -920
2470i20K488k16k199J058j332J491J942k314J1p84l35K546n27j110J61k205J827
2487d18J428p77N85k249l83K297l89P69o38j991J567L78K60J245k411l4Q90j21
2505HJ855j216j520J124q94J614O73k247K18m55J51K534j550r43K43j334K330
2522E91L96j425M63j593P56J762j048P75j044j032K108m4K17J21k295J032J266
2539A006l21J126k196p73J480m52J350k54k431J083n15R70J623k193m09K85m07
2556a028K326o90j211L80j410J720J715j747M6j265j70K603l77j50n01j849J966
2573C58P40l69P63k659m3J705l80J312j409j869J297j13J093Q47k564K11L20J26
2591f34K425j328j189K28p92K245Q13k119L51j233N15K641j028k95q84j306J948
$$ plain form
2470 -920 1568 1352 -847 211 -1121 370 2312 -2 9 -775 -1110 1436 909 -201 -40 -2245 -418
2487 -418 1010 233 818 -1431 -1814 483 94 863 225 -1766 -199 179 439 1684 -727 -761 129 8
2505 8 1863 647 -873 251 -643 971 1644 -603 -385 -840 -689 1845 295 -648 -405 -1739 591
2522 591 987 -438 25 -1568 -812 950 -98 677 -367 -1399 709 665 882 1003 -1292 -260 1006
2539 1006 685 1811 -385 -1158 322 -130 1220 966 -1465 -382 -897 73 1696 -497 -906 -621 -1028
2556 -1028 1298 608 -603 -223 -1633 87 1802 55 101 -1164 -1334 1269 892 742 241 -1608 358
2573 358 1098 729 1492 -1167 -1210 495 115 1427 18 -1851 -554 -667 426 1273 -1291 -1080 -760 -634
2591 -634 1791 463 -726 -498 -1290 955 1768 -351 0 -1233 -718 1923 895 600 -284 -1590 358
2608C58R84n64J73k213M77J258o04J233j508j356J751k53J128q7k302O97M03N86
2626A61J607j965r58Q40l65J985K18k090M46j079J167J882j407k69o93o20K335
2643A195o29l79K24j984J251Q22o93P92j663o28J959j98P10o38j740J444L53M80
2661F78J073k412j61P47j26J855q67j587O95q68J585J240j782O3q67j86K241j054
2679B67m87N5j433J668N92q15J40j496M50J951l82o8o88j531J883M06M59J88k386
2698a227L79J012J33J526j671j473J316o76J639L13j873M77o89P52J480j639j09
2715c30m56n29K114j12j092K05j162J028J557q60K01j147o54K104k44K28l1k050
2733a230R87O58l6J014j767n99J091m96J384n37j412N59m22P79J075j771q1N4
$$ plain form
2608 358 1342 778 951 -1262 -785 473 -131 1102 -406 -1762 -11 -264 864 777 -1525 -828 -425 161
2626 161 1768 -197 -1155 -315 -680 1305 1523 -567 -121 -1200 -33 1849 442 173 -520 -1140 1195
2643 1195 566 187 411 -1573 -322 500 -193 599 -1064 -1692 267 69 779 141 -1599 -155 198 678
2661 678 1751 -661 -822 -75 -201 1654 787 -800 -105 -973 612 1852 70 133 -734 -920 1321 267
2679 267 -220 -165 -1598 70 662 -153 -13 -1509 -1059 892 510 442 -246 -1777 106 512 971 1159 -1227
2698 -1227 -848 164 297 1823 152 -1321 -5 -681 958 1271 -602 -125 -814 -62 1418 -221 -330
2715 -330 -786 -1315 799 687 -405 -200 -1362 -334 1223 363 564 -583 -1237 867 623 851 820 -1230
2733 -1230 -243 415 379 1393 -374 -973 118 -378 1006 469 -943 -384 -806 -27 1048 -723 -804 -750
2751g50n1J905p85j132N39q36J581R34j139J2j136m0K032m05P5p17j443J550L32
2770E26m2L96j784J04J358o32R55j095j135R83J39O81J56j765N05K96K43J542
2788A431j202j039L63k63J771K43j489K55j225J126J823j234k87p17q32K094j19
2805F99k71j40j933J067J414n54J63j402p25J677J00N33j18j971R31K35Q56J235
2823A796k132o01L88L79J813m39j583j0o28J282J721j759k38j018k56K344k07
2840H52n62n53j386J547P77k99L20j920k6J529J09P54r39j678J018L44R74O83
2858A544k076m29P13k2K078q17j759K71m31J489J071j571l47q89J13K164l91l44
2876C67p27j572J982M65k09M73j863Q3J471k44P99j054j355J507p5P75M99j919
$$ plain form
2751 -750 -801 1104 319 -813 -274 -1110 471 1405 266 278 -858 -898 1134 729 804 87 -1356 194 526
2770 526 484 880 -904 -800 558 -74 881 -214 -1349 -366 -227 454 610 -1155 -650 -354 -111 1431
2788 1431 229 -810 -447 -710 1061 1304 -185 70 -1155 -29 1794 560 273 -444 -1276 818 699
2805 699 428 288 -1645 -578 836 282 445 -957 -1682 -5 95 628 510 -1461 -530 -295 561 1796
2823 1796 -336 -937 -549 -170 1643 1204 -379 -389 -1017 265 1986 227 -11 -1029 -1285 1059 852
2840 852 290 -263 -1649 -102 675 376 696 -1224 -1250 279 388 1142 203 -1475 -457 -113 861 1544
2858 1544 -532 -961 -248 -270 1808 991 -768 -497 -928 561 1632 61 -286 -1175 -1062 1102 711 367
2876 367 -360 -1932 50 515 306 779 -1084 -1001 470 226 1025 -29 -1384 123 48 823 1322 -597
2894e97MN78R0J533j367q55L88n55J329O39j502M0q44M72J542q88l9l03q44J439
2914B60P9m43O57j557P87R08o05K65o11o61J395k60L18J47j657J148J33l08J054
2933A049j327n40Q48n10J272k72j269O21p17M81R59j178M22j53m28J491n92m02
2951b45L44m75Q67L75j004L95r29M73J301o79j21k96r99J341Nj45N94j700L95
2970e03P01o00J033j127n13P56k06O43K5q87N37J90j44J228j601j77Q72m64J263
2989A026n9j701Q18r52R93J301j219j54n59m15J733m72k20R3j450R83Q68o89M96
3008D21j110j65J063l04L93%j440J078L33L70O35k043M9O95P9J426q59j435M19
3027c95k88J327R00j620n7o40j7J898n70l56n18j028J422M29m38J85j424M80J324
$$ plain form
2894 -597 -593 -15 75 1608 241 -614 -226 -781 548 1187 -315 -275 -1119 -647 895 7 -32 -335 -1179 260
2914 260 339 -104 553 -1004 -217 691 86 351 -260 -921 474 214 532 679 -978 170 303 -5 1049
2933 1049 -278 -818 30 -480 792 520 -749 -128 -845 -364 595 -583 -161 -314 -742 749 157 -245
2951 -245 99 -376 491 866 -138 257 -672 -199 1102 423 302 6 -993 348 353 208 802 -898 -503
2970 -503 198 -402 631 -496 -1009 -253 -459 184 209 -678 -141 49 -95 1133 -468 -645 227 -237 1026
2989 1026 967 -734 84 -868 125 1426 207 53 -506 -921 812 340 120 213 -1237 -254 614 -75 421
3008 421 -689 -854 209 -95 298 298 -1142 -64 269 639 1274 -769 -720 -25 54 1480 621 -814 -395
3027 -395 -683 644 1544 -76 -133 -773 -790 1108 538 182 -336 -1364 58 487 49 234 -1190 -710 614
3046F14k94L48q47j215J583K08O34J88k331M13P40N67J064j261j458M15l9J529
3064H58M21j744J67q31M59J901r86n10l33o92J875J62o67n4j432Q72J335k08K3
3083F16j416n67J852K59N17m01j996L37O49O99J164j991p77O52j60J591l9j614
3101f25j00k58J034J095j111k52q25J10J978m02o30j92j293J622Q25n89L77j725
3119i61r0J879l5K35p50j511Q16P07K84O19j733l46N46J35J547r77j380M85k09
3138g39J099O10j389n7n46N35J791p96p96r0p15J474J036p33m03j214J16J792
3156I75k81Q2p45j629J503L95K53L88j998K57Q37j83J316j113r13L39q8J174M64
3175A033j555JJ5L22J841j127o42l00m65J703K68q44K1j283L85J477k85L3r43
$$ plain form
3046 614 320 668 -179 -1394 189 397 1031 1219 -1112 -699 41 608 1672 411 -1047 -632 -671 858
3064 858 1279 -465 -298 -1129 -670 1231 245 -265 -598 -1290 585 747 80 26 -1406 -534 801 593 616
3083 616 -800 -1367 485 744 1261 860 -1136 -799 -150 549 1713 -278 -1055 -403 -563 1028 989 -625
3101 -625 -725 -983 51 1146 35 -217 -1042 -932 1046 644 14 -178 -1471 151 976 387 764 -961
3119 -961 -1051 828 793 1028 278 -1233 -417 290 574 1193 -540 -886 -340 -205 1342 365 -1015 -530 -739
3138 -739 360 970 -419 -476 -1022 -487 1304 508 -288 -378 -1093 381 1417 684 281 -933 -817 975
3156 975 694 776 31 -1598 -95 300 553 941 -1057 -800 37 -146 1170 57 -856 -517 -605 569 1033
3175 1033 -522 -521 -506 -184 1657 530 -112 -412 -877 826 1094 250 271 -1012 -627 850 565 598 -345
3194c45j107J539K08K36L8j818M01P07K69R26j421p06J001l56J401k36j468M88
3212b43j76O24J070j430R0k99l50J868l70r60K14j039P87J269q17J32j173l97
3230a200J627k77L15l96j421J221L27Q8L42j317J44O81k11Q69n02j047P67l3M31
3249D08O81j502J65L0QJ307o18p13K78q21J343p9q29M16p28J50R70l55J40l94
3269a43q81J237J6q7O5r85M50R58m42M92p19q88J186pM30O8j319M27j21K62Q18
3290H17r62l05K58l05J247k32j250P24o72N38R79j076K43l75m12J384k40j44m0
3309A77r41P81Q50o07N53j336P1J017n04L64j28j204R85K0k1P38j496J76M74j79
3329b10R65o41p04L75n84J042N02j188K39j49k08J529n82m51R4o78J221K01p23
$$ plain form
3194 -345 -1452 87 295 531 569 -1249 -848 -141 128 1054 -367 -1073 -72 -428 973 737 -731 -243
3212 -243 -419 205 1275 -155 -65 -364 -714 1154 784 -176 38 -1001 -214 1055 238 370 -803 -1200
3230 -1200 427 150 465 69 -1352 -131 196 284 626 -691 -547 134 -77 792 290 -757 10 -23 408
3249 408 1089 -413 -248 -218 -210 1097 479 -234 44 -777 566 487 -342 74 -654 -504 466 111 251 -143
3269 -143 -1024 213 229 142 207 -778 -328 630 188 680 -39 -927 259 252 682 750 -569 -142 -263 -1 817
3290 817 -145 -450 -192 -497 750 518 -732 -8 -680 -142 837 -239 4 -371 -783 601 361 217 177
3309 177 -764 17 867 260 813 -523 -452 565 61 425 297 -907 78 98 77 815 -681 -505 -31 -210
3329 -210 755 114 -590 -215 -799 243 745 -443 -204 -353 -561 968 386 -65 29 -649 572 773 50
3348E0L40j073M73Q67m65K80o48j043J293l7J47J93j396O10L48L12N12r69p87
3367i93Q10k94J169q9j013K14l61O19J114r88k74J35o27J208J60r13L41j082P16
3386a48R03o82J40j024j72J255P8j13o3j176O31O80j12O25j352k32Q31l09J215
3405I75p60j184P33m6O25O79j333J07L2k70J445m58q71J27o57R08Q75j090N29
3424C66j087J70J248o05Q2p9j151J014L23j04N61j361J2O72k5O81o41q61P70k15
3444b30Q12K85j042j32NK67R75q64m71J01l71J008M24r40Q9n56K08J199n66p3
3464A28l72m92Q56L04j0j07j275P85O34k94O35q99m85J029l05M86q7j098M09R6
3484f2J94O96j063l67L86j68J127l40q35K02l97P17N13r42J04k81o4J388l07n09
$$ plain form
3348 50 390 -683 -210 657 192 472 -176 -1219 74 37 184 377 -1019 -409 -61 251 763 -206 -993
3367 -993 -183 -477 692 603 -410 -196 -557 62 1176 188 -86 49 -578 630 790 -123 218 -864 -148
3386 -148 755 73 213 -811 -983 272 350 237 174 -1002 -371 309 197 822 -530 -762 69 -240 975
3405 975 215 -969 -236 -282 343 1022 -311 -204 -172 -442 1003 545 -326 -199 -856 52 927 -163 366
3424 366 -721 -551 697 92 174 95 -1056 -42 281 177 738 -623 -611 61 36 717 76 -785 -15 -230
3444 -230 582 867 -175 -307 -302 -35 940 76 -395 -294 -665 343 767 -173 -84 -640 -432 767 201 128
3464 128 -244 -736 120 424 414 307 -968 -183 451 157 792 -107 -592 437 132 618 531 -567 -158 -62
3484 -62 132 828 -235 -602 -216 -384 743 403 -432 -230 -627 90 603 -339 -235 -516 -580 808 501 -8
3504hJ23r46Q95P44o56K30q53j39J226l61N35r41q24J084J12M9K87j316m0Q05
3524FR8N37n01j131Q49j71P22O30j398j82j60K95J684r21p76K60n03R93N82m75
3544D38j90j126M79J092j68J04r82o42R95M31N6q2j566K84R65o2R45r81q62N28
3564c44N5J162l4j316N7l04R03J317j244l38m07l37J337M57p30k70j088P86J022
3583F84m11L95j278m64J294l9L29l42j397O85N59J81O86j237l61N16J20J014k68
3602F66j207L63m72Q51R89j004m29j77k02J581m97n50k13o35Q25P17l21K5r21
3621f11j39J100j04J67m93q80P21M76L34n4j292N8Q02L6J056r17r71N31j98P82
3641D04M89j112k19K1K85J109o67n38Ko06J132M28q86K99r59L98J078l65J61p34
$$ plain form
3504 -8 115 -831 64 808 152 382 -471 -610 616 255 790 -151 -975 109 221 270 557 -759 -799 6
3524 6 104 641 140 -991 -142 -313 409 1039 -359 -541 -701 -406 1278 357 -419 -159 -662 331 913 438
3544 438 248 -878 -399 693 525 629 -353 -995 0 431 487 405 -1161 -877 88 26 971 -10 -872 -344
3564 -344 -289 873 839 -477 -420 -724 179 1496 252 -86 -493 -830 507 964 234 -36 -1124 -338 684
3583 684 273 668 -610 -1074 220 181 510 168 -1229 -544 15 196 882 -355 -716 -200 -80 934 666
3602 666 -541 -178 -650 201 1190 186 -243 -420 -622 959 462 -88 -301 -936 -111 606 285 310 -611
3621 -611 -750 350 246 413 -80 -960 -239 237 571 517 -775 -717 85 121 1177 260 -711 -180 -378 404
3641 404 893 -219 -438 -417 -132 977 310 -228 -226 -832 300 728 -158 141 -818 -420 658 293 454 -280
3661b80n74J132K47k4j40j147K78P46jQ46j116p58P19p9O26K13j203J15J24J14
3681a62R57q45j58j98k55J109P6o40k6k78K39R93n72j23o46j13J188j02J96l13
3701C27j089O81L67J30O22j289j23L33j19P92k20j007N20k57L47L99p04L8K9j56
3721c79J105p21l21K76n13Q43M73r46K57m04j17J139m92P9k32o69P69K33k43M54
3741E91r66N2O04n55N49l34n82O37j5J74m5o92L71K58q4Q33r86l64O65o35R42
3762D18Mo74M02n14K84P13n46O1j79l39P65l07k8K85r30L41O81p14J81l06rR55
3784E44n38L78k03r48P49L64J57N7r30k36N89qQ90n60q51L94j02N28M82r17M4
3805a17j46j8Q73n49k99J36l47N43L91o67K55p88K69J330m93l08l46m12R12L16
$$ plain form
3661 -280 -854 278 525 501 361 -786 -508 238 237 1083 -33 -791 -72 -151 475 688 -515 -400 -276 -162
3681 -162 795 -50 -208 -406 -661 448 524 -116 -142 -420 -181 812 240 117 -529 -642 546 444 640 327
3701 327 -762 -81 286 416 1038 -251 -374 -41 -160 632 412 -595 -75 -332 15 414 -290 -252 -223 -379
3721 -379 726 5 -316 -40 -553 290 763 -183 74 -330 -447 692 200 279 47 -622 147 380 137 591
3741 591 -375 -323 281 -274 275 -59 -641 -4 -19 155 110 -582 -211 47 -37 796 -190 -554 111 -524 418
3762 418 422 -252 150 -364 -80 633 87 148 -31 -370 395 88 60 345 -585 -244 437 -277 -96 -402 -411 544
3784 544 6 384 181 -767 -18 346 503 560 -370 -606 -17 -25 865 305 -546 -152 -254 274 756 -161 -117
3805 -117 -263 -281 592 43 -256 -120 -467 76 467 -200 55 -733 -464 866 373 65 -281 -693 219 535
3825E35J81j77j010L1M97J30M68n26p92O51j49N99j05o32K48r4r5P60m60j63k23
3846c26j74Q72L54j064O9l66L60R33o27J60m77m73R10Q9P3K2j070K69O27j50P25
3867G36p20n67M05p1O26N9r36N45k01J07P49j012p3J97k30Q54j37o70L23p21P57
3888B0N47m72O4l33m38J121k89J2J00r10N68K14k45M79n43k90O36k72M72m21p26
3909g06P78L7K76P5j144K71K32q9R78o43l50J89k43M98L91m85J0o33L21P55k91
3930B27j1j28q33R07L33l62J34p55K33M77j90J30k56o11Q65j77J58L10j185M10
3950c24K85n6Q01q45l45J94j39R74K13r20M4j53J30N48k95n7m7o33P90J58n08
3971a85L64o24K81M49l78L93o27l27R37k02K03j44p95L88K70J63M84p82r4K90
$$ plain form
3825 535 716 539 -471 -440 57 187 655 129 -663 -12 -161 438 333 -299 -51 -145 -240 520 60 -103 -326
3846 -326 -500 372 726 -338 -269 -635 -275 658 31 191 -286 -759 151 240 313 335 -735 -466 161 11 736
3867 736 16 -551 -146 -217 409 468 -468 77 -124 -17 732 -280 -353 -156 -386 468 331 -339 -16 -737 20
3888 20 567 95 159 -174 -612 509 220 232 332 -578 -10 204 -41 438 -105 -395 241 -31 441 20 -706
3909 -706 72 109 385 460 -684 -413 -181 -270 708 65 -285 -96 -339 159 550 65 75 -558 -237 518 227
3930 227 216 88 -745 162 495 133 267 -488 -255 222 32 162 -94 -705 160 -17 141 451 -734 -324
3950 -324 -39 -95 706 -139 -484 -290 -429 545 758 -162 -118 -271 -141 407 112 55 8 -625 165 323 -185
3971 -185 179 -445 -164 285 -93 300 -327 -654 283 81 284 140 -655 -267 3 166 650 -132 -226 64
3991F4j62Q27l55p63M08l22K34O14q05J46j59l46P03L7m79J99m16O29J44k48J54
4012A04o62K19P13m00K96k92p31P52K38l0L59q86N3L90p5P55m75o35L32m48P78
4033C55M1p33J54o2P6P38o62k66P9l78R86mm94K96n65L32M55k96K11m81m26R03
4055B59q7L7R1p93O33j11L8L90m55l63L43k52O67k10o95N56k31Q1P48q95K9J43
4077g7l01P35P4o92L47n22L61P74p87K66n27j69R37j73j20O8q33N87N66k87L93
4098F20j000r8O49j03M05l75p67N54N0l8O72p84JO1R2N20m28k99M69o78Q77L18
4120G18o91Jm67K51O02j71j81k22m12P43J77j06p2o79J20O75k20K23m64o43P24
4141i4R3J32K98r51J09K98K33Q34r20n56N60j98O38J1p09L69o14K85Q59o94j6
$$ plain form
3991 64 -98 729 374 -389 19 -303 -69 545 -260 -114 -273 -619 84 121 -358 -159 -575 54 198 -50 104
4012 104 -558 -339 374 -26 270 -22 -753 -1 237 207 566 -320 -267 123 48 803 328 -307 25 -423 355
4033 355 396 -337 -183 -245 -169 569 -93 -359 -280 -658 328 324 -170 126 -439 -107 348 52 263 -218 -644 259
4055 259 172 209 300 -493 140 29 67 457 2 -361 -18 -270 397 187 -508 48 -183 -102 646 -249 -220 -77
4077 -77 -378 357 431 -261 86 -436 -75 699 -88 178 -349 -518 419 246 126 194 -639 -52 514 227 620
4098 620 -380 -478 171 68 473 98 -669 -115 -65 -103 569 -215 -214 -153 -61 459 31 -268 201 -477 400 718
4120 718 27 28 -439 -188 414 243 62 -160 -572 171 348 242 170 -509 -389 286 66 289 -175 -818 -94
4141 -94 -1 131 429 -522 -413 -115 118 952 32 -524 36 -162 476 487 -222 147 -467 -182 677 -17 -33
4162c3j29o11J034K8l19J36q75O39N38n69L80k70n02Q39k45K31m9p85L69K06J3
4183B6O14q72k33L91k54P35N2p90K74m60O19M88q96K58j15l26Q34j53K6k40p61
4204g83O40M66l30K80p06j03Q03k20K79r9p43N91j13J05N02q46O0J69j67P74m76
4225H3m50K39l17P41J10n75R4l18pR41l27l38J40l43M81J59l47J78n79R7P14n27
4247a51L68k14n58Q21j72N9J19o39J64M28j28N27p22l99P97m28L62M0o73J94J26
4268g9k0O08n54j41j85j61R96o4o12L07n85M11O19m27K08m35l52P36k06J19j6
4289A67o92N72J04j74M55p13j11O41n37N20K24r40P41m44L27J47o14J65J63j89
4309a88P36k13m56K40m49L87N15o80J77k30k14P59k34k15J69o66O35Mp6K61r21
$$ plain form
4162 -33 -162 -773 261 289 -30 106 -769 -130 408 -161 219 -51 -553 286 41 272 223 -562 -193 13 26
4183 26 640 -232 -465 -74 -328 407 459 -331 -57 -517 102 590 -306 -48 -163 -489 345 192 218 -22 -783
4204 -783 -143 323 -7 273 -433 -536 267 47 326 227 -516 75 -38 67 569 -277 -217 -48 -215 559 83
4225 83 -367 -128 -445 296 406 -169 -75 -393 -400 541 214 -124 16 -327 154 313 -34 144 -435 -338 376 -151
4247 -151 217 3 -555 266 94 153 272 -367 -203 225 97 624 -98 -497 300 -128 234 274 -399 -205 -79
4268 -79 -99 509 -45 -186 -371 -532 464 400 -212 95 -490 -79 540 113 321 -114 -466 270 64 183 167
4289 167 -525 47 151 -23 432 -281 -392 249 -288 232 456 -484 257 -187 140 287 -327 -162 1 -188
4309 -188 548 335 -121 119 -330 57 572 -108 69 -161 -375 384 150 -65 104 -562 73 77 1 262 -659
4330f59O11J37j64L81l40m27O24l46M41M39j037J44J37l3N01l71k04K33o33P98
4350B32J40m84K31m71P6O20l65M2j11l04P66j62k52K37n89L20M18k56J63k09o78
4371f36P48nK0J03o91N58j46J04M47p34k40N60l91O64j10o17M27l21K91Q17j054
4392b06J69l35j85P47J12k12j23o39Q30J40k58K95r52J00P77k06L04k31q02O51
4412b4J20j7M47q67k5L85J08M19l89m75L96m88N85L08o74J2k16n0R79n09N1k16
4434a40m85O31N28n14L23p89j49R22m2K04k69p75P78n5K6K81q38L23qj23P46o59
4456h4l48M89l69O03J85o92L72l17j98Q42n24K60k98m33N14K62k51L27p10L94
4476B4K14j62J37l86k17Q61k78p3L7m83L63J91l42L94n52j54L69k25N11k69l64
$$ plain form
4330 -659 -48 89 -75 306 -34 -461 163 -183 258 697 -340 -196 -59 -92 409 38 -166 67 -566 232
4350 232 372 -112 119 -352 -276 344 -21 21 -90 -394 372 210 -42 195 -394 -74 344 88 251 42 -636
4371 -636 112 107 127 230 -461 97 -49 55 502 -232 -472 88 -303 361 251 -366 61 -260 31 848 -206
4392 -206 -37 -372 -557 190 302 90 -33 -672 158 298 40 335 -617 -517 260 54 358 127 -675 -24
4412 -24 96 79 526 -341 -366 19 127 546 157 -318 78 -410 175 483 -191 -179 -395 -445 534 25 76 -140
4434 -140 -625 6 534 20 343 -446 -595 327 285 489 220 -555 223 168 194 475 -363 -40 -48 -171 575 -84
4456 -84 -432 57 -312 291 476 -216 156 -161 -359 483 -41 219 -79 -512 2 264 13 340 -370 24
4476 24 238 76 213 -173 -390 471 193 120 157 -326 37 228 -114 280 -272 -426 -57 -282 229 -40 -404
4497d04M37j61J73M41p53K15J88n35Q06l97k42L67k64K16L67o35K90k76OP05m48
4518I6j13J26p03Q29O2l61K93o73K5M50oK93l86n80P13k74L68K24p48K76K28j16
4540B3N32l51m01K71m37R25j74n71K09l27J24P40n58ko1n38P08J3j00M8n26J23
4562c30O30k72L31o07l7L85j48M99M7n29NRJ18O14r39n0L63n7M10k44n46M59n34
4585d23M48N27n45R2l61l16R83l07lM4o26L05L38l71N87p56Q4L28k18M55j64n12
4607d11L48j1N7K55l87j33L47k39O26k33p21N54k08R5M00o72K84l70R8O84k44
4628A19j27J71n69O46N1k66J87n85O5Q04m09J62l40l20M48j13J29J77p31K20K36
4649d5R2O09n06k70O4q9M85J38p11L12k58qM87k72k38J89l25O70j73k56K18o12
$$ plain form
4497 -404 33 -128 45 486 -267 -52 136 -399 407 10 -232 135 -129 87 454 -181 109 -167 -161 544 96
4518 96 -17 109 -594 235 297 -64 229 -444 -419 31 25 318 -68 -648 65 -209 159 383 -365 -89 139 23
4540 23 555 204 -197 74 -363 562 388 -183 26 -301 -177 563 5 3 -58 -596 112 125 25 73 -453 -330
4562 -330 300 28 359 -248 -285 100 -48 451 498 -31 -26 -17 101 715 -224 -274 89 32 442 198 -348 111 -423
4585 -423 25 552 7 99 -262 -578 405 98 95 139 -487 -182 156 -215 372 -384 -300 28 -190 265 101 -411
4607 -411 -63 -74 -17 238 -149 -282 65 -174 452 219 -502 52 -156 -61 339 -333 -49 -419 -321 363 119
4628 119 -8 163 -406 240 291 25 212 -373 -308 496 87 249 -91 -411 37 -76 53 230 -501 -281 -45
4649 -45 47 656 150 -120 -56 -145 340 478 -233 79 -179 -187 300 28 -210 -21 -346 324 151 -105 113 -499
4671d99M64M77m09jk16l46P44k8n5K45p91N14p7L8N72r13n4L51n7L60k09m60M89
4694A39k39N5L62n45K61j33k58P33j48k22j08k82K22O70n75L8j60R6M15m31K72
4715A62J8q27O82QJ74P7l87l0K48k02L71k45m45M27k44M84K57q44K54k7M4M46
4737D01l58k98M19k96L21M5m25N45n74Q4O38m31L6jm11N68k58R9Q6o48M04K49
4759A95k76M27o02p6O10m83L00J29o43K68m3P0P39o88j15J45k21O33k62k64M44
4780B87l99J82L38l30l1j20k25O17k52q4J27n53M75K36k29L38m55j37N67l58K49
4801B43j15p09M74J3K05L23m50k10K72P8M29k41o64K39k14M81J29l60Q1l70J13
4822b53M39M1m8j62m58P86l07LOl33J00L30m9L93n19l66M35Q5Q3M2o86J47K93
$$ plain form
4671 -499 -35 442 33 32 -184 -530 214 186 131 376 -415 99 22 60 632 -281 -335 16 -41 319 110 -350 139
4694 139 -100 -45 317 -228 33 -100 -358 375 227 5 -103 -385 -163 507 -68 -30 -190 -94 321 -110 162
4715 162 180 -647 35 43 217 294 -93 -123 125 -77 294 49 -396 31 -213 271 528 -316 -62 -89 -45 401
4737 401 43 -255 164 -132 189 234 -191 354 -220 -136 502 71 107 106 -305 263 5 104 190 -458 -54 195
4759 195 -81 346 -256 -332 278 -205 95 224 -419 -151 -194 -124 615 -73 -188 -43 -264 369 107 -157 287
4780 287 -112 70 408 78 47 -73 -298 319 67 -17 110 -443 32 268 39 377 -78 -215 352 -6 243
4801 243 128 -581 -107 -94 111 434 -16 -226 46 124 553 312 -352 -113 -327 154 283 -77 4 -366 -253
4822 -253 186 227 179 17 -441 345 38 41 47 -286 -186 144 95 488 -31 -397 38 123 206 248 -438 -291 2
4845Br7M85m18p9R8j39M74j8m30L2q7n4Q91o30j37J91n90Q60j50j03K05q26K64
4868b56N22j93K81m08l03L92p7J98J48n28N1J27N6K79l84j19K69k40K40k0m25
4889c90K72l3J21N03o06Rj50K1O53l37l5P5m93M97J87m25J40j06k82L85J91j1
4911A86M9n58M06j7j85L68m83J0L31p3J51k79j70L10o2J36J48n10J27m7L62L21
4933E21m93k13K97l06L99J30m16Q4l77L31L81k61k86J08k60M74K58l42L16p71
4953d26M51J88j67K30m16j13K04J03K29O0o01J99L2l4M92n46j40N4j86P03j06
4974B10m38K87l44J08O53m42P3k98k1L12K0j11L4n26N71J12o6J67m13j08L11J41
4996B32K13j30p66L56J33n8K42k99l30K84q3M31j94k90J49j05L09M39p39K01j19
$$ plain form
4845 2 -95 390 -28 -107 -9 -148 326 308 -122 -90 -177 -231 660 30 -107 84 -506 354 204 101 306 -520 -256
4868 -256 266 73 354 -54 -357 35 -42 156 304 -224 -173 -46 10 289 -95 -214 55 -185 55 35 -390
4889 -390 -118 -151 -30 473 -133 -124 -274 -253 400 63 28 103 -390 107 294 -131 9 -97 -379 6 197 186
4911 186 235 -323 83 66 -119 249 -234 -224 107 34 185 -94 -264 46 -16 120 268 -242 -115 -162 200 521
4933 521 28 -185 112 -194 205 335 -81 3 -374 -43 338 77 -209 -101 -361 113 371 29 345 -426
4953 -426 25 213 46 276 -140 -253 -49 54 283 343 -258 -59 -27 -61 431 -115 -255 -201 -387 316 210
4974 210 -228 59 -285 -177 476 34 107 -191 -212 100 120 9 43 -483 88 200 134 301 -112 -220 91 232
4996 232 445 315 -451 -95 38 -20 222 -77 -407 -123 -206 225 31 -259 -110 -215 94 533 -206 -5 -124
5017a24k45O02J13k32l6m76M59M08m19K20m01p2J42J69N4k53l69L51oj4N50o72
5039b51J04j4J43N09m65j28K35l31L36m4k40K00j82j26M68k44K3n4m18O67M3k06
5061B5L5l48J12K65j32N5q0l1K58k56K09Q4l75J71J38j86N50o76r6L86j34L90
5083C64l44m59N92l57L63J28m31k9N1qK78o2j83L51m52L27K2k59O8J22m03O87
5105C66l46M1j22l60N12M14l56J35m97J61K51k27P5o5n42N21q7K69K51p53K40
5126a19KJ30L46m54R0m7p2K14J27k08no9J64K99m57JJ9l10N63j18n0O7o67K77
5150b77L66l3J46k47m47M41R2K76m1o58K95J47L7J92j68j39l3j30N53j11k27K57
5172B91m15k0M54m76Nj6q5M42j02R9k46j22K4M28j50L03o31JM32j40J58k10l88
$$ plain form
5017 -124 -369 233 346 114 78 -398 61 469 50 270 -131 -203 -61 108 162 -91 -460 -109 -115 -129 421 -251
5039 -251 -147 -161 -18 491 26 -102 133 -198 138 94 -146 54 -128 -254 214 -30 -7 -61 -479 188 231 25
5061 25 60 -288 -176 89 -43 12 -68 -99 159 -97 112 196 -179 -8 130 -56 494 -182 -278 108 -26 364
5083 364 20 -439 153 -204 159 287 -144 -173 -122 -130 148 86 -97 254 -198 129 151 -108 -40 82 -321 366
5105 366 20 61 -61 -421 91 505 149 284 -213 -52 199 -28 47 -18 -560 -39 -126 143 394 -359 -119
5126 -119 -117 13 359 -95 -5 -52 -124 90 217 9 4 -65 99 398 -59 -58 -39 -349 214 96 46 113 -554 -277
5150 -277 89 56 202 -45 -492 -51 41 317 276 -382 -87 60 97 289 121 -18 -51 -181 372 261 34 291
5172 291 -124 -144 310 -166 -161 -177 -262 180 78 177 -69 -191 -167 261 111 414 -217 -216 216 76 234 24 -364
5195c64N35r1L05m8n74J30J1k48Q26o19k00J43Q6K51J86j44l56O6PO28m36k99
5217b05J01j02M65o8M3j40m75J55L84k47M59k86l43L36k68K82K51o92K30n9J64
5238a5L09m91j26K97q7L84j18l77K25q7J93L15l48m2Q6l37L88J36m82J30l17K70
5260i4J77j81K61k74k74L87l6J66n5p16M86J53j09K86l43p8J56j41O87l17o48
5281e07L74k06L93J93l03r8L2N1K59R8j85n2l95J75M23k15K07n78PM85k27J17
5303D8q1k55O9J97O7L10m63j90K67q6L68r4n37L36R7M5L87o02J1j4j01N11l15
5326b5j15j6j20M64K3m9l9l95l1O58l13j2j11m06O25k8k15L61n26P7K09j9L46
5349C43l08l90M31j80L70J25n06Q2j20J68L76l49q2q2l26N62J73k78k6j26m1L00
$$ plain form
5195 -364 171 80 385 337 -237 -107 -96 -344 482 -137 -337 -194 -108 143 329 185 -171 -105 -98 530 94 -205
5217 -205 -104 -206 259 191 234 94 -381 -226 158 -89 370 84 -259 77 -191 91 342 -350 -120 -179 -15
5238 -15 294 -197 -323 -26 -113 271 153 -224 1 -86 107 422 74 32 118 -219 169 305 -177 -47 -364 -94
5260 -94 83 -98 163 -111 -385 2 -34 132 77 -639 -153 0 -109 177 -166 -244 -88 -229 458 141 -507
5281 -507 -133 -339 54 247 -56 -154 -122 -71 188 286 101 49 -346 -171 252 37 244 -334 -327 158 -69 48
5303 48 -33 -288 -219 -22 45 355 -108 -298 -31 -117 251 157 -380 -44 53 98 485 -117 -106 -120 -221 290 -25
5326 -25 -140 -156 -276 188 211 162 123 -272 -303 355 42 30 -81 -487 138 110 -105 256 -270 -193 16 -3 343
5349 343 35 -355 76 -104 266 391 -115 -33 -153 15 391 42 -40 -122 -448 114 287 9 -17 -143 -184 116
5371A16o5L9k83j18N41j63J78k3m24O2J62j26N21m30l63N26k49L75n2l50Q6j39
5393a79J64M04n40p9K70k2P9J58m03K16j25j2K71k3j79j23j19N69k44J99l04k13
5415b35K75P6r7J82j63k06L07l34L93k61k05M36k78N5J92j91m3J51j61L16k22
5436a3k48M68m84L25J84m87L21j79J10K28l99K01L4m16M26k40J75K94n90J81Q0
5457b9j44L46k29j72M02j71K6J4m06M77j62K8K70m40j3M36j67K4P2m55K18p6P3
5480g8M26n25J76o5l99N81Q7q9P0l25K93Q5l17L82l40p1M25j48p7O5l82K81O0
5503A15n6L06o77kL43k09L24j85k94K86j14L1L26l75N9o4L7L99p6l97K33l09N90
5526B91k03k04J89k10L0J83j5M1l02q5L98M9j72L28o38J69O6jK05p6k52L58k3
$$ plain form
5371 116 51 90 -193 -311 230 67 245 222 -202 -140 22 -104 417 -13 -376 150 -99 276 224 -126 -40 -179
5393 -179 -15 389 -151 -230 40 18 97 255 -148 68 -57 -69 202 179 0 -123 -242 327 83 282 -22 -235
5415 -235 40 116 19 201 38 -168 139 -195 198 -63 -268 168 -110 -55 137 -54 -97 54 -107 209 -13
5436 -13 -261 207 -277 48 232 -255 66 -113 -3 225 -174 27 61 -355 71 -169 6 300 -290 -109 -29
5457 -29 -173 173 -56 -228 174 3 29 43 -363 114 -48 -20 250 -190 -203 233 66 90 162 -293 -75 -151 -78
5480 -78 348 -177 -1 -66 -465 116 203 114 184 -141 152 237 -80 302 -38 -109 316 168 91 156 -226 55 115
5503 115 59 365 -312 -314 29 -180 144 -41 -335 -49 -163 -132 194 -181 -122 -186 -149 250 174 -223 10 -299 291
5526 291 88 -116 73 -137 -107 76 61 102 -200 -285 113 162 -10 318 -320 -151 -85 -86 119 43 -209 149 126
5549A26J07K7l91J55j84K79L43l90j49J02j66J04J82l97L62m48L73L04m22R9j55
5570a39k07M12K13k47M4m59L73L8M3N9K4n74N99n5pM3m18K11ok5M74m75R1j67
5594a55o4N41l15k86J70k97M38L78n07J76k54L5M50j26k27J61j50j30N38l57M10
5615D29m61p9K31j49K60k55j75J07PN8L53m72O9j8K1K51p8k45Q9j80L39K23l95
5638g0J16j04k3M05k31j28M9k43M44k02n0J92l88K15J80j08R4m88J77L79l09J75
5660H2N9l01N2J57l7L02l17l41L85j64M30j26k77Q2N1j03N0j38R7j4l06N97m35
5683b15Q5J24j98Q5K91k60O5l7j57M00k21K61j58j71J62k39J53J81j02j00O7r8
5705h2L61p2m26K64j4L0L1j03M7M7k85M43nk47j86O6L78j06l36L18m95N8L95r0
$$ plain form
5549 126 233 260 -131 24 -160 119 462 72 -77 25 -141 -37 145 -252 110 -338 35 339 -83 16 -139
5570 -139 -346 66 279 32 76 -383 -10 28 71 130 154 -420 179 124 117 160 -258 -47 -53 -78 396 -79 12 -155
5594 -155 -219 322 7 -279 -109 -406 32 410 -97 79 -175 -140 310 184 -43 118 -32 -162 376 19 429
5615 429 -32 -111 120 -29 231 -24 -199 -92 -85 -27 326 -146 -77 -95 -74 177 99 -146 -57 -237 102 325 -70
5638 -70 46 -58 -81 324 93 -35 14 -229 215 13 -37 155 -233 -18 162 54 148 -340 -163 216 -93 82
5660 82 141 -160 -108 49 12 314 -3 -344 41 -123 307 181 -96 -14 37 -66 -16 -154 -57 -71 -377 220 -215
5683 -215 -130 -6 -204 -119 172 -88 -23 -60 -217 183 -38 223 65 -106 56 -183 -30 151 49 -51 16 -82
5705 -82 279 207 -219 45 31 61 92 -11 36 83 -202 241 236 -11 -197 -131 247 141 -195 123 -372 -314 81 -9
5729ip0J13q5Q1J39k68K05k14j29K59j12L27k77j34L21k30J85pp4j99K25j46M36
5752C37l21j33J53m25O54k43J08o1k84J16K80r8l4j35j4m5N0J53Rm57M32Mk7K89
5776C08m58M7P2O3J50J7m84K46O5N8J29l11o4n0k93N67p4k10N07l85M8L23l03
5799c2J50l30j53N87r8j3j01j32j3L27k40M5j77J04J00m9J20j2k13P5j15J11K36
5822A77k18K44j68k26L09Lj53M4r1K91r9m8J09k28j28L60k6j38j02j16L22j67
5844d9J19j04j7J29j68j00M54l01pJ17j86J25K09l07L5K61k20J42N3k59N3j06
5866a27P8K35l48M60m19L1K76k46K33l06j00M78j45k30K98k39L5K71k80K97k29
5887B3j58K79k03R7K91m33q4m8K31n0k9j7J9N9O1J07l30J70j53K93q5k26N5K71
$$ plain form
5729 -9 -79 34 -51 30 169 -99 106 -108 -237 22 -90 237 -40 -174 147 -83 102 95 21 -178 47 -99 337
5752 337 16 -117 36 -389 265 22 130 69 -215 -99 181 83 49 -86 -100 -145 -95 58 67 -390 42 46 19 308
5776 308 -150 -103 -31 32 182 199 -285 -39 26 84 213 -98 -162 -212 -505 62 -12 -222 285 -100 -52 271 -32
5799 -32 118 -212 -365 222 124 111 10 -122 -135 192 -48 -3 -180 -76 24 -25 95 83 -130 -55 -170 -59 177
5822 177 -41 203 35 -191 118 121 -32 12 -79 212 113 65 174 -54 -182 178 152 14 -88 -204 118 -49
5844 -49 70 -34 -51 78 -90 -190 264 -37 -44 73 -113 12 221 -86 -51 210 -10 132 185 -74 -21 -127
5866 -127 -49 186 -162 298 -121 -90 186 -60 173 -133 -233 245 100 -130 168 -71 -36 235 -45 252 23
5887 23 -135 144 -59 38 329 -104 -188 -236 -5 -55 -84 -101 -82 -23 38 145 -185 -15 -168 125 40 -186 -131 140
5911A40j88K27k40RK90k96L00p5k19J64k74J58J68j34kM3l44L11o5n0J49l51J21
5934a58L09j83J67j94k0J95qJ99o9m03K69n6p0J98l74K10j22J19J34j33j5L69
5956C64p60M41L8o9R9k89j34M95k95R0M9j26J49j0m8qm2j70L28j59J25n3n0j10
5980a45N7J10J82l88K57j4k68N29l56r2J28k28N65j00m77L01j15kL13k08J45k93
6002i9j73L14L3N3J41m00k8L71p7N2l0k52mM3J56J58l47L7K48k74L58l38l1M7
6026d2k05L38K15n10K71%j47K96j79j31k04m3J76K70L3j32l45K41J17R9%J12n23
6049b93K83m2O0L38n79L15M2K5M2j14l7j08j11M03j76n6L9j03J21k9p0J45j81
6072h6o1L76j84j31L75m53Q9K99k71J22o8j80J56J56k95L61l89N4J73lJ78l07
$$ plain form
5911 140 -48 179 -61 -52 238 -58 242 167 -52 112 -162 -4 164 30 28 71 -273 38 -27 -77 72 -279 -158
5934 -158 151 -32 135 -59 -79 116 108 307 238 -165 104 48 -22 176 -198 12 -110 9 143 10 -5 364
5956 364 -396 45 83 14 113 -176 -310 185 -110 -20 29 -97 52 42 -6 -14 -56 -226 102 -57 68 15 -35 -145
5980 -145 -88 22 204 -184 73 59 -209 320 -36 -128 0 -228 337 237 -240 61 -54 -56 257 49 194 -99
6002 -99 -272 42 75 128 269 -131 -159 212 135 187 157 -95 -99 -56 100 258 -89 -52 196 -78 280 -58 -89 -42
6026 -42 -247 91 306 -204 67 67 -80 216 37 -94 -298 -341 -165 105 138 6 -339 -98 19 118 118 230 -293
6049 -293 -10 -52 8 346 -233 82 124 149 191 77 40 -68 -179 224 48 -8 31 -72 49 20 -50 95 -86
6072 -86 -147 229 45 -86 289 -164 -75 224 -47 75 7 -173 -17 139 -156 205 -184 -130 43 40 218 -89
6094h9r4K74P1O6M9l28R2k20J20J72l49J91k14J88L20r7k62L8j4O2N1K5M1k72
6118a79n2L99l22K35J1m23K68K3pQ8q9R0k14K03j4J07j20K2j07J13J47l56K62
6141H5j81M1M28l15O9q2m40M33J30k54J63k53L01J91l82J35m0n7J17n3m2J38k86
6164a54J99l25L47J18k10J45k41j93L45r1k7K33k24R1J22j63J5N8m0J29n1j95
6186a12J30j51N0L15l86J15j11k49N34k35J38J26k34R2R0j4o6j28o6M79m58K73
6208A32%l75L01j58n3K41k43M5K24k15L79j52j71J44j31O7J83k60N8K4j75J59
6230B4j21J87J1k73K38j36m8L02l17J2M14k95R3r5P9q8O4j11K3j63K30q2K46J70
6254C64m40L0n1j59K85l6k65K38M2qJ01k14J41q7M2K07k32j2k3j32J72P3j88K31
$$ plain form
6094 -89 -183 91 162 228 277 -51 41 -179 -59 113 -236 -45 -259 -71 249 152 -110 -72 -86 -24 27 52 93 -179
6118 -179 -231 168 -154 81 92 -331 -63 -40 -47 41 -48 42 -172 31 17 124 4 26 -81 32 179 -177 85
6141 85 -96 -55 373 58 127 45 -395 38 168 -86 77 -176 125 316 -66 69 29 -28 89 36 -6 132 -154
6164 -154 45 -280 67 185 -25 120 -121 -314 31 -60 -87 146 -78 13 135 -28 -13 45 5 134 83 -112
6186 -112 18 -133 -83 232 -154 -39 -150 -399 135 -100 38 164 -70 22 112 98 32 -96 -162 317 -141 132
6208 132 132 -243 58 -100 -153 88 -155 -110 114 -101 278 126 -45 99 -32 35 218 -42 16 40 -135 24
6230 24 -97 90 101 -172 66 -70 -118 184 -133 -121 293 -2 91 -4 75 -13 51 -60 -37 -200 30 -52 194 364
6254 364 -76 -46 -97 -256 29 -7 -272 -34 8 0 101 -113 28 -59 -17 190 -42 -54 -77 -209 -37 36 -152 79
6278G9j03L2N1L2j76J38k32L08M3j44K03k92l2K4p5K71j38m5J35l34M17lj65n
6302a1p0J9L92j35k71J82k41K41N6n9j7m47M18J80k50J82j08j55K01q7o1L79m96
6325a58K22L8k41L80k46j13J65j66J34J91l80L03l40K35J28k29J12o4j57K61r1
6346a6N2l5k26K98P8q5M4j99J5qj6K48j09k96K95K09j17J8k09j09K87k30k8K72
6370A33l64K92j73J31R9N9j79k6j39L50j75k20J78j29K41N0j50J02qk95K14qJ3
6393dl0o1J17J60n5l1l8QP2k54K69Ok45p2OJ37Q5p5qn8m4J49o1N8p0k58M89j14
6421G8j75N9Q8n0J57l40L26j0j12J45l63J98K49l42j06L13l04K11q8o6K99l30
6443a63K50J43n59L75N6q2J81j37k66O1K12j68K41l33R1j85K67N3r0n9P5k15K49
$$ plain form
6278 79 -24 8 59 91 -85 53 -179 129 172 28 231 -61 -93 -69 -144 127 -11 -56 79 -255 162 159 -6 -11
6302 -11 -81 -62 330 195 -76 106 -135 106 162 103 86 -361 57 237 -13 169 61 -94 107 20 -41 338 -158
6325 -158 64 102 -139 241 -5 -118 47 -119 15 206 -174 129 -211 24 152 -77 35 -29 -186 75 -16
6346 -16 36 1 -225 73 151 66 110 -89 -74 -82 -98 150 41 -255 40 249 132 150 -59 -168 119 -111 -139 133
6370 133 -231 61 -112 19 118 177 -2 -28 -167 183 8 -212 -34 -163 78 128 -22 80 72 -223 -9 -17 -4
6393 -4 -34 -95 22 182 127 96 58 66 138 -116 153 159 -86 -158 -152 -15 70 -5 -13 -71 -115 34 -27 31 -39 -297 192 78
6421 78 -97 -38 50 0 157 -183 143 133 21 166 -197 1 250 -92 -198 115 -189 22 -66 -132 167 -163
6443 -163 87 230 -329 46 102 20 201 64 -202 -141 71 -97 144 -189 -98 -283 -16 37 -53 -112 -37 -252 -3
6466cJ22j34L6k29K66j35P7J71j61k50M42k39J91k03k15K32J46k01N45n43P0o4
6488g9L7P2K2j78R6J6P4p6M0j18J07l02M34j16j80K80l00L66O2k51J21j79L2p3
6512i3j16L53k36Q1Q0j57J52q7k31R6K94p0N6k39l5J27L7p6K12j22%l8j14K95
6536A69j87m1J06k85K32L50l18M3l15K11J11j26R9rj79J55j13J50j90n7M61k48
6558A9P8J13j72l75M48k39J57J57l02K23k03P6O4k7J48k82L5L24j54l07K90k06
6580a35J50J56k28J96j86l8j2J98q7k3j88J08j4R4J96k77J12l1j43L39l6l98L30
6603H3q9j10M11m39J58q9j80L42J02m43L16j74K78Q0k37o7m9n2K33O4j38j09j02
6626b11L15k81L48j30j13J6J11j24O4P6j27J53L5k61K83k75P8n0o1L21j40Rj10
$$ plain form
6466 -3 119 -15 21 -208 58 -77 0 171 10 -240 202 -37 154 -49 -264 -32 114 -87 458 -85 -15 -79
6488 -79 -42 30 52 -126 -30 -14 60 -16 24 -94 13 -289 145 29 -151 129 -171 195 257 6 127 -52 -20 -93
6512 -93 -209 144 -92 -11 69 -88 64 -23 -254 -158 136 66 122 -117 -152 -25 12 -64 148 26 26 -12 -126 169
6536 169 -18 -59 47 -238 -6 344 26 69 -246 -35 76 -50 49 40 -139 16 -97 53 -137 -194 267 19
6558 19 97 210 38 -337 111 -128 29 186 -116 107 -96 -20 44 17 165 -117 -82 242 88 -219 71 -135
6580 -135 15 171 -57 139 -47 -85 -97 101 14 -9 -197 -89 -103 -9 187 -90 22 -9 -152 187 151 -247 83
6603 83 -6 -116 295 -144 14 -75 -255 87 189 -254 62 -112 166 246 9 -58 -107 -159 74 138 0 -109 -211
6626 -211 104 -177 171 41 -72 -56 55 -69 -5 71 -56 97 132 -129 154 -121 -43 -93 -154 167 27 36 -74
6649g4n7L24j25q5J24j33M4M4j8J8P0l86L37M5j24O0m9k0q8J29K7p1l4N8K4J17
6675A57l3J6j23j41N8L89l29o1J78l48K32Q9J7r9j06Q4J09n1j3L1k25L29k66J98
6699I2M2k09Q5J88k0j21j70l2J49k00J94J30m0j40K36j03N9k21k1J18P2o8k75
6722b55J48J57q4J16J26n27L03j5J63J03k81J64l2j03K46k12k0K0n0j05N6N9M5
6745B2J99l71M9P0J68Jm13K33KJ30K7j77p2J81r4J96k67M6J55r7m6L2J16l12L58
6770A36l55P1J84j21l9J23l1K78k77P6j29j92M18RJ0k18J23l2j49j17L44j83L1
6793d0M4p7K25l4j65O3j5J0J19j4m13K65LJ33n8j84K21k66K64Jk20J48j24O6J57
6818A09k8J14l90N3Q4r7K40k1j01q8N9j34K39L4j76O9J23j51K0j29J18J70r0K7
$$ plain form
6649 -74 -131 193 68 -17 107 -26 18 62 44 62 132 -254 83 128 4 64 15 -5 -93 36 63 -8 -42 16 40 157
6675 157 124 140 17 -124 -66 323 -6 -67 111 -237 -5 84 101 2 -104 -20 89 38 25 56 -169 160 -106 92
6699 92 134 -75 10 198 178 57 -113 -145 4 -196 -2 128 88 -52 184 81 140 -81 -102 16 88 20 -255
6722 -255 -107 50 -34 82 208 -319 -16 -31 132 235 -46 118 86 -17 229 17 -3 17 -33 -138 -82 -23 22
6745 22 221 -150 -101 -31 137 138 -275 -42 -40 90 117 -60 -132 49 -45 151 -116 -70 85 -12 -58 -26 90 -222 136
6770 136 -219 -148 36 -85 -124 -1 -32 246 -31 45 -84 -276 142 151 161 -57 66 34 -115 -232 112 -71 -40
6793 -40 4 -73 152 118 -47 16 1 11 130 116 -297 -32 -29 104 46 -138 83 -183 81 82 -138 10 -114 -48 109
6818 109 81 195 -195 -142 -58 -155 85 64 -37 -125 -66 -200 39 73 -103 -34 89 -62 -42 -171 -53 117 27 54
6842E4M1P0l42K51j57K50j27n9o0L1J74q8J01l8j53O6Q0O5M3j29k12J81j14O5
6866gj24N8J14k26J08n8O1K18j31o4J77k40j01M35l44K53j33RK68l58j0J28q9
6889e6J18j79j18M42j86j68N9K61j09j7q0%L2n7P0q5o2K37l51K55J70k48J29k62
6913b05O9K85k35K57k49K04J24m03K73j55j39K28k5j84J72j4J36n2o6L6O8j86
6935f1r2J86P6q2j57J69m4p9K42j84P9j0j8L1N9O7J8j01L9J3k03Q2J70k71J42
6960G1l3j02j6L7m1K62l52J48Rj09j14K13L1j2P4l3R4p1O2k10R3r2j95L99k29
6985a16J73r1r1J48l8j59K04J76l41L55m68K29J35k6j1j63p8M69k20oj73J51j55
7008i6J53j6J41j44j59K07n2m6O4j70Q1J11j09J04j40P8M0k39L7K76OR1j31J23
$$ plain form
6842 54 95 165 -177 74 -83 167 40 -19 -79 -48 126 38 139 101 -52 14 94 159 202 73 -139 42 -72 -7
6866 -7 -131 -73 41 -185 -77 -135 -74 144 13 -51 126 -114 -215 220 -124 129 -4 5 273 -85 -95 33 -56
6889 -56 62 -117 -235 207 21 -147 -88 173 64 47 -33 -33 -1 -58 12 -73 -135 102 -249 6 176 -72 57 -205
6913 -205 -136 149 -86 171 -78 126 250 -153 120 -35 -174 54 29 -155 17 3 139 87 21 57 125 -61
6935 -61 -153 33 109 27 -130 39 -5 -84 158 -26 53 43 25 56 115 182 200 99 138 151 -52 30 200 -71 71
6960 71 38 -64 -80 -43 -84 178 -174 -26 -17 -126 -240 -27 4 -8 66 33 127 56 118 -92 1 -91 -286 113 -116
6985 -116 57 -34 -125 23 -15 -174 30 206 -135 220 -248 -19 116 90 79 -84 -162 307 87 81 -92 59 -96
7008 -96 57 41 182 38 -121 86 34 -12 52 -118 -37 74 -35 69 -71 7 47 -192 -155 121 127 218 87 210
7032B10k70J98k00J83p8j10j0K93k21k04K42J43j99K46j37k11L02k65K03j23J47
7053A39mj98M8R2P9l10K8N9K82j72kJ17k11J93k62j5J35L0P7Q5j76l0j0K56m00
7078a70R9j30M01k37J80M0j87J38k8j71m2J65n2J06j25j47J82J72k85K03l26K00
7100a4N7k9P3k78J12j43R9J24K7k56O1J49J18PK5k37J2J17J59k21j19nJ25K03
7124A66k40J08P9l32J46MO2J19j12k47M48j23l1R9k11J85j94j4J44j52J26j51
7146a21J35J58k23j1P1J35j24k7J26k03M7J05J13k15L8j96K00kJ37j39O2m8j37
7169a19P3Q9q2QN7j34J34J0j45J57k47K49r6J84k33K5l7K73j41O4o5n5j24K4K41
7194A10j22J29l03J65O6J21l10J25l7J4J11K5J9j50Q3P8j90K47o7k11R2R2K6O5
$$ plain form
7032 210 -60 138 -62 121 43 -67 -77 216 -5 -209 33 176 -23 223 86 -125 177 -88 115 -8 139
7053 139 135 -63 -15 77 156 -154 -126 -67 215 43 41 158 -53 140 -122 -137 -2 28 105 190 14 -16 -26 230 -170
7078 -170 -71 -201 200 -37 143 183 -4 134 106 -65 -107 58 6 112 -13 -160 22 194 -91 112 -214 -14
7100 -14 43 14 87 -191 -79 -222 -123 1 28 -228 -167 -18 100 107 132 -105 -93 24 183 -38 -157 -162 -37 166
7124 166 -74 34 113 -219 -73 -69 -7 112 0 -247 201 78 47 146 -65 120 -74 -88 56 -96 30 -121
7146 -121 14 172 -51 -62 9 144 20 -7 119 -84 -37 68 181 -34 4 -192 8 6 143 4 66 18 -119
7169 -119 -46 43 -39 -31 26 -108 26 36 -109 48 -199 50 -46 138 -95 -70 -107 166 25 89 24 -31 -155 -131 110
7194 110 -12 117 -186 -21 45 166 -144 -19 -56 -42 69 94 113 -37 46 124 -66 181 114 -97 -5 87 113 178
7218A78j93j45J68K11k01Q2k92J77q1j8L38m65K09J03j75J34qk5n0q5O2J50j02
7241b8O6M2k0l4R3n9L3k84K56p7k3R9j10J71j17j38Q8K2N1p2J18r0r3o4O5J33
7267B8j61L11j51q2K40l53K25P8qk63M7P4k5J59l5l3j59m1j32L80k19K7rL29l30
7292a03J12L4m7P1J05l01L13n23L11J46j88j1j40K28M7J3J70k19K32m46Q2J87
7314G3j51q4P1P9j36R6k4p8K06l01K03K72l07N1n5L1j18L10j02o8J5lQ3m9K34
7339B48l0j83m8P7J56k73n1J70j00Q9l9l2N6j07J44J40k77q2L28k44J48M6k63
7362a27J06j61J17M6l6J59j08j24K58k00J46M1k23Q0J71j49L9Q5k26R5p4J30J01
7385A46o6j69P0J7p9J8Qj8j25K97j49n6L8J41j94J29N1R9k73J65r7Q0P8j11j13
$$ plain form
7218 178 -15 -160 8 219 18 100 -192 -15 -96 -114 224 -241 -32 71 -104 30 22 -3 -53 -138 -76 74 -28
7241 -28 38 80 60 26 119 60 93 -191 65 -12 -35 64 -46 125 8 -130 -42 -20 31 -41 77 -13 -106 -170 -105 28
7267 28 -133 178 27 -55 185 -168 57 135 127 -136 -89 -15 -40 119 84 51 -108 -149 -281 99 -120 -93 -102 227 -103
7292 -103 9 43 -4 67 172 -129 184 -339 -28 118 -70 -81 -221 7 54 67 237 18 250 -196 -114 73
7314 73 -78 -162 -91 -12 -148 -52 -76 -154 52 -249 -46 226 -81 -30 -85 -54 -172 138 36 -32 -17 -20 63 14 248
7339 248 218 35 -13 64 220 -53 -104 66 -34 55 16 -16 40 -67 77 217 -60 -142 186 -58 90 136 -127
7362 -127 -21 -182 -65 -19 -55 104 -4 -128 130 -70 76 117 -106 -26 145 -4 35 120 -106 -11 -85 45 146
7385 146 80 -89 -19 -2 -81 -63 -55 -73 -198 99 -50 -106 -68 73 -121 8 59 158 -115 50 -47 33 111 0 -113
7410a13J75j85L38q1k46J51R0q4M2j19j4J56k84J75M1j86L06k60K34k3j09k5M6
7433B5k16J54N7k44J59L7k70N09j62p2m7J16nq0L8m1Pj48K46k6L4mlr9J13k21
7459a43J59k7J30j39kJ6Q6q2J98j91o9KJ93l04q2K03R5K2J15l2l61J56j49R1o3
7484a78J11R1J44j77j32K15j75K32l19K4N04l88L1kk00L71p4K3k77J17J16O9r9
7507B7r5O5l0Q0J20j30M2K4j03oR3N3l33K03J37p1l8j39J42k4P7J99j43j55j6
7532b1N8L4q0k10J62K42m39M19j29r3M7q4K66j20j7K25k41K1n9P7J71k72p5J29
7556A1n6L6L0N8j48j65K78r1n9j09M15j86M7l3k72K47P5O3j75O1j5k9Q3k7K8j8
7582D9p9N3j89L33k44R2r6K06p1J6n5r0O4P9K0K4k30LO6j07Q5j19R3q8K28l8N0
$$ plain form
7410 -113 62 -123 215 134 -112 39 129 45 87 -32 -46 110 -174 1 42 -144 162 -98 136 113 4 -21 25
7433 25 -191 -37 20 -224 -65 -28 -298 211 49 -23 -70 46 41 -39 -1 -42 -35 -183 63 37 71 67 64 -35 78 -143
7459 -143 16 -11 119 -20 -22 -6 80 -2 196 5 -64 -62 131 -173 -255 -52 43 65 180 148 -213 -57 -206 -115 -178
7484 -178 -67 24 168 -9 -141 74 -101 131 -188 -164 340 -48 -17 -19 -219 152 78 101 -176 -59 57 126 27
7507 27 -68 -3 -33 47 167 37 79 103 0 -6 87 140 -193 10 147 76 38 -101 41 17 94 293 150 -5 -21
7532 -21 37 71 -9 -219 -57 185 -254 165 36 -57 -10 -94 172 52 35 260 19 40 -19 58 229 -43 -118 11
7556 11 -45 -9 21 79 -69 -234 44 -47 -106 -215 200 14 61 28 -244 3 78 141 -34 27 12 -17 66 39 67 49
7582 49 -30 23 -166 167 -77 15 -81 125 54 70 15 -75 -11 68 88 112 -118 -115 -49 -156 -71 -190 -97 -185 43 5 55
7609E5j19j12K17mj62M12j43k65J24j16K73N6l10j34J73pJ38k8k12J82j86J55
7631a3J44k57J12r7J34J58p1k6L5o9k9j58P3K32j48j78J8K56j63O4k28J08l1J54
7655B0m4M4j1j19J25r8J26J18j90k11K70J66j65j70J77j59J51J05O4j70k79K18
7677c2P2l5J06j08n7om0M2J37k84L18k34j85K95q4p9p8K76ML3j26K34j83l7p8
7702a29J62n9J03l12M27p4j37J51k98J16J57m3K1p1j31L5K5J13kj88K15k2K7Q1
7726A67m33J77J45J4N1n1O4k38K9J70oj24o3N7K0M9Q7L7k48k13L08O8j32J37j70
7751i8P3m8q1l6J29J25m6j09J01M6j27K02l6m3QK1R5nk39J11Q1j57mo1n5J27j55
7778a81J67P7K5k2M9K8J18k45j84J78j07K02l10J28J64j83J76n0k27K18j8R5l9
$$ plain form
7609 55 -64 -176 41 37 -125 287 144 -121 3 -113 160 216 -94 -228 -55 -62 76 48 -164 18 -168 -13
7631 -13 131 -126 -14 -111 23 181 110 84 119 50 21 -137 -64 168 20 -158 -140 116 -47 17 -211 -103 -134 20
7655 20 -24 20 9 -110 15 -83 43 161 -29 -240 30 196 31 -139 38 -121 30 135 199 29 -250 -32
7677 -32 40 5 111 3 -54 -60 -100 -58 79 -205 113 -121 -306 -11 -95 -174 -252 24 28 61 -65 169 -14 -51 -129
7702 -129 33 -26 77 -235 192 118 -19 132 -166 -50 107 64 85 14 -117 -82 -57 56 54 -134 81 59 86 167
7726 167 -266 -89 56 70 121 70 134 -104 -75 95 89 -35 -98 -41 -21 28 115 152 -96 -309 -1 67 -65 72 -98
7751 -98 -25 -73 -154 -190 -61 64 18 -91 10 56 -71 131 95 52 60 81 176 171 -68 43 124 -33 -37 -98 -153 -26 -181
7778 -181 -14 63 88 66 115 143 261 16 -168 10 -97 105 -205 -77 87 -96 80 30 -197 21 3 98 59
7801E9r4J39m8qj38J76j54K76j90j47L06l24J78m3M9j12J32j78K34q4J23j31q2
7824f1P2j72K85j11j40M57k36k16J63L8K0J02k43o5J98oj28P6j87J21j87J47J34
7847F1q3p5J71j28jJ22Km0J1R5k10J45q9n9O2j6J01J17j24j1M4k94J29J17j72
7872a25N8O6N2O2j07k64L20r4j9L9L07k66P4k05K98j65j59q6J92J27j97oJ81k25
7896a42K18nP8q6k58L18K8k07J13J12l38OJ44R4p9n4N2J14j79J10j17j19M11j35
7920G9M3Q9j72N5k5j27R6q5J94k89J60M8Qj75K18k42K34j35J39k1q0q9J54j32
7944e5J47k6oo0J28o7k58K98j54J29k51L63qn4K7l12J08L4l6J56m3k81J92m6%
7969g5oJ74j45p1L38k91L2j24K39K6q6P4Q8l05M29k30j6r5m1P7K9r7K76j19k33
$$ plain form
7801 59 -35 104 56 48 -90 86 -68 208 18 -129 177 -147 31 -12 37 -75 57 -121 113 29 152 21 -61
7824 -61 11 -161 124 13 -127 330 94 -122 41 79 99 201 -42 -107 91 85 -43 33 -154 -33 -220 -73 61
7847 61 -22 -97 74 -54 -55 67 69 29 40 135 -75 70 -19 -78 -16 -32 69 186 62 51 95 -199 -70 47 -125
7872 -125 -67 -1 51 113 6 -258 62 -32 -51 -12 295 29 103 -102 196 31 -128 -214 -22 105 -92 -98 83 -142
7896 -142 76 71 149 63 -195 123 151 -56 57 169 -169 -163 -19 75 -4 -58 -6 108 -71 39 -78 -197 214 79
7920 79 122 211 39 94 69 -58 38 -47 147 -142 18 66 74 -101 117 -125 109 -26 113 92 12 -77 77 -55
7944 -55 92 66 60 0 128 61 -197 101 -53 76 -175 188 180 126 153 -159 -51 -17 -53 103 60 -221 -29 -75 -75
7969 -75 -81 93 -52 -123 215 -76 -44 -168 71 97 11 85 173 -132 297 67 51 -44 -85 -8 21 -76 200 81 -152
7994a52R1N6n9M7m0K0J30j28K8j23J77Mr6l8n6J58Oj55K28r2k05K58r2m7K7R4
8020D1n1r7P9J19j48J59j29j66L52k48L61m0j81p6K11l33K99k33K16p4kj13N7
8043Ck12K64L4j59j4p7J57k6J75jJ28l49N8j19J06Q0m7N7L6j27l2M8p6L15k43
8068b1J09N6j69J1l3J72k35J50J5q7J49k7m8j32K78k82L31k14j55K71k59K09k16
8091a27M8K5%O2J0o0J25p9p1J59m7R3Q1m18J92N1m9M1k53J57O5J11j9J5q4P9L8
8118A45q0O2Qq8R3p0j44mL9J07j35J05j40J67k61L31J2o8N2j38p5J24j39Rk0k4
8144a32K29p4k06K72k50Q0l6J31K20k68R0j22jk8j8J49n0kj8Q9M8p8J31k89K68
8169A35k37O2R3q7o2J7J04l5J4rJ26k22K39k4o4L4j7P4j34M0N5k16
$$ plain form
7994 -152 -61 -5 -64 -17 -57 -37 93 -35 -7 -130 47 51 -45 -83 -139 19 25 -130 98 6 -199 59 -33 -80 -53 41
8020 41 -10 -107 -28 91 -57 102 -27 -193 159 -89 272 232 51 -25 186 -147 152 -81 135 61 59 -54 3
8043 3 -209 55 89 -70 -84 -161 -4 -30 145 144 272 -77 -19 -138 -32 48 1 58 94 -33 -65 -17 -93 222 -21
8068 -21 88 144 -25 -14 -47 125 -110 40 55 -32 117 90 42 -90 188 -94 237 23 -132 139 -120 89 -127
8091 -127 -79 -54 -54 8 18 -42 83 4 -67 92 45 138 219 -199 -7 44 -5 36 -217 -60 5 116 97 112 28 107 145
8118 145 65 127 135 47 140 70 -74 -78 -39 68 -67 38 -102 65 -196 135 147 79 131 -7 -82 42 -97 -88 -108 -132
8144 -132 97 23 -183 89 -161 -81 -117 14 234 -34 56 -66 -67 -95 -113 36 -14 -16 -34 55 103 25 156 -133 135
8169 135 -102 -40 53 -34 -96 -79 25 -10 4 -5 121 -101 138 114 50 84 67 141 7 47 102 -114
8191a14
$$ Imaginary data points
##PAGE= N=2
##DATA TABLE= (X++(I..I)), XYDATA
0@%%%%%%%%%%%%%mQj2J6j6J6k4L2l2M0m9N7p2Q3r2J07j25J43j65J89k13K41k72
36a44L06l44L86m31M82n39N98o64P35q10Q97r92J091j203J327j461J611j775J957
55A027k163K394k656K955l301L710m200M798n546O516p831R724j2715J8295m5580
70c4573K28970P9496k66929k68986o1405K53524J75727O3087o6727k25293r5560
81b18669J40266K36967J47278k35439k90902L2738K20482J96397o5316k49757
91h5955p2462N6785J49706J65672n0985j74770j66004o922K72822J67141j34724
102A20304k45271j67445J25950K41733O1356o0132j74828j24212J10444J80374
112F8273J42866m6995k38171o8146J22281J44413O1037j43381j34587M39M3791
$$ plain form
0 0 0 0 0 0 0 0 0 0 0 0 0 0 0 -4 4 -8 8 -8 8 -16 16 -16 24 -25 32 -40 43 -49 58 -67 76 -89 100 -113 128 -144
36 -144 162 -182 204 -227 255 -284 314 -350 385 -425 472 -520 571 -632 695 -766 845 -930 1027
55 1027 -1136 1258 -1398 1557 -1744 1966 -2234 2564 -2982 3534 -4297 5427 -7288 11007 -34573
70 -34573 194397 273893 6964 -262022 -323427 -69903 105824 168911 102184 -123109 -218669
81 -218669 -78403 158564 305842 70403 -220499 -187761 32721 229118 163802 -85955
91 -85955 -158417 -101632 48074 213746 162761 -12009 -178013 -184935 87887 255028 120304
102 120304 -124967 -292412 -166462 75271 136627 76495 -98333 -222545 -112101 68273
112 68273 211139 164144 -74027 -142173 -19892 124521 185558 42177 -92410 -91971 -48180
123d8180J26251M1870j18358j05861l9247J36441J78136o4201j56422r0264L6713
134a03122J57586M0106n6358o1314j11550M233J21104J07437L6401j50238j27592
145a43307R6356J30802N9346o5174j13961J7825K1465l988M5025j5866m5360n3460
157g0297k2734J17720N2388r6071o4340J1133J08898O0031r0132m0509P539K99
169b6075L6453O535K3118p626j06915m508R3207N9793r99r5243k5951P3699L046
182B8534o216k364j5266J0610m7112j5621N9412j2904k7918o717J0562N6088k7473
195C615m6962M0381K2573J5687q362l6645K5094j1182k9318L8643Q115p618k4035
208a0014l6498M8237K1323l1538J2699J134R793m770m4576L1066K6248k8246R55
$$ plain form
123 -48180 78071 119941 1583 -104278 -143525 -7084 171052 106851 -49571 -139835 -103122
134 -103122 54464 94570 38212 -23102 -134652 -130419 -9315 98122 134523 -15715 -143307
145 -143307 -46951 83851 143197 78023 -35938 -18113 3352 -636 44389 28523 -16837 -70297
157 -70297 -93031 24689 77077 -18994 -83334 -72201 36697 96728 6596 -33913 -26374 -26075
169 -26075 10378 16913 40031 32405 -74510 -79018 14189 73982 72983 -22260 -48211 25488 28534
182 28534 22318 19954 4688 15298 -31814 -47435 11977 -927 -28845 -35562 -25000 31088 3615
195 3615 -43347 -2966 19607 35294 26932 -9713 15381 4199 -25119 13524 21639 14021 -10014
208 -10014 -46512 1725 23048 -8490 4209 5343 15136 10366 -34210 -3144 23104 -5142 -4187
221d187q489Q007J588m3872L6441N1840k0707k4335k8502K9900N1218l7416j1737
234b51J8786j1901m978k8876J5153M9249m3183l2540K2165K2633J9303m8985k1737
247d5162O6896J0770k4971k0302r615M0070j1923k4881M3342n9l1784k5423K68
260c2774P4299R028o5979r200J3365K9321N525m0173J9980R074l5500R511J2255
273a268J6408q431n4739K7822N3063j2085k3671l3241K0557N0312j9891n609L281
286A2508k7317K748L152L0213L1817o0561l9655K4734L2314L1777l6564l7274
298c2108K3536m925R707K3775j0885o265l4052k663O8245N108m0504l0664m039
311c5734N9563J3820l7385j093j6566k470K3930J1121K8367l2239o6807K3748
$$ plain form
221 -4187 -12676 -4669 -3081 -46953 -10512 41328 20621 -3714 -32216 -2316 48902 11486 -251
234 -251 18535 6634 1656 -27220 -12067 37182 -6001 -38541 -16376 6257 25560 -23425 -45162
247 -45162 21734 32504 7533 -12769 -22384 17686 5763 -19118 24224 24165 -7619 -33042 -32774
260 -32774 41525 50553 -15426 -24626 -11261 18060 23585 -16588 3392 12466 -23034 -13523 -1268
273 -1268 15140 6709 -48030 -20208 32855 20770 -2901 -36142 -15585 34727 14836 9227 12508
286 12508 -14809 -12061 -8909 21304 53121 -7440 -47095 -22361 9953 41730 5166 -32108
298 -32108 -8572 -13497 -3790 19985 9100 2835 -31217 -33880 34365 39473 -1031 -31695 -35734
311 -35734 23829 37649 264 -829 -17395 -19865 4065 15186 43553 11314 -55493 -31745
323c1745N1710L0516k2913p2181P600L9828L404J4253j3828j8103p119j9227M8946
336A1141M6362m0721m4392j7094M7092N9616l9344m2162k158J323K9022L513k030
349A0168M610n1388j1426N4271L5544Q71o3730l6219N8541L2590l629j8990l4973
362b3760Q689L597N358M4350j6310m7013j4754J8156O6166L658o3664j3002J1498
375a7031K7399J9583k7683m320j3790k7179L5177L1955k83k9200m8813L4754N9548
388D0117n623j9919k9410R72L1715p311R676N126m2343j4411R672L5927K8419
401D2607n5039l5836K8179K8382K3159k4254k6423J7549j0333L475K7903n280
413A4089j3157l4489m273O2360J0737l3919k0161j454M4251J1762k7235O420j0591
$$ plain form
323 -31745 19965 50481 27568 -44613 -37013 2815 6219 20472 6644 -11459 -18578 -37805 11141
336 11141 57503 16782 -27610 -44704 2388 62004 22660 -19502 -21660 -20337 8685 12198 10168
349 10168 14778 -36610 -48036 6235 41779 42650 -21080 -57299 1242 33832 30203 11213 -23760
362 -23760 -15071 -11474 -6116 38234 21924 -25089 -39843 -21687 44479 48137 -15527 -28529 -17031
375 -17031 10368 29951 2268 -2052 -15842 -43021 -7844 24111 23828 -5372 -54185 -19431 40117
388 40117 34494 14575 -14835 -13863 17852 10541 20217 25343 -17000 -31411 -21739 14188 42607
401 42607 -12432 -48268 -20089 8293 31452 7198 -19225 -1676 -12009 -8534 19369 14089
413 14089 932 -33557 -37830 24530 35267 1348 -18813 -20267 23984 35746 8511 14931 4340
426D340j2828J0051K907J9932k0819n3430J6783L4787J5001j2422m3590J4561
438b4727L3505m650R780m888j0114L1j6099K8163K7428l5914k4236j156K9201
451F324L3607l3455k1619J5620L235J4884k925q233M704l3638n973L7089M682
464A4302j6367l8682r419N2518J2348j7559o239q670K0480Q593j780K5972j6988
477A8509l3094N263J7987L1107j8855n3850J0358K6778J3133k49k9046L317P508
490a134j2307K5718J1522k1259k4369k3144L8048L9134l1385k9013r873K1461
502a6601L8354j0214m799N145k1212Q616K1775J6987J777n3442k0145L9257K0027
515B5525k372l6633k6372K7677R319N720J2987j9855j3382o872J4704M7355j2463
$$ plain form
426 4340 -8488 1563 4470 24402 3583 -49847 -33064 1723 16724 4302 -39288 -24727
438 -24727 8778 4128 13908 9020 -1094 -1063 -17162 11001 38429 2515 -21721 -22877 6324
451 6324 39931 6476 -15143 477 3712 18596 15671 7438 12142 -21496 -27469 9620 14302
464 14302 -2065 -40747 -50166 2352 14700 -2859 -9098 -17768 2712 11305 9525 35497 18509
477 18509 -14585 -9322 8665 39772 20917 -32933 -22575 4203 17336 17087 -11959 -8642 -1134
490 -1134 -13441 12277 23799 2540 -21829 -44973 -6925 32209 824 -28189 -38062 -16601
502 -16601 21753 11539 6740 11885 -9327 -711 21064 38051 39828 -13614 -33759 5498 25525
515 25525 23153 -13480 -39852 -12175 -2856 2864 15851 -4004 -17386 -24258 -9554 37801 25338
528B5338m7265j3140J2656M2014O711l5559l927l074O333L0111P195R79k5773
541B599l3543L4308L6713n579k9666m3170J3076L3917m094r9j5048j9667P878
554b2375P784L4388J6056m5970k1628J6625L4646K4460l9255k9549J2058N724
566g036J9444N541j2256n754k7031R993N0097N626k5861l8323o203M9552J1916
579B9705k3304j5492j9654Q725J2691O217K2460k1086l5086J1910K9604L3833
591D0523j3142m8816M526K2819J2669M766k4469q246j600j0080L0019J7106k0730
604E345k2994j7215L4329L9794k1359k4175j4355M081K6923j450m67k339l2730
617b6612m10K4440K1784R159l9082j8216L0094J5640P426j4112k0268R490n307
$$ plain form
528 25338 -21927 -35067 -22411 19603 26314 -9245 -13172 -16246 -9913 20198 27393 28372 2599
541 2599 -30944 3364 40077 34498 4832 -38338 -25262 8655 4561 4462 -10586 -30253 -22375
554 -22375 -14591 19797 35853 -10117 -31745 -15120 19526 43986 4731 -24818 -12760 -7036
566 -7036 12408 17949 5693 -61 -27092 -17099 32998 38624 12763 -25560 -31763 17789 29705
579 29705 6401 -9091 -28745 -20020 -7329 -1112 21348 262 -34824 -22914 6690 40523
591 40523 27381 -21435 -16909 5910 18579 23345 -1124 -9370 -10970 -21050 8969 26075 5345
604 5345 -17649 -34864 -535 39259 17900 -6275 -20630 -16549 10374 8924 8457 6118 -26612
617 -26612 -27022 -2582 19202 28361 -10721 -28937 1157 16797 24223 10111 -10157 -667 -5974
630e974L665K1368j3789j9431j2134Q206M1111l157l2255n686M510K4268R895
643B0597j6282L672j2863j5890J8672J5457R781j8718l7263J6815K7792L270m366
656A0674k0199L923J1296j2307J2520Q353j4397q586j1636J9485K2240k6036j4265
669a8935O139J2781J7661j6977p015J3522j0788J673J0076N005N631k8612j4025
682b3864K7066Q975j632j3282j3053J6621m199o914J8678O66n315j3064j0413
695a9730K6903N793j6228N17l640P362R94j3171J7311N229j5479J077Q96J4167
709A2001K925k5517M942J2377j511K952j2716m5N221j6424J1702J7814n518j0328
723b125k2623Q182L1985k959o492q505j1512R553j89J1744J9206k3082k1169J565
$$ plain form
630 -5974 -2309 19059 5270 -14161 -26295 -18089 23022 19865 -12390 -18076 -13566 10702 20597
643 20597 4315 7987 -4876 -20766 -2094 13363 23144 4426 -32837 -16022 11770 15040 10674
656 10674 -9525 -5602 5694 -6613 5907 14260 -137 -8723 -20359 -874 21366 -4670 -18935
669 -18935 -12796 -15 17646 669 -6346 7176 -3612 -1939 8137 13142 18773 -9839 -23864
682 -23864 3202 12177 10545 -2737 -15790 831 -3368 -10282 8396 9062 3747 -9317 -19730
695 -19730 7173 12966 -3262 -2745 -6385 977 1971 -11200 6111 11340 -4139 -3062 -2166 12001
709 12001 14926 -10591 -5649 6728 5217 8169 -4547 -4592 629 -15795 -4093 13721 8203 -2125
723 -2125 -24748 -16566 15419 12460 5968 -2537 -14049 -4496 -4685 7059 26265 3183 -17986 -16421
737a6421J5958K8113j4739k5813N730K243J0296N318r778L417j4971q634K8301
750I020J0237j0093k4680j8002L3885K4340j1434j3488k0769K822J8598O864J8632
763B5932r475l7636o819J7184L6758J2603m1693k1800P179J5843K3583p148j4197
776C14q098j7523J8420K9362k221j8242l1026O519M2027N693j6423k2655j3906
789b7759K2960J5578O232J708l3903j8584J7595K9987K8217k6512m5055J564K0906
802g066K9678Q651k7535j4605j1978M090L6798J0067j7756k8057j7382L5744K9189
815B9838j2925j8902k0754Q646K5641J326J746j5692k8213Q952K3370K3747l114
828B3666m6536j3091K6120K6611J6636k3051k5488O09P46K4251K1357j5803k3282
$$ plain form
737 -16421 -463 27650 12911 -12902 -7172 -4929 5367 10685 907 4324 -10647 -19281 9020
750 9020 19257 9164 -15516 -33518 367 24707 13273 -215 -20984 -18162 436 7300 25932
763 25932 16457 -21179 -27998 -10814 25944 38547 -3146 -24946 -17767 -1924 21659 14511 314
776 314 -7784 -25307 -6887 22475 20254 2012 -29014 -22495 19532 25225 8802 -13853 -27759
789 -27759 -4799 10779 17011 18719 -15184 -33768 -16173 13814 42031 15519 -29536 -27972 -7066
802 -7066 22612 31263 3728 -10877 -22855 -18765 18033 28100 10344 -17713 -35095 649 29838
815 29838 16913 -1989 -22743 -14097 11544 12870 14616 -1076 -29289 -20337 3033 26780 23666
828 23666 -22870 -35961 -9841 16770 33406 10355 -15133 -14524 -13778 10473 31830 16027 -7255
841g255k3690J2257M2442P54k2795j8841m698K6706R758p675j209j8499m704J6764
855f85J1715Q987k5539k8810J9223K4867J2790j1053l0636L070J4285Q842J8217
868B5273q515j9207j1290m280L1685J6296k4153j9159r184J5508K1926j0541n694
881a335l466r441J1936P512M307j671k5654J649K3220N909l825k2667p242K2850
895B082N303L191l21j5273m77K96J0653K2423j4908k2586m292O008K2141l702
909A0538j9733J541k825L121R625k850N481q568j2144J8374Q997l800j0058j4491
923a6792J7118J3388j0654k314p365P74R307l291J1280K441k0019j666N456J3107
937A0770P773k2587p747Q435r26N884m713l144P008j1984K870J4266k064j036
$$ plain form
841 -7255 -30945 -18688 23754 24508 1713 -17128 -21826 4880 14638 6963 5754 -12745 -17449 -685
855 -685 11030 20017 -5522 -34332 -15109 9758 22548 11495 -19141 -16071 -1786 7056 25273
868 25273 16758 -2449 -13739 -18019 13666 29962 5809 -13350 -22534 -7026 14900 4359 -1335
881 -1335 -4801 -14242 -2306 5206 9513 7842 -17812 -16163 7057 12966 9141 -13526 -20768 2082
895 2082 7385 10576 10255 -5018 -5495 -5199 5454 27877 12969 -9617 -13909 -7901 14240 10538
909 10538 -9195 -7654 -10479 -7358 2267 -583 4898 -3670 -15814 2560 11557 7757 -2301 -16792
923 -16792 326 13714 3060 746 -6619 -5845 3462 171 11451 13892 -6127 -7793 -2337 10770
937 10770 18543 -4044 -11791 -3356 -4282 1602 -3111 -6255 753 -11231 -8361 5905 3841 2805
951B805r158J059J9504o413r811J24j952R958k692p150R505p076o285P339K352
966B109R995p782j5594J0890M343j105j091r608P644P91j1463P995L039j151J162
981A74q305J0798O799j2497K910L172L294K986j5399K820R852p693J003k897N09
996b474P535j1227J848J1184n576q60m329K173J3091j1955p707O892l6N741n593
1011a293o852J0406m936k361R291l33L002r002q003J7121L617p709m452q100R896
1026B92M138q325O895l761o427M119M63J2651J93j9392K621P513O607L305j6186
1041e294j362N920m751Q694J580n127j670j1251J0502J7220p979p640q128K912
1055f374J6922m890n702L34r543N033N532L276O408j6669r096J3940R022O922
$$ plain form
951 2805 -6353 -5294 14210 7797 -2014 -1890 -3842 6116 3424 -3726 5779 -1297 -7582 -243 2109
966 2109 12104 4322 -11272 -382 3961 2856 1765 -7843 -199 592 -10871 -2876 163 -988 174
981 174 -8131 2667 9466 -3031 -121 3051 6345 9331 -6068 -3248 6604 -1089 -86 -2983 -2474
996 -2474 5061 -6166 -4318 6866 1290 430 -3899 -1726 11365 -590 -8297 -1405 -1441 4300 -1293
1011 -1293 -8145 2261 -2675 -5036 4255 3922 6924 -2078 -10081 7040 10657 2948 -1504 -9604 292
1026 292 4430 -3895 3000 -761 -7188 -3069 -2606 10045 10238 -9154 -6533 980 7587 10892 -5294
1041 -5294 -6656 -736 -5487 3207 4787 -340 -2010 -13261 -2759 14461 6482 -1158 -9286 -6374
1055 -6374 10548 5658 -44 290 -9253 -4220 1312 4588 10996 -5673 -14769 -829 8193 15115
1069A5115j1812j5906R538M298K731N448j0444l986m441q03K0017J169j4401o513
1083i990k506J7816Q704j3721k261l476Q62J0704j563J842n190j6416R727J3713
1097H245L842m601k0601J358J7043J923K502q399j0534M518j524R986J0389j5387
1111a240r630j626R050J8107r706j2720K044J90J0912K826o884J555r551o97J5473
1126H103J880l337j3102r143J8058Q930m751n286j2352M660P896K07Q693p411
1140C045j4274J747M902J4524J762j9843j296M984O189P602r189k449K178o415
1154f533R948N878n731l962j0521Q661J6149p396p825o865K59J4198j548k511
1168B201M44j1561J134O684N306P730j4163j0987J0026N384O397n425j0851P017
$$ plain form
1069 15115 3303 -12603 -3065 1233 3964 9412 -1032 -5018 -9459 -10262 9755 10924 -3477 -9990
1083 -9990 -12496 5320 14024 303 -1958 -5434 -4572 6132 4569 6411 1221 -15195 -5468 8245
1097 8245 12087 7486 -13115 -11757 5286 7209 9711 1312 -9222 -4704 -6228 3758 14147 -1240
1111 -1240 -10870 -12496 -3446 14661 4955 -7765 -5721 -5531 5381 8207 1323 2878 -6673 -7370 8103
1126 8103 9983 6646 -6456 -15599 2459 11389 6638 1352 -11000 -6340 1556 1763 10456 3045
1140 3045 -11229 -9482 -4580 9944 11706 -8137 -9433 -4449 1740 9342 153 -2296 -118 -6533
1154 -6533 3415 9293 3562 -400 -10921 -2260 13889 6493 -1332 -8197 -7938 6260 4712 2201
1168 2201 2645 -8916 -7782 -1098 4208 11938 -2225 -13212 -3186 2198 8595 3170 -7681 -664
1182f64R1n36O893m900j868k002k730J3893j15j1429j572o70J1649M784j2702
1197a878p38r94j009Q546j639J107k736j2868P290R891J09j112j1690K048J0924
1212E251m192J479k100m545N350l132K565N863j0856j691M494M589P679j1351
1226e97p958Q207J873N676j340r058K192m445M90J2112k920n204o407l251J5370
1241D740K711q361j114l788O247N018o203L754m217o205P518K533L734m125j4152
1256a1910O995J1246J916p77j2374r06P853j172O614l85j1081k406k934R643J1120
1271A1442j1603p711j083M562J2582m058o226J596n268N646O665k365l12j1181
1285g314k340J5008K892k774q451q591J2150O165p13J502j0870l071M326K519
$$ plain form
1182 -664 -573 -1109 5784 884 -984 -2986 -5716 8177 8062 -3367 -4939 -5609 6040 10824 -1878
1197 -1878 -2616 -3610 -4619 3927 2288 3395 659 -12209 -4919 4972 5081 3969 -7721 -5673 5251
1212 5251 1059 2538 438 -4107 1243 -1889 676 6539 -4317 -6008 -1514 3075 10754 -597
1226 -597 -8555 -348 1525 7201 5861 -3197 -1005 -5450 -4960 7152 4232 -972 -7379 -10630 4740
1241 4740 7451 -910 -2024 -5812 435 5453 -750 3004 -1213 -7418 100 2633 6367 2242 -11910
1256 -11910 -4915 6331 8247 7470 -4904 -5810 2043 871 7485 7100 -3981 -6387 -9321 322 11442
1271 11442 -161 -7872 -8955 -4393 8189 4131 -2095 -499 -5767 -121 6544 4179 3867 -7314
1285 -7314 -9654 5354 8246 5472 -2979 -11570 580 6745 6032 7534 -3336 -6407 -2081 438
1299D38J0524o159j5376N06L589J0796L631j3248j167J643J907J0002j882k917
1313B287l158p311J0523Q589o056n221r546N313J3016l800k375m521n256P861
1327C45K749L138J851j4310l065P044N409N944j1663r489O784K340O188J332p722
1342c125J569k486K018J2391l097o032m798k166J2971J352r375j728l833M989
1356a350O080m173K039m395o136P771M001K755l729j2929M495P883J73P73q169
1371d911k020N520j101O406K218p738M2j279O073Q220r376m641M71Q61O946m063
1387A628m926K401m654L381N576k323Q64o976j309J1417j84k948l911n604Q177
1402F09J687k874L178n934j323L569N99P737l044q772L676K038M211O43r346K101
$$ plain form
1299 438 10962 4803 -10573 -10067 -6478 4318 7949 -5299 -6466 -4823 -2916 7086 5204 2287
1313 2287 -871 -8182 2341 10930 4874 -347 -9893 -4580 8436 4636 2261 -2260 -7516 345
1327 345 3094 6232 8083 -6227 -9292 -2248 3161 9105 -2558 -12047 -5263 -2923 3265 4597 -3125
1342 -3125 -1556 -4042 -2024 10367 7270 1238 -3560 -5726 7245 8597 -778 -2506 -6339 -1350
1356 -1350 4730 557 2596 -1799 -7935 -164 3837 6592 2863 -10066 -5571 2312 2485 3258 -4911
1371 -4911 -6931 -1411 -2512 3894 6112 -1626 -1584 -2863 3210 11430 2054 -2587 -2116 -1255 5691 1628
1387 1628 -3298 -897 -5551 -2170 3406 1083 1947 -5029 -6338 5079 4895 1947 -1964 -7568 609
1402 609 2296 -578 2600 -3334 -4657 -1088 -489 7248 4204 -4568 -892 1146 5357 6000 -3346 -1245
1418a245J706k568M424k781j695Q60m655O849M877o176j223k462L927P626o548
1433I16k179l3k791N227n59l47K730p759K01O041R73L177o233l457P342j487o0
1450A702j22m411L791j266k339N345l858k030K053n16O896k497p396L631Q31L080
1466B894J562o865J540k98k971N693k53r90n48n493N751M946m560N31k378J762
1482C23M898n597J83J068l773M049l16l53J570p778J472P245K01Q34o483l782
1498f239P321n11J663P45o321O22o49J475P716m484m615P95M90P319r54o894K459
1515f2o65K519L375n178J36k663k788Q684J176k903m098o712P185P451k313q23
1531B321o631j717N976M59M593j047r148N10K591N374M343r184l129L615J751
$$ plain form
1418 -1245 461 -2107 2317 -464 -2159 -1299 -5954 895 5772 -404 -1627 -4089 -162 7464 916
1433 916 -1263 -1296 -4087 1140 581 234 2964 -4795 -4594 1447 2420 5597 -636 -4093 3249 1762 1702
1450 1702 1580 -2831 960 -306 -2645 2700 -1158 -3188 -1135 -1651 5245 2748 -4648 -1017 -186 2894
1466 2894 4456 -2409 -869 -1167 -4138 1555 1302 312 -236 -5729 22 4968 408 939 -1439 323
1482 323 5221 -376 -193 875 -2898 1151 835 482 2052 -5726 -4254 2991 3192 4026 -2457 -6239
1498 -6239 1082 571 2234 2979 -3342 -2720 -3369 -1894 5822 1338 -3277 -2482 -1992 5327 4373 -2521 -62
1515 -62 -727 1792 5167 -11 125 -2538 -5326 3358 4534 1631 -2467 -9179 -1994 5457 3144 2321
1531 2321 -4310 -6027 -51 408 5001 3954 -5194 -4684 -2093 3281 7624 -1560 -4689 -1074 677
1546F77N580l336n509J742k190M967N255n766l688m762K193J1434j036n928m078
1561d445l968P688N186j139J67q255k562O743L682M663n372r784M028M293L663
1576D588J018q361m94K078N58O662k925n904r68q42Q915M097q822m029k382M517
1592b294Q998l229l520l416m820P021N470P17j358j0240j1Q620K687J894o752
1607b33n535N273J101K783R99o925p82Q12K685O854n164o501O18J855P948J96
1623E984p826j092k163L255O836k269k061n076l845Q400M623q92k532p617L503
1638b772O065n74J803m549l660L465j51L897np788R17K043L525L493p190k533
1654d014K812O98N063j107m935n24l416L614O604l470k134m271m54Q476J70j863
$$ plain form
1546 677 6257 2921 -2588 -846 -3036 1931 7186 1420 -2268 -7030 -4837 6597 5561 -367 -4445
1561 -4445 -8413 -725 4461 3322 3489 -4766 -7328 -585 3097 7760 2388 -7396 -3368 925 4588
1576 4588 5606 -2755 -3249 -1171 -613 6049 3124 -2780 -3748 -4590 4325 8422 -400 -4429 -6811 -2294
1592 -2294 6704 3475 -45 -3461 -8281 -1260 4210 4927 3569 -6671 -6682 1938 4625 6519 -233
1607 -233 -5768 -495 606 3389 4388 -2537 -3319 -2507 178 7032 1868 -4633 -4015 -2160 5788 5984
1623 5984 -1842 -2934 -5097 -1842 4994 2725 664 -4412 -8257 143 4766 3874 1342 -6275 -2772
1638 -2772 3293 2719 4522 -27 -3687 -222 -373 3524 3519 -4269 -3352 -1309 2216 5709 -1481 -4014
1654 -4014 -1202 -504 4559 3452 -1483 -2007 -5423 -1809 4795 1325 -809 -5080 -5534 2942 3112 1249
1670A249m08l834L316K327r70K344m474k758L850Q7K389k853n759M636J948Q92
1686A982Q14n299P44K112j122M532j928m579K05j874M659L194n341k78n75J252
1702a502N322k829q6J106l248L296P07j473O73m738P26M968k434l99k814j526
1718d251N611m83k57R99m387J572J423j61L432m623l083K913j79L377o82m743
1734c522L121L49Q61L249l314K81J34j931M663p95m020k42k678L657K817m510
1750a880L34j221r6M678j009J07J63m573K725K781p92P67n283j70M551q14J259
1767A527j577k631L580n8J270K680n043l63N21M58M335m144m282J566p87L698
1783G50Q58m158J448j496J036M741j666m43j833k562N307R53k625k76l962K436
$$ plain form
1670 1249 841 -2993 323 2650 1680 4024 -450 -3208 642 729 3118 265 -5494 -858 1090 1982
1686 1982 2796 -2503 -1759 353 -769 3763 1835 -2744 -2539 -4413 246 3440 -1901 -2179 -2754 -1502
1702 -1502 3820 991 905 2011 -1237 2059 2766 1293 1966 -2772 -2046 2922 488 89 -2725 -4251
1718 -4251 1360 877 620 1619 -2768 -1196 227 66 3498 -1125 -4208 -1295 -1474 1903 1221 -3522
1734 -3522 -401 -52 809 4058 744 1025 1159 -772 3891 3096 -924 -1166 -3844 -187 2630 -1880
1750 -1880 -1546 -2767 -2863 1815 806 913 1076 -3497 -772 2009 1217 1984 -3299 -3469 1082 268 1527
1767 1527 -50 -2681 899 841 2111 4791 -252 -615 -94 364 4699 555 -3727 -2161 -2948 750
1783 750 1608 -2550 -1102 -2598 -1562 3179 1513 1070 -763 -3325 1982 2935 310 34 -3928 -1492
1799a492L592j609J244k318k546M628L90K011j21o892J620J715J115J859n158
1814a962k001K204q41M134j60l717J353j386L137M278m089j647j205R4N600j519
1830B273l232j78k893L367L429j459J032m471j271N816N67Q64k866n376L318J865
1846G85J17J066m900r08K193J96M699j760m399J379L50M399J699n819j073l8J063
1863i51M815k172k673q92k795N105L677j876r47m926J284N772o13j17l135l835
1879d279L653P92N72J150n403j17K665J099L571l330m060L010N29L631K54n715
1895a978L34o86J531N048k801k276j378j555O152J552k803n20l625K149M002k093
1911A053O67k710k911L740M09O96j2n299K320K737L07K050m419j145L136m41K859
$$ plain form
1799 -1492 2100 491 1735 -583 -3129 1499 1889 3900 3779 -3113 -1493 222 1337 3196 -1962
1814 -1962 -3963 -1759 -2600 1534 1374 -2343 -990 -2376 761 5039 950 -697 -1902 -1808 3792 2273
1830 2273 -959 -1137 -4030 -663 2766 1307 2339 -2132 -3403 2413 2980 3844 978 -4398 -1080 785
1846 785 902 1968 -2932 -3840 -1647 -1451 3248 1488 -2911 -1532 -1182 3217 4916 -903 -1976 -2014 -951
1863 -951 3864 1692 -981 -1873 -4668 437 4114 2238 1291 -3635 -2351 3421 2808 2691 -444 -4279
1879 -4279 -626 166 738 1888 -3515 -3632 -967 132 3703 373 -3687 -677 -148 3483 3737 -1978
1895 -1978 -1644 -2330 -799 4249 1448 -828 -2206 -3761 2391 3943 1140 620 -3005 -856 3146 1053
1911 1053 1720 -990 -3901 -161 248 944 932 -4367 -2047 690 997 3047 -1372 -2517 619 178 3037
1928C037n62m665Q34l47K535L595m284j625j52n2N004r92k662Q12k794K105K591
1945B378k494O48k513j114M256n90o37q37l146M421J752j570P79l700N98L300
1961A531n59K216k263m217K668N55K327J058n155J39J222K72L439k800k264J421
1977d10j722L400R10l576K13j829J827M580l120j338q10j168N277M75j566n53
1993E90l662J673L945n26R50m004k846M187J017J379r41n107J725J332O55K765
2009C132l685j970J355k85M434q52m439L34o22L208L283l815j173j071l94N585
2025C025j55j868j317l756L544L998r79k25m660j045M674J8J368j745m715K006
2041a832J161J848K083n163j316K052Q81L858k325m114J449m93L389K276m095
$$ plain form
1928 3037 2475 -2190 -1356 -1703 832 4427 143 -1482 -1634 -1686 3318 2326 -336 476 -2318 -213 2378
1945 2378 -116 532 -1981 -3095 1161 571 -66 -903 -4049 372 2124 554 1333 -2367 -1769 1531
1961 1531 972 3188 925 -3292 -624 -69 2258 3316 -1839 -1700 -478 -206 3233 433 -1831 -410
1977 -410 -2132 1268 2178 -1398 -1185 -3014 -1187 3393 273 -1065 -1875 -3043 2234 2709 1143 590
1993 590 -3072 -1399 2546 2020 2970 -1034 -3880 307 1324 2703 1762 -3345 -1620 -288 367 3132
2009 3132 -553 -2523 -1168 -1453 2981 2129 -2310 -1976 -2598 610 3893 78 -1095 -2166 -2560 3025
2025 3025 2870 1002 -315 -4071 -527 3471 2492 2267 -2393 -3438 1236 1254 2622 877 -3838 -1832
2041 -1832 -671 1177 3260 -1903 -3219 -1167 -286 3572 1247 -2867 -1418 -1911 1478 3754 -341
2056c41p74j480P37N602j083k295j367k692M725K527j972p1m209L56L796l85J027
2073B101k544l862K998J208J617O65m942M10J903Q79K938l013k584J506n08L381
2089B153R86m368j61r53K046M338k663j798o04j297M699O18k062l87l625J319
2105a759L569j049N93l159k422M094O02Q53m20l866J848J754L94J872l454j468
2121b018J721r7L209q80m347J130J43K177K965l863p45m56m09M636q22k186o13
2138d55l084K902K553j863J30l047k08L983l53Q72r63l094K436J232J86J291m176
2155a658j40J787K70K385k330k809J868J97K021J556l842n6m16M26M180k116k200
2172h77l90j889L260J501k095L46k379L94L590j140J074j139k497L317N1J91K11
$$ plain form
2056 -341 -1115 -2595 -1858 3744 2661 366 -1001 -3693 1032 3559 1587 1516 -2693 -2337 1459 1074 2101
2073 2101 -443 -4305 -1307 -99 1518 2183 -2759 -2349 -446 433 3371 358 -2226 -720 -1228 2153
2089 2153 3139 -1229 -1390 -2343 -297 4041 1378 -420 -1024 -2321 2378 2996 934 547 -3078 -1759
2105 -1759 1810 761 1354 -1805 -4227 -133 469 1322 902 -2964 -1116 638 1032 2904 -550 -2018
2121 -2018 -297 -394 2815 1935 -2412 -1282 -1139 1038 4003 140 -605 -1061 -1470 3166 2344 158 -455
2138 -455 -3539 -637 1916 53 183 -2864 -3072 911 558 1430 467 -2627 -191 1041 1227 2518 -1658
2155 -1658 -1798 -11 259 2644 314 -2495 -627 -430 1591 3147 -695 -751 -1167 -741 3439 1323 -877
2172 -877 -1267 -3156 104 1605 -490 -144 -2523 -2129 1461 321 1395 256 -2241 1076 1127 1318 1529
2189A529l621J283K027r65J746k544j683K474m93K240L39l819Q10l10P31K860
2205B604k811j201K56j305K913L5j541J459k201J632K009j938J072q72q25K921
2221B207j410p40K75k275K391J102j700Q95k285o8K696p15J350j040k791K074
2237c4r4M61R36k934L72Q60j047K496j365j212K004j008J940O32l252J126J56
2254C7P07K248l194r71J73o58L448Q5k150r4k279J762L189j404J20j998j596L371
2272G96k23k86J35l552K239J061j06J428k764o99K801r9K149j371l827J623N47
2289a48J712J936l992j542J70K25M150k53k794n75j966L005K864k014j47k610
2305a979o66L718j39j11j034l276K897J776j10O99l621p9K690P80K069k570l527
$$ plain form
2189 1529 -2092 -809 1218 253 1999 -545 -2228 246 -247 1993 2332 -1487 -677 -987 -256 2604
2205 2604 -207 -1408 -1152 -2457 456 491 -1050 409 -1792 -160 1849 -89 983 111 -714 2207
2221 2207 797 57 332 -1943 448 1550 -150 745 -1540 -1608 1088 373 1723 683 -2108 -34
2237 -34 -128 333 1269 -1665 -1293 -433 -1480 1016 -349 -1561 443 -565 1375 2007 -1245 -119 37
2254 37 744 2992 -202 -1173 -1000 -1658 1790 1875 -275 -369 -2648 -886 2303 899 1019 -979 -2575 796
2272 796 573 287 422 -3130 -891 170 64 1492 -1272 -1971 830 731 2880 1509 -2318 -695 -148
2289 -148 1564 3500 -492 -2034 -1864 -1639 2511 2258 -536 -1111 -3077 -72 2792 778 631 -1979
2305 -1979 -2645 1073 934 823 -211 -3487 -590 1186 1076 1775 -1846 -1925 765 1545 3614 1044 -2483
2322b483J186O98K781J291m387j116l69J013M408j218k403p44j828L508K190j787
2338G40m74k829K90L872o92Kj721k255L033J374M81k62l872Q84K480L95J888k873
2356D61l239J654N55K729Q01m233p09K2J210L695j751j917n07j319L406J159j936
2373H1j94k289J229K957j303J29j421j413L407J89r2k9l299J157K110L9J222l229
2391g49j590J910K42K092m15l385M74J45J144K568k495r51Rn74K878k24j709M25
2409b05j357J592J954k067K37j255k34L221p28k63r88k376K577J449n54O63l268
2426a602k99K119n1J426j209k606J331K6J349J324k941J66M56o1K529j485j578
2443a106Q50r08K330Q51k361K05r98P26K672j340l97r53j587K697P73o86j14k790
$$ plain form
2322 -2483 -1297 -599 2182 3473 -914 -2030 -2399 -1386 3022 1804 -599 -1343 -3171 337 2527 740
2338 740 266 -2563 -2273 1599 907 909 -812 -3067 -34 1340 1821 1559 -2313 -1429 1051 1446 3334 461
2356 461 -2778 -1124 -569 2160 2961 -1272 -1981 -1959 -749 2946 1195 -722 -1229 -2548 858 2017 81
2373 81 -113 -2402 -1173 1784 481 610 -811 -2224 1183 1372 1280 1251 -2048 -891 1219 1258 2480 -749
2391 -749 -2339 -429 -187 1905 1490 -1895 -1421 -1276 -132 2436 -59 -1010 -1001 -1575 1303 1079 -630 -205
2409 -205 -1562 30 1984 -83 154 -1101 -1335 1886 1158 895 -93 -2469 108 1557 1003 1666 -1602
2426 -1602 -1901 218 167 1593 384 -2222 -891 -865 484 1808 -1133 -967 -511 -572 1957 472 -1106
2443 -1106 -256 -1164 1166 2017 -344 -139 -1137 -411 2261 921 524 -429 -2016 681 1454 768 654 -2136
2461b136N98K208n22J074j706j524J739j61J317L34k729O20N27N99J776k155j003
2478a144J118p14K579l43k332O68q81J162K164j892k58q64o68K721n35p53J35
2495A63k137J307J529j149R36j774n17K123n44O38k60k126J823L52L73J037k761
2512i87K54J301m77J776j184j575Q73o48J318Q90k088J72l67q4K464j577p34L67
2530c06j192J973M08j164K95j367L31K480j319M93j022j334K450N1p4L91k153
2547a059L61J581m67J274j867j365J559k69J253r2k384P18K11N50J701k095n27
2564i17L12p23K496r6j739M67j228J202J752j257J85r98o59K596n48l0j66k236
2582a587J673J087q42Q45k115m94J714j87J104p90k218J128K45R07J300k593m21
$$ plain form
2461 -2136 -1538 670 148 1222 -484 -2008 -269 -430 887 1221 -1508 -888 -361 238 2014 -141 -1144
2478 -1144 -26 -740 1839 1496 -836 -168 -1049 113 2277 385 127 -737 -1405 1316 781 28 163
2495 163 -1974 -667 862 -287 649 -1125 -1642 481 -63 575 315 -1811 12 364 737 1774 -987
2512 -987 -733 568 91 1867 683 -892 -19 -667 651 1541 -547 -375 -742 -826 1638 61 -673 -306
2530 -306 -1498 475 883 -281 14 -1353 -1022 1458 139 632 -390 -1724 726 777 703 1094 -1059
2547 -1059 -698 883 416 1690 -177 -1542 17 -252 1001 909 -1475 -757 -546 4 1705 -390 -917
2564 -917 -605 -1328 1168 1072 -667 -200 -1428 -226 1526 269 454 -544 -1203 1393 845 815 649 -1587
2582 -1587 86 1173 331 1176 -939 -1433 281 94 1198 408 -1810 -682 -437 470 1770 -823 -1244
2599a244O04l7K399r56j650K94p75J843J302j495J93j332L5K437p43k75n49j622
2617a571K195K21o44K58k183N60J788k99Q20j533j471J553L36O96M79k393J67
2634a021M31M31J991j497j159M57m44J984K63j752O27j104P68J744j364k44m25
2651c14q71J917p5q03M2j597J101J431q40O72j581p83K200k27P21m66k251J168
2669e56N99L06J282j924o15R50k61J794m43j715O34p69J240J159j939l09j79j03
2687h49K230j078q00K48j561J961P47n35j57j519o2K083l91M59o47j659J376M11
2705B57L61P06j977O1R99l60J471j228j274J109l84Q60L75j812M24o16N75J582
2723A129j218o64K77j052K014P63j303L93j664M78K059j035O87j043j101J731
$$ plain form
2599 -1244 -640 -677 1722 766 -884 -590 -1365 478 1780 285 478 -854 -819 1618 875 600 51 -1571
2617 -1571 624 845 201 459 -1724 -1164 624 325 1145 -388 -1859 -306 30 726 1205 -1188 -1021
2634 -1021 -590 -159 1832 335 -824 -367 -811 1173 1436 -316 311 -793 -25 1719 355 111 -314
2651 -314 -1185 732 657 -146 -104 -1701 -600 831 -9 663 -918 -1701 499 272 993 527 -1724 -556
2669 -556 43 349 1631 -293 -908 42 -219 1575 1132 -583 51 -718 522 1681 -258 -567 -746 -849
2687 -849 1381 303 -497 -249 -1810 151 898 363 206 -1313 -1375 708 317 776 129 -1530 -154 257
2705 257 618 1324 -653 -592 407 47 1518 290 -984 125 -259 601 976 -836 -412 -1028 -453 1129
2723 1129 -89 -753 -476 -1528 486 1249 -54 339 -1325 -847 1212 177 864 -179 -1280 451
2739D51j05K70K15j882R26O80l71J167j634p84J188l30R88j61k023P70r3P68J174
2758A214j617l95K09n51K414n52j172K62r46J158J173j005K29r93j93K039n89
2775F85q9m77j344J454N20n26N40j783M2J628n34P42r50j594J475n9P95N58k112
2794a029J34M48M00J783j242j278N31o95J952N32j601L9q73M92K026j039n60m12
2812c92r11J841K93m12j32j695L60J709j97N23j772r44J441K15J095j62k231M79
2830h92N87O14J453j726r22M28k68K046J75j778j35n36R20J756j198n18p90l69
2848a153J723K23m82l05j843J382J433o21L59j747o61J791J35J052o29j909N62
2865f90O59N77J232j976o08O36k59K138o95j566M00r59J296J017j119q1j119k3
$$ plain form
2739 451 346 616 831 -1051 -125 555 184 1351 -283 -1067 121 -209 779 618 -1405 -635 -728 40 1214
2758 1214 -403 -798 -589 -1140 1274 722 -450 -188 -1134 24 1197 192 421 -572 -765 1274 685
2775 685 596 119 -1225 229 749 223 763 -1020 -978 650 116 858 -92 -1686 -211 -270 525 1083 -1029
2794 -1029 -895 -447 -47 1736 494 -784 -253 -948 1004 1536 -65 -26 -899 -407 1619 580 20 -392
2812 -392 -1303 538 831 419 287 -1408 -1048 661 464 987 -785 -1729 -288 -73 1022 860 -1371 -892
2830 -892 -305 309 1762 36 -886 -458 -726 1320 1495 -283 -418 -954 -34 1722 524 6 -784 -1153
2848 -1153 570 793 311 6 -1837 -455 978 357 716 -1031 -1692 99 234 1286 657 -1252 -690
2865 -690 -31 546 1778 -198 -806 -170 -429 1709 1014 -552 -152 -1111 185 1202 83 2 -1117 -1140
2883a140J841l33m52l5j483J665L78j01J57j572Q0J298M8P13p24j477J038J66
2901F7O98O05j730l48O44l68J757p90r70O23r89J002P58j517M97n12k90J869j188
2920a82q8O1q75J578o8m81L96j420P11J039n00L59o13q05J427l40L93L50j659
2939g17O66J35j87J045j225j85N35o36J035m45q27P51l13L63P46j411L40J01k05
2958d34J443r94n97P25p14R45O60j026M71p67q9J311p20M5r7j105J364k46m59
2977b84O58j490N56J168j025Q60p76r37J415j53N38M7j503M79N45J84J138j401
2995A9n51L01k93J390qj055M25q11P06J059r17Q8p92m00J592l82o59K75j361J013
3015c61J117p98M02j443j56J599r2O05l96j879Q33O95N92P53j689n92O30L8J458
$$ plain form
2883 -1140 701 368 -84 -119 -1602 63 441 340 497 -1075 -995 303 351 1064 340 -1137 -99 67
2901 67 765 1370 -360 -708 -64 -432 1325 535 -435 188 -801 201 959 -558 -61 -573 -863 1006 -182
2920 -182 -270 -209 -1084 494 426 -55 341 -1079 -368 671 171 530 -83 -888 539 199 592 942 -717
2939 -717 -51 84 -103 942 -283 -468 67 -569 466 21 -806 -55 -368 -5 741 -670 -330 -229 -434
2958 -434 1009 15 -582 143 -571 374 1034 8 479 -288 -377 934 214 259 162 -943 421 175 -284
2977 -284 374 -1116 -560 608 -417 443 -333 -1270 145 -8 530 577 -926 -447 98 282 1420 19
2995 19 -532 -231 -524 866 858 -197 228 -583 123 1182 265 353 -439 -839 753 371 -288 -13 -1374 -361
3015 -361 756 -42 360 -1083 -1239 360 268 873 477 -1402 -569 126 718 1471 -218 -810 -180 -142 1316
3034A316m88j442L34n83J090R37j161j97p72J60J871o09n34n55o57J463P23n48
3052C48J25j671J3K047j92K96j093j396J152O99P54J13j918j29O43K33J441q88
3070E77j168L03m05J274N69j462o3o45K81J830r07o44l14o51J856P27r41j10j609
3089a502P42J579j55K37j377r49J205N06N45K91j928K01L73K08J445j486j019
3106a084O96j70J517p6j783K70k12N94J611j142o72l20l09K104K75r75m55j284
3124a415J073J338l47L13j484q04J598J15O26m89j768P98M88L21P91j605o56R05
3142b02k45J309m79j422N36l05J078J128j623l77l24L75J736k35j158j5r49J343
3160A71J063p16K02j521j05J642j97P0l85j514J012N80R8M77j698j42Q44N4J187
$$ plain form
3034 1316 828 -614 -280 -863 227 1164 3 -194 -966 -806 1065 456 -78 -633 -1290 173 896 348
3052 348 473 -1198 -1185 862 670 966 -127 -1523 -371 328 1082 1195 -723 -852 -209 24 1465 577
3070 577 -591 -288 -693 581 1150 -312 -375 -1020 -739 1091 184 -460 -774 -1425 431 1158 217 107 -1502
3089 -1502 -760 819 664 901 -476 -1425 -220 286 831 1122 -806 -605 -232 -24 1421 -65 -1084
3106 -1084 -388 -558 959 883 -900 -630 -842 -248 1363 221 -451 -771 -1080 1024 1299 324 -131 -1415
3124 -1415 -342 996 649 962 -522 -1326 272 387 1013 524 -1244 -446 42 363 1154 -451 -1107 -202
3142 -202 -447 862 383 -1039 -503 -808 270 1398 -225 -602 -926 -551 1185 950 -208 -223 -1172 171
3160 171 1234 518 720 -801 -906 736 539 609 224 -1290 -278 302 400 877 -821 -963 -119 -65 1122
3179A122j100j205N96J38J107O65j720j11l13M00J884o41j001j72o08J420P07
3196A168q30O5j293K22J457k16r6o74j005J256K19J07O0j471L21O38mJ046j211
3215b41r64J004j73J272k3j412L53l38O29J454j299l43l36m52J731P2j066K44
3233A12j023N88J077r59N03q32m12J252j52J76m39j296J318M22nO24j507j50Q43
3252A40k1O94l71r94O11k57N40O59j178j8j3k31J281m30o96K57o95R72L21j097
3272e26N62m97m3J108o17o1n7r64J457L12m43K91j205K81J073n34N22o49q90R83
3292A03k31O51K39j494M58K36j39R99r71l55J80n07J240l9r32M49o17M21J250
3311I41j031q7j22n28J537j58m41J15q45O81O93o47O16j141l88J490m43L63l65
$$ plain form
3179 1122 22 -1183 -587 -449 658 1323 -397 -508 -821 -421 1463 822 -179 -351 -959 461 1168
3196 1168 338 403 -890 -668 789 573 477 -197 -1202 54 273 380 440 -1031 -710 -72 -76 970 -241
3215 -241 -1205 -201 -374 898 875 -537 -184 -522 107 1561 262 -81 -417 -869 862 934 -132 112
3233 112 -911 -323 754 -205 298 -534 -946 306 154 330 -109 -1405 -87 335 330 954 -553 -703 140
3252 140 119 813 442 -552 59 -198 342 1001 -177 -195 -208 -439 842 412 -284 -27 -722 250 571 -526
3272 -526 36 -461 -504 604 -13 -74 -131 -1095 362 674 231 522 -683 -402 671 137 659 10 -880 103
3292 103 -128 523 762 -732 -274 -38 -177 822 -149 -504 -324 -831 409 370 -562 -113 -730 -309 941
3311 941 -90 -177 -299 -827 710 552 111 226 -619 62 755 108 724 -417 -805 685 242 605 240
3330B40j210P74L17P5O03j229l45P29k60R28k06j341Q05n05R02P41j399J85J19
3349g7j68J087m96k71op57R61M32n10L3j040K31J279k59P4o93p29R61K6K22O07
3370I07j792M4R93k94O59n03r78O74n0J032K56j353J41J64N6J146r45m74M5m94
3390g66J538j11r11L82j108P09J107p90M74q65n17J237m8m5Q1j598R29N28k12
3409A4O61r08n46P87j48P93R1j473O71l19O10P99j131j45j37k0J030j07r77L54
3429a01q58J088O13p35K18p29m10J539l72l1r7j035R73K11p3M89j343m3J091j98
3449A97N73n29r72O52KM96L11j141l03M69J35J004n87o66J20l47Q87L84q69K6
3469a58n22K75J113o67j24J9r23J077M10o14M91j269L91R52j90N56q69o83R76
$$ plain form
3330 240 -970 -196 121 196 799 -430 -775 -46 -306 622 416 -925 -120 -625 277 1018 -381 -196 -77
3349 -77 -245 842 346 75 69 -688 273 705 195 228 -812 -581 698 439 513 -180 -909 52 78 300 907
3370 907 -885 -841 152 -142 517 14 -964 -290 -340 692 948 -405 -264 -100 -44 1102 157 -317 -272 -766
3390 -766 772 661 -250 132 -976 -267 840 50 524 -341 -858 379 331 286 367 -1231 -302 226 14
3409 14 675 -233 -779 8 -140 653 744 -729 -58 -377 233 1032 -99 -244 -381 -401 629 522 -455 -101
3429 -101 -959 129 742 7 225 -504 -914 625 253 222 125 -910 63 274 201 690 -653 -696 395 197
3449 197 770 241 -731 -79 -77 419 730 -411 -714 -245 -110 894 307 -359 -239 -586 301 685 -184 -158
3469 -158 -680 -405 708 41 -83 -64 -987 90 500 -114 377 -892 -501 451 261 817 -52 -735 241
3488B41J20J9K18j367M77J70Q4J127j302n38Q08m07J059j13j086K48k03N07P14
3507G76q93j08j16k60J376k66l23j27r01Q68J126o06J8j199r5J082l4J76l03j148
3527i57P60J08L96M23j358j02O48O4R29p56r87N97k71R70O05j312J4l17J35J593
3547A182o47o23j27p47J433K53p25O1r82M77J066k41M04j013r42R13N74K12P3
3566F01j654J89P86L51P55q88j211P18L4J107L47j581K08l62N60J375q34n60r3
3585a52n21J150K29o25j2j102L31J414l21j27q87n59J323N6L11k88j242M49O70
3604I7M14N97j116o78L23K03J156l87j090K92m76P58J003r20l50k21l51J384j6
3623F22o95p7p65O98Q44m78n6p23l49J232J5M19k68j298M78N69M35L09j106m34
$$ plain form
3488 241 361 380 598 -769 -292 -122 -38 1089 -213 -751 57 -350 709 596 -490 -242 -445 62 776
3507 776 -117 -225 -341 -601 775 509 186 59 -842 26 1152 546 564 -635 -730 352 318 494 191 -957
3527 -957 -197 -89 307 730 -628 -730 -82 -18 911 155 -832 -235 -506 464 1069 -243 -229 -546 -411 1182
3547 1182 535 -88 -215 -962 471 724 -1 60 -922 -445 621 380 784 -229 -1171 -258 316 528 601
3566 601 -1053 -864 -78 273 1028 140 -1071 -353 -319 788 1135 -446 -238 -600 -40 1335 501 -59 -152
3585 -152 -673 477 706 81 69 -1033 -702 712 391 264 -623 -1182 141 197 508 220 -1022 -573 97
3604 97 511 1108 -8 -686 -363 -160 996 609 -481 -189 -665 93 1096 176 -174 -395 -746 638 622
3623 622 -73 -150 -915 -217 627 149 93 -630 -979 253 268 687 419 -879 -401 168 603 912 -194 -628
3643f28O47j80J035k99j190N90l63P23O63j082r7j24N6J093o15n22M2n90J101
3662B60M62o82J11r63K60J301n44M66o44j117J138L66q0N93j268j38P97k49N93
3681F62m38o68N00k94P43k4o85j36K1J76Q30p36l41N9l94J000M78r81M72r77K45
3702d88J110m29J83m71p18J033J80J59P0j228M31L19l54P91o85m09O10l00O81
3721D85k57p84K75J28K08M67p78j97K23l15J055O4q32R2n58N13Q66n77J41l68
3741a49r9P82o35J89K12q08O38Q1k03K51p72P1P41l41P7k32o68J034j87M1M46
3762D69r21P0M62k73Q18o15m11M92l33N81M7m22J75k68J12N67n18k8J07m03N50
3783B58m6o84K99n02O07O33m49p5n14r6R80k5N4j59j022N61K65J39O01r54k09
$$ plain form
3643 -628 19 -161 874 575 -615 -25 -388 335 998 -84 -181 -305 -249 844 229 -293 -251 -841 260
3662 260 722 40 151 -812 -552 749 205 671 27 -1090 48 414 334 927 -341 -479 318 69 662
3681 662 224 -444 56 -238 505 481 -204 -340 -319 -143 687 -49 -390 -331 -725 275 753 -228 244 -733 -488
3702 -488 622 193 376 -95 -813 220 400 559 629 -599 -168 151 -203 588 -97 -506 104 -196 485
3721 485 228 -556 -281 -153 55 522 -256 -453 -230 -545 510 574 -258 -166 -724 -211 655 78 219 -149
3741 -149 -248 534 -101 88 300 -508 130 211 8 259 -513 -442 299 -42 35 -197 -865 169 -18 23 469
3762 469 -452 -382 80 -193 625 10 -401 91 -242 339 386 -36 139 -129 -17 550 32 4 111 -292 258
3783 258 212 -472 -173 -675 -68 565 116 41 -473 -569 411 386 440 281 -741 -180 85 224 825 -129 -338
3804c38N47k87O08k25p04L68j48M91L43j082L16k00j20J048k48q74L87o86Q77
3823G3Q54r28J25o87NJ082j66Q1k69j019P21N09j63M70j168J65M64j34N64k62
3843C17p87M16j23O06J26j039J52m7J61R52n27m69J44n97Q55O14o20N5q26N06
3863a31O67l60Q2m68m23N29K32K60l7p16J81L27j1L77n03o85Q63j63L27j09q76
3884f37L77j5J46Q76q52l14J46k57J120p8o05K44p58L98P17n85M77m93k73O71
3904C05j97k4K50j037P56M55k82J71o67k32R17l69L65k75r02M37K15L02L89q51
3924b74l28L92k18J082k53n34R2k61M99M39o16Q7k16n4R88n37l06p2m73J036K03
3945F76o28K49p97j18J040k18M4m49n66N58J62L23K64q94J51J07j41R77o84m72
$$ plain form
3804 -338 209 -78 530 305 -399 -31 -179 312 655 -427 -111 -311 -431 617 369 -505 -118 -804 73
3823 73 927 -1 124 -563 -558 524 358 439 170 -849 -128 381 218 688 -480 -315 149 15 579 317
3843 317 -470 -54 -177 429 555 -484 -332 -379 -218 734 207 -262 -118 -715 140 754 134 189 -637 -131
3863 -131 536 176 258 -210 -633 -104 128 388 351 -365 -184 143 132 509 6 -679 184 21 348 239 -637
3884 -637 -260 -275 -129 747 -105 -419 -273 -530 590 512 -93 151 -607 -209 508 -77 400 -93 -366 305
3904 305 108 84 334 -703 53 508 226 397 -270 -502 415 46 411 136 -766 -329 -114 188 577 -274
3924 -274 -602 -210 -428 654 401 -133 -41 -302 197 636 20 107 -109 -163 825 288 -18 -90 -563 473 676
3945 676 48 297 -500 -618 422 204 248 -201 -767 -209 -47 276 540 -354 -203 -96 -237 740 56 -416
3965d16M20l43N60L17p51K12k60MJ104p10j35j06l74J038k24n95L35o46J59P05
3985B94k82L34o95m34O44Q6L85K14j126N96n3J11P80r38k02M37m25P78k6r07K98
4006a31l21N32M83p53J34k2k47P37k89m73L36m94L48N32k53J16m70k83P97j41
4026A38K18p8o88K92K62M6K25p90j26O60k15N94j99q35M82o3K86M8n73j3J79p3
4048b23Q27o36k14r4j73Q06L67p05J53m84J56O33l05O0Jq44Q19K3K13J24j104
4069f00K75M52M9L17n85m50O61k52L72J29j057O21j23J47M26m54m32J67k09J159
4089F13q4q01L34o17N63N60m95K20m51k16Q02N2j18j32o91N33L21n07M35o10k95
4110e84P34m05O43p0j026M65K45R1N26r80j16M23l96R65k14n66K98o34O83N04
$$ plain form
3965 -416 4 -339 221 538 -213 -1 -261 -257 847 137 2 -104 -478 560 336 -259 76 -570 -411 294
3985 294 12 346 -349 -783 -139 -53 332 546 -580 16 -37 74 854 -84 -286 151 -274 504 478 -429 -131
4006 -131 -452 80 563 -190 -56 -78 -325 412 123 -350 -14 -508 -160 372 119 235 -235 -518 279 138
4026 138 356 278 -410 -118 144 190 415 -375 -501 159 -56 538 339 -496 -14 -77 209 257 -316 -329 -150 -223
4048 -223 604 -32 -246 -340 -513 293 660 -45 108 -376 -220 413 108 168 169 -675 144 167 380 504 -600
4069 -600 -325 127 176 493 -92 -542 119 -133 239 368 -689 -68 -191 -44 382 -72 -504 -337 -546 613
4089 613 529 -272 62 -555 8 568 73 293 -158 -374 428 480 362 230 -461 72 393 -114 321 -289 -584
4110 -584 150 -255 388 318 -708 -243 2 93 619 -361 -477 -54 -450 515 301 -265 33 -601 82 586
4130E86p22J28l80r8R66k32l3l12n66Q09J31j29M1o02n0L41K35M28n21p55P71
4151C6l05M27L30r84L50J67j66R49n75m00p5q7P50L04p83J76m60J54P91m66k8
4172A05j58m33P86j9m53L75r38M26O35k97K46l88n14P89k8Q2K87j024M81r4J90
4193E6P80p19m89M37l08N59J65q36K49l08J69P34l35k89j28k50P39J5k87n0m97
4214e93O12M27l51J61j76l11O12l00K77k08q06P04k26L77K65o43r0M90n03P87
4234E05j86p71M40l32N49L27p57J99q4k00P16m30j51J36o10R01J91m49L40q84
4254e50O6Q02k07K16l34n66Q33k41R3L50q98J39K62O6L87l37n72L97j48N69K99
4275F26j001L61k39P0P35n29l5L3m97O34K46m35K21m57J84O41o94K51m08j47P29
$$ plain form
4130 586 -136 -8 -388 -486 480 248 215 -97 -663 146 277 148 189 -413 -463 -122 113 541 20 -735 36
4151 36 -269 158 488 -496 -146 21 -145 804 229 -171 -246 -333 417 721 -62 114 -346 -192 599 133 105
4172 105 -53 -486 300 281 -172 203 -735 -309 326 29 275 -113 -627 162 134 216 503 -521 -40 -134 56
4193 56 836 117 -372 65 -243 316 481 -355 -106 -414 -245 489 154 -135 -263 -513 226 241 -46 -96 -593
4214 -593 19 446 95 256 80 -231 381 81 358 150 -656 48 -178 199 464 -179 -269 221 -282 505
4234 505 319 -452 -12 -344 205 532 -225 -26 -110 -310 406 -24 -175 -39 -649 252 443 -6 334 -550
4254 -550 -484 318 111 327 -7 -573 260 19 112 462 -436 -297 -35 31 418 81 -491 -94 -242 327 626
4275 626 -375 -14 -253 -183 552 23 -12 21 -476 158 404 -31 190 -267 -83 558 -136 115 -293 -440 289
4296B89q5j91K91q68M99K31j15M08o19k79M50j75N01j52n63M35k22p7N38m71j6
4317a91K19m93R11j34o68M29l63L05M89m85L89o91m3P91k08k9Q8q74O29P3j60
4338a6M35o33j52O27n62M12k81l52Q16n38K65K19o58J35L36j63P84o20m41M43
4358E6k54N45Q6q35N64l89j9P13n88J23j08m17O87J52m40L48p10M24M04m02K69
4379B09l16n26Q03j87K03K62q99M16J45j48P15n69k83J30k52P41k69l22M4j22
4399b25K80O70p27k09k42J31P06k51m5J63p07L86L99l47M26p31k65Q23j95K20
4419B60j25o89M55J02J89M79o45k35J36k39P63p6p56M57m28J19Q40o90J89k39
4439a33l99R08k70j64K73r94O50N37l55J75m71NM90k88K31m4o46N51J27n5K40
$$ plain form
4296 289 204 13 304 -564 -65 166 51 459 -160 -439 11 -164 337 185 -378 57 -165 -242 296 -175 -191
4317 -191 28 -465 446 312 -356 73 -290 15 504 19 408 -283 -326 465 257 228 316 -558 71 144 -16
4338 -16 419 -214 -366 261 -301 111 -170 -522 294 -244 21 240 -418 -283 53 -110 674 54 -387 56
4358 56 -198 347 433 -402 162 -227 -246 467 -121 2 -106 -523 164 316 -124 224 -486 -62 342 -60 209
4379 209 -107 -633 170 -17 186 448 -451 -35 110 -38 677 108 -175 -45 -297 444 175 -147 -103 -225
4399 -225 55 725 -2 -211 -453 -322 384 133 88 251 -456 -70 329 -18 408 -323 -588 235 40 260
4419 260 135 -554 -99 3 192 671 26 -209 -73 -312 451 375 -381 76 -352 -233 607 -83 106 -133
4439 -133 -532 376 106 -58 215 -779 -129 408 53 228 -243 -238 252 -36 195 151 -495 56 183 128 368
4460C68n04l8N3j29O89k52m56J36k40M19L17o26M77m96J28O01n77j21K77l44O15
4481B97p5k85K03l80J95M39m38K48j66m20O56j66R5J97q27K46K29j47M27n44J33
4502h3K57k80K01J04n75M03k8j69O07o31oK86j62O12n74k42M83m88M37K87p59
4523c20N63k89k53N60j26q0j07k87L49L64m06J97l38mK56k47N20l62m73N49rO8
4545A25J44o42K31N3mP05l95m11N1k26O17L46p70K02m17J10R28m91k5j08p51Q64
4567A36j70J46K61r68M14N73m39N03n02n23R21l16J79K62r52M51L9q5N69l73l61
4588b35J90k22M11L75q51L51l82J13P53l62r7m7m81O97J1k39L30q93N13M02l89
4609e2L85m95j17O62m96L96j8p67N51j66J52M34p01l7J67k23N42M3l59L37l81
$$ plain form
4460 368 -136 -174 -121 -250 439 187 -269 -133 -373 46 363 -263 214 -282 -154 447 -130 -251 26 -318 297
4481 297 222 -63 140 -240 -45 394 -44 204 38 -382 274 108 203 400 -427 -181 48 -99 328 -216 -83
4502 -83 174 -106 95 199 -376 27 -1 -170 437 -194 -200 86 -76 536 -38 -280 203 -285 152 439 -320
4523 -320 243 -46 -299 261 135 55 -52 -339 10 374 -32 165 -173 -177 79 -168 352 -10 -483 66 57 125
4545 125 269 -373 -142 -89 -93 612 217 -194 -143 -369 248 594 -176 26 -391 -281 647 156 131 23 -728 136
4567 136 -34 112 373 -595 -181 392 -47 456 -46 -569 352 36 215 477 -475 -24 15 -70 499 126 -235
4588 -235 -45 -267 144 519 -332 19 -363 -250 503 141 44 -3 -484 213 224 -15 315 -578 -65 337 -52
4609 -52 333 -162 -279 383 -113 283 265 -502 49 -117 35 469 -232 -269 -102 -325 217 260 -99 238 -143
4630a43J01P27q20J67j08q4O31l73o8kk54M52J1m40M66n02j64P17l15K59j7p54
4652e13M64K75p5J76p43J31M20l07P83n77m77N96m04M92j8n16J56n9J6P84n34
4673G0k34Mj92L75K59n41N18p77M01M32j39L4n77k6R26m55Q9J37n66P2K53k07
4695a44N24m04j25K54l24M87k20k97J70m4oN22n39J98q7m15P07J5l63J40n52L75
4717a28M22j30M3n03k5N70k11J29J52p25N16L08m23K21m45n0M14j04K77q5n90
4738c67K77j09L99Q4m85OJ70j83O57l06l92K50j80K06K23l25K24k15p0L53l21
4759a04N3j09k61N68K7j03o0k95k9M02k01J25Q5l30K52o7J84J50n73K46M8l3M87
4782D62n82p1J05K06K07k05m11J52j35K83M44m83j80P0m38Q60Ln15J85l59L44
$$ plain form
4630 -143 -42 685 -135 32 -76 -160 471 98 30 28 -226 226 237 -203 263 -239 -403 314 -1 258 241 -513
4652 -513 -49 226 151 327 -416 -285 135 -172 611 34 -443 153 -251 241 223 -293 -137 -196 -180 604 70
4673 70 -164 -160 -352 23 282 -259 259 -518 -117 315 176 210 -367 -393 533 78 167 304 -262 -190 63 -144
4695 -144 380 -24 -149 105 -219 268 48 -249 -79 -123 -129 393 -146 52 -35 -450 257 272 -91 49 -503 -128
4717 -128 294 164 207 -296 -321 249 38 167 319 -406 110 418 -5 216 -229 -279 135 31 308 223 -367
4738 -367 -90 -199 200 284 -201 -195 -25 -208 449 143 -249 1 -179 27 250 -75 149 -66 -136 217 -104
4759 -104 -51 -160 -421 147 174 71 11 -284 -313 89 -112 13 98 -232 20 -47 137 287 -286 -40 8 -25 462
4782 462 -120 -191 -86 120 327 122 -289 -137 -272 11 455 -28 -208 -138 -576 284 287 -228 -43 -402 -58
4803e8L69o06M34k69l52N57K0K41k3o37K22J05J79M47r45J31J85l3L50Km17k9
4825a27j82N69K67o26K71l28j0O59l71J5P2p55N38K95j82Jl47K27K97k72K83j10
4847A84o64N59m7K9J85n81M2J68k9O03l66l79L00j55L90K31q10L44l40p4O36k66
4869d0j48J51m70N39L14l79K48q25L62N54m50N16l93l90O21j32J11J27n22J07
4889i9K32k09L00l58j32K10n4K42K40m82J44l11K36N79o67p7K38k40N48j4n25
$$ plain form
4803 -58 311 -295 139 -130 -482 75 95 336 313 -324 -102 3 182 629 -316 -185 0 -33 317 319 -98 -127
4825 -127 -309 260 527 -99 172 -156 -166 493 122 137 209 -546 -8 287 105 106 -241 -14 283 11 294 184
4847 184 -480 79 32 61 246 -335 -293 -125 -154 449 83 -296 4 -151 239 470 -340 4 -336 -410 226 -40
4869 -40 -188 -37 -507 32 346 -33 215 -610 -248 306 -144 372 -21 -411 210 78 189 316 -206 -99
4889 -99 133 -76 224 -134 -266 -56 -110 132 372 -110 34 -277 -41 538 -129 -206 32 -208 340 326 -199
$$ [...]
8191A13
##END NTUPLES=NMR FID
##END=
