##TITLE=1H_67-2022
 CDCl3
 8 sc, 
 25.08.2022
##JCAMPDX= 6.0         $$ Bruker NMR JCAMP-DX V2.0
##DATA TYPE= NMR SPECTRUM
##DATA CLASS= NTUPLES
##ORIGIN= UXNMR, Bruker Analytische Messtechnik GmbH
##OWNER= root
$$ XWIN-NMR		Version 3.5
$$ Thu Aug 25 10:09:19 2022 Russian Standard Time (UT+4h)  she@DPX200
##.OBSERVE FREQUENCY= 200.1313499994
##.OBSERVE NUCLEUS= ^1H
##.ACQUISITION MODE= SIMULTANEOUS
##.ACQUISITION SCHEME= undefined
##.AVERAGES= 8
##.DIGITISER RES= 18
##SPECTROMETER/DATA SYSTEM= spect
##.PULSE SEQUENCE= zg30
##.SOLVENT NAME= CDCl3
##.SHIFT REFERENCE= (INTERNAL, CDCl3, 0, 15.748)
##AUDIT TRAIL= $$ (NUMBER, WHEN, WHO, WHERE, WHAT)
$$ ##TITLE= Audit trail, XWIN-NMR		Version 3.5
$$ ##JCAMPDX= 5.01
$$ ##ORIGIN= Bruker BioSpin GmbH
$$ ##OWNER= she
$$ F:/spectra/data/she/nmr/H-F/1/pdata/1/auditp.txt
$$ ##AUDIT TRAIL=  $$ (NUMBER, WHEN, WHO, WHERE, WHAT)
(   1,<2022-08-25 10:08:12.64 +0400>,<she>,<DPX200>,
      <created by zg, POWCHK disabled, PULCHK disabled
       configuration hash MD5:
       00 E9 B6 7A A2 85 ED C7 34 08 36 98 17 FE 4E 26
       data hash MD5: 16K
       B0 60 9B A9 9C 45 FE 09 63 90 FE 4F 70 16 2A 26>)
(   2,<2022-08-25 10:08:15.29 +0400>,<she>,<DPX200>,
      <Start of raw data processing
       efp BC_mod = 2 LB = 0.24 FT_mod = 6 PKNL = 1 PHC0 = -18038.64 PHC1 = 12.40069 SI = 16K 
       data hash MD5: 16K
       4E 6A C0 F0 11 5B AE 7B 99 94 6E 82 56 33 0E E8>)
(   3,<2022-08-25 10:08:32.09 +0400>,<she>,<DPX200>,
      <pk PHC0 = 1.525967 PHC1 = -2.2 
       data hash MD5: 16K
       B9 BF 8E B8 A6 17 B9 40 1B 79 B1 53 82 63 FA 5C>)
(   4,<2022-08-25 10:08:35.12 +0400>,<she>,<DPX200>,
      <abs ABSG = 5 
       data hash MD5: 16K
       F6 76 87 45 DF 19 D0 DB EC EF 3C 53 D6 00 9B DE>)
$$ ##END=
$$ 
$$ hash MD5
$$ A2 18 FE 9F FC F4 5A 50 96 98 BB 96 DD C1 ED 56
##$RELAX= 
##$RELAX= 
##$RELAX= 
##$RELAX= 
##$RELAX= 
##$RELAX= 
$$ Bruker specific parameters
$$ --------------------------
##$DU= <F:/spectra>
##$EXPNO= 1
##$NAME= <H-F>
##$PROCNO= 1
##$TYPE= <nmr>
##$USER= <she>
##$AMP= (0..31)
100 100 100 100 100 100 100 100 100 100 100 100 100 100 100 100 100 100 
100 100 100 100 100 100 100 100 100 100 100 100 100 100 
##$AQSEQ= 0
##$AQ_mod= 1
##$AUNM= <au_zg>
##$AUTOPOS= <>
##$BF1= 200.13
##$BF2= 200.13
##$BF3= 200.13
##$BF4= 200.13
##$BF5= 200.13
##$BF6= 200.13
##$BF7= 200.13
##$BF8= 200.13
##$BYTORDA= 1
##$CFDGTYP= 0
##$CFRGTYP= 5
##$CHEMSTR= <none>
##$CNST= (0..31)
1 1 145 1 1 1 1 1 1 1 1 1 1 1 1 1 1 1 1 1 1 1 1 1 1 1 1 1 1 1 1 1 
##$CPDPRG= <>
##$CPDPRG1= <>
##$CPDPRG2= <>
##$CPDPRG3= <>
##$CPDPRG4= <mlev>
##$CPDPRG5= <mlev>
##$CPDPRG6= <mlev>
##$CPDPRG7= <mlev>
##$CPDPRG8= <mlev>
##$CPDPRGB= <>
##$CPDPRGT= <>
##$D= (0..31)
0 1.2 0 0 0 0 0 0 0 0.06 0 0.03 0 0 0 0 0.0002 0 0 0 0 0 0 0 0 0 0 0 0 
0 0 0 
##$DATE= 1661407692
##$DBL= (0..7)
120 120 120 120 120 120 120 120 
##$DBP= (0..7)
150 150 150 150 150 150 150 150 
##$DBP07= 0
##$DBPNAM0= <>
##$DBPNAM1= <>
##$DBPNAM2= <>
##$DBPNAM3= <>
##$DBPNAM4= <>
$$ [...]
##$SUBNAM3= <"">
##$SUBNAM4= <"">
##$SUBNAM5= <"">
##$SUBNAM6= <"">
##$SUBNAM7= <"">
##$SUBNAM8= <"">
##$SUBNAM9= <"">
##$SW= 18.0517283424941
##$SWIBOX= (0..15)
0 0 2 0 0 0 0 0 0 0 0 0 0 0 0 0 
##$SW_h= 3612.71676300578
##$TD= 16384
##$TD0= 1
##$TE= 0
##$TE2= 300
##$TE3= 300
##$TEG= 300
##$TL= (0..7)
0 120 120 120 120 120 120 120 
##$TP= (0..7)
150 150 150 150 150 150 150 150 
##$TP07= 0
##$TPNAME0= <>
##$TPNAME1= <>
##$TPNAME2= <>
##$TPNAME3= <>
##$TPNAME4= <>
##$TPNAME5= <>
##$TPNAME6= <>
##$TPNAME7= <>
##$TPOAL= (0..7)
0.5 0.5 0.5 0.5 0.5 0.5 0.5 0.5 
##$TPOFFS= (0..7)
0 0 0 0 0 0 0 0 
##$TUNHIN= 0
##$TUNHOUT= 0
##$TUNXOUT= 0
##$USERA1= <user>
##$USERA2= <user>
##$USERA3= <user>
##$USERA4= <user>
##$USERA5= <user>
##$V9= 5
##$VALIST= <valist>
##$VCLIST= <CCCCCCCCCCCCCCC>
##$VD= 0
##$VDLIST= <DDDDDDDDDDDDDDD>
##$VPLIST= <PPPPPPPPPPPPPPP>
##$VTLIST= <TTTTTTTTTTTTTTT>
##$WBST= 1024
##$WBSW= 4
##$XGAIN= (0..3)
0 0 0 0 
##$XL= 0
##$YL= 0
##$YMAX_a= 551717
##$YMIN_a= -514578
##$ZGOPTNS= <>
##$ZL1= 120
##$ZL2= 120
##$ZL3= 120
##$ZL4= 120
##$ABSF1= 15.7535
##$ABSF2= -2.298349
##$ABSG= 5
##$ABSL= 3
##$ALPHA= 0
##$AQORDER= 0
##$ASSFAC= 0
##$ASSFACI= 0
##$ASSFACX= 0
##$ASSWID= 0
##$AUNMP= <proc_1d>
##$AZFE= 0.1
##$AZFW= 0.1
##$BCFW= 0
##$BC_mod= 2
##$BYTORDP= 0
##$COROFFS= 0
##$CY= -3
##$DATMOD= 1
##$DC= 0
##$DFILT= <>
##$DTYPP= 0
##$F1P= 0
##$F2P= 0
##$FCOR= 1
##$FTSIZE= 16384
##$FT_mod= 6
##$GAMMA= 0
##$GB= 0
##$INTBC= 1
##$INTSCL= 1.705223e-09
##$ISEN= 128
##$LB= 0.24
##$LEV0= 0
##$LPBIN= 0
##$MAXI= 10000
##$MC2= 0
##$MEAN= 0
##$ME_mod= 0
##$MI= 1.114404
##$NCOEF= 0
##$NC_proc= -6
##$NLEV= 6
##$NOISF1= 3.799351
##$NOISF2= 2.8
##$NSP= 0
##$NTH_PI= 0
##$NZP= 0
##$OFFSET= 15.74799
##$PC= 1
##$PHC0= -18037.12
##$PHC1= 10.20069
##$PH_mod= 1
##$PKNL= yes
##$PPARMOD= 0
##$PSCAL= 0
##$PSIGN= 0
##$REVERSE= no
##$SF= 200.130004711635
##$SI= 16384
##$SIGF1= 3
##$SIGF2= 2
##$SINO= 5.538805
##$SIOLD= 16384
##$SREGLST= <1H.CDCl3>
##$SSB= 0
##$STSI= 16384
##$STSR= 0
##$SW_p= 3612.71676300578
##$SYMM= 0
##$S_DEV= 0
##$TDeff= 16384
##$TDoff= 0
##$TI= <>
##$TILT= no
##$TM1= 0
##$TM2= 0
##$TOPLEV= 0
##$USERP1= <user>
##$USERP2= <user>
##$USERP3= <user>
##$USERP4= <user>
##$USERP5= <user>
##$WDW= 1
##$XDIM= 16384
##$YMAX_p= 506631977
##$YMIN_p= -954851
$$ End of Bruker specific parameters
$$ ---------------------------------
##NTUPLES= NMR SPECTRUM
##VAR_NAME=  FREQUENCY,     SPECTRUM/REAL,   SPECTRUM/IMAG
##SYMBOL=    X,             R,               I
##VAR_TYPE=  INDEPENDENT,   DEPENDENT,       DEPENDENT
##VAR_FORM=  AFFN,          ASDF,            ASDF
##VAR_DIM=   16384,         16384,           16384
##UNITS=     HZ,            ARBITRARY UNITS, ARBITRARY UNITS
##FACTOR=    0.220516191357247, 1,           1
##FIRST=     3151.64524376207, 0,            0
##LAST=      -461.071519243707, 0,           0
##MIN=       -461.071519243707, -954851,     0
##MAX=       3151.64524376207, 506631977,    0
$$ Real data points
##PAGE= N=1
##DATA TABLE= (X++(R..R)), XYDATA
$$ [...]
6308i6843q7694J24366N9245J51180k1095q9891j89231l247l1631K0098P3792
$$ -96843 -184537 -60171 -926 150254 129159 39268 -149963 -153210 -184841 -164743 -90951
6297i0951N9575k5399J4954Q5436j1922n8880N8537j47492M7764K9903k0947R4569
$$ -90951 -31376 -56775 -41821 43615 31693 -27187 31350 -116142 -68378 -38475 -59422 35147
6285C5147k2017K8197j8868p5053l2987L8073o3191J0011m0756J62448J12396
$$ 35147 13130 41327 22459 -52594 -85581 -47508 -110699 -100688 -141444 21004 133400
6274A33400j52701O3749k6991j23974j086M5046J18796q9396q686J3445j86352
$$ 133400 -19301 44448 17457 -106517 -107603 -62557 56239 -33157 -41843 -28398 -214750
6263b14750K0098K36145M958Q1856n1590j87208L269j6800P7530P3406k3153J4583
$$ -214750 -194652 41493 46451 128307 76717 -110491 -107222 -124022 -46492 26914 3761 18344
6251A8344p7269j3902l8792J24908j29284j14802m6993J23494O8405R9404l747
$$ 18344 -58925 -72827 -111619 13289 -115995 -230797 -277790 -154296 -85891 13513 9766
6240I766j80029Q6255J15046j4350j28467M8289o2039j23183N9446J35534o4511
$$ 9766 -170263 -84008 31038 16688 -111779 -63490 -125529 -248712 -189266 -53732 -118243
6229a18243J02475j49090M696p919O5907J60113l8089k2508o6359J27134o5069
$$ -118243 -15768 -164858 -160162 -168081 -102174 57939 19850 -2658 -69017 58117 -6952
6218f952p0749o9796N9414J65646j29846N1797N7804j09327j7920l2366R4456
$$ -6952 -77701 -147497 -88083 77563 -52283 -486 57318 -52009 -69929 -102295 -7839
6207g839j18321O8009K5745l0707q1047M9670J61531j03691k4868O5011j20428
$$ -7839 -126160 -58151 -32406 -63113 -144160 -94490 67041 -36650 -61518 3493 -116935
6196a16935m8978l7225J29993J3526j34803J17160J37223L504j51332Q6775k095
$$ -116935 -165913 -203138 -73145 -59619 -194422 -77262 59961 63465 -87867 -1092 -3187
6185c187Q7635j14834q975O4759o8356q2932J41735M3424j48975m7976J57492
$$ -3187 84448 -30386 -39361 25398 -42958 -125890 15845 59269 -89706 -137682 19810
6174A9810J76195j49273j45156r825Q1877J82719j00011Q759r1726m6615Q1329
$$ 19810 196005 46732 -98424 -108249 -26372 156347 56336 65095 -26631 -73246 8083
6163H083j40917n1969L2511J96706m6614P0944n6398k3792l8410K3568j14690
$$ 8083 -132834 -184803 -152292 44414 -2200 68744 12346 -11446 -49856 -26288 -140978
6152a40978J08313J72592j68251K7270j9159K1670o8838j70947J42306R2986j33165
$$ -140978 -32665 139927 -28324 -1054 -20213 1457 -67381 -238328 -96022 -3036 -136201
6141a36201N9931j7277J73794L1726j34380k05889K9275J30201J05143j0787o3328
$$ -136201 -76270 -93547 80247 111973 -22407 -228296 -199021 -68820 36323 25536 -37792
6130c7792k4528J53966m8626j22766K4030J02657p0216q0722J1751O5385L898
$$ -37792 -62320 91646 43020 -79746 -55716 46941 -23275 -103997 -92246 -26861 -22963
6119b2963k9789j1898r304P799m5460J81239o2143j04210n2825P3563R5165n3398
$$ -22963 -52752 -64650 -73954 -66155 -111615 69624 7481 -96729 -149554 -75991 19174 -34224
6107c4224q9527J58849j28085J42710J13645j90018p7411o0711n6681J18362Q7878
$$ -34224 -123751 35098 -92987 49723 163368 -26650 -104061 -164772 -221453 -103091 -15213
6096a5213K6061n3427q6180M2295J32707o3326R4251p8396r2067J68069j19178
$$ -15213 10848 -42579 -128759 -86464 46243 -17083 77168 -1228 -93295 74774 -44404
6085d4404q6363J4191Q4438k937O5787R9349L3460r929K7789q0190n030j0411
$$ -44404 -130767 -116576 -32138 -35075 30712 130061 163521 153592 181381 101191 96161 85750
6073H5750k0964k1730o2877R5251k09034L9135J5959M2665q2525l1618L8500J54834
$$ 85750 64786 43056 -19821 75430 -133604 -94469 -78510 -35845 -118370 -149988 -111488 43346
6061D3346q6603j67021O0861P9473K31959k8680K0965m1912k07015K5330J20884
$$ 43346 -43257 -210278 -149417 -69944 162015 133335 154300 112388 -94627 -69297 51587
6050E1587J4586J73283j34726j78840o0169k907O7061k0409l66N88J35684J15513
$$ 51587 66173 239456 104730 -74110 -134279 -137186 -70125 -90534 -90900 -90312 45372 160885
6038A60885j46382j80246N4852n965k5746K13546o1646M0378n5219n8799J12966
$$ 160885 14503 -165743 -110891 -116856 -142602 70944 9298 49676 -5543 -64342 48624
6027D8624l6877q7162Q817Q9554P6028m3535J1031n4272L3309l0280M7247K315
$$ 48624 11747 -75415 -66598 22956 98984 55449 66480 12208 45517 15237 62484 64799
6015F4799P1026J0263j44633J00153p9701L2889m9532N756p68j61026p0711J33936
$$ 64799 135825 146088 1455 101608 21907 54796 5264 11020 10252 -150774 -221485 -87549
6003h7549J03350O6789M6281M5971J3874p9591m78n107k3150N224Q8394n5220
$$ -87549 15801 82590 128871 174842 188716 109125 108647 103540 80390 85614 174008 118788
5991A18788r279M8614O388j75028j1026K4456j3979N6030l3669n4088J14859l0977
$$ 118788 109509 158123 164511 -10517 -21543 2913 -11066 44964 11295 -42793 72066 41089
5979D1089j0557J99650J08014j96528r8273J2967p9944m605J12839n3113j40992
$$ 41089 30532 230182 338196 141668 43395 56362 -23582 -28187 84652 31539 -109453
5968a09453O8591Q1318j8859m1696l3297j09366P7239J78536k0343m3483l4808
$$ -109453 -40862 40456 21597 -20099 -53396 -162762 -85523 93013 72670 29187 -5621
5957e621J56144j1724j71284m3970O4894K0128J5550r7688Q0012L5888M4949P131
$$ -5621 150523 138799 -32485 -76455 -11561 8567 24117 -73571 6441 42329 87278 94409
5945I4409j59737j3177j9567M8338K2247J79076n8118n5302o6790j13626J21218
$$ 94409 -65328 -78505 -98072 -49734 -27487 151589 93471 38169 -28621 -142247 -21029
5934b1029J30071m3081j11489j60979P7769J57655o9659O3619J59644r2563p0381
$$ -21029 109042 65961 -45528 -206507 -128738 28917 -40742 22877 182521 89958 19577
5923A9577L2292M8013j98662n0464J48445J23822j89328r8177L1748M2309Q3055
$$ 19577 51869 99882 -98780 -149244 -799 123023 -66305 -164482 -132734 -90425 -7370
5912g370Q9434l5706j9170j21807J10267j16439L798l6287j50244J88369J45294
$$ -7370 82064 46358 27188 -94619 15648 -100791 -96993 -133280 -283524 -95155 50139
5901E0139j09555L7911J36650q0052o7207L1433O8115j05779k8111J61648m3185
$$ 50139 -59416 -21505 115145 35093 -32114 -681 67434 -38345 -66456 95192 52007
5890E2007j13050J56546j27605K2069m7476J54071j9980n728O6841J3930j28484
$$ 52007 -61043 95503 -32102 -10033 -57509 96562 76582 70854 137695 151625 23141
5879B3141j26680J80120P5981M1315q405j33095N565L7629k42928j9426n2491
$$ 23141 -103539 76581 152562 193877 185472 52377 57942 95571 -147357 -166783 -219274
5868b19274o0455M0921n9450P9890K07492N4055j15498J11810O1074j10886J8357
$$ -219274 -279729 -238808 -298258 -218368 -10876 43179 -72319 39491 100565 -10321 8036
5857H036L2154j49526K5604M3977K6868R6402P9036j02166j0047j8526j44581
$$ 8036 40190 -109336 -83732 -39755 -12887 83515 162551 60385 50338 31812 -112769
5846a12769K97099j05709j7985m0392P994R0319n7981M2903Q975r215k1443J9440
$$ -112769 184330 78621 60636 20244 28238 118557 60576 103479 112454 103239 81796 101236
5834A01236r9595J2290J75246N3488n6716j40390N9018J68613J4780l2562k3695
$$ 101236 1641 13931 189177 242665 185949 45559 104577 273190 287970 255408 231713
5823B31713l2204p0961n5187N7357Q4520j33349j33948N5571O9052j6410l7729
$$ 231713 199509 128548 73361 130718 215238 81889 -52059 3512 72564 56154 18425
5812A8425j15318K49074j07309j47480J2091J19196K20737k8444j68966j03998
$$ 18425 -96893 152181 44872 -102608 -90517 28679 249416 220972 52006 -51992
5802e1992k8989r671k9830J21045J24579j38242o3938K6134J42161o6101J8680
$$ -51992 -80981 -90652 -120482 563 125142 -13100 -77038 -50904 91257 25156 43836
5791D3836L1695Q028N6154L4303K9567j8566m5984j57211L9791Q4630P4645j65280
$$ 43836 75531 83559 139713 174016 203583 185017 139033 -18178 21613 106243 180888 15608
5779A5608J8784r3156j085K19648j73302j30253J10999O9400P015k29531O6390
$$ 15608 34392 -58764 -59849 159799 -13503 -143756 -32757 36643 43658 -185873 -119483
5768a19483O736J07850N2141l6006J47972o0399p9739m4113j20638Q6611K33570
$$ -119483 -112747 -4897 47244 11238 159210 98811 19072 -25041 -145679 -59068 174502
5757A74502j66040k4281m4753J3184Q4513J08579j97174p7901K36874j873l2122
$$ 174502 8462 -15819 -60572 -47388 37125 145704 -51470 -129371 107503 105630 73508
5746G3508q8637J08653N3604j20110Q329L3371J79445o0999j35311J46726p2522
$$ 73508 -15129 93524 147128 27018 35347 68718 248163 187164 51853 198579 126057
5735A26057j16463K7075K472r8108m157Q7034j59811Q7790K26633J1968j05822
$$ 126057 9594 36669 39141 -58967 -63124 23910 -135901 -48111 178522 190490 84668
5724H4668o2701O080J02637r5691L4552P9203J21503j23525n5167p2617N2875
$$ 84668 21967 28047 130684 34993 69545 148748 270251 146726 91559 18942 71817
5713G1817j12795k7371J88013n0601n8166q2531Q2469P4954j8883M0711Q766j57857
$$ 71817 -40978 -68349 119664 69063 10897 -71634 10835 85789 66906 107617 116383 -41474
5701d1474L9327R4621M8712J6736m6082Q277J07852o5738K9750o3120p5722J50442
$$ -41474 -2147 92474 141186 157922 111840 120117 227969 162231 191981 128861 53139 203581
5689B03581l7669n7406R2232j22551L466L0409n8147k2660J02989p889j34548
$$ 203581 165912 108506 200738 78187 81653 112062 53915 31255 134244 126355 -8193
5678h193J48865J46057j8387r0097L9643O0604j99509l100J05379k54188Q568
$$ -8193 140672 286729 268342 178245 217888 278492 78983 75883 181262 -72926 -64358
5667f4358J04258J36562K028q4494m388K8338k6306R2140L6577N7720J47360o206
$$ -64358 39900 176462 178490 93996 89608 117946 91640 183780 220357 278077 425437 419231
5655D19231Q3531n9641R4858N7357j44128J94328m2531j27358r077O1944J8963
$$ 419231 502762 443121 537979 595336 451208 645536 603005 475647 466570 528514 547477
5644E47477j55845j9349j10701j01662m2168J73319l0772r4363J59866r0087p6697
$$ 547477 391632 372283 261582 159920 117752 291071 260299 165936 325802 235715 159018
5633A59018j5169J6360m0220k893M9756o5361M979j31425L085J68883Q5500j09998
$$ 159018 143849 160209 119989 117096 166852 101491 106470 -24955 -21870 147013 232513 122515
5621A22515k5176j5610K2690l4572P6827O5097k7547J7204n885o1130K06876q6632
$$ 122515 97339 81729 104419 69847 146674 211771 184224 201428 195543 134413 341289 254657
5609B54657j52340K60119J67427k0022j49607r8064j10123N5112J35163p5421
$$ 254657 102317 362436 529863 509841 360234 262170 152047 207159 342322 266901
5599B66901M3064J8155K5658j036l0531k5827N6091M5764m804M403K2259L9406
$$ 266901 309965 328120 353778 352742 322211 296384 352475 398239 393435 397838 420097 459503
5587D59503L9898J11994J25274j42984l023N4836m25j4865J09548j04953o9734
$$ 459503 499401 611395 736669 593685 590662 645498 645073 630208 739756 634803 565069
5576E65069p2724r7106J04171J362J1780l2639q687r8550J8129n4032J31149J30398
$$ 565069 492345 395239 499410 500772 512552 479913 471226 372676 390805 336773 467922 598320
5564E98320j89720M2572J60770p4114P276j55032p8113J72757Q4573k29729L6333
$$ 598320 408600 451172 611942 537828 545104 390072 311959 484716 569289 339560 375893
5553C75893K2401k0336j03522J49665J283L8180N4197p0296p5368P6012q468n5168
$$ 375893 398294 377958 274436 424101 425384 463564 517761 447465 372097 448109 439641 384473
5541C84473L0239L1245J17024q91n7838j11522L5515m4385Q8934j2683r5903J63275
$$ 384473 414712 445957 562981 562090 504252 392730 428245 383860 472794 460111 364208 527483
5529E27483j30559M3631Q4971J7281M0958j36340j20025O5062M4670K9221J7603
$$ 527483 396924 440555 525526 542807 583765 447425 327400 392462 437132 466353 483956
5518D83956q9414J32018R7888j37442N431O6121j40604q739r588K15549J20145
$$ 483956 394542 526560 624448 487006 492437 558558 417954 409215 399627 615176 735321
5507G35321j7837o6266k664o609l5135J29078m3775K2944n7589n7011J8158J6491
$$ 735321 717484 651218 648554 641945 606810 735888 692113 715057 657468 600457 618615 635106
5495F35106l3424l4523J26697K708M1543J35002O5571j192j26033m169K9778q8471
$$ 635106 601682 567159 693856 696564 738107 873109 938680 937488 811455 807286 837064 748593
5483G48593l1667Q2438Q2037l4607r7768M1877J84232K0707O5918R762Q06o2631
$$ 748593 716926 799364 881401 846794 749026 790903 975135 995842 1061760 1071522 1072328 1009697
5471A009697M0339m5978l7235k1701N7209J2656p7235P2559J4578J4555J15276
$$ 1009697 1050036 1004058 966823 945122 1002331 1014987 937752 1010311 1024889 1039444 1154720
5460A154720P3641J9436q0589P9776j4285O6996m3035j3844J7850J95932L4742
$$ 1154720 1228361 1247797 1167208 1246984 1232699 1299695 1256660 1242816 1260666 1456598 1491340
5449A491340j07907Q3196J1949p6204l5428J94590J25476L3117K15616K76976
$$ 1491340 1383433 1466629 1478578 1402374 1366946 1561536 1687012 1720129 1935745 2212721
5439B212721j53126j31300J35508o1667n2436J31428q5198O0505K07667J21540
$$ 2212721 2059595 1928295 2063803 2002136 1949700 2081128 1995930 2056435 2264102 2385642
5429B385642o763j05743J39794J80266Q002p3244Q9639K79799K09797M6223k7171
$$ 2385642 2378879 2273136 2412930 2593196 2601198 2527954 2617593 2897392 3107189 3153412 3126241
5418C126241J91813J53185j995j9900J89268J46665Q198K12003l9870P3155L20868
$$ 3126241 3318054 3471239 3469244 3449344 3638612 3785277 3793475 4005478 3965608 4038763 4359631
5407D359631J64299J90877n3429R6250J49991K24898J08385J10873J40335J81806
$$ 4359631 4523930 4714807 4661378 4757628 4907619 5132517 5240902 5351775 5492110 5673916
5397E673916J41908L52156L69049J43168J15023M80201M83189K75394L52497N43493
$$ 5673916 5815824 6167980 6537029 6680197 6795220 7275421 7758610 8034004 8386501 8929994
5387H929994K89630K56749M21651N78385O73464N12659P79041P52913Q94920R47982
$$ 8929994 9219624 9476373 9898024 10476409 11149873 11662532 12441573 13194486 14089406 15037388
5377A5037388J324585J233821J179245J511163J884973K221349K517115L128530
$$ 15037388 16361973 17595794 18775039 20286202 22171175 24392524 26909639 30038169
5369C0038169L791574M458895N372906O554699P572932Q338500P997698N943341
$$ 30038169 33829743 38288638 43661544 50216243 57789175 66127675 74125373 80068714
5361H0068714K023531k890610o759695q534003q641071p586683o375621n096152
$$ 80068714 82092245 79201635 72441940 63907937 55266866 47680183 41304562 36208410
5353C6208410m098559l465010k742535k275442j874978j493662j263525j307748
$$ 36208410 32109851 28644841 25902306 23626864 21751886 20258224 18994699 17686951
5345A7686951j137048p45707p69416o78910n35938n17531m43034m11080k51082
$$ 17686951 16549903 15804196 15034780 14355870 13819932 13302401 12859367 12448287 12197205
5336A2197205m59011m34195j32575j51689q6401j98251l0341k21436o8943K02886
$$ 12197205 11738194 11303999 11171424 11019735 10933334 10735083 10704742 10483306 10414363 10617249
5326A0617249k05142n8851J72513O6255M4627J75376J35269K90040J38931L02971
$$ 10617249 10412107 10353256 10525769 10592024 10636651 10812027 10947296 11237336 11376267 11679238
5316A1679238L76198K25648L14330L50867M01508M31923N11532O50719O08297
$$ 11679238 12055436 12281084 12595414 12946281 13347789 13779712 14291244 14941963 15550260
5307A5550260Q03956R81624R36479J203083J263522J599599J971622K334186K659330
$$ 15550260 16354216 17335840 18272319 19475402 20738924 22338523 24310145 26644331 29303661
5298B9303661L279632L998150M721290N678358O817146P950411Q310934P286688
$$ 29303661 32583293 36581443 41302733 46981091 53798237 61748648 70059582 77346270
5290G7346270M517384Q3387m681276p676832q810596q416169p215329o022653
$$ 77346270 81863654 81947041 77265765 69588933 60778337 52362168 45146839 39124186
5282C9124186m948156l878713l137127k531705k053151j953751j826281j395260
$$ 39124186 34176030 30297317 27160190 24628485 22575334 20621583 18795302 17400042
5274A7400042j234903r29694q29057r19584o18369n79824o86093n57908n80383
$$ 17400042 16165139 15235445 14406388 13486804 12868435 12288611 11602518 11044610 10464227
5265A0464227m66691l56475l41162m63999k20649m12247m54123k05266m16298
$$ 10464227 9997536 9641061 9299899 8835900 8615251 8203004 7748881 7543615 7127317
5256G127317k15863L3750j17880k93806l30931j64787k00504q601j29896k39598
$$ 7127317 6911454 6945204 6827324 6533518 6202587 6037800 5837296 5828695 5698799 5459201
5246E459201k0086j39375k28602L8092j16438k04615K496r6859K6794m2504J8812
$$ 5459201 5439115 5299740 5071138 5109230 4992792 4788177 4790673 4693814 4720608 4678104 4696916
5235D696916j87628p1612n5807k17583K4941J03415j10484j26301k01043p2103
$$ 4696916 4509288 4437676 4381869 4164286 4189227 4292642 4182158 4055857 3854814 3782711
5225C782711O3868N2441j76360N8656R6815j51748j79883l0164j25604J54069
$$ 3782711 3846579 3899020 3722660 3781316 3878131 3726383 3546500 3516336 3390732 3544801
5215C544801P2605q7591q1245m2406J06738N8980K2751l7338r2496r1603N181
$$ 3544801 3617406 3529815 3448570 3406164 3512902 3571882 3594633 3557295 3464799 3373196 3378377
5204C378377l0416J94077J86906O8945r0137J08471Q5379q1115k0163j5450l9678
$$ 3378377 3347961 3542038 3728944 3797889 3707752 3816223 3901602 3820487 3800324 3784874 3745196
5193C745196J78487N6138O1999O96j30497J4882j0058J49063J14208o9951J51942
$$ 3745196 3923683 3979821 4041820 4042516 3912019 3926901 3916843 4065906 4180114 4110163 4262105
5182D262105R6695N4028j13594k2409N7703J11176J40094J08542K48902M0778
$$ 4262105 4358800 4412828 4299234 4276825 4334528 4445704 4585798 4694340 4943242 4984020
5172D984020J48268J66713P7290J84261L23404J72531K65110K12997J44733J83018
$$ 4984020 5132288 5299001 5376291 5560552 5883956 6056487 6321597 6534594 6679327 6862345
5162F862345K09974K58652K22492L74100K81824M17556M27654L79944L86221M28735
$$ 6862345 7072319 7330971 7553463 7927563 8209387 8626943 9054597 9434541 9820762 10249497
5152A0249497M17797N45499Q21558N86818P31853P41002Q46427J073036J148718
$$ 10249497 10667294 11212793 12034351 12621169 13353022 14094024 14940451 16013487 17162205
5143A7162205J589593J603755J657074J923531K004927K057536K232811K039763
$$ 17162205 18751798 20355553 22012627 23936158 25941085 27998621 30231432 32271195
5135C2271195J721956J311278N02826J1186n20615j064693j531334j370628j290984
$$ 32271195 33993151 35304429 35807255 35818441 35297826 34233133 32701799 31331171 30040187
5126C0040187j074785r18375p31665n17344l50139j34403J54895K79535M92868
$$ 30040187 28965402 28047027 27315362 26798018 26447879 26313476 26468371 26747906 27240774
5117B7240774O52604N97438R22335J175907J383449J566905J507423J868149J929549
$$ 27240774 27893378 28490816 29413151 30589058 31972507 33539412 35046835 36914984 38844533
5108C8844533K161063K152359J893394J847855J683177J507159R70457O61841
$$ 38844533 41005596 43157955 45051349 46899204 48582381 50089540 51059997 51721838
5100E1721838L33018r8159m99829q44552j159563j293833j464616j500247j606176
$$ 51721838 52054856 51956697 51456868 50612316 49452753 48158920 46694304 45194057 43587881
5091D3587881j628622j657731j508702j598918j358733j404434j240973j237632
$$ 43587881 41959259 40301528 38792826 37193908 35835175 34430741 33189768 31952136
5083C1952136j173393j061011q62895n32603n98347m02888J51794J23516L63471
$$ 31952136 30778743 29717732 28854837 28322234 27723887 27320999 27472793 27596309 27959780
5074B7959780P08249N04000J088454J043706J266378J628452J580092J677433
$$ 27959780 28668029 29172029 30260483 31304189 32570567 34199019 35779111 37456544
5066C7456544J512491P63441o0086n27839j355507j857300k353561k400599k407928
$$ 37456544 38969035 39732476 39672390 39144551 37789044 35931744 33578183 31177584 28769656
5057B8769656k381120k178636j859238j531473j245330j360512j084521p64378
$$ 28769656 26388536 24209900 22350662 20819189 19573859 18213347 17128826 16364448
5049A6364448j011776n28872n66224n49025n08304l73326m38255l31623k49457
$$ 16364448 15352672 14823800 14257576 13708551 13200247 12826921 12388666 12057043 11807586
5040A1807586l21995k91809k12414j55013k03115q4532j43064k71848m8211j8669
$$ 11807586 11485591 11193782 10981368 10826355 10623240 10538708 10395644 10123796 10075585 10056916
5030A0056916J03085Q3641p5050k6474K6635L2738K934J3773J32632J50966L71563
$$ 10056916 10160001 10243642 10168592 10142118 10168753 10201491 10204425 10218198 10350830 10501796 10873359
5019A0873359K02243J86117K37109J39113M78245K34334L06818M14743M70924
$$ 10873359 11075602 11261719 11498828 11637941 12116186 12350520 12657338 13072081 13543005
5010A3543005N52592O92672O65489N74202Q40519Q53390J017920J147416J134886
$$ 13543005 14095597 14788269 15453758 16027960 16868479 17721869 18739789 19887205 21022091
5001B1022091J422055J495146J672054J548388J826340J575927J293887R87631
$$ 21022091 22444146 23939292 25611346 27159734 28986074 30562001 31855888 32843519
4993C2843519O59985M24652J60154n7355k24237l39730m80075m18748k81487k50485
$$ 32843519 33503504 33928156 34088310 34030955 33806718 33466988 32986913 32568165 32286678 32036193
4983C2036193j51771p7024j16602M35811M32958L85980P34803Q04620R38532J167915
$$ 32036193 31884422 31807398 31690796 32126607 32559565 32945545 33680348 34484968 35423500 36591415
4973C6591415J180495J355207J449006J502323J524345J357033J292499J238633
$$ 36591415 37771910 39127117 40576123 42078446 43602791 44959824 46252323 47490956
4965D7490956R79509O83100N19731K27555r8661l97182n26512o52057p65038q48314
$$ 47490956 48470465 49153565 49673296 49900851 49802190 49405008 48878496 48226439 47461401 46613087
4955D6613087j114816j183566j413903j332734j327319j402554j452650j229403
$$ 46613087 45498271 44314705 42900802 41568068 40240749 38838195 37385545 36156142
4947C6156142j386547j263598j066473r11417r28156p95082m45729l31670l77045
$$ 36156142 34769595 33505997 32439524 31528107 30599951 29804869 29359140 29027470 28650425
4938B8650425j495l8124K87895Q31766O14267Q41415R20044J217910J397782J004467
$$ 28650425 28648930 28610806 28898701 29730467 30344734 31186149 32106193 33324103 34721885 35726352
4928C5726352N23315M11413k0739n75324j017607j625096j978333k158311k310760
$$ 35726352 36249667 36661080 36640341 36065017 35047410 33422314 31443981 29285670 26974910
4919B6974910k286831k016473j837214j757022j341231j292611j130957q63979
$$ 26974910 24688079 22671606 20834392 19077370 17736139 16443528 15312571 14448592
4911A4448592q70236q51598p15746o40755m80510n67150n05468m44337m33924
$$ 14448592 13578356 12726758 12011012 11370257 10889747 10322597 9817129 9372792 8938868
4902H938868l89892l89831k17280l55706l62810j03176l54950l92868K8209l61179
$$ 8938868 8548976 8159145 7941865 7586159 7223349 7120173 6765223 6372355 6400564 6039385
4892F039385k50765q3298j65911j39615l8217k77553j54775m4218k24325j7124
$$ 6039385 5788620 5705322 5539411 5399796 5361579 5084026 4929251 4885033 4660708 4643584
4882D643584k43758j52553o9759j91867r5115j36045r9871L355n022r3501k5811
$$ 4643584 4399826 4247273 4177514 3985647 3890532 3754487 3654616 3657971 3652949 3559448 3533637
4871C533637k82685j25245L3668n1936m4611n3142N1458k15814l4611L8553m6118
$$ 3533637 3250952 3125707 3159375 3107439 3062828 3009686 3061144 2845330 2810719 2849272 2803154
4860B803154q2756j44131j48364P478M5016K366L337k9314j38481K367J9107q7650
$$ 2803154 2720398 2576267 2427903 2435381 2480397 2482763 2486100 2456786 2318305 2320672 2339779 2252129
4848B252129q4790M0289r5185r4387n0094l763J3745l4976j67292J3856J48199
$$ 2252129 2167339 2207628 2112443 2018056 1967962 1964199 1977944 1942968 1775676 1789532 1937731
4837A937731l8757j03839k12410l8605J98436p2789k925J42259j21710j36352
$$ 1937731 1898974 1795135 1582725 1544120 1742556 1669767 1666842 1809101 1687391 1551039
4827A551039n7797R1511P1783p1195L1571K7397r1963l602o9918j82440L222J0111
$$ 1551039 1493242 1584753 1656536 1585341 1616912 1644309 1552346 1548744 1478826 1296386 1299608 1309719
4815A309719l5636j3558q4858N0469n2772K3382R323j07733n984J61796N5914
$$ 1309719 1274083 1260525 1175667 1226136 1173364 1196746 1206069 1098336 1092352 1254148 1310062
4804A310062j26936N3414j47653j58782J82364M6101j7312M4204N1151r7576k0021
$$ 1310062 1183126 1236540 1088887 930105 1112469 1158570 1141258 1185462 1236613 1139037 1119016
4793A119016m3466l5837L9702m1580P697O1001Q4098m3584p5971j50626o5878
$$ 1119016 1075550 1039713 1079415 1037835 1045532 1106533 1190631 1147047 1071076 920450 854572
4782H54572J13670N1106k27230j9459R4323M2094L8904k0794j59481j08247J44299
$$ 854572 968242 1019348 792118 772659 866982 909076 947980 927186 767705 659458 803757
4771H03757Q4097q1820K5789M3625j5126k9054m9001o2099O9388J28273j69968
$$ 803757 887854 806034 831823 875448 860322 831268 782267 720168 789556 917829 747861
4760G47861j20779Q4371L4242o491n555K7670k6025j07257m0675J0523R0243p639
$$ 747861 627082 711453 745695 739204 733649 761319 735294 628037 587362 597885 688128 680489
4748F80489m4578n2338j5510N4037j45639K7654m8820J47796J7069n2340l7194
$$ 680489 635911 583573 568063 622100 476461 504115 455295 603091 620160 567820 530626
4737E30626K6776P773j42985l0152J3823K3025m3238j6222L0600K28680j44831
$$ 530626 557402 565175 422190 392038 405861 428886 385648 369426 400026 628706 483875
4726D83875m8055j93056N0639J08532m5215R2203K4526j85107l2222R1527J12706
$$ 483875 435820 242764 293403 401935 356720 448923 473449 288342 256120 347647 460353
4715D60353M5520l5381q6809l0106O5132J00628j8762L1132o4909j03791J01032
$$ 460353 505873 470492 383683 353577 418709 519337 500575 531707 466798 363007 464039
4704D64039J16426l25986n8831N4305L6694q086J14987M4145j0704L9139l9844
$$ 464039 580465 254479 195648 249953 286647 278561 393548 437693 426989 466128 426284
4693D26284j82934j6395j0837o0915J81703O7663J2917M4116K6288q3356K235
$$ 426284 243350 226955 216118 155203 336906 404569 417486 461602 487890 404534 406769
4682D06769m4340L3077L7019j03594m1477J98708j98258k8435J9105J6655N0715
$$ 406769 362429 395506 432525 328931 287454 486162 287904 259469 278574 295229 345944
4671C45944M5095n047P1708j23834k6071P2432k4996K884q5100J38242L0684j58316
$$ 345944 391039 385992 457700 333866 307795 380227 355231 358115 273015 411257 441941 283625
4659B83625J50762J90945j54121p5203J34746K221q0815j20892O0260j8069M1572
$$ 283625 434387 625332 471211 396008 530754 532975 452160 331268 391528 373459 415031
4648D15031O4648j1570M1874j5786p9139j7026n3928n8704o0187Q2998N8453L6421
$$ 415031 479679 468109 509983 494197 415058 398032 344104 285400 225213 308211 366664 403085
4636D03085O9343j17721N9592j91554n164J48837m2922l7286j42410J7059O055
$$ 403085 472428 354707 414299 222745 217581 366418 323496 286210 143800 160859 166914
4625A66914K0424L7928N9561j26742J87541r835M3542k1826O4451j65107L7002
$$ 166914 187338 225266 284827 158085 345626 335791 379333 357507 421958 256851 293853
4614B93853n1916j26274O3939L2584P8993j5970o0097m825R4017p2330J1276j02569
$$ 293853 241937 115663 179602 212186 291179 275209 215112 210287 304304 231974 243250 140681
4602A40681K09444J14771j90810j14201J29866o1124j48269k0223J84311o2913
$$ 140681 350125 464896 274086 159885 289751 228627 80358 60135 244446 181533
4592A81533R0335j85183j46712J76797J39285m28q8069l1648r76o388K508R5523
$$ 181533 271868 86685 -60027 116770 256055 255627 167558 135910 134934 128546 131054 226577
4580B26577j50210j92003J06492M5826l7059M2989J04147J7621K0783n2263R4179
$$ 226577 76367 -115636 -9144 36682 -377 42612 146759 164380 185163 132900 227079
4569B27079j82116M0636J44920o8776L956O544q6520q6794m2323J18172J03669
$$ 227079 44963 85599 230519 161743 165699 172243 85723 -1071 -43394 74778 178447
4558A78447j11602J36124j31383j19779N4391n9837l3500R8637J19290j64553
$$ 178447 66845 202969 71586 -48193 6198 -53639 -87139 11498 130788 -33765
4548c3765m5338J43967r862l3300j5118p4805Q5625R2162l9601j8485K1102R254
$$ -33765 -79103 64864 55002 21702 6584 -68221 17404 109566 69965 51480 72582 81836
4536H1836n8069o752N7854m1376j17910l5762P0178N7744j13074J01425L7697
$$ 81836 23767 17015 74869 33493 -84417 -120179 -50001 7743 -105331 -3906 33791
4525C3791J25498m6707j07877q463O5293J36163j9784J4952j84370p2178K16474
$$ 33791 159289 112582 4705 -3758 61535 197698 177914 192866 8496 -63682 152792
4514A52792p3251q4819J36790j35751k8994J09298L8189l8246q0604R3278j25544
$$ 152792 79541 -5278 131512 -4239 -33233 76065 114254 76008 -4596 88682 -36862
4503c6862Q4295l1742Q0636l0632q9922J41966q7024J70492O3353j2038j08988
$$ -36862 47433 15691 96327 65695 -24227 117739 30715 201207 264560 252522 143534
4492A43534o5763P1362J1709j32475O4089j22482O8961P6513p5815M3501P9470
$$ 143534 77771 149133 160842 28367 92456 -30026 38935 115448 39633 83134 162604
4481A62604J33237M8643k07344p2541K22226j19089j77162N9234P5583l2237j01195
$$ 162604 295841 344484 137140 64599 286825 167736 -9426 49808 125391 93154 -8041
4470h041O9196N6624j7586n3983k9080K9148j5405o1618M601m555O4164J05263
$$ -8041 61155 117779 100193 46210 17130 46278 30873 -30745 -26144 -30699 33465 138728
4458A38728j16693J66291j79659n0182N4791N6434M7998j6467j36486J82556Q5913
$$ 138728 22035 188326 8667 -41515 13276 69710 117708 101241 -35245 147311 233224
4447B33224J2406P8308o5437J12801j74268j58040O9120R1788j27699j80579K4463
$$ 233224 245630 323938 258501 371302 197034 38994 108114 199902 72203 -108376 -83913
4436h3913J8114M0332j35550J32816J63106j07954k24954J11114Q5216Q3317n0446
$$ -83913 -65799 -25467 -161017 -28201 134905 26951 -198003 -86889 -1673 81644 31198
4425C1198q3415J65696j63735Q0000k10998M2770j36j0787j088L1854R2483J9760
$$ 31198 -52217 113479 -50256 29744 -181254 -138484 -138620 -149407 -150495 -118641 -26158 -6398
4413f398M8566L402K2077j31296j53423J71188J09048j70127o5949J91088M3672
$$ -6398 42168 45570 67647 -63649 -217072 -45884 63164 -106963 -172912 18176 61848
4402F1848j9468m077N0904j04634J21527o8582o6173Q5242n9895n4173P2569o0894
$$ 61848 42380 38303 89207 -15427 106100 37518 -28655 56587 -3308 -57481 15088 -45806
4390d5806o4141M2765P5966J8114K1259K15590j08900n7532J22518n2761m3853
$$ -45806 -109947 -67182 8784 26898 48157 263747 154847 97315 219833 167072 123219
4379A23219m4336L9532p9161r0799J87326N6717p9537M4169j08555k01816M0886
$$ 123219 78883 118415 39254 -51545 135781 192498 112961 157130 48575 -153241 -112355
4368a12355m2888K4238M5656Q5676q4061J79304l2763J39049o4k45330L0963K7477
$$ -112355 -155243 -131005 -85349 327 -83734 95570 62807 201856 201792 -43538 -12575 14902
4356A4902k0117o2171o0175P8986p7488K95130j22026n18J5103R4879p2999P5787
$$ 14902 -5215 -67386 -127561 -48575 -126063 169067 47041 46523 61626 156505 83506 159293
4344A59293N403j68053M2882k2752K7477J8975j0991j08605O7707O9405K7946
$$ 159293 164696 -3357 39525 16773 44250 63225 52234 -56371 11336 80741 108687
4333A08687k2734P2514m6195j1384j8888l4501P4821Q7035j63073k2632J07311
$$ 108687 85953 158467 112272 100888 82000 47499 122320 209355 46282 23650 130961
4322A30961j32635n2112L986Q696j32455j0642J85053j271m5415J5608J56036
$$ 130961 -1674 -53786 -49800 -41104 -173559 -184201 852 -419 -45834 -30226 125810
4311A25810j08116R7603j9277L0138K4869r342j38324J27187j38587K9574Q5531
$$ 125810 17694 115297 96020 126158 151027 141685 3361 130548 -8039 21535 107066
4300A07066N9298l6665j0551j4541p3363m3443p436l8799L5356J51559q1275N0336
$$ 107066 166364 129699 119148 104607 31244 -12199 -19635 -58434 -23078 128481 47206 97542
4288I7542j96318J6476J6964k7812k1649j16291J29505m3884J30012K412L0424
$$ 97542 -98776 -82300 -65336 -93148 -114797 -231088 -101583 -145467 -15455 -13043 17381
4277A7381j33015J39514J80568l1770Q152M9688M8447K2628o3151n9902j15375
$$ 17381 -115634 23880 204448 172678 180830 230518 278965 301593 238442 178540 63165
4266F3165k15334O1698N1877N998Q9599J5391p7446J60225L2192k25003m6307
$$ 63165 -152169 -90471 -38594 -32596 57003 72394 -5052 155173 187365 -37638 -83945
4255h3945J7775m128j02593J3391J67741K41k1510L6894q4426m8190K13126j32150
$$ -83945 -66170 -70298 -172891 -159500 8241 8482 -13028 23866 -60560 -108750 104376 -27774
4243b7774N0344K9787J79134M7613j57982m3455J40458n2347j34511r8058J5043
$$ -27774 22570 52357 231491 279104 121122 77667 218125 165778 31267 -66791 -51748
4232e1748K1115K46147M1089L5644j67667K484o6041q150O7428j9954J69842J8364
$$ -51748 -30633 215514 256603 292247 124580 127064 61023 52873 120301 100347 270189 288553
4220B88553j55963q0108M8500L9580L9893j9062Q4947J1516O0000j92123n8925
$$ 288553 132590 52482 100982 140562 180455 161393 246340 257856 317856 125733 66808
4209F6808R6609k1952K3855N5616n3072k5755O6660p4810n0765p504j19080J21877
$$ 66808 163417 141465 165320 220936 167864 142109 208769 133959 83194 75690 -43390 78487
4197G8487p7112J6576J55533Q4910K8375k30303J656K29456m0005j17812J05433
$$ 78487 1375 17951 173484 258394 286769 56466 58122 287578 247573 129761 235194
4186B35194N7489J904n837j9819j19680o2179r9457N5905J64935q3623L8616O1681
$$ 235194 292683 294587 288750 268931 149251 87072 -12385 43520 208455 124832 163448 225129
4174B25129M7085j17609j05089n3298J88960k065m1086R251l7607Q8128N3536
$$ 225129 272214 154605 49516 -3782 185178 183113 142027 151278 113671 201799 255335
4163B55335r0668n4988K4458J4592J07472o8p8911j41825L7167k6560q45J5285
$$ 255335 164667 109679 134137 148729 256201 256133 177222 35397 72564 46004 45159 60444
4151F0444P8820P9305R1781J5871j15962l1426O4494L2275J78634R7328j31878
$$ 60444 139264 218569 310350 326221 210259 178833 243327 275602 454236 551564 419686
4140D19686j51375J97126n2905j01595m3798n905J39568o0435J07503j295n1136
$$ 419686 268311 465437 412532 310937 267139 261234 400802 340367 447870 446575 395439
4129C95439M9795m1668j71909M0047k2961K30933K6848p3426N9407o6546j364
$$ 395439 445234 403566 231657 271704 248743 479676 506524 433098 492505 425959 424595
4118D24595k5929P4252N8127M908M4849j63581L4747k2845p5330J09550K7737
$$ 424595 398666 472918 531045 535953 580802 417221 451968 429123 353793 463343 491080
4107D91080j20653l8279M3546J38442O5522J39469p7303J407Q6704j01611J27919
$$ 491080 370427 332148 375694 514136 579658 719127 641824 643231 729935 628324 756243
4096G56243P9161j7221q5006r033N9172O4687k5508M2698r8819O692K0693R5605
$$ 756243 835404 818183 733177 724144 783316 848003 822495 865193 766374 773066 793759 889364
4084H89364J71700m9068N3054N8489k6942j6607K68906r3590m5607O762J38325
$$ 889364 1061064 1011996 1065050 1123539 1096597 1079990 1348896 1255306 1209699 1216461 1354786
4073A354786K613O5535K18895l5109m0233l6893L7367j4132K32608N6722J01212
$$ 1354786 1357399 1422934 1641829 1606720 1566487 1529594 1566961 1552829 1785437 1842159 1943371
4062A943371N7655J00735m5553N9956J9527N3417O1768M3578J12128L8504J2247
$$ 1943371 2001026 2101761 2056208 2116164 2135691 2189108 2250876 2294454 2406582 2445086 2457333
4051B457333J13313l2349J73822K22895J9979J4652Q8950J84753K56073l624j0920
$$ 2457333 2570646 2538297 2712119 2935014 2954993 2969645 3058595 3243348 3499421 3495797 3484877
4040C484877L72628O0194L15836Q0144J76258M01493J48629P3097K23620L77361
$$ 3484877 3857505 3917699 4233535 4313679 4489937 4891430 5040059 5113156 5336776 5714137
4030E714137K90808L29143M19209N18542N80822M76891N56989N92548Q06501Q43753
$$ 5714137 6004945 6334088 6753297 7271839 7852661 8329552 8886541 9479089 10285590 11129343
4020A1129343R61200J430814J398373J845470J954673K047289K559319K805929
$$ 11129343 12090543 13521357 14919730 16765200 18719873 20767162 23326481 26132410
4012B6132410K689493K563270K131905J095696M74607o0288r32568j279980j615345
$$ 26132410 28821903 31385173 33517078 34612774 35087381 35027093 34094525 32814545 31199200
4003C1199200j828101j945618k223751k256200j953463j980754j885689j684074
$$ 31199200 29371099 27425481 25201730 22945530 20992067 19011313 17125624 15441550
3995A5441550j462988j292313j052521r03485q93908o45506n79923o37635n15022
$$ 15441550 13978562 12686249 11633728 10730243 9836335 9190829 8610906 7973271 7458249
3986G458249m41059m54485l09213l86112k60121j81314k66065p6679j83266k77941
$$ 7458249 7017190 6562705 6253492 5867380 5607259 5425945 5159880 5083201 4899935 4621994
3976D621994o5873o1124k30008k52356k20183j34600j09560k16236k5428q2334
$$ 4621994 4556121 4494997 4264989 4012633 3792450 3657850 3548290 3332054 3306626 3224292
3966C224292j86975o0542l2348j16086m0908j93906j69233j28034J02346l7720
$$ 3224292 3037317 2976775 2944427 2828341 2787433 2593527 2424294 2296260 2398606 2360886
3956B360886k13193K0188J5839k13146l7313m8168M3833J33325j28144o892j69068
$$ 2360886 2147693 2167881 2183720 1970574 1933261 1885093 1928926 2062251 1934107 1927215 1758147
3945A758147l1055K1535j66282R1446q8017j17790l7878O1191j83963r0270M9202
$$ 1758147 1727092 1748627 1582345 1673791 1585774 1467984 1430106 1491297 1307334 1217064 1266266
3934A266266Q395m2776j39387J16192K596q9976j8412m6248N8659p571o4726Q8073
$$ 1266266 1274661 1231885 1092498 1208690 1211286 1121310 1102898 1056650 1115309 1107738 1043012 1131085
3922A131085j52159k0771J00824k6976J20818j60891r1134k9247J12170J21630
$$ 1131085 978926 958155 1058979 1032003 1152821 991930 900796 871549 983719 1105349
3912A105349j54700j31585p9699J7683N4619N0630n6074K9917O0335J0421j9363
$$ 1105349 950649 819064 739365 757048 811667 862297 806223 836140 896475 906896 887533
3901H87533K4034j47469r7805j12451J08397j0063o9420q4462Q7301j15903r8610
$$ 887533 911567 764098 666293 553842 662239 652176 582756 498294 585595 469692 371082
3890C71082J68644K2138J10300r9282J1878J33464j83612r0639p6111J16326j04914
$$ 371082 539726 561864 672164 572882 584760 718224 534612 443973 367862 484188 379274
3879C79274J9701J38005L6469l059K7367j36940M0672J63303r1367P442o0690
$$ 379274 398975 536980 573449 570390 597757 460817 501489 664792 573425 580867 520177
3868E20177p7373L7519J37966k8308m1292l6754q4845j07147J86557o3161m3185
$$ 520177 442804 480323 618289 589981 548689 511935 427090 319943 506500 443339 400154
3857D00154o1208P7961J20978k5303o8832j02748K0574n3518o158L2182j1854
$$ 400154 338946 416907 537885 512582 443750 341002 361576 308058 301900 334082 322228
3846C22228O1827Q465N672O3194j62678j7285m6164o2874J18216J02741n2187
$$ 322228 384055 392520 398192 461386 298708 281423 235259 172385 290601 393342 341155
3835C41155o8567j8257J5582M2360P185M6792m5323J4775L8632j57808k3281J48794
$$ 341155 272588 254331 269913 312273 319458 366250 320927 335702 374334 216526 193245 342039
3823C42039J02883J7998j60100j38206j02379K6157j1126K18621O0444J1418Q5446
$$ 342039 444922 462920 302820 164614 62235 88392 77266 295887 356331 367749 453195
3812D53195J4550j36889p0004j07027J59575M9346j00126Q7589O2458N8570j33046
$$ 453195 467745 330856 260852 153825 313400 362746 262620 350209 412667 471237 338191
3801C38191k8595m1716K4329J2404o9026j3145Q869m399L2330J34346J27369M1778
$$ 338191 309596 267880 292209 304613 235587 222442 231311 226912 259242 393588 520957 562735
3789E62735k8572j61419j22861J21561m7994q0137n8204q457O1366J8993J25193
$$ 562735 534163 372744 249883 371444 323450 243313 185109 176652 238018 257011 382204
3778C82204J02462p3545n4887M7008l8116K714j37808Q2662M9765j5365L0330
$$ 382204 484666 411121 356234 403242 365126 367840 230032 312694 362459 347094 377424
3767C77424j13484P7687m8139r955K8799p8292o5195j4719K1314L0902J34345
$$ 377424 263940 341627 293488 283533 312332 234040 168845 154126 175440 206342 340687
3756C40687J31526O793j56231K0580j2208n0631J21833K01106j45382M369Q7154
$$ 340687 472213 479006 322775 343355 331147 280516 402349 603455 458073 462442 549596
3745E49596q6228j6150J21870O6738k6409K557K01346j28017j71409j21476j945
$$ 549596 463368 447218 569088 635826 609417 611974 813320 685303 513894 392418 390473
3734C90473J81075q7863r5713O2842R5562L115j58643p5264J10120J82486o9658
$$ 390473 571548 483685 387972 450814 546376 549491 390848 315584 425704 608190 538532
3723E38532q2251R4134R8013N3813j99050J03087J43925k7562j6705r1128K8496
$$ 538532 456281 550415 648428 702241 503191 606278 750203 722641 705936 614808 643304
3712F43304Q1590n1387j21919K3076j20685K4324K22803M739k51848j30205l364
$$ 643304 724894 673507 551588 574664 453979 478303 701106 705845 453997 323792 320428
3701C20428J07016J78934m806R458L7300m9336j37383j02363O5587J96372o9573
$$ 320428 427444 606378 601572 611030 648330 598994 461611 359248 424835 621207 551634
3690E51634k2786L3107J17205L6026k5579N8318l1691j93975N6073K2056N6725
$$ 551634 528848 561955 679160 715186 689607 747925 716234 522259 578332 600388 657113
3679F57113J17282j060J2146m822j60365j34570J10638q6686k8163J68043R5568
$$ 657113 774395 773335 785481 780659 620294 485724 596362 509676 481513 649556 745124
3668G45124M0894M7491J52093o1571o0009j61096k4616O6712J04166j31879j41962
$$ 745124 786018 833509 985602 924031 864022 702926 678310 745022 849188 717309 575347
3657E75347P8521M2332j3846J15694P026K0320o8362Q4189P6122j10812M8994
$$ 575347 653868 696200 682354 798048 805074 825394 757032 841221 917343 806531 855525
3646H55525p9258j9396q7775n1489k4920J97592J9j50575k6388K15376O39m2644
$$ 855525 776267 756871 669096 617607 592687 790279 790298 639723 613335 828711 829350 786706
3634G86706r08O9926o7470K1252M7256o596j5301r92J86206m3494J8102n2402
$$ 786706 785798 855724 788254 809506 856762 850166 834865 833873 1020079 976585 994687 942285
3622I42285n2062K9615J31274q7062j13163J43260R4594O3435r2645L1094N0998
$$ 942285 890223 919838 1051112 964050 850887 994147 1088741 1152176 1059531 1090625 1141623
3611A141623Q0040j00835l59L3919n7282J04757j30925N6483K61903k9549k5832
$$ 1141623 1221663 1120828 1120469 1154388 1097106 1201863 1070938 1127421 1389324 1359775 1333943
3600A333943k21039j4461J71065J11512J60090j06547k4681R4748j79404r2663
$$ 1333943 1112904 1098443 1269508 1381020 1541110 1434563 1409882 1504630 1325226 1232563
3590A232563K07498o7404K26880j2056R8934K8660L3704n2393J37927K39943l6143
$$ 1232563 1440061 1372657 1599537 1587481 1686415 1715075 1748779 1696386 1834313 2074256 2038113
3579B038113M776k14398O6508r7118j3752j28523K33463J98557k6891O3109J91408
$$ 2038113 2042889 1828491 1894999 1797881 1784129 1655606 1889069 2087626 2060735 2123844 2315252
3568B315252J18807R9888R2602o1816K9976J74191K373n2127P7435j06015J83440
$$ 2315252 2434059 2533947 2626549 2564733 2594709 2768900 2771273 2719146 2796581 2690566 2874006
3557B874006Q3382Q5232J14796o3200L3627K02196R2746Q4492J32338K3126l6351
$$ 2874006 2957388 3042620 3157416 3094216 3127843 3330039 3422785 3507277 3639615 3662741 3626390
3546C626390M4742R8528J05837J39010J8452O7230J86714L4969p6798J73382r95
$$ 3626390 3671132 3769660 3875497 4014507 4032959 4100189 4286903 4321872 4245074 4418456 4417461
3535D417461N2566K88544L5085J46217M00036J52680m4296L5642K65154K19680
$$ 4417461 4470027 4758571 4793656 4939873 5339909 5492589 5448293 5483935 5749089 5968769
3525E968769N3873K41331J41017L90209J64770M4965J92865K21979K88783K39997
$$ 5968769 6022642 6263973 6404990 6795199 6959969 7004934 7197799 7419778 7708561 7948558
3515G948558K37103J61410L84743K74948K83209M04870K14350L64970L21189K57919
$$ 7948558 8185661 8347071 8731814 9006762 9289971 9694841 9909191 10274161 10595350 10853269
3505A0853269K81058M24450K57271J53532L60030K09019M44298K24945L16260
$$ 10853269 11134327 11558777 11816048 11969580 12329610 12538629 12982927 13207872 13524132
3496A3524132K54916L08372K55938L14837L79369L45772N00569L91076K06167
$$ 13524132 13779048 14087420 14343358 14658195 15037564 15383336 15883905 16274981 16481148
3487A6481148L07916M83061O32522P14292N50905O84570O65173O13255P03277
$$ 16481148 16789064 17272125 17904647 18618939 19169844 19854414 20519587 21132842 21836119
3478B1836119O78966P35158O58362O50440N57241M48618N16428O05414N39030
$$ 21836119 22515085 23250243 23908605 24559045 25116286 25564904 26081332 26686746 27225776
3469B7225776K43216L10424L01659K06345J60801K02510K96910L80802K44426
$$ 27225776 27468992 27779416 28081075 28287420 28448221 28650731 28947641 29328443 29572869
3460B9572869J31662K71827M04936L87746J77418J70538K98815L82395M51023
$$ 29572869 29704531 29976358 30381294 30769040 30946458 31116996 31415811 31798206 32249229
3451C2249229L06448M40490M71281L75081M48641K93385L83284M86423M35896
$$ 32249229 32555677 32996167 33467448 33842529 34291170 34584555 34967839 35454262 35890158
3442C5890158L90665L41218K17596K05528L04499O9335J36616O9515q913j29308
$$ 35890158 36280823 36622041 36839637 37045165 37349664 37418999 37555615 37625130 37616217 37486909
3432C7486909n3207j74064k16556o7822j36768l94282l00194l01362r7667k36267
$$ 37486909 37433702 37259638 37043082 36975260 36838492 36444210 36144016 35842654 35744987 35508720
3422C5508720k16225j75805k44270j61181j05591l4886l66985n05831j93816k17354
$$ 35508720 35292495 35116690 34872420 34711239 34605648 34570762 34203777 33697946 33504130 33286776
3412C3286776j41463k90640k02734N6950k50007k32644j85280k96464l09337k67759
$$ 33286776 33145313 32854673 32651939 32708889 32458882 32226238 32040958 31744494 31435157 31167398
3402C1167398j43931l70880l08316m32163n44865m05163n54234l42275n70843
$$ 31167398 31023467 30652587 30344271 29912108 29367243 28962080 28407846 28065571 27494728
3393B7494728m46299m09817m08976n08653n46358m85115l62604l62715m02248
$$ 27494728 27048429 26638612 26229636 25720983 25174625 24689510 24326906 23964191 23561943
3384B3561943j62590l87870k37796k09841l35112j60954j86793j08553l49865
$$ 23561943 23399353 23011483 22773687 22563846 22228734 22067780 21880987 21772434 21422569
3375B1422569j77962q3902k17781k93576j8048k73167k01236k82367l99251j89252
$$ 21422569 21244607 21160705 20942924 20649348 20631300 20358133 20156897 19874530 19475279 19286027
3365A9286027k18536k89418J0474n1711P1633k11169j09404O6213k99570K2281
$$ 19286027 19067491 18778073 18788547 18736836 18808469 18597300 18487896 18554109 18254539 18276820
3355A8276820K2275R4767J46735J05427J70758J35768J84186J64844K20314M26048
$$ 18276820 18299095 18393862 18540597 18646024 18816782 18952550 19136736 19301580 19521894 19947942
3345A9947942K17983o429K96243K07327K71310L35494L31881N86656N44446L59646
$$ 19947942 20165925 20159496 20455739 20663066 20934376 21269870 21601751 22188407 22732853 23092499
3335B3092499K11906M41089M94471N37996M86157M59271N57615O90295O74821
$$ 23092499 23304405 23745494 24239965 24777961 25264118 25723389 26281004 26971299 27646120
3326B7646120N30016O63204O84814Q62334Q15375R20031R72460R23555J020791
$$ 27646120 28176136 28839340 29524154 30386488 31201863 32121894 33094354 34017909 35038700
3317C5038700J156519J299742J351821J343281J218105J316370J203057J477590
$$ 35038700 36195219 37494961 38846782 40190063 41408168 42724538 43927595 45405185
3309D5405185J416366J244710J308656J478064J254907J142605J343824J229156
$$ 45405185 46821551 48066261 49374917 50852981 52107888 53250493 54594317 55823473
3301E5823473J250799J224869J055477J240555J265428J348198J210714J635473
$$ 55823473 57074272 58299141 59354618 60595173 61860601 63208799 64419513 66054986
3293F6054986J799011J641893J823711K183355K171519K438458K371184K660440
$$ 66054986 67853997 69495890 71319601 73502956 75674475 78112933 80484117 83144557
3285H3144557K893205K793513L154929L090069L227828L331350L267641L526404
$$ 83144557 86037762 88831275 91986204 95076273 98304101 101635451 104903092 108429496
3277A08429496L436942L653147L460670L368622L405564L210961L410683L442997
$$ 108429496 111866438 115519585 118980255 122348877 125754441 128965402 132376085 135819082
3269A35819082L657631L705403L867201M022077M244270M611922M878733N443297
$$ 135819082 139476713 143182116 147049317 151071394 155315664 159927586 164806319 170249616
3261A70249616N834359N996706O544611O868967P309383P609955P983337Q344149
$$ 170249616 176083975 182080681 188625292 195494259 202803642 210413597 218396934 226741083
3253B26741083Q949331R225971R848281J0648957J1169361J1593520J2116800
$$ 226741083 235690414 244916385 254764666 265413623 276582984 288176504 300293304
3246C00293304J3028318J4004366J5024473J6164945J7281746J8323290J8941426
$$ 300293304 313321622 327325988 342350461 358515406 375797152 394120442 413061868
3239D13061868J9163069J8874715J7661061J5457002J2262279P559134K592849
$$ 413061868 432224937 451099652 468760713 484217715 496479994 504039128 506631977
3232E06631977l284056q829342j3269469j6517160j7677995j7812118j6746431
$$ 506631977 503347921 494518579 481249110 464731950 447053955 429241837 412495406
3225D12495406j5467588j3913841j2462079j1211428j0043717q994468q000587
$$ 412495406 397027818 383113977 370651898 359440470 349396753 340402285 332401698
3218C32401698o968160o326844n661795m846925m215325l820872l468321l114189
$$ 332401698 325433538 319106694 313444899 308597974 304382649 300561777 297093456 293979267
3210B93979267k639843k011546j398864o21823j07357L52765O29132J081720J141626
$$ 293979267 291339424 289327878 287929014 287307191 287199834 287552599 288181731 289263451 290405077
3201B90405077Q64532L71412k90622n21249j044287j501697j951446j940913k168077
$$ 290405077 291269609 291641021 291350399 290829150 289784863 288283166 286331720 284390807 282222730
3192B82222730k499234k859050l244532l540788l977857m376634m539578m696601
$$ 282222730 279723496 276864446 273619914 270079126 266101269 261724635 257185057 252488456
3184B52488456m756902m659893m515438m242080l999855l809165l665915l391831
$$ 252488456 247731554 243071661 238556223 234314143 230314288 226505123 222839208 219447377
3176B19447377l145352l362471l412786l246885l518029l776123l811369l704579
$$ 219447377 216302025 212939554 209526768 206279883 202761854 198985731 195174362 191469783
3168A91469783m025704m183681m406570m514800m147183m128737m078320l863355
$$ 191469783 187444079 183260398 178853828 174339028 170191845 166063108 161984788 158121433
3160A58121433l923864l448230l271939l462697l337042l177036l135354l082332
$$ 158121433 154197569 150749339 147477400 144014703 140677661 137500625 134365271 131282939
3152A31282939l315064l163298l195323l210936l194206l077683k884035k956603
$$ 131282939 127967875 124804577 121609254 118398318 115204112 112126429 109242394 106285791
3144A06285791k925155k799412k656070k554119k705640k658263k307147k240116
$$ 106285791 103360636 100561224 97905154 95351035 92645395 89987132 87679985 85439869
3136H5439869k316627k056301j593183j747313j904614j653230j546166j521165
$$ 85439869 83123242 81066941 79473758 77726445 75821831 74168601 72622435 71101270
3128G1101270j449652j361318j389813j465977j243098j289730j294149j318621
$$ 71101270 69651618 68290300 66900487 65434510 64191412 62901682 61607533 60288912
3120F0288912j349104j244402q25491j144771j107863r09664j184267r06432r36680
$$ 60288912 58939808 57695406 56869915 55725144 54617281 53707617 52523350 51616918 50680238
3111E0680238r23635r01310j087299p61161o95542j003501p84731p10650q49041
$$ 50680238 49756603 48855293 47767994 47006833 46311291 45307790 44523059 43812409 42963368
3102D2963368q14777p15675q37863r06215p84549r89943p23708o95433q71255
$$ 42963368 42148591 41432916 40595053 39688838 38904289 37914346 37190638 36495205 35623950
3093C5623950p53950o30219n56866o66074o42420o18481o90733p81503m03113
$$ 35623950 34870000 34239781 33682915 33016841 32374421 31755940 31065207 30283704 29880591
3084B9880591n26658m52503m63064p27273o81657n71265m76166m56115o07893
$$ 29880591 29353933 28901430 28438366 27711093 27029436 26458171 25982005 25525890 24917997
3075B4917997o01175n30953n61028l77202m17112l30064n58055n74263l25357
$$ 24917997 24316822 23785869 23224841 22847639 22430527 22100463 21542408 20968145 20642788
3066B0642788l77827l52070m37964n71326n24426m74778l95774m49906l10509
$$ 20642788 20264961 19912891 19474927 18903601 18379175 17904397 17508623 17058717 16748208
3057A6748208m50694m26991k28283l33650j66714l93424l93279k89850j63222
$$ 16748208 16297514 15870523 15642240 15308590 15141876 14748452 14355173 14065323 13902101
3048A3902101k98370k13276k67233l90162j91112j26771l03560k11330k21112
$$ 13902101 13603731 13390455 13123222 12733060 12541948 12415177 12111617 11900287 11679175
3039A1679175l93071j95958j92604q5057l5514j25157j0406m0583j42383j22384
$$ 11679175 11286104 11090146 10897542 10812485 10776971 10651814 10641408 10600825 10458442 10336058
3029A0336058k73657j00433r3422j3026l19839M5324l1444k43357p000K640j73886
$$ 10336058 10062401 9961968 9868546 9855520 9535681 9581005 9549561 9306204 9299204 9301844 9127958
3018I127958j01874j05476k7291M539M0364k31407l545J63647n3879n865J09452
$$ 9127958 9026084 8920608 8893317 8897856 8938220 8706813 8703268 8866915 8813036 8807171 8916623
3007H916623R846j14396J16833j6955M0043L8630J52356J45030q2652J75153Q6619
$$ 8916623 8926469 8812073 8928906 8911951 8951994 8990624 9142980 9288010 9205358 9380511 9467130
2996I467130J5283o7785K8708J29447J60053P1357J13067K20406J42710J51638
$$ 9467130 9482413 9414628 9443336 9572783 9732836 9804193 9917260 10137666 10280376 10432014
2986A0432014n7542K17177J84972K31999K20639K93327J31522K60094K58777J76149
$$ 10432014 10374472 10591649 10776621 11008620 11229259 11522586 11654108 11914202 12172979 12349128
2976A2349128K08158L04547L11312K88665K12002J72514L93652J72053K65122
$$ 12349128 12557286 12861833 13173145 13461810 13673812 13846326 14239978 14412031 14677153
2967A4677153L85161K31682J64739M01405K84897L87915N36724N82736M45957
$$ 14677153 15062314 15293996 15458735 15860140 16145037 16532952 17069676 17652412 18098369
2958A8098369L46056M43154L19566O25186M98593L35140N35048Q50023Q10087
$$ 18098369 18444425 18887579 19207145 19832331 20330924 20666064 21201112 22051135 22861222
2949B2861222O68265O85959Q10470P14706R97848R93098J015109J022774J157617
$$ 22861222 23529487 24215446 25025916 25740622 26738470 27731568 28746677 29769451 30927068
2940C0927068J170104J258405J472529J767920J753126J924540J922932K285152
$$ 30927068 32097172 33355577 34828106 36596026 38349152 40273692 42196624 44481776
2932D4481776K267787K691758K807153L002376L761621M055745M549861N009038
$$ 44481776 46749563 49441321 52248474 55250850 59012471 63068216 67618077 72627115
2924G2627115N370692N864815O309795O270441O044202N356126M643347L403574
$$ 72627115 77997807 83862622 90172417 96442858 102487060 107843186 112486533 115890107
2916A15890107J882838L86497o09191j220997j288678j274299q65139p20072p48892
$$ 115890107 117772945 118159442 117550251 116329254 115040576 113766277 112901138 112181066 111432174
2907A11432174m21721j6042K68267P55840J168317J477912K074116L078842L983054
$$ 111432174 111010453 110994411 111262678 112018518 113186835 114664747 116738863 119817705 123800759
2898A23800759M986848O478182Q071048J0322133J2897382J4870016J4616724
$$ 123800759 128787607 135265789 143336837 153658970 166556352 181426368 196043092
2891A96043092J1431222O514924J492068k829023q369180j4422188j7206730j6528095
$$ 196043092 207474314 213989238 215481306 212652283 204283103 189860915 172654185 156126090
2883A56126090j4262914j1874892r625430p893800o492631n497754m695616l885830
$$ 156126090 141863176 129988284 120362854 112469054 105976423 100478669 95783053 91897223
2875I1897223l298841k537419k495138j635862r86111o17188K7543L25728P16954
$$ 91897223 88598382 86060963 83565825 81929963 80943852 80326664 80354207 80679935 81396889
2866H1396889J246097J629414K285056K472580K588366K402940J622229Q57379
$$ 81396889 82642986 84272400 86557456 89030036 91618402 94021342 95643571 96500950
2858I6500950l25578j678943l287739m641932n434318n934074n878877n747925
$$ 96500950 96175372 94496429 91208690 86566758 81132440 75198366 69319489 63571564
2850F3571564n213137m478608m100089l383200l125769k865515k348668k081510
$$ 63571564 58358427 53879819 49779730 46396530 43270761 40405246 38056578 35975068
2842C5975068j935502j904847j840928j494890j323579j294172j114789j117062
$$ 35975068 34039566 32134719 30293791 28798901 27475322 26181150 25066361 23949299
2834B3949299j028215r45272q50119p96409p09073o02947o31310o52917n28656
$$ 23949299 22921084 21975812 21125693 20329284 19620211 19017264 18385954 17733037 17204381
2825A7204381o87402m86970m67176m89463n80086n42648l13568l24612l54823
$$ 17204381 16516979 16030009 15562833 15073370 14493284 13950636 13637068 13312456 12957633
2816A2957633n29678l46608m36422j98518l82345m57603j40785k59718p6018k10803
$$ 12957633 12427955 12081347 11644925 11446407 11064062 10606459 10465674 10205956 10129938 9919135
2806I919135l14945k78186j95244j19824k33931k72894k71437k78121j24430q7858
$$ 9919135 9604190 9326004 9130760 9010936 8777005 8504111 8232674 7954553 7830123 7742265
2796G742265k48005j16811j19394j83951j67148r8000q4957k11541o9978j23199
$$ 7742265 7494260 7377449 7258055 7074104 6906956 6808956 6723999 6512458 6442480 6319281
2786F319281j11171k76457j14701q5964j31155r1789j15436j01495k89484j59429
$$ 6319281 6208110 5931653 5816952 5730988 5599833 5508044 5392608 5291113 5001629 4842200
2776D842200q9283j23280j18899j00573o9692Q4522j9657p2114n1265J77085p2122
$$ 4842200 4752917 4629637 4510738 4410165 4340473 4424995 4405338 4333224 4281959 4459044 4386922
2765D386922k49946j08858k526j11158k29548j10320N4623L6052j2658j76997
$$ 4386922 4136976 4028118 4025592 3914434 3684886 3574566 3629189 3665241 3652583 3475586
2755C475586j03488J9380j53176j03087j46013R5199k566o7480n1806q2950M4232
$$ 3475586 3372098 3391478 3238302 3135215 2989202 3084401 3081835 3014355 2962549 2879599 2923831
2744B923831r3395n5199o568p0967J8583p6653j02927M6940K6082j4745k30178
$$ 2923831 2830436 2775237 2768669 2697702 2716285 2639632 2536705 2583645 2609727 2594982 2364804
2733B364804o3254K4380k1502q241N1425j4814j55933N6365j61679M8141R5256
$$ 2364804 2301550 2325930 2304428 2296187 2347612 2332798 2176865 2233230 2071551 2119692 2214948
2722B214948j59743n9728k72263P0742l4638p6018O8682Q6021q7993N9927j64020
$$ 2214948 2055205 1995477 1723214 1793956 1759318 1683300 1751982 1838003 1750010 1809937 1645917
2711A645917j00940N4212p0519j16712J41021M814L117l4376j1449j14010j18089
$$ 1645917 1544977 1599189 1528670 1411958 1552979 1557793 1560910 1526534 1515085 1401075 1282986
2700A282986K61532J27321j55223r141J2153n0536j27422j25168N3664P8402m611
$$ 1282986 1544518 1671839 1516616 1507475 1519628 1469092 1341670 1216502 1270166 1348568 1343957
2689A343957o4084J8281l2075j07429N959n8993Q3740J77814j92967j58730J12125
$$ 1343957 1279873 1298154 1266079 1158650 1164609 1105616 1189356 1367170 1174203 1015473 1127598
2678A127598N365j59041r9583M5353J02482j19919K11584q6474p622n9705q3454
$$ 1127598 1132963 973922 874339 919692 1022174 902255 1113839 1027365 1019743 960038 876584
2667H76584O7440J66818L8053j23799P4827K6469j45369N1324L022J1256K2657
$$ 876584 944024 1110842 1148895 1025096 1099923 1126392 981023 1032347 1035369 1046625 1069282
2656A069282j0671n5863j93236J23443J17261p65q1581O3347O1884j01744l89
$$ 1069282 1058611 1002748 809512 932955 1050216 1049451 967870 1031217 1093101 991357 990968
2645I90968j51149Q0913J54062J951L7381J37295k20273J05087J08448o4506p7406
$$ 990968 839819 920732 1074794 1076745 1114126 1251421 1031148 1136235 1244683 1180177 1102771
2634A102771k1555K08926J43802m0545j24503j1704j0906r4591P1544r4086J43888
$$ 1102771 1081216 1290142 1433944 1393399 1268896 1257192 1246286 1151695 1223239 1129153 1273041
2623A273041j05511J32447O7114j41282R2617L365l1782q9411J52089R8562j2806
$$ 1273041 1167530 1299977 1367091 1225809 1318426 1321791 1290009 1200598 1352687 1451249 1438443
2612A438443j08627J9658R4094L9224Q9727j7264N7300J29456o9035j62893J56793
$$ 1438443 1329816 1349474 1443568 1482792 1572519 1555255 1612555 1742011 1672976 1510083 1666876
2601A666876j39041k04365j73281J1719j6761j42165P472j49710L1805J40919
$$ 1666876 1527835 1323470 1150189 1161908 1145147 1002982 1010454 860744 892549 1033468
2591A033468j08779k26106K26973J39669j16747k1136j45799k7731J16069n6523
$$ 1033468 924689 698583 925556 1065225 948478 927342 781543 753812 869881 813358
2581H13358J86378L6123q1778j92591J71282P5253j5318p7719L2439L5733j66118
$$ 813358 999736 1035859 954081 761490 932772 1008025 992707 914988 947427 983160 817042
2570H17042M3492N7811j83345k4297p577O9947n9400j88014J09000m3544j93632
$$ 817042 860534 918345 735000 710703 703126 773073 713673 525659 634659 591115 397483
2559C97483K0922R3230m0168O2772J0536q7723O0733q6911k9105N3785J13450
$$ 397483 418405 511635 471467 534239 544775 457052 517785 430874 401769 455554 569004
2548E69004k43662p98J62948R5784r4972o0839J53107j21154J2903M8155L2596
$$ 569004 325342 324544 487492 583276 488304 427465 580572 459418 472321 520476 553072
2537E53072k9069j12905K1415m1150J6128j32267m884O7892o891N0834P5749o4611
$$ 553072 524003 411098 432513 391363 407491 275224 270340 338232 331341 382175 457924 393313
2525C93313j47152P9826r943j2703k7119j4075j19862K19140n887j36212m8130
$$ 393313 246161 325987 316044 303341 276222 262147 142285 361425 355538 219326 171196
2514A71196J15636O3687q9327Q2392j05786R5009j21058R8869M0945m5863J8839
$$ 171196 286832 350519 261192 343584 237798 332807 211749 310618 351563 305700 324539
2503C24539j05787j55814J3998J11895o296j11613n7866J47677Q683Q0590J29462
$$ 324539 218752 62938 76936 188831 182535 70922 13056 160733 169416 250006 379468
2492C79468k02434o6973J12967k4383j60375M4297M9113k6851N6088K1486J32178
$$ 379468 177034 110061 223028 198645 38270 82567 131680 104829 160917 182403 314581
2481C14581j38957m3957k5975K121o1435J00951p169j45726J84442J16277k562
$$ 314581 175624 131667 105692 107813 46378 147329 140160 -5566 178876 295153 292591
2470B92591j75513m8283m0487J33905q0905L2384O9205J32833j50017j29464Q375
$$ 292591 117078 68795 28308 162213 81308 113692 182897 315730 165713 36249 44624
2459D4624J2446J36011j59988P2589O5392p0536o1978J31839K4963P525k79392
$$ 44624 57070 193081 33093 105682 171074 100538 38560 170399 195362 202887 -76505
2448g6505r276J37825J60612J826N9447q1465r8577J51556j40285L4081N3143
$$ -76505 -85781 52044 212656 214482 273929 192464 93887 245443 105158 139239 192382
2437A92382l1648P931J07182q1747j41500J60177j38866P108p5397J6433o599
$$ 192382 160734 168665 275847 194100 52600 212777 73911 81019 5622 22055 15456
2426A5456L4373J83051J03348j30574j02132n5929l9593k5186L4615n4278J86086
$$ 15456 49829 232880 336228 205654 103522 47593 8000 -17186 17429 -36849 149237
2415A49237j55651M2366O5386O8676O6345p2395p4481q817M313j15649n8841J19110
$$ 149237 -6414 35952 101338 170014 236359 163964 89483 80666 84979 -30670 -89511 29599
2403B9599R869o8584J10446J02664Q6803L6920j10313Q8788L083j55986J8996
$$ 29599 39468 -29116 81330 183994 270797 307717 197404 286192 289275 133289 152285
2392A52285p5493J19787j52439m7808Q553N1078K43547J7003p0337l5997n6975
$$ 152285 76792 196579 44140 -3668 4885 55963 299510 316513 246176 210179 153204
2381A53204j6107k1330k100k1401K2283m540j6416j3564j6810J08917Q2707k8422
$$ 153204 137097 115767 113667 92266 114549 110009 93593 80029 63219 172136 254843 226421
2369B26421K0777j39533j9066o071J98450O5415J05918n8166P4956q4226p0972
$$ 226421 247198 107665 88599 82528 280978 346393 452311 394145 469101 384875 313903
2358C13903r3448n5039m1055q2137J50937J69599p4006j0703J73209r0j79852
$$ 313903 220455 165416 124361 42224 193161 362760 288754 278051 451260 451170 271318
2347B71318q1524l0753k0912p8365N8816p5965J02570Q0011l1323q1104k7004
$$ 271318 189794 159041 138129 59764 118580 42615 145185 225196 193873 112769 85765
2336H5765r9659J54367J19396j27482p7799n4197P3554r2424R6447j47900r8149
$$ 85765 -13894 140473 259869 132387 54588 391 73945 -18479 77968 -69932 -168081
2325a68081r3224J53678J74078Q9330O141k7598m4853N1406p0048k4580j5280
$$ -168081 -261305 -107627 66451 155781 161922 134324 89471 140877 70829 46249 30969
2314C0969P800J50326k0996j1125j34225J06781n1832J15403K0729k2314j21443
$$ 30969 38769 189095 168099 156974 22749 129530 77698 193101 213830 191516 70073
2303G0073k8167R0107n6595R1624o7669j24153J43253J6095q5608J33415P6232
$$ 70073 41906 132013 75418 167042 99373 -24780 118473 134568 48960 182375 258607
2292B58607j58840J4097m4898m2757R0186j12264k4386J24811M0345M7757q263
$$ 258607 99767 113864 68966 26209 116395 4131 -20255 104556 144901 192658 184395
2281A84395j21700K842R4436n9546k784L3438r2251k1499j6637P6153l0796Q9413
$$ 184395 62695 65537 159973 100427 97643 131081 38830 17331 694 76847 46051 135464
2269A35464j14685J58784J45415j04193j02620l5810J7203o4367J15707L2933
$$ 135464 20779 179563 324978 220785 118165 82355 99558 35191 150898 183831
2259A83831q1089N6178k3557O7971o3553q1397J1443k6760M0680R775k6419r4208
$$ 183831 102742 158920 135363 203334 139781 58384 69827 43067 83747 93522 67103 -27105
2247b7105J26569L2420n4216K2685m6722J5842l3025L738j36396J20102J12687
$$ -27105 99464 131884 77668 100353 53631 69473 36448 40186 -96210 23892 136579
2236A36579J6492j39093K4775J7386M0309J9766K0775K5171p5220j1667o2716
$$ 136579 153071 13978 38753 56139 96448 116214 136989 162160 86940 75273 12557
2225A2557J40681J29644p3469j15015j23094J03316J57503M8193p2276j15974
$$ 12557 153238 282882 209413 94398 -28696 74620 232123 280316 208040 92066
2215I2066R5958J99103m2451R69m6567O1690n8511q1719L229q8085J40246J92445
$$ 92066 188024 387127 344676 345645 299078 360768 302257 220538 223767 135682 275928 468373
2203D68373m7292j22514q1921P0121N9156L7572r9002j30449K00O5638j0619P2294
$$ 468373 421081 298567 216646 286767 345923 383495 284493 154044 154244 219882 209263 281557
2191B81557M9513O7253J06751j23971k3286M5636M2157q9683l285Q0487J6053
$$ 281557 331070 398323 505074 381103 357817 403453 445610 355927 352642 433129 449182
2180D49182N3650q52r6256J26966P8132L3685K494p303P0196R5319p7245l6086
$$ 449182 502832 501980 405724 532690 610822 644507 647001 639698 709894 805213 727968 691882
2168F91882M1590L4389L8719r3903N9385m4011n2640R5069L8545J66661j47650
$$ 691882 733472 767861 806580 712677 772062 728051 675411 770480 809025 975686 828036
2157H28036N6841J0222n693Q4085R3154P7535j3105O8714L7903l4830P0275O8993
$$ 828036 884877 895099 889406 973491 1066645 1144180 1131075 1199789 1237692 1202862 1273137 1342130
2145A342130P6438Q2733N0065q8650Q4326N8790o4432m5201R7524K34864K30707
$$ 1342130 1418568 1501301 1551366 1462716 1547042 1605832 1541400 1496199 1593723 1828587 2059294
2134B059294l586j0027J73881J03735j5769K14761j37779r1925K71294K26052
$$ 2059294 2055708 2045681 2219562 2323297 2307528 2522289 2384510 2292585 2563879 2789931
2124B789931J85376K60306J23921K92304K96648J52002K44250J05563K20317K29229
$$ 2789931 2975307 3235613 3359534 3651838 3948486 4100488 4344738 4450301 4670618 4899847
2114D899847K85522M77998N37629P74690N69383P17240N18761L84540M51810N55902
$$ 4899847 5185369 5663367 6200996 6975686 7545069 8262309 8781070 9165610 9617420 10173322
2104A0173322Q81675J294516J533386K101580K821866K949845M065018O056252
$$ 10173322 11054997 12349513 13882899 15984479 18806345 21756190 25821208 31877460
2096C1877460Q506502J0780726R825258L653567o756129j2379263r983142p649542
$$ 31877460 40383962 51164688 60989946 64643513 57887384 45508121 35524979 27875437
2088B7875437n247719l833003k926694k116006j443387j354574p91995m65618
$$ 27875437 22627718 18794715 15868021 13752015 12308628 10954054 10162059 9696441
2080I696441o51035n01207n08830o54820p46342m83621m78952k78693m34187k62799
$$ 9696441 9045406 8544199 8035369 7380549 6634207 6150586 5671634 5392941 4958754 4695955
2070D695955k88758k96472k59081j12486j36773j17592j12822k58198m0797k75639
$$ 4695955 4407197 4110725 3851644 3739158 3602385 3484793 3371971 3113773 3072976 2797337
2060B797337k15451j97685q0991m8177O121j8078P7951j08800j59892M6812j8649
$$ 2797337 2581886 2384201 2303210 2255033 2261154 2243076 2321027 2212227 2052335 2099147 2080498
2049B080498k415j36122k82519q2404k2474J49012n1759J6369j18854J15747k870
$$ 2080498 2078083 1941961 1659442 1577038 1554564 1703576 1651817 1668186 1549332 1665079 1662209
2038A662209k96163o0618J4780Q413N6010J840p5432K3578r0998Q7897j94669
$$ 1662209 1366046 1305428 1320208 1328621 1384631 1386471 1311039 1334617 1243619 1331516 1136847
2027A136847L6952j06458k06656J13762l4316j06304o8599M4791K9419O9668j55499
$$ 1136847 1173799 1067341 860685 974447 940131 833827 765228 810019 839438 909106 753607
2016G53607P7498K18310q2578o36k75333j37700R4002R6198o6350k0819J03910
$$ 753607 831105 1049415 966837 966201 690868 553168 647170 743368 677018 656199 760109
2005G60109r5131L1826q1756l9389p6575J2377J12258n177j05866j17708J32734
$$ 760109 664978 696804 615048 575659 499084 511461 623719 618542 512676 394968 527702
1994E27702J3726j6938j117j439P221k29467J5247M8269N974J5363j5790L7201
$$ 527702 541428 524490 523373 521934 529155 299688 314935 363204 369178 384541 368751 405952
1982D05952j75914J21454K0729j4891j1628p901j54478K5705J9310M6718j9007
$$ 405952 230038 351492 372221 357330 345702 337801 183323 209028 228338 275056 256049
1971B56049R3870o122m5208K8936j49234J66452L1113j24289N7285J26952l0739
$$ 256049 349919 343797 298589 327525 178291 344743 375856 251567 308852 435804 405065
1960D05065j29914m1933K0888r8079M3936o870q732P9257O6212P7457p0278j04516
$$ 405065 275151 233218 254106 156027 199963 193093 184361 263618 329830 407287 337009 232493
1948B32493j51842M8484K77430l6877q6097j93666n6736J56217j58748q7501N9302
$$ 232493 80651 129135 406565 369688 283591 89925 33189 189406 30658 -56843 2459
1937B459M6006J20487O6162J00561K0538n5809j01232Q1955j59638j99764J92124
$$ 2459 48465 168952 235114 335675 356213 300404 199172 281127 121489 -78275 113849
1926A13849Q5658K8025j77599p6903R6753O1105P7781k6030J5597l810j1409o4315
$$ 113849 199507 227532 49933 -26970 69783 130888 208669 182639 198236 194426 183017 118702
1914A18702O1297m3971o8750J39024o8394L4032j17062m1634q5826O5797J28732
$$ 118702 179999 136028 67278 206302 137908 171940 54878 13244 -72582 -6785 121947
1903A21947J7679q3738N0753l2544K49520j44591q9372J4556q3999P3572J46961
$$ 121947 139626 55888 106641 74097 323617 179026 89654 104210 20211 93783 240744
1892B40744j02994n3446J5162q3242J68580j06262j3653p3307q5819K3084R1026
$$ 240744 137750 84304 99466 16224 184804 78542 64889 -8418 -94237 -71153 19873
1881A9873n2995P6506M7349j26092p5892J60678o1499J0121o1976L4825M0501
$$ 19873 -33122 43384 90733 -35359 -111251 49427 -12072 -1951 -63927 -29102 11399
1870A1399l1817j50037J76454R9182J1178n5540l084O6436p2172q2700j52277
$$ 11399 -20418 -170455 5999 105181 116359 60819 57735 124171 51999 -30701 -182978
1859a82978k5689O7998K89699j9933k04103l9032R5565m9897N0590J25220p7136
$$ -182978 -208667 -140669 149030 129097 -75006 -114038 -18473 -68370 -17780 107440 30304
1848C0304j0750K3515p8684q853N860n8231q0747Q8114L9709R7277Q155r7763
$$ 30304 19554 43069 -35615 -44468 -38608 -96839 -177586 -89472 -49763 47514 55669 -42094
1836d2094J6511R487J29288j13448J26327j03813L4686r464m6624P3854M307J5780
$$ -42094 -25583 -16096 113192 -256 126071 22258 56944 47480 856 74710 79017 94797
1824I4797j920r4127J85187J13340j49701K7378J7184j33119N963K5968l0985
$$ 94797 92877 -1250 183937 297277 147576 174954 192138 59019 64982 90950 59965
1813E9965o6968R4952K8581j00051j1290l67R9643J5567K8509k1705l2796j56191
$$ 59965 -7003 87949 116530 16479 5189 4822 104465 120032 148541 126836 94040 -62151
1801f2151J06930M2204l4647j85483J34150j5313R1762J26142k05716m2285N2564
$$ -62151 44779 86983 52336 -133147 1003 -14310 77452 203594 -2122 -44407 8157
1790H157k4702J24382j38830j4295J03660j35332M6620q2594M857J61104j16728
$$ 8157 -16545 107837 -30993 -45288 58372 -76960 -30340 -112934 -108077 53027 -63701
1779f3701Q6187N1997r5651R284l8404r962J44568l9596n4721q6750J5968Q0282
$$ -63701 22486 74483 -21168 -11884 -50288 -60250 84318 44722 -9999 -96749 -80781 -499
1767d99l5377M8239n7809p5369k2697R4310J26414j40407N6015L6786M9169N6131
$$ -499 -35876 12363 -45446 -120815 -143512 -49202 77212 -63195 -7180 29606 78775 134906
1755A34906m9975M7746k48235n1676L3515n2074l5006N9378O9863J51220n9287
$$ 134906 84931 132677 -115558 -167234 -133719 -185793 -220799 -161421 -91558 59662 375
1744C75R61m2059p214K2295l5321J706J17382m5144K4035K28080j98992j69445
$$ 375 1336 -40723 -47937 -25642 -60963 -59257 58125 12981 37016 265096 66104 -103341
1732a03341k3377P7715J2572r282n2893K7970K5179N0137p4507J23742r7383j38042
$$ -103341 -126718 -49003 -36431 -45713 -98606 -70636 -45457 4680 -69827 53915 -43468 -181510
1720a81510J39193k08574j22262J46805J54626k2285J77496j15185m534O0746
$$ -181510 -42317 -250891 -373153 -226348 -71722 -94007 83489 -31696 -36230 24516
1710B4516J40107q5003K9246n6142r4039J7965K4445K3606k4062Q1014p3275r0863
$$ 24516 164623 79620 108866 52724 -41315 -23350 1095 24701 639 81653 8378 -82485
1698h2485L4453M9322J5489J0536m6577L4302J1988k6286q8572M8450M6210O5880
$$ -82485 -48032 1290 16779 27315 -19262 15040 27028 742 -87830 -39380 6830 72710
1686G2710n2340j11597J6542J61759q1399o6013J08716M4327q1181j17864N0297
$$ 72710 20370 -91227 -74685 87074 5675 -60338 48378 92705 11524 -106340 -56043
1675e6043J31305k1419l5650m220j15771J34489j5466o5153k6606o4641l8828
$$ -56043 75262 53843 18193 13973 -101798 32691 17225 -47928 -74534 -139175 -178003
1664a78003j0384m012p7097J2433J54173P8549j69142J36503J23070K9043j17076
$$ -178003 -188387 -192399 -269496 -257063 -102890 -24341 -193483 -56980 66090 95133 -21943
1653b1943j28043J33396o6861L8179r383L3487j8926j4851N1197r6829J26981
$$ -21943 -149986 -16590 -83451 -45272 -54655 -21168 -40094 -54945 -3748 -100577 26404
1642B6404p2751J2516o7401R7438K7741n9948o5326j9926q081m1834J32801J6582
$$ 26404 -46347 -33831 -101232 -3794 23947 -36001 -101327 -121253 -129334 -171168 -38367 -21785
1630b1785J5724K6620n5976o0022m0064J00328k0421j56015K47872p0913J7646
$$ -21785 -6061 20559 -35417 -95439 -135503 -35175 -55596 -211611 36261 -34652 -17006
1619a7006L9310k87626K0788J65270K5356j7227J18848p6099j8351L1679O484
$$ -17006 22304 -265322 -244534 -79264 -53908 -71135 47713 -28386 -46737 -15058 -8574
1608h574j52260k1570J25094r5973j3521J30851P3350M1233n7965j55195L2214
$$ -8574 -160834 -182404 -57310 -153283 -166804 -35953 37397 78630 20665 -134530 -102316
1597a02316j56889J74676R1896j39274j7922N5806J11775j34621R4152J41613
$$ -102316 -259205 -84529 7367 -131907 -149829 -94023 17752 -116869 -22717 118896
1587A18896n3016n8675j82971n3829R2728M5917K6667K6823m9119k3912L095J0776
$$ 118896 65880 7205 -175766 -229595 -136867 -90950 -64283 -37460 -86579 -110491 -107396 -96620
1575i6620L4372M2922m6529l524K3424o3663k7088L8097o4966J67541n5547m5223
$$ -96620 -62248 -19326 -65855 -69379 -45955 -109618 -136706 -98609 -163575 3966 -51581 -96804
1563i6804J47017j6704o5686q1095l6217n1439k4671R1956J50364J37340n4004
$$ -96804 50213 33509 -32177 -113272 -149489 -200928 -225599 -133643 16721 154061 100057
1552A00057l1627j8649o4851j4823l7983q9449k3290l0164J44087Q2395j28222
$$ 100057 68430 49781 -15070 -29893 -67876 -157325 -180615 -210779 -66692 15703 -112519
1541a12519J02574q8873n8280j8546m4629Q9075N3767K7522k9495N5024L4044
$$ -112519 -9945 -98818 -157098 -175644 -220273 -131198 -77431 -49909 -79404 -24380 9664
1530I664j00204n6970o8390J75999J61268M6607j94154J29575J31409m6524j48143
$$ 9664 -90540 -147510 -215900 -39901 121367 167974 -26180 103395 234804 188280 40137
1519D0137k8784n9712O3698r3069r8157K62151m4563j58585k7816J13862o6860
$$ 40137 11353 -48359 15339 -77730 -175887 86264 41701 -116884 -144700 -30838 -97698
1508i7698j50048N6415N7256k6615j02655K6380J56061l8908R9150P941Q8501
$$ -97698 -247746 -191331 -134075 -160690 -263345 -236965 -80904 -119812 -20662 -12721 75780
1497G5780j5021m4959j1154Q355l0195j67108P9001M6396P2653j78176Q5629Q8375
$$ 75780 60759 15800 4646 13001 -17194 -184302 -105301 -58905 13748 -164428 -78799 9576
1485I576p559R888j63401J18639n9696n7384R6415K3536j10848J64227O2539k25
$$ 9576 2017 11905 -151496 -32857 -92553 -149937 -53522 -29986 -140834 23393 85932 85707
1473H5707j00520j05374J09995M5084Q0961j91205m7592J8480O0681L75o5268
$$ 85707 -14813 -120187 -10192 34892 115853 -75352 -122944 -104464 -43783 -43408 -108676
1462a08676N3432J33482m3368p2379N5570j1915P1608j78532n5966K31283m9114
$$ -108676 -55244 78238 34870 -37509 18061 6146 77754 -100778 -156744 74539 25425
1451B5425K0757k2047q2758J47628J6240p7216j74322R7518j5715j7636M3303
$$ 25425 46182 24135 -58623 89005 105245 28029 -146293 -48775 -64490 -82126 -38823
1440c8823j96175L8674P3418J05975J79076p9210p7728Q0694N6353p4387j3018
$$ -38823 -234998 -196324 -122906 -16931 162145 82935 5207 85901 142254 67867 54849
1429E4849r695n7279J2054o4568p8348K3889k8306J02217R2889O6001j97591J08127
$$ 54849 45154 -12125 -71 -64639 -142987 -119098 -147404 -45187 47702 113703 -83888 24239
1417B4239L5669j59654O1454K5138K696j9295q8182k06363J85281J14262N1795
$$ 24239 59908 -99746 -38292 -13154 -10458 -29753 -117935 -324298 -139017 -24755 27040
1406B7040M09P5978p0578o4268J9849m1838N5946j08940K7793j9512j9764N6618
$$ 27040 27449 103427 32849 -31419 -11570 -53408 2538 -106402 -78609 -98121 -117885 -61267
1394f1267j2570L1024L2752q7931O3591J5969j50227r1658J13792J25557K4169
$$ -61267 -73837 -42813 -10061 -97992 -34401 -18432 -168659 -260317 -146525 -20968 3201
1383C201m3768P4796r896J29923J01046j12487r0938r8735J04821L6991j08003
$$ 3201 -40567 34229 24333 154256 255302 142815 51877 -46858 57963 94954 -13049
1372a3049j6580n1889n9618Q0733P5364p6420m7451Q3084j4156N8175m0651L342
$$ -13049 -29629 -81518 -141136 -60403 14961 -61459 -108910 -25826 -39982 18193 -22458 -19116
1360a9116J26249O9568k21764j5487J09845k9798j13920o3451q2223Q8878K25412
$$ -19116 107133 176701 -45063 -60550 49295 19497 -94423 -157874 -240097 -151219 74193
1349G4193O7387j32292j14717J47567M0909j6185J30280o7374n4876j4437k3977
$$ 74193 141580 9288 -105429 42138 83047 66862 197142 129768 74892 60455 36478
1338C6478P3721J12121k12506m2016j71692j1019J08766r7976J3001J36274K07305
$$ 36478 110199 222320 9814 -32202 -203894 -214913 -106147 -204123 -191122 -54848 152457
1327A52457j6997J0842l5475j65335l2831J5989l7388k9927j31544p5370Q1458
$$ 152457 135460 146302 110827 -54508 -87339 -71350 -108738 -138665 -270209 -345579 -264121
1316b64121R857r2512Q9534J37216k1195o4754J8927R3884N5871M366K6012j14300
$$ -264121 -254264 -346776 -257242 -120026 -141221 -205975 -187048 -93164 -37293 -32927 -6915 -121215
1304a21215l311N1128l0322N0213L5163j41628m9596L9045J14322l1227R0343
$$ -121215 -124526 -73398 -103720 -53507 -18344 -159972 -209568 -170523 -56201 -87428 2915
1293B915l0893o5759Q3240p851m7763M8569M1235J0040k6822j5241r0708k0305
$$ 2915 -27978 -93737 -10497 -18348 -66111 -17542 23693 33733 6911 -8330 -99038 -119343
1281a19343L2035k3359J5733l6330Q582Q278J8372q3071N2077J37629K6680j1051
$$ -119343 -87308 -110667 -94934 -131264 -122682 -114404 -96032 -179103 -127026 10603 37283 26232
1269B6232J43897N227L8529k01687r617J12528n7534K9531r6503j23110r9330
$$ 26232 170129 175356 213885 12198 2581 115109 57575 87106 -9397 -132507 -231837
1258b31837R5988J45147J5960p0909k2628l5102L4703K159R4253l9803p6446p1834
$$ -231837 -135849 9298 25258 -45651 -68279 -103381 -68678 -66519 27734 -12069 -88515 -160349
1246a60349m8323l180J95360O8751j47725q8965J04227O8239m4008L784j02451
$$ -160349 -208672 -211852 -16492 52259 -95466 -184431 -80204 -11965 -55973 -52189 -154640
1235a54640J71285l7178J0398J12921L8912p0011J1281L1715k24685M1883K3105
$$ -154640 16645 -20533 -10135 102786 141698 71687 82968 114683 -110002 -68119 -45014
1224d5014P5870p6619P1487J13228K0148m2195q7980o6720l4636l4905N0441l2709
$$ -45014 30856 -45763 25724 138952 159100 116905 28925 -37795 -72431 -107336 -56895 -89604
1212h9604m3969j21829J52116O5008J28075J13524j66499P1413J4041k05102o1457
$$ -89604 -133573 -255402 -103286 -38278 89797 203321 36822 108235 122276 -82826 -144283
1201a44283O9755k9097J33754M6674P8536K4563o7220j95489R0293J09444r2499
$$ -144283 -74528 -103625 30129 76803 155339 179902 112682 -82807 7486 116930 24431
1190B4431o0337M3877j19286q188J47440k0973k24828J42976J72098K1256j790
$$ 24431 -35906 7971 -111315 -119503 27937 6964 -217864 -74888 97210 118466 116676
1179A16676p4438Q3744r5613m0161J30928q5545q322j81924K9564J44021m7J27844
$$ 116676 42238 125982 30369 -9792 121136 35591 27269 -154655 -125091 18930 18883 146727
1167A46727o2382n578j23311p9297J13856q0930j4502N7080K1493j22605k8470
$$ 146727 84345 78767 -44544 -123841 -9985 -90915 -105417 -48337 -26844 -149449 -177919
1156a77919q7546j2984K40348K66383j5327k09653M0800L1984j68898O9553M9071
$$ -177919 -265465 -278449 -38101 228282 212955 3302 44102 76086 -92812 -23259 25812
1145B5812k31925k5096J46717k7091r7104J83767O4179J63461r1651j67526J3150
$$ 25812 -206113 -231209 -84492 -111583 -208687 -24920 39259 202720 111069 -56457 -43307
1134d3307j33928N0361K6735Q8494l0396K9375N449j11843K33271o4241j83017
$$ -43307 -177235 -126874 -100139 -11645 -42041 -12666 -7217 -119060 114211 49970 -133047
1123a33047O7769R4512j325O942R3822j9123q7504O5894j67375n7535J27042j54573
$$ -133047 -65278 29234 27909 34851 128673 109550 22046 87940 -79435 -136970 -9928 -164501
1111a64501J56015j3975j54543J73538J143k4170J56907K1773n85j74188j11895
$$ -164501 -8486 -22461 -177004 -3466 -2323 -26493 130414 152187 151602 -22586 -134481
1100a34481R9259K47026n6262o4314Q2151l8754q4915m6745n1401J0004O9919
$$ -134481 -35222 211804 155542 91228 173379 134625 49710 2965 -48436 -38432 31487
1089C1487l3103r1018o8712Q0199o3026P1953J87426j42195k8310l5280m1913
$$ 31487 -1616 -92634 -161346 -81147 -144173 -72220 115206 -26989 -55299 -90579 -132492
1078a32492J39000O4453M2728o2669j16839o2531J73962q1401n7607o6022J25750
$$ -132492 6508 70961 113689 51020 -65819 -128350 45612 -35789 -93396 -159418 -33668
1067c3668J08209j7585n9291L5235m2590N1077O8821k23812K8999P2150k0556
$$ -33668 74541 56956 -2335 32900 -9690 41387 110208 -113604 -84605 -12455 -33011
1056c3011o8097j34008L9737l5415J56826J9705J21775O0280l1947p0153j25185
$$ -33011 -101108 -235116 -195379 -230794 -73968 -54263 67512 127792 95845 25692 -99493
1045i9493L6714k6896o3115R964J61444Q5246j1580N566p2564k7460J8148r6063
$$ -99493 -62779 -89675 -152790 -142826 18618 103864 92284 97850 25286 -2174 15974 -80089
1033h0089M0182m2217K028J37602j1590N477N297j32494J11983m7519l7074l0079
$$ -80089 -39907 -82124 -80096 57506 45916 51393 56690 -75804 36179 -11340 -48414 -78493
1021g8493n5236J67514P4436m1311N4921J7159n9271k9729N6938M0518O2024j14283
$$ -78493 -133729 33785 108221 66910 121831 138990 79719 49990 106928 147446 209470 95187
1009I5187j58577k9597k3865j01305N4888O5976O6584N199L0533o3884m0874Q8955
$$ 95187 -63390 -92987 -116852 -218157 -163269 -97293 -30709 -25510 5023 -58861 -99735 -10780
997a0780J2699J0155j90129P7411K54654m915q7581J11362j33003k9375o4337
$$ -10780 1919 12074 -178055 -100644 154010 149095 61514 172876 39873 10498 -53839
986e3839l3919l3850j07800N940O8433J91420j9407n2654l431k4174j08175P9911
$$ -53839 -87758 -121608 -229408 -223468 -155035 36385 16978 -35676 -39107 -63281 -171456 -91545
974i1545Q5220n9189R0577m2381n4595J65537L0764m713j29502n6766r8348J01958
$$ -91545 -6325 -65514 25063 -17318 -71913 93624 124388 119675 -9827 -66593 -164941 -62983
962f2983L4891R5553o9228j48527N2660J9145M8289R7398j2395n6386k9674j75462
$$ -62983 -28092 67461 -1767 -150294 -97634 -78489 -30200 67198 54803 -1583 -31257 -206719
950b06719P068J8881M2318J83932N8844l7325M8861k4761q8813p5030o703m4294
$$ -206719 -199651 -180770 -138452 45480 104324 66999 115860 91099 2286 -72744 -79447 -123741
938a23741P6097K861K975Q784N6747n3096L0756R4459J8079p5650m3111L5461
$$ -123741 -47644 -44783 -41808 -33024 23723 -29373 1383 95842 113921 38271 -4840 30621
926C0621k8585p8615l3593J91043K6848k00593K5163K81643o6628k03539N8740
$$ 30621 2036 -76579 -110172 80871 107719 -92874 -67711 213932 147304 -56235 2505
915B505K1077M1474p7800q1850J14497k1287j29237k5758J21694j50599P7627
$$ 2505 23582 65056 -12744 -94594 19903 -1384 -130621 -156379 -34685 -185284 -107657
904a07657Q3072m7998J9265m9044N6312N7149o713q2164q4527m487j2377K24421
$$ -107657 -24585 -72583 -53318 -102362 -46050 11099 4386 -77778 -162305 -166792 -179169 45252
892D5252R1279k27274J05551Q4252m0895p6037j72611o8944K4217J51294J23019
$$ 45252 136531 -90743 14808 99060 58165 -17872 -190483 -259427 -235210 -83916 39103
881C9103p1204j8097J45465j49777k706Q1905r0010j15483j2261R9198R1794m21
$$ 39103 -32101 -50198 95267 -54510 -57216 24689 -65321 -180804 -193065 -93867 -2073 -2494
869b494o4296r3101L7380n3889O3770K14897J1598m672k66578R7525J83132k12248
$$ -2494 -66790 -159891 -122511 -176400 -112630 102267 113865 109193 -157385 -59860 123272 -88976
857h8976o5206K32283L5839r4311q3478l2964J7541J12453P0595r9553k07280
$$ -88976 -154182 78101 113940 19629 -63849 -96813 -79272 33181 103776 4223 -203057
846b03057P9986P6690q5536j3234l3967J9265L5689J0246K3235J03312q0640J13394
$$ -203057 -123071 -46381 -131917 -145151 -179118 -159853 -124164 -113918 -90683 12629 -68011 45383
834D5383l3450N2885P1674j66980J317q7623R5745l8056o852R0786K6917j13828
$$ 45383 11933 64818 136492 -30488 -29171 -116794 -21049 -59105 -65957 24829 51746 -62082
822f2082J97615j00974k06532r8423K99522k8928j72594r383k1704J64715j3453
$$ -62082 135533 34559 -171973 -270396 29126 198 -172396 -181779 -203483 -38768 -52221
811e2221J3660k7942R9773j5507n9095j3686J23379J54241k42686M165M8498q2741
$$ -52221 -38561 -66503 33270 17763 -41332 -55018 68361 222602 -20084 -15919 32579 -50162
799e0162K1676J55810j19110r5375R4800j23589P3168L9386J06917O3021k8652
$$ -50162 -28486 127324 8214 -87161 7639 -115950 -42782 -3396 103521 166542 137890
788A37890q7243j85819R7728J69361k21420k9823k9479N2592J107J2038K2502
$$ 137890 50647 -135172 -37444 131917 -89503 -119326 -148805 -96213 -95106 -83068 -60566
777f0566k6983l7465J19932O0257o0907Q5919Q1229j23842n98m2856L7429k03387
$$ -60566 -87549 -125014 -5082 55175 -5732 80187 161416 37574 36976 -5880 31549 -171838
765a71838K3554J54291R4075J1294l9877P5481j33467J12250L7775J5267p670
$$ -171838 -148284 6007 100082 111376 71499 146980 13513 125763 163538 178805 171135
754A71135q2711J14404k4074k0332j09164l4273k9170P34J12081j54114Q333J00730
$$ 171135 88424 202828 178754 158422 49258 14985 -14185 -13451 98630 -55484 -47151 53579
742E3579p9728Q2954Q969r0560N7401k6247j1591J33616J22899j96644j06376
$$ 53579 -26149 56805 65774 -24786 32615 6368 -5223 128393 251292 54648 -51728
731e1728M9043m242J43539R771j37394o8249n7836K220m4912J23537J11115O189
$$ -51728 -2685 -6927 136612 146383 8989 -59260 -117096 -114876 -159788 -36251 74864 81053
719H1053J34126j2123K805O2152p7330j81048r7492J51664k47252m3963J55208
$$ 81053 215179 203056 205861 268013 190683 9635 -87857 63807 -183445 -227408 -72200
708g2200j31786N221K20090M2767n3236P2851j25801K3923Q3356J0201M70n469
$$ -72200 -203986 -198765 21325 64092 10856 83707 -42094 -18171 65185 75386 75856 70387
696G0387r6548r4561q5n392M9699J38323J19722K1691N8208j14154j16053n6474
$$ 70387 -26161 -120722 -120807 -126199 -76500 61823 181545 203236 261444 147290 31237 -25237
684b5237r58K7615q5747O8493m1181J03468k283n3903m8882l4752P8589R963K5155
$$ -25237 -26195 1420 -84327 -15834 -57015 46453 44170 -9733 -58615 -93367 -14778 -4815 20340
671B0340o586J68185n4913j25139l4383K22721q355j14762j11881M8331P7231
$$ 20340 13754 181939 127026 1887 -32496 190225 181870 67108 -44773 3558 80789
660H0789J1757O5645L7790r2081j16241K6037M2535N442j29724K0247r068q2361
$$ 80789 92546 158191 195981 103900 -12341 13696 56231 61673 -68051 -47804 -56872 -139233
648a39233L2800J64293O5534l6833j12217J0697N6226K3525N0712j59554J05269
$$ -139233 -106433 57860 123394 86561 -25656 -14959 41267 64792 115504 -44050 61219
637F1219l2290o6357N3318l0060M1451o1110j4255q368J27543n7174r8950J53769
$$ 61219 28929 -37428 15890 -14170 27281 -33829 -48084 -56452 71091 13917 -85033 68736
625F8736k35890J4495J14399r5364k5771N0494l5548Q051R7889l2520k4797l1829
$$ 68736 -167154 -152659 -38260 -133624 -159395 -108901 -144449 -136398 -38509 -71029 -95826 -127655
613a27655k173M4899P9842j01852J6515O7844L6154R4504n4125R1713k0648j930
$$ -127655 -129828 -84929 -5087 -106939 -90424 -22580 13574 108078 53953 145666 125018 123088
601A23088n2721L5568k01951L3853J34779J11362K6587r0451L6050j34671l6457
$$ 123088 70367 105935 -96016 -62163 72616 183978 210565 120114 156164 21493 -14964
590a4964q8229M4877J1662J77218j4046r1031M110o6939R346Q3411L1141L4225
$$ -14964 -103193 -58316 -46654 130564 116518 25487 29597 -37342 -27996 55415 86556 120781
578A20781m8459P563j9621Q2900l1458j14232p5389n3895m3392J04645m323P4509
$$ 120781 72322 79885 60264 143164 111706 -2526 -77915 -131810 -175202 -70557 -74880 -371
566c71m7224M7542m3881j58437Q8644M3566L0819J58359j32587P7064J11978j16343
$$ -371 -47595 -53 -43934 -202371 -113727 -70161 -39342 119017 -13570 63494 175472 59129
554E9129n3626p3033j1835J29054j18154m4374J72682Q0324j3702j47441n9388
$$ 59129 5503 -67530 -79365 49689 -68465 -112839 59843 140167 126465 -20976 -80364
543h0364K32631L8993j77573n903l1095M2031O0320j47850j0592K3362K3927J42025
$$ -80364 152267 191260 13687 7784 -23311 18720 79040 -68810 -79402 -56040 -32113 109912
531A09912M2826j27547o3045Q3062N0806j0161j88798N5422l8203l5040J21719
$$ 109912 152738 25191 -37854 45208 96014 85853 -102945 -47523 -85726 -120766 953
520I53J40341o0271r3191m1862J7386o391J29893l7289j22824L349k3781O7147
$$ 953 141294 81023 -12168 -54030 -36644 -43035 86858 49569 -73255 -69906 -93687 -26540
508b6540L6285j7494J09678j46401J37626k7863J44662O653k14293o5697j00249
$$ -26540 9745 -7749 101929 -44472 93154 65291 209953 216606 2313 -63384 -163633
497a63633J4585P5459J1290j3386L9692N2779M981j1154N9784p6024L115L5674
$$ -163633 -149048 -73589 -62299 -75685 -35993 16786 21767 10613 70397 -5627 -2512 33162
485C3162P4658J34592n3187j4446P3661j2021n3718j6125o8108j48053R2816J7906
$$ 33162 107820 242412 189225 174779 248440 236419 182701 166576 98468 -49585 43231 61137
473F1137o556K9200N3287L8109L6647N6570J9691j49139l0900q0903J7885l4120
$$ 61137 54581 83781 137068 175177 211824 268394 288085 138946 108046 27143 45028 10908
461A0908O4618N5800j18076j2333J8237n0633o3497O0808j3104K3830L7920K9334
$$ 10908 75526 131326 13250 917 19154 -31479 -94976 -34168 -47272 -23442 14478 43812
449D3812l3908o2163M3722J06418L8085J61183K7220j93042j23620O331N3985
$$ 43812 9904 -52259 -8537 97881 135966 297149 324369 131327 7707 14038 68023
438F8023Q2960k19574R4312J94459r373j12478o8546L8648m7538m9734k0715N7720
$$ 68023 150983 -68591 25721 220180 210807 98329 29783 68431 20893 -28841 -49556 8164
426H164O8352O4665K2045L7225k5866j45767M6704j56900J1712M6319N8536J50052
$$ 8164 76516 141181 163226 200451 174585 28818 75522 -81378 -69666 -23347 35189 185241
414A85241j2690j45818j6683P9623l4662J00627l9946m0300j9900n082j62758
$$ 185241 172551 26733 10050 89673 55011 155638 115692 75392 55492 50410 -112348
403a12348O5802J83078R5236m5468m4345j2489k7816p692o6693j05103J23179
$$ -112348 -46546 136532 231768 186300 141955 129466 101650 93958 27265 -77838 45341
392D5341J39833k6467j21966L895L2587O1191n8999r9518j57222M5361L2834R2309
$$ 45341 185174 158707 36741 40636 73223 134414 75415 -24103 -181325 -135964 -103130 -10821
380a0821j0599J36562o3283L9994J8227M3775j29237J03510m8332j70601K3494
$$ -10821 -21420 115142 51859 91853 110080 153855 24618 128128 79796 -90805 -67311
369f7311J4968Q5026p4035J39403q526j05704L5993R3431j36394m205J88742J30835
$$ -67311 -52343 32683 -41352 98051 89525 -16179 19814 113245 -23149 -27354 161388 292223
357B92223j12072k6316O9073Q7076r1612K9888r0596q9854k7534J8278o6760J4923
$$ 292223 180151 153835 222908 309984 218372 248260 157664 67810 40276 58554 -8206 6717
345F717L1103J13883j02437m8922K1979J50354R9876j05008l2367J4374L8855
$$ 6717 37820 151703 49266 344 22323 172677 272553 167545 135178 149552 188407
334A88407K2660j27303n4990m1661k5254j1129O0081N6447j08330p503N6078k7722
$$ 188407 211067 83764 28774 -12887 -38141 -49270 10811 67258 -41072 -48575 7503 -20219
322b0219J06943P1139q8589J26314k5848l7748l8019n4304P5447p0360L3798N1105
$$ -20219 86724 157863 69274 195588 169740 131992 93973 39669 115116 44756 78554 129659
310A29659q2379n4858M501R7024J0171k8521q1546K6615N4523Q4823k4128k3615
$$ 129659 47280 -7578 -3077 93947 104118 75597 -5949 20666 75189 160012 135884 112269
298A12269j10946J22205m662j15337O9813k4726n7594L2304O1123j4177J11697
$$ 112269 1323 123528 118866 3529 73342 48616 -8978 23326 84449 70272 181969
287A81969m0982k0467J68821q8366j16706O1603j65790J09992J54383k8371j77339
$$ 181969 140987 120520 289341 200975 84269 145872 -19918 90074 244457 216086 38747
276C8747o0264j5675O0520r713O7350P7618k6281j3972j13657j24134Q5673L1833
$$ 38747 -21517 -37192 23328 13615 80965 158583 132302 118330 4673 -119461 -33788 -1955
264a955J0202J50541p9401j37871l9862K2828K30450J01962j63656Q2661P2776
$$ -1955 8247 158788 79387 -58484 -98346 -75518 154932 256894 93238 175899 248675
253B48675j49316j7842k1841M9377R8130p9227k417k6021J1955l962J29548j16402
$$ 248675 99359 81517 59676 109053 207183 127956 125539 99518 111473 107511 237059 120657
241A20657n0493n1523j050m3946R569m7730M125M9739o3669J32563l4361J06653
$$ 120657 70164 18641 17591 -26355 -16786 -64516 -60391 -10652 -74321 58242 23881 130534
229A30534Q4491n1154j613r0912p4918m2271j36874k1824J35246P8921j8956J9855
$$ 130534 215025 163871 162258 71346 -3572 -45843 -182717 -204541 -69295 9626 -9330 10525
217A0525J14681j03013p1650J06467j3866r5452M5979P0614K6323N0890J4903
$$ 10525 125206 22193 -49457 57010 43144 -52308 -6329 64285 90608 141498 156401
206A56401m4900K821j26n8406P023J29861N8481P6309r9310j97343l203r199m8231
$$ 156401 111501 114322 114196 55790 62813 192674 251155 327464 228154 30811 27608 18409 -29822
193b9822J44579J30457Q986p0328o0668n4027J300P5563k3544l8942l4121L3666
$$ -29822 114757 245214 254200 183872 123204 69177 70477 146040 122496 83554 49433 83099
181H3099m0884M6827n8080L6410n0600J67192j23644j16127R5548O6379N4616
$$ 83099 42215 89042 30962 67372 16772 183964 60320 -55807 39741 106120 160736
170A60736j51343O2688K9166J8416L5522o7088j7164Q1920J782p7718R1102k1787
$$ 160736 9393 72081 101247 119663 155185 88097 70933 152853 154635 76917 168019 146232
158A46232L8879P8556O9796k8568j64796k9738N1307L8213p3067O8399J22287
$$ 146232 185111 263667 333463 304895 140099 110361 161668 199881 126814 195213 317500
147C17500l6181j71714K3925q1690M215J02715j6607p3988L4916m6561O8430K2090
$$ 317500 281319 109605 133530 51840 56055 158770 142163 68175 103091 56530 124960 147050
135A47050j52717n9222J6263k3417o8415J16326O7788k4959N5376j8058k716j13426
$$ 147050 -5667 -64889 -48626 -72043 -140458 -24132 43656 18697 74073 56015 53299 -60127
123f0127J31870N1832k500L3612o569n4942j07603O2525m0605N9454M4830k0093
$$ -60127 71743 123575 121075 154687 148118 93176 -14427 48098 7493 66947 111777 91684
111I1684l813r6927J4002J63679m6851j33350J20784R5518j5046k2250p9869K8430
$$ 91684 87871 -9056 4946 168625 121774 -11576 109208 204726 189680 167430 87561 115991
99A15991j13387o6585k2052P4316O612j92379Q7489J70615O7221M5218m9594k4215
$$ 115991 2604 -63981 -86033 -11717 -5105 -197484 -109995 60620 127841 173059 123465 99250
87I9250N1241l1492J2022K3016P6730o4173J7214l5031j9185p0913n4069Q8560
$$ 99250 150491 118999 131021 154037 230767 166594 183808 148777 129592 58679 4610 93170
75I3170m7539J73359j34934j5443l4476P0251O6755N6678l3738o3824q1805k7715
$$ 93170 45631 218990 84056 68613 34137 104388 171143 227821 194083 130259 48454 20739
63B0739J41128L5776k5309M1839j50690j03029P7376l7086j6191J01835J16705
$$ 20739 161867 197643 172334 214173 63483 -39546 37830 744 -15447 86388 203093
52B03093j35519L0136J2730j12507L0011J00106m1806Q579L4484J7813L1233j33851
$$ 203093 67574 97710 110440 -2067 27944 128050 86244 94823 129307 147120 178353 44502
$$ [...]
##END NTUPLES=NMR SPECTRUM
##END=
