##TITLE=1H_66-2023
 CDCl3
 8 sc, 
 5.9.2023
##JCAMPDX= 6.0         $$ Bruker NMR JCAMP-DX V2.0
##DATA TYPE= NMR FID
##DATA CLASS= NTUPLES
##ORIGIN= UXNMR, Bruker Analytische Messtechnik GmbH
##OWNER= root
$$ XWIN-NMR		Version 3.5
$$ Tue Sep  5 14:22:02 2023 Russian Standard Time (UT+4h)  she@DPX200
##.OBSERVE FREQUENCY= 200.13135
##.OBSERVE NUCLEUS= ^1H
##.DELAY= (6, 6)
##.ACQUISITION MODE= SIMULTANEOUS
##.ACQUISITION SCHEME= undefined
##.AVERAGES= 8
##.DIGITISER RES= 18
##SPECTROMETER/DATA SYSTEM= spect
##.PULSE SEQUENCE= zg30
##.SOLVENT NAME= CDCl3
##.SHIFT REFERENCE= (INTERNAL, CDCl3, 0, 15.7039)
##AUDIT TRAIL= $$ (NUMBER, WHEN, WHO, WHERE, WHAT)
$$ ##TITLE= Audit trail, XWIN-NMR		Version 3.5
$$ ##JCAMPDX= 5.01
$$ ##ORIGIN= Bruker BioSpin GmbH
$$ ##OWNER= she
$$ F:/spectra/data/she/nmr/H-F/1/audita.txt
$$ ##AUDIT TRAIL=  $$ (NUMBER, WHEN, WHO, WHERE, WHAT)
(   1,<2023-09-05 14:20:23.56 +0400>,<she>,<DPX200>,
      <created by zg, POWCHK disabled, PULCHK disabled
       configuration hash MD5:
       00 E9 B6 7A A2 85 ED C7 34 08 36 98 17 FE 4E 26
       data hash MD5: 16K
       C9 DB EE 48 6B 01 54 08 D0 90 07 23 68 13 C5 53>)
$$ ##END=
$$ 
$$ hash MD5
$$ 78 37 96 9C 59 95 D0 E5 92 F7 8E D0 64 F8 E8 CB
##$RELAX= 
##$RELAX= 
##$RELAX= 
##$RELAX= 
##$RELAX= 
##$RELAX= 
$$ Bruker specific parameters
$$ --------------------------
##$DU= <F:/spectra>
##$EXPNO= 1
##$NAME= <H-F>
##$PROCNO= 1
##$TYPE= <nmr>
##$USER= <she>
##$AMP= (0..31)
100 100 100 100 100 100 100 100 100 100 100 100 100 100 100 100 100 100 
100 100 100 100 100 100 100 100 100 100 100 100 100 100 
##$AQSEQ= 0
##$AQ_mod= 1
##$AUNM= <au_zg>
##$AUTOPOS= <>
##$BF1= 200.13
##$BF2= 200.13
##$BF3= 200.13
##$BF4= 200.13
##$BF5= 200.13
##$BF6= 200.13
##$BF7= 200.13
##$BF8= 200.13
##$BYTORDA= 1
##$CFDGTYP= 0
##$CFRGTYP= 5
##$CHEMSTR= <none>
##$CNST= (0..31)
1 1 145 1 1 1 1 1 1 1 1 1 1 1 1 1 1 1 1 1 1 1 1 1 1 1 1 1 1 1 1 1 
##$CPDPRG= <>
##$CPDPRG1= <>
##$CPDPRG2= <>
##$CPDPRG3= <>
##$CPDPRG4= <mlev>
##$CPDPRG5= <mlev>
##$CPDPRG6= <mlev>
##$CPDPRG7= <mlev>
##$CPDPRG8= <mlev>
##$CPDPRGB= <>
##$CPDPRGT= <>
##$D= (0..31)
0 1.2 0 0 0 0 0 0 0 0.06 0 0.03 0 0 0 0 0.0002 0 0 0 0 0 0 0 0 0 0 0 0 
0 0 0 
##$DATE= 1693909223
##$DBL= (0..7)
120 120 120 120 120 120 120 120 
##$DBP= (0..7)
150 150 150 150 150 150 150 150 
##$DBP07= 0
##$DBPNAM0= <>
##$DBPNAM1= <>
##$DBPNAM2= <>
##$DBPNAM3= <>
##$DBPNAM4= <>
##$DBPNAM5= <>
##$DBPNAM6= <>
##$DBPNAM7= <>
##$DBPOAL= (0..7)
0.5 0.5 0.5 0.5 0.5 0.5 0.5 0.5 
##$DBPOFFS= (0..7)
0 0 0 0 0 0 0 0 
##$DE= 6
##$DECBNUC= <off>
##$DECIM= 32
##$DECNUC= <off>
##$DECSTAT= 4
##$DIGMOD= 1
##$DIGTYP= 9
##$DL= (0..7)
0 120 120 120 120 120 120 120 
##$DP= (0..7)
150 150 150 150 150 150 150 150 
##$DP07= 0
##$DPNAME0= <>
##$DPNAME1= <>
##$DPNAME2= <>
##$DPNAME3= <>
##$DPNAME4= <>
##$DPNAME5= <>
##$DPNAME6= <>
##$DPNAME7= <>
##$DPOAL= (0..7)
0.5 0.5 0.5 0.5 0.5 0.5 0.5 0.5 
##$DPOFFS= (0..7)
0 0 0 0 0 0 0 0 
##$DQDMODE= 0
##$DR= 18
##$DS= 0
##$DSLIST= <SSSSSSSSSSSSSSS>
$$ [...]
##$SUBNAM2= <"">
##$SUBNAM3= <"">
##$SUBNAM4= <"">
##$SUBNAM5= <"">
##$SUBNAM6= <"">
##$SUBNAM7= <"">
##$SUBNAM8= <"">
##$SUBNAM9= <"">
##$SW= 18.05172834244
##$SWIBOX= (0..15)
0 0 2 0 0 0 0 0 0 0 0 0 0 0 0 0 
##$SW_h= 3612.71676300578
##$TD= 16384
##$TD0= 1
##$TE= 0
##$TE2= 300
##$TE3= 300
##$TEG= 300
##$TL= (0..7)
0 120 120 120 120 120 120 120 
##$TP= (0..7)
150 150 150 150 150 150 150 150 
##$TP07= 0
##$TPNAME0= <>
##$TPNAME1= <>
##$TPNAME2= <>
##$TPNAME3= <>
##$TPNAME4= <>
##$TPNAME5= <>
##$TPNAME6= <>
##$TPNAME7= <>
##$TPOAL= (0..7)
0.5 0.5 0.5 0.5 0.5 0.5 0.5 0.5 
##$TPOFFS= (0..7)
0 0 0 0 0 0 0 0 
##$TUNHIN= 0
##$TUNHOUT= 0
##$TUNXOUT= 0
##$USERA1= <user>
##$USERA2= <user>
##$USERA3= <user>
##$USERA4= <user>
##$USERA5= <user>
##$V9= 5
##$VALIST= <valist>
##$VCLIST= <CCCCCCCCCCCCCCC>
##$VD= 0
##$VDLIST= <DDDDDDDDDDDDDDD>
##$VPLIST= <PPPPPPPPPPPPPPP>
##$VTLIST= <TTTTTTTTTTTTTTT>
##$WBST= 1024
##$WBSW= 4
##$XGAIN= (0..3)
0 0 0 0 
##$XL= 0
##$YL= 0
##$YMAX_a= 357914
##$YMIN_a= -437743
##$ZGOPTNS= <>
##$ZL1= 120
##$ZL2= 120
##$ZL3= 120
##$ZL4= 120
##$ABSF1= 10
##$ABSF2= 0
##$ABSG= 5
##$ABSL= 3
##$ALPHA= 0
##$AQORDER= 0
##$ASSFAC= 0
##$ASSFACI= 0
##$ASSFACX= 0
##$ASSWID= 0
##$AUNMP= <proc_1d>
##$AZFE= 0.1
##$AZFW= 0.1
##$BCFW= 1
##$BC_mod= 2
##$BYTORDP= 1
##$COROFFS= 0
##$CY= 11.3945322036743
##$DATMOD= 1
##$DC= 2
##$DFILT= <>
##$DTYPP= 0
##$F1P= 15.7292609196834
##$F2P= 12.9074282941183
##$FCOR= 0.5
##$FTSIZE= 0
##$FT_mod= 4
##$GAMMA= 1
##$GB= 0.15
##$INTBC= 1
##$INTSCL= 1
##$ISEN= 128
##$LB= 0.24
##$LEV0= 0
##$LPBIN= 0
##$MAXI= 10000
##$MC2= 0
##$MEAN= 0
##$ME_mod= 0
##$MI= 1.114404
##$NCOEF= 0
##$NC_proc= 0
##$NLEV= 6
##$NOISF1= 3.799351
##$NOISF2= 2.8
##$NSP= 1
##$NTH_PI= 0
##$NZP= 0
##$OFFSET= 15.70392
##$PC= 1
##$PHC0= -21046.67
##$PHC1= 10.85272
##$PH_mod= 1
##$PKNL= yes
##$PPARMOD= 0
##$PSCAL= 0
##$PSIGN= 0
##$REVERSE= no
##$SF= 200.130013532006
##$SI= 16384
##$SIGF1= 3
##$SIGF2= 2
##$SINO= 400
##$SIOLD= 16384
##$SREGLST= <1H.CDCl3>
##$SSB= 0
##$STSI= 0
##$STSR= 0
##$SW_p= 3612.71676300578
##$SYMM= 0
##$S_DEV= 0
##$TDeff= 0
##$TDoff= 0
##$TI= <>
##$TILT= no
##$TM1= 0
##$TM2= 0
##$TOPLEV= 0
##$USERP1= <user>
##$USERP2= <user>
##$USERP3= <user>
##$USERP4= <user>
##$USERP5= <user>
##$WDW= 1
##$XDIM= 8192
##$YMAX_p= 0
##$YMIN_p= 0
$$ End of Bruker specific parameters
$$ ---------------------------------
##NTUPLES= NMR FID
##VAR_NAME=  TIME,          FID/REAL,        FID/IMAG
##SYMBOL=    X,             R,               I
##VAR_TYPE=  INDEPENDENT,   DEPENDENT,       DEPENDENT
##VAR_FORM=  AFFN,          ASDF,            ASDF
##VAR_DIM=   8192,          8192,            8192
##UNITS=     SECONDS,       ARBITRARY UNITS, ARBITRARY UNITS
##FACTOR=    0.0002768,     1,               1
##FIRST=     0,             0,               0
##LAST=      2.2672688,     0,               0
##MIN=       0,             -437743,         0
##MAX=       2.2672688,     357914,          0
$$ Real data points
##PAGE= N=1
##DATA TABLE= (X++(R..R)), XYDATA
$$ [...]
2443C100k676J71k245k91M670j268m67q49l826L603J141k89J385m247q59K692
$$ 3100 424 595 -1650 -1941 2729 1461 994 145 -3681 -78 1063 774 2159 -2088 -2947 -255
2459b55m2K633j708l482K107l21K255J559m054N92K70j16L399k189j661J026j783
$$ -255 -297 2336 628 -2854 -747 -1068 1187 2746 -1308 -716 -446 -562 2837 648 -1013 13 -1770
2476a770L471O96k895O12k366R77L963k075j52j436k392M362K74p25M52l965J584
$$ -1770 1701 2397 -498 114 -2252 -1275 2688 613 461 -975 -3367 995 1269 544 996 -2969 -1385
2493a385K474j162J917k580j391K633p53J842P9l690J774L51M69K391l700r03
$$ -1385 1089 -73 1844 -736 -2127 506 -247 1595 1674 -2016 -242 109 578 2969 -731 -1634
2509a634J635q10L264j126l009J246j093K003J971l228M88p30o52L806j379r12
$$ -1634 1 -809 2455 1329 -1680 -434 -1527 476 2447 -781 -293 -1023 -1675 2131 752 -160
2525a60K7k789L251J485k064J087k696N44L336j527Q55j363k381L455M7J00P57
$$ -160 -133 -2922 329 1814 -250 837 -1859 -1315 2021 494 1349 -14 -2395 1060 1107 1207 1964
2542A964m022Q52J704m84K529k614k515K094m74K473N81l935O59R8J017K862l039
$$ 1964 -2058 -1206 498 14 2543 -71 -2586 -492 -966 1507 2088 -1847 -1188 -1090 -73 2789 -250
2559b50q46K44j213L882K3k395O53k634K124L163j599J85k629j415M174Q3R0p34
$$ -250 -1096 -852 -2065 1817 1840 -555 98 -2536 -412 2751 1152 1337 -1292 -2707 1467 1550 1640 906
2577I06m128K371J670j17J401l734p34K101k19K778j188l642J395j38K084K467
$$ 906 -3222 -851 819 702 2103 -1631 -2365 -264 -483 2295 1107 -2535 -1140 -1278 806 3273
2593C273m139o90J25J42M379j639k308K05j864L263K182k408K82k426k92L920
$$ 3273 -866 -1556 -1431 -1289 3090 1451 -857 -652 -2516 747 2929 521 803 -1623 -1915 2005
2609B005r04P6j160k991K622J250j50P84l906L09K596j75J933k350k522K300N5
$$ 2005 1101 1177 17 -2974 -352 898 748 1532 -2374 -2065 531 356 2289 -61 -2583 -283 -228
2626b28J909P56m270O24J30Q21L397k365j774L28j234L783O05k552K64k078J114
$$ -228 1681 2437 -1833 -1209 -1079 -258 3139 774 -1000 -672 -1906 1877 2482 -70 194 -1884 -770
2643g70L102j933J51j688j288L334l17m45K27l095J912K091p38J440l235j127
$$ -770 2332 399 550 -1138 -2426 908 591 146 373 -2722 -810 1281 543 1983 -1252 -2379
2659b379K883k48K020j161l610J675N00J222K124l442o03Q07n52L218r22k382
$$ -2379 504 256 2276 1115 -2495 -820 -320 902 3026 -416 -1019 -212 -764 2454 1532 -850
2675h50N52j544K059J863k789K15j227J40L803j621r46m14k149L426J299j146
$$ -850 -298 -1842 217 2080 -709 -494 -1721 -1581 2222 601 -345 -759 -2908 518 1817 671
2691F71L56l273O02L035o37J165j734k841K306N26J471O61l669K91Q83J86K634
$$ 671 1027 -2246 -1644 1391 754 1919 185 -2656 -350 176 1647 2308 -1361 -1070 -187 -1 2633
2708B633k310j993J534j094K211O31l073R34q47P77K646k144m63m64j249L872
$$ 2633 323 -1670 -136 -1230 981 1612 -1461 -527 -1374 -597 2049 -95 -558 -1022 -2271 1601
2724A601J27j341j8k666J619K563j103P15k363j294K903m07Q82k3l146J651L48
$$ 1601 1728 387 369 -2297 -678 1885 782 1497 -866 -2160 743 336 1218 1195 -1951 -300 48
2741D8P5J976l036o38J672o03K047r90k768J659j89J294J627l080J61o9m8L481
$$ 48 123 2099 -937 -1575 97 -506 1541 551 -2217 -558 -747 547 2174 -906 -745 -814 -862 2619
2759B619j442j531J21j787K730J349j892L13k024J57L279j277K9j020k082L077
$$ 2619 1177 -354 -233 -2020 710 2059 167 480 -1544 -1387 1892 615 644 -376 -2458 619
2775F19N10p33L28l126J083K050o63J540k385j772K404MJ833K07l918R68M93R89
$$ 619 1129 396 724 -2402 -1319 731 68 1608 -777 -2549 -145 -141 1692 1899 -2019 -1051 -558 431
2793D31K693k846j389M6l97L649pk608P8k006K002K633j864k24j528j040L573
$$ 431 3124 278 -1111 -1065 -1462 2187 2180 -428 -350 -2356 -354 2279 415 191 -1337 -2377 1196
2810A196J90p10p19l157K468K004k94M42l315p47K814K85K007j317l563J374P26
$$ 1196 1386 676 -43 -3200 -732 1272 978 1420 -1895 -2642 172 457 2464 1147 -2416 -1042 -316
2827c16J855J646l486j193J77N84L492r18k584j54j288K809J891k294m33k085
$$ -316 1539 3185 -301 -1494 -1317 -733 2759 1841 -743 -897 -2185 624 2515 221 -212 -2297
2843b297L49L530o32j23j460k556L144J470j86K25l430n2K687K31J736k202k854
$$ -2297 -1948 1582 950 827 -633 -3189 -45 1425 1239 1464 -1966 -2018 669 900 2636 434 -2420
2860b420J840L85K078P09l676KL6N50L029j775j738O4j163K888J119k222K55k025
$$ -2420 -580 -195 1883 2592 -1084 -1082 -1046 -496 2533 758 -980 -916 -2079 809 1928 -294 -39 -2064
2878b064P81K711j178Jq48j704L097N9k62L68k580R00J607m42J367k153j597K182
$$ -2064 -1283 1428 250 251 -597 -2301 796 855 593 961 -1619 -719 888 446 1813 -340 -1937 245
2896B45k53J577j2k949Q82l7L84K138k229o73N10r81K276k27j765J240r97O92
$$ 245 -8 1569 1557 -1392 -510 -547 -163 1975 -254 -927 -417 -1398 878 651 -1114 126 -871 -179
2914a79J329j641P85o29p08K575j206m97K33j509K185M96j281P50j784K89K088
$$ -179 1150 -491 294 -335 -1043 1532 326 -171 62 -1447 738 1234 -47 703 -1081 -792 1296
2931A296j057N53o23j782J969l68M1J120k469O53Q22o33J321j255j080J916o31
$$ 1296 239 792 169 -1613 356 -12 29 1149 -1320 -667 155 -478 843 -412 -1492 424 -207
2948b07J070k89k232J749j80N64J557k523l95O70l92K302m63j845N21j570J771
$$ -207 863 574 -1658 91 -89 475 2032 -491 -886 -216 -608 1694 1231 -614 -93 -1663 108
2965A08J869j864L96j338o37K807j092l6l11j963K176Q77j026P43k275M39K196
$$ 108 1977 113 509 -829 -1466 1341 249 213 -98 -2061 115 992 -34 709 -1566 -1127 1069
2982A069o36R49j382k289K384K81J124N85l243r1O88M17K407j547k027O27r29
$$ 1069 433 1382 0 -2289 95 376 1500 2085 -1158 -1249 -561 -144 2263 716 -1311 -684 -1613
2999a613K542J058k388L62j525O96K679j626l92p30j268L257J66j022Q2k713J570
$$ -1613 929 1987 -401 -39 -1564 -868 1811 185 -207 -937 -2205 1052 1218 196 278 -2435 -865
3016h65K570p21K30k251j448K761N75J222o35l501O61J011R77K412l032j589N81
$$ -865 1705 984 1214 -1037 -2485 276 851 2073 1438 -2063 -1402 -391 586 2998 -34 -1623 -1042
3033a042n4K913M5k804K35r20J581K105k223j79j092k68L498n59j141m94k241
$$ -1042 -1096 1817 1862 -942 -707 -1627 -46 2059 -164 -343 -1435 -1703 1795 1236 95 -399 -2640
3050b640K475K330p55j9l148o86L303M36J011j615l345J321J161J399J235l592
$$ -2640 -165 2165 1410 1391 -1757 -2443 860 1296 2307 692 -2653 -1332 -171 1228 2463 -1129
3066a129m99O13K29L008j142k353M60p32K436J380k898k93q66J016L267j304j291
$$ -1129 -1628 -1015 -786 2222 1080 -1273 -813 -1545 891 2271 -627 -920 -1786 -770 2497 1193 -98
3083i8p75j348L389J212j207m66l016N18K946K95O86k527k552K427P37J338K52
$$ -98 -873 -2221 1168 2380 1173 707 -2309 -1791 1155 1450 2136 -391 -2943 -516 221 1559 1811
3100A811l467L2Q75J011J785k042j787J003j82K676k7k945M06p33J671K794k102
$$ 1811 -1656 -1624 -749 262 2047 5 -1782 -779 -961 1715 1688 -1257 -851 -1584 87 2881 779
3117G79j100r08o59L582M60j483o15k790J908K331m63M77k730j306K667O6J247
$$ 779 -321 -1229 -1888 1694 2154 671 56 -2734 -826 1505 1042 1519 -1211 -2517 150 216 1463
3134A463o74k961J068R73O10J559k846r39J445J97K286j038k692P37j87K002J829
$$ 1463 789 -2172 -1104 -131 479 2038 -808 -1747 -302 -105 2181 1143 -1549 -812 -999 1003 2832
3151B832k919m66j025M09L422l98j777n27k132K489J584o64j98k519j16K552q7
$$ 2832 -87 -553 -1578 -1169 2253 1855 78 -449 -2581 -92 1492 828 630 -1889 -2005 547 460
3168D60O93j219k320K306K65P13L24k718N2J478P6K151j943j747O61p6K635K85
$$ 460 1153 -66 -2386 -80 185 898 1222 -1496 -1444 34 110 2261 318 -1429 -768 -844 1791 2076
3186B076k665j74n59R37K761j762p02o47j310K867L33p59L0k440J113K000j040
$$ 2076 -589 -763 -1322 -385 2376 614 -88 -735 -2045 822 1155 396 426 -2014 -901 1099 59
3203E9P77j606j027K396o1L98k08k545J335Q72r7J545k349r66J232m4J829k41
$$ 59 836 -770 -1797 599 538 936 728 -1817 -482 390 293 1838 -511 -1477 -245 -289 1540 1299
3221A299k434P26m13Q64K041k411J56n68m86K458n96j007L61j354J291J225j535
$$ 1299 -1135 -409 -822 42 2083 -328 -172 -740 -1226 1232 636 -371 -10 -1364 -73 1152 -383
3238c83Q17j184k37K212r87M72o90j455J870L66l22P84k386O9J782o21J173j115
$$ -383 434 -750 -987 1225 238 710 20 -1435 435 801 479 1263 -1123 -1054 728 107 1280 165
3256A65j491J317k57Q42N86k230O01M9K51J795j897o96Q59o41J821j00j951J057
$$ 165 -1326 -9 -266 576 1162 -1068 -467 -418 -167 1628 -269 -965 -106 -747 1074 974 -977 80
3274H0j008R30J676j652J95p26n51K344n02m64J37j991J451R46o35P25j881n06
$$ 80 -928 2 1678 26 221 -505 -1056 1288 786 322 459 -1532 -81 865 230 955 -926 -1432
3292a432J918m53Q75m17k318J514L08L06J028k337K3Q48n1J723j101j521Q68m36
$$ -1432 486 33 908 491 -1827 -313 -5 301 1329 -1008 -985 -137 -188 1535 434 -1087 -219 -655
3310f55J364J234k417M35o78P2K598j411n14l77j232K141M86j116O36k012L12
$$ -655 709 1943 -474 -39 -717 -645 1953 542 28 -349 -1581 560 1046 -70 566 -1446 -1134
3327a134K102o75N05j159j521K075K43K45J17k475Q88R15L1J336j640j132J499
$$ -1134 968 293 798 -361 -1882 193 436 681 798 -1677 -789 126 157 1493 -147 -1279 220
3344B20l32J510L3k491P36k88Q96J701k059m92j78l93K454m04j097j21j538J798
$$ 220 -112 1398 1431 -1060 -324 -612 284 1985 -74 -566 -744 -1137 1317 913 -184 -305 -1843 -45
3362d5J624j497J49j231k66K269m68J93n74k060J813O81q4R03k342l41J687j80
$$ -45 1579 82 231 -1000 -1266 1003 535 728 154 -1906 -93 588 504 1407 -935 -1276 411 231
3380B31J563j264j926J167k15J210R74k507k13R4L37K247j263j264K85j105K504
$$ 231 1794 530 -1396 -229 -444 766 1740 -767 -980 -886 -549 1698 435 -829 -544 -1649 855
3397H55O36j495L83j745N34K107p15p4r63j298K145N40j76M3k294O76J629n19
$$ 855 1491 -4 379 -1366 -832 1275 560 486 -477 -1775 370 910 734 777 -1517 -841 788 269
3415B69J275j549j636J594k99J559p7k482M27OQ53K060j999q22N04q61K518k21
$$ 269 1544 -5 -1641 -47 -346 1213 1136 -1346 -919 -913 -60 2000 1 -821 -317 -1178 1340 1119
3433A119j600M79j490J293J684j162L0j360l48K331l1n52q9k044J607J196n39
$$ 1119 -481 -2 -1492 -199 1485 323 353 -1007 -1355 976 945 393 304 -1740 -133 1063 524
3450E24N34k000n22J815l03J070r14j991J476n1P36J075k128j40M51j84J839q50
$$ 524 1058 -942 -1464 351 48 1118 204 -1787 -311 -362 374 1449 -679 -819 -368 -552 1287 437
3468D37j314O82p30J565Q00j972L89o85L02K084j133l12k90j410K147M47p18K46
$$ 437 -877 -195 -925 640 1440 -532 -143 -828 -526 1558 425 113 -177 -1587 560 1007 289 535
3486E35k247J006J772q69M42j323j119K045P1K26K76k413Q31O16N45J181j776
$$ 535 -1712 -706 1066 197 639 -684 -1803 242 313 539 815 -1598 -767 -151 394 1575 -201
3503b01j181J335j18J726m07k213M97k58J072J794j942m15m05m40K726n65j137
$$ -201 -1382 -47 -165 1561 1154 -1059 -562 -820 252 2046 104 -311 -716 -1156 1570 1005 -132
3520a32k39j572J853J498r74j58j732q5K240K00K82j148k121J684R75N20M31k621
$$ -132 -371 -1943 -90 1408 434 276 -1456 -1541 699 899 1181 33 -2088 -404 571 1091 1522 -1099
3538a099l10J255N92J649j497j950N52J3J732J132k268n18m95O16K484j169j196
$$ -1099 -1409 -154 438 2087 590 -1360 -808 -795 937 2069 -199 -717 -1212 -596 1888 719 -477
3555d77n43p42K397J115j408m35j595N21K485m18M36j786j583K166Q08L14j70
$$ -477 -1020 -1762 635 1750 342 -93 -1688 -1167 1318 900 1336 -450 -2033 133 941 1255 1085
3572A085k506J44J280O55J264j881j699J253k26J854J65k340J5j56R52J808j218
$$ 1085 -1421 -1277 3 658 1922 41 -1658 -405 -631 1223 1388 -952 -937 -1093 -141 1667 449
3589D49j025l61n70K392L15q54n79j566J251K201q40j31j486n50K183j64L73l96
$$ 449 -576 -937 -1507 885 1200 346 -233 -1799 -548 1653 813 682 -804 -1354 829 665 1038 642
3607F42k003O85Q61N87O49k046n24R89J47J158o69j631O13P7N61J667k088k73
$$ 642 -1361 -676 185 772 1421 -625 -1149 -160 -13 1145 476 -1155 -542 -465 96 1763 -325 -598
3625e98k27j04K411n08j441j33o13J705J109j117k24j328R3J940k6n2r25j612
$$ -598 -825 -929 1482 974 -467 -600 -1213 492 1601 484 260 -1068 -975 965 939 887 -38 -1650
3643a650J492P77m8M19k519Q03J114l55J029j283j185J145J27P60N24k080K5L04
$$ -1650 -158 619 571 990 -1529 -726 388 33 1062 -221 -1406 -261 -134 626 1150 -930 -905 -601
3661f01O21J758j449r62J89o43J989M18j185r8j175O23J704o09k20q94q11J885
$$ -601 20 1778 329 -633 -444 -1087 902 1320 135 37 -1138 -515 1189 580 360 -534 -1345 540
3679E40J08l69k00j462Q86R99m97P71j492o46J363N1J072n03k236J232K94N83
$$ 540 648 279 79 -1383 -497 502 5 776 -716 -1362 1 52 1124 621 -1615 -383 -89 494
3697D94J028j827j46M6l35J886k17j034L5r28J062J286j295N7q11j55J710j135
$$ 494 1522 -305 -451 -405 -740 1146 929 -105 -70 -998 64 1350 55 112 -699 -854 856 -279
3715b79L27j53j120J242M02m01M39j568R6J579l30O38q91j171J345j05O38O79
$$ -279 48 -105 -1225 17 419 18 457 -1111 -1015 564 234 872 -19 -1190 155 50 688 1367
3733A367j769M0Q8J34J118q24o14N83o75J111N1j438P92l11K16J095j309j44M7
$$ 1367 -402 -362 -274 -140 978 154 -460 123 -552 559 610 -828 -36 -347 -131 964 -345 -489 -442
3752d42l53J631o7j036pr38J357R25p37J87r72k17J444m51M63p2j686R33J69M9
$$ -442 -795 836 769 -267 -274 -1212 145 1070 333 520 -452 -669 775 324 787 715 -971 -38 131 180
3772A80L42j225j16R47l99Q03q63p90Q71N4O55L92j589M7J79K89J684q40j343
$$ 180 522 -703 -819 128 -271 532 -331 -1121 -250 -196 459 851 -738 -691 -512 -223 1461 621 -722
3791g22J54l10J616N75q48j95j176K20J555k93j10n49j020J306J98j16j66j068
$$ -722 -568 -878 738 1313 465 270 -906 -686 869 576 466 -83 -1103 203 401 285 119 -949
3809i49M61J080m29O65j277q32J313J64R56m68j753J49O39P72J017j441n91J67
$$ -949 -488 592 163 828 -449 -1281 32 196 1152 684 -1069 -920 -281 491 1508 67 -524 -357
3827c57n17K031o1q67k39j114P34J358q18L9p63l82J506l25j89K8j185J071O50
$$ -357 -874 1157 1096 229 -10 -1124 -390 968 150 189 -574 -956 550 225 36 64 -1121 -50 600
3846F00l66N24j650k97J433J52O86q03j513O64J90Q46Q76j544m92L63k51J833
$$ 600 234 758 -892 -1189 244 396 1082 279 -1234 -570 -380 466 1342 -202 -694 -331 -582 1251
3864A251l30j152J45p45Q63J073j516M42n99j1J343n92ll81r62J536L96k61o3
$$ 1251 921 -231 -86 -831 32 1105 -411 31 -568 -579 764 172 169 -212 -1174 362 758 497 434
3883D34j608M97J205k87M84r53j135J174K5Q94L58j589O7J09L88Q91r07o08N71
$$ 434 -1174 -677 528 241 725 -228 -1363 -189 -164 730 1088 -501 -434 -325 63 954 47 -561 10
3902A0m02R11k2j087N70n33M78J073r42j94m38k73J545r9m56l20r70R02P33j48
$$ 10 -392 519 497 -590 -20 -553 -75 998 56 -138 -576 -849 696 597 141 -179 -1149 -247 486 338
3922C38L62j129n72J308m64J023j49j601Q81N7K34O17j208j13P21n67Q61l78p87
$$ 338 700 -429 -1001 307 -157 866 717 -884 -3 54 288 905 -303 -416 305 -262 599 221 -566
3941e66L04l74J081O48j346k12k36K39J238n01j20l86p86J367K31l78N01j202
$$ -566 -262 -636 445 1093 -253 -465 -701 -462 776 275 155 -231 -1017 350 581 203 704 -498
3959d98m8J085l13N16n58q22R88j60k9L19j172K29N81l02R59j004n78P23j84R42
$$ -498 -546 539 226 742 184 -638 350 190 161 480 -692 -463 118 -184 775 -229 -807 -84 -268 674
3979F74j95j417O21j92K49J297j034p7L7n59J363r9o79J10o39N64Q78q63M61p79
$$ 674 479 -938 -317 -509 -260 1037 3 -74 -37 -596 767 668 -11 99 -540 24 902 39 500 -279
3999b79l88J099m36Q9j08j091J015M26m01N88j229r8R88k33P64o28o63M99k08
$$ -279 -667 432 -4 85 -23 -1114 -99 327 -74 514 -715 -813 175 -58 706 78 -585 -86 -294
4018b94N00P79j216J03j11j13J364o88n75M09o37Q76R3q67M35o08K24R60n39J4
$$ -294 206 985 -231 -128 -239 -352 1012 324 -251 158 -479 397 490 -377 58 -550 -326 634 95 109
4038A09l89p75J474l6k44kj197O42Q42l92L66o67n13R68k05M91R0j348R03o0R0
$$ 109 -280 -1055 419 383 139 137 -1060 -418 424 32 398 -269 -782 186 -19 472 562 -786 117 57 147
4059A47P99j064j35K35k87Q81j29q73L37o81P80P65j007K7k37j61J184o5m54l
$$ 147 946 -118 -253 -18 -305 576 447 -426 -89 -770 10 775 -232 -205 -442 -603 581 516 62 59
4079E9r13R38M36l19K75r32l79J287l54M84m07j056J167n5J59M52j300J32M25
$$ 59 -854 84 520 201 476 -456 -835 452 98 582 175 -881 286 231 390 842 -458 -326 99
4098I9l82J043o17q55K64p6R18N12j292K33l17J51J390r26j86j19p80J185N06
$$ 99 -283 760 143 -712 -448 -524 394 906 -386 -153 -470 -319 1071 145 -41 -160 -940 245 751
4117G51n78J92j097L09J021n04M15n83p11R38k0K97J64j373M57J14J18R11r16
$$ 751 173 365 -732 -423 598 94 509 -74 -785 153 133 430 594 -779 -322 -208 -90 821 -95
4136i5p04N61k18Q99n4j147M65l9J83J018q46j82j40k71J460m59l07P6j053P43
$$ -95 -799 -238 -456 443 389 -758 -293 -332 -149 869 23 -159 -299 -570 890 431 124 200 -853 -110
4156a10Q18m88K37p71n04J376l64K27k15r72O50J57L4N12j211M8O51l45Q52k79
$$ -110 708 220 457 -314 -818 558 194 421 206 -766 -116 41 75 587 -624 -576 75 -270 582 303
4176C03q27L28p3M67N90r46j34M5L9J064k96m19r7p45Q16M43m88K88q26q3J078
$$ 303 -524 -196 -269 198 788 -158 -292 -247 -208 856 560 141 44 -701 115 558 70 358 -468 -551 527
4197E27p59N89n56n68J002k13k60N74q99J70N87l63R41o70n32N14q1N35J81j295
$$ 527 -232 357 -199 -767 235 22 -238 336 -563 -393 194 -169 772 102 -430 84 3 538 719 -576
4217e76N59m8j08Q26q13K04j20o42J243k18o47L79o67M63O93n43J40l96k37J055
$$ -576 -17 -65 -173 653 -160 44 -76 -718 525 307 -340 39 -628 -165 528 -15 125 -271 -508 547
4237E47m52l3O0p83O29M25l55N54q34k85R38m14O32m28r19P02k15J37R41j103
$$ 547 95 62 122 -661 -32 393 38 592 -242 -527 411 -3 629 201 -718 -16 -231 -94 847 -256
4257b56p4K03l64J101k74p94O94q31P71L04q22K32l09R0Q53m68r2j06n97J209
$$ -256 -330 -127 -491 610 336 -458 236 -595 176 480 -342 -110 -419 -329 524 56 -36 -142 -739 470
4277D70k0l48L59r89K82O39n47N47m10n49Q03l48K87N35j277L74J64LN96n86l74
$$ 470 450 102 461 -528 -246 393 -154 393 -17 -566 237 -111 176 711 -566 -192 -28 -25 571 -15 -389
4298c89L76m33P92rq68N91n95L71R19r22M50n43q9R20m00k65L01p36M04M63m03
$$ -389 -13 -446 346 337 -531 60 -535 -164 755 -167 283 -260 -349 571 171 -94 207 -529 -125 338 -65
4319f5M26n02j65O29l67N41l28r00O98O9j28N35p04K5M37m15P00r3q01M85l28
$$ -65 361 -141 -306 323 -44 497 169 -731 -33 36 -92 443 -261 -236 201 -214 486 393 -408 77 -251
4340b51N56L87j005K05q3j11Q00o98m4K78n53Q76Qm24L11o38J32Q34o76K31l15
$$ -251 305 692 -313 -108 -191 -302 498 -200 -244 34 -519 357 365 -59 252 -386 -254 580 -96 135 -180
4361a80o59R11J82n6L78j197K23O32l17N59l09o75O44j83M40J88j275Q74k64L60
$$ -180 -839 72 254 198 576 -621 -398 234 -83 476 167 -508 136 -47 393 581 -694 180 -84 276
4381B76O41r64j62o4l6J238n22p01K32n64P64M90o53P5m68l22J068j12%k0j012
$$ 276 917 -47 -209 -273 -309 929 407 -294 -62 -626 138 628 -25 50 -418 -740 328 216 216 196 -816
4402h16O97N81l03M09q74K4N16j42N20m38o46M68p0K65N96j098R9j88J45J041
$$ -816 -119 462 159 568 -306 -282 234 92 612 174 -472 -4 -74 191 787 -311 -212 -400 -255 786
4422G86o53m71K90o23Q12L26l56P8o22j46J019l47J34l9q56P67m2J45L94r97K58
$$ 786 133 -338 -48 -671 141 467 111 189 -433 -579 440 93 227 188 -668 99 57 202 596 -401 -143
4443a43N38n07P17n10n70O81j51J59K46q85M28j50k58R60o07qJ12p45Q55L07o96
$$ -143 395 -112 605 95 -475 206 55 214 460 -425 3 -147 -405 555 -52 -60 52 -693 162 469 -227
4464b27M18p57M19P09o25J89q7m14Q05n61k1M66p52N51K00o20P27p96qP70m60
$$ -227 191 -566 -147 562 -63 126 39 -375 430 -131 -152 314 -438 113 313 -307 420 -376 -384 386 -74
4485g4L48k28m96O71l55L3M40n78k3M08l95P65n81n15Q02n27N80Ro62L73j24q
$$ -74 274 46 -450 221 -134 -101 339 -239 -262 146 -249 516 -65 -580 222 -305 275 284 -378 -5 -129 -137
4507a37P70p92L8L14o96R64J4o74M27o39L15M12m43L58k30p63J102l94L74k1j029
$$ -137 633 -159 -121 193 -503 461 475 -199 228 -411 -96 316 -127 231 1 -762 340 -54 320 299 -730
4528g30N06K70l78P46o57k87P61m75O54j72r23O63j65K88Q88j087o3J4l53J208
$$ -730 -224 46 -332 414 -243 -530 231 -244 410 238 -685 -22 -187 101 989 -98 -161 -147 -500 708
4548G08l19m20j41p21P52P22p01M90p80j81R77m02M8P0q53O63K93j05M32r39L1
$$ 708 389 -31 -172 -893 -141 581 -120 370 -410 -591 386 -16 32 102 -751 -88 205 100 532 -407 -376
4569c76O69k70L61q7p65M11q9N69L74j250M46k58J4J102p08l54R1m97P80K62p40
$$ -376 293 23 384 297 -468 -57 -146 423 797 -453 -7 -265 -251 851 143 -211 -120 -617 163 425 -315
4590c15M55n03K3P19k61J09k69m77Q34j60p5L14p69L86K94k30L00m21n19O18k99
$$ -315 140 -363 -340 379 118 227 -42 -519 315 155 80 394 -375 11 305 75 375 -46 -565 53 -246
4611b46N75J61j077L57MJ70O78q33m0P1j38N50j02m53L72l71K48N21n80L23k90
$$ -246 329 490 -587 -230 -226 -56 622 -211 -251 -180 -318 232 130 -323 49 -322 -74 447 -133 190 -100
4632a00l80J027k89r5o3m84Q02n8k53J63k93m71P65k30M01j37j055N37j58N18
$$ -100 -480 547 258 163 100 -384 418 360 107 270 -23 -494 271 41 442 305 -750 -213 -371 147
4652A47J58o51J29J33j95P47l87l66L46l72O10K81p89J96k55P6P42l54O6k16m63
$$ 147 305 -346 -217 -84 -279 468 81 -285 61 -311 299 580 -209 -13 -268 -192 550 196 262 46 -417
4673d17O71R5m12K84p28K29M30l21N01k77p09O13k31M50K0n49K22k0J7N83o17
$$ -417 254 349 -63 221 -507 -278 152 -169 332 55 -654 -41 -272 178 198 -351 -129 -149 -132 451 -166
4694a66j84L51k27N17K47o51K78m69K90N89o62K58l83l63R11l00q3K58o98L57
$$ -166 -350 1 -226 291 538 -113 165 -304 -14 575 -87 171 -212 -575 336 36 -47 211 -487 -130
4714a30M14l37L16o52L6Q00n33L38j58n92N23k7j4N86o83j58N94m68O65k29n64
$$ -130 284 -53 263 -389 -353 447 -86 252 94 -498 25 -2 -16 570 -113 -271 323 -145 520 291 -273
4735b73L65l11K69N07q62M22k88l03P61k51j04L9m19N40P1k35J26o13L66O60n27
$$ -273 92 -219 50 557 -305 117 -171 -474 287 36 -68 -29 -448 92 163 -72 54 -559 -193 467 -60
4756f0J86k29k23N11L3j34L38r44L85L33l95M89l62n49Q23j92K48N1q28M76j80
$$ -60 126 -103 -326 185 218 84 422 -522 -137 196 -199 290 -72 -621 202 10 258 309 -519 -43 -223
4777b23K90L49m47j18L8k45P66j13o94M61m95N76L87o47K64m78j0R67m25j80M7
$$ -223 67 416 -31 -149 -111 -356 410 297 -397 64 -431 145 532 -115 149 -329 -339 628 203 23 70
4798G0o77P03O4j3L41p90j1M90j29K39k99n26M34j21M40J00n17j11K61j75O90
$$ 70 -607 96 160 147 488 -302 -313 177 48 287 -12 -538 -104 -225 215 315 -202 -313 -52 -227 463
4819D63l66n07L54j83M33K46p48M53m45n0P77k23L5j39m84N17J47Q2k37o08J68
$$ 463 97 -410 -56 -239 194 440 -308 145 -300 -350 427 204 239 100 -384 133 280 362 125 -483 -315
4840c15L12j20N45n54m94M76n4N97K4r11K97J96o8P74q55J1J34l81R05j53n73
$$ -315 -3 -123 422 -132 -626 -150 -204 393 417 -494 -197 -1 -69 705 -150 -139 -5 -386 519 366 -207
4861b07K01k47O8M68k47j17j1k02N77j42k50L61p26L14L26l83N03o12J01L54l49
$$ -207 -6 -253 -185 283 36 -81 -92 -294 283 141 -109 252 -474 -160 166 -217 286 -326 -225 129 -220
4882b20M21q5o08N55m8L6N15n34j88K57k08N87q5p86N31m22L30L36n29K51k69
$$ -220 201 116 -492 63 15 51 566 32 -156 101 -107 480 395 -391 140 -282 48 384 -145 106 -163
4903a63j08O46m71J83j98k64L84m0l9J26k81J90K94j29Mk76l27O68j53l3J71n28
$$ -163 -271 375 -96 87 -111 -375 9 -31 -70 56 -225 -35 259 130 134 -142 -469 199 46 13 184 -344
4925c44J28K36m9M13m38l06N61l38M12j15l78%R7Q2O62p02O9o5j06N99j83n69
$$ -344 -216 20 -29 384 -54 -360 201 -137 275 160 -218 -218 -121 -39 623 -79 -10 -75 -181 418 235 -334
4947c34K85k40M55R9k76P4l02k41P62l8J6j89o08N32J28O0J56n67j00N77m24N11
$$ -334 -49 -289 166 265 -11 63 -239 -480 282 244 260 71 -537 -5 123 183 339 -228 -328 249 -175 336
4969C36l62l74M15j21M41J70p61K19J92l88P74n75m3O3m67P07P6n98K31n01K49
$$ 336 -26 -400 15 -106 335 505 -256 -37 155 -233 541 -34 -77 -14 -481 226 302 -296 -65 -566 -317
4990c17Q60l87J96k94m58N98n4R9l8n53K50J97l7K96m98k36M75j62J57r3l69J76
$$ -317 543 156 352 58 -400 198 144 243 205 -348 -98 99 62 358 -140 -376 99 -63 94 1 -368 -192
5012a92P2M1N06n65l1J29l55O69k2l77L33m56K81L67m00L96m59l3L16j36r9K01
$$ -192 -120 -79 427 -138 -169 -40 -395 274 252 -125 208 -248 33 400 0 396 -63 -96 220 84 -15 186
5034A86m64J37K98l47K54l55J67K42k30J40n7m36M79o4p4M18n15J81J00j48N49
$$ 186 -278 -141 157 -190 64 -291 -124 118 -112 28 -29 -465 14 -50 -124 294 -221 -40 60 -88 461
5055D61k24m18L10j73K82K32n62K37k56j58N90k88j75R9k53N65l23j82L00l67
$$ 461 237 -181 129 -44 238 470 -92 145 -111 -269 321 33 -142 -43 -296 269 -54 -236 64 -303
5075c03J82K30j02q6j65j87P17k69R5M4m49K89L38j25L39o13p2K34k70L56K7p12
$$ -303 -121 109 7 -79 -244 -431 286 17 112 156 -293 -4 334 209 548 -65 -137 97 -173 183 210 -502
5097e02N49k39J24L84n20k6N8l7O50m90l81K74j27N59J20m39%k37l1Q78l65m2
$$ -502 47 -192 -68 316 -204 -230 -172 -209 441 -49 -430 -156 -283 276 396 -43 -43 -280 -311 567 202 160
5119A60j03m61N85J11j28J40p52L66L92l47J53P9q19N47j58M45q3m43L8O8J96
$$ 160 57 -404 181 292 164 304 -448 -82 310 -37 116 195 -624 -77 -235 210 127 -316 -278 -210 -14
5140a4P67o66k07n3m0O32l5m19K27o46K25Q85n56R5l66n4L94K8O1j1p37L93K10
$$ -14 753 87 -120 -173 -213 419 384 -35 192 -454 -229 656 100 195 -171 -225 169 197 258 247 -490 -97 113
5163A13J8K67m47m97M50J22K44j11n07J24K18J9O21p63r5K84j49P64m47l57Ol98
$$ 113 131 398 -49 -546 -96 26 270 159 -348 -224 -6 13 634 -129 -224 60 -89 675 228 -129 -123 -521
5185e21N35J64j63J7l60r5O51m0j23j4n53N29J10j53K66n32K9M29k36M17k68o86
$$ -521 14 178 15 32 -328 -423 228 188 65 51 -502 27 137 -16 250 -282 -253 176 -60 357 89 -597
5207e97N74p3J76M12n52j85J94j6N64m02n13J95k41O00K10m83J1M2j79N72k59
$$ -597 -23 -96 80 492 -60 -245 -51 -67 497 95 -418 -223 -464 136 346 -137 -126 -84 -263 309 50
5228E0J01j83k83Q86l52j84K49p73K04L80k94M28l97l07P39j79J88K35q21K4K09
$$ 50 151 -32 -315 571 219 35 284 -489 -285 95 -199 229 -168 -475 264 85 273 508 -313 -289 -80
5249h0K11L53n36k54K66k73O47j42k57K25l93K87K73l53n3k8j45O31k59N8m66
$$ -80 131 484 -52 -306 -40 -313 334 192 -65 160 -233 54 327 -26 -79 -107 -252 379 120 178 -288
5270b88j95K91N84r0m0n87J54K71p8K46l01m58N50p5K76J90n57q3J42j62O93k53
$$ -288 -483 -192 392 302 262 -325 -171 100 22 268 -33 -491 59 -16 260 450 -107 -190 -48 -210 483 230
5292B30o23N13l13M35K20p42K22j01k00N26k4k15k08o0N27J51k36J43o63K19N41
$$ 230 -393 120 -193 242 462 -280 -58 -159 -359 167 143 -72 -280 -340 187 338 102 245 -418 -199 342
5313C42O0N2l92o70P17j1M4J73n94J0J9K17L32l26l25M87l63O41k24l45J09mj
$$ 342 402 454 62 -608 109 98 142 315 -279 -269 -250 -33 299 -27 -352 135 -228 413 189 -156 -47 -51 -52
5336e2M93l05k10l1j63N45J8l03q1l47L27L26l20L92n92Q1M53p5r8J23o23M67
$$ -52 441 136 -74 -105 -268 277 295 -8 -89 -436 -109 217 -103 289 -303 -222 231 156 58 181 -442 25
5358B5l62M39J58m00M1J78j58K73j70l31L05qP0K04n14Q1M9j38O71j15m87J01
$$ 25 -337 102 260 -140 -99 79 -79 194 24 -307 -2 -10 60 264 -250 -169 -120 -258 413 298 -189 -88
5380h8k54L79J58l82K12j71j77N09j91J72k4o36O40j01J66J02n31J14L80k81K78
$$ -88 -342 37 195 -187 25 -146 -323 186 -5 167 143 -493 147 46 212 314 -217 -103 277 -4 274
5401B74o76K07K59k60K76J53n76M99k05q4O14o26J96j28QM62k69k58N00o80J91
$$ 274 -402 -195 64 -196 80 233 -343 156 -49 -133 481 -145 51 -77 -69 393 124 -134 366 -314 -123
5422a23M13k69j36j1j06L19P2j83Q1l03K82k1j29M02n20O9L05p4K44j98m71L54
$$ -123 290 21 -115 -126 -232 87 159 -24 57 -246 36 15 -114 288 -232 -163 142 68 312 114 -357 -3
5444cQj37K71k79J6J95J5M22m28l49L84k86L58K51q09M52k76J18L21m61J74J18
$$ -3 5 -132 139 -140 -124 71 86 508 80 -269 115 -171 187 438 -371 81 -195 -77 244 -217 -43 75
5466G5l37K35J4p7J68j84L3K50l06K10k35j94M56jo8J46l43jL52j42J89l46k17
$$ 75 -262 -27 -13 -90 78 -106 -73 177 -129 81 -154 -348 108 107 39 185 -158 -159 193 51 240 -106 -323
5489c23L94k02M64k3o92K75k23K76L86l49k52K87l18M41J34k20J5l39K60L55k79
$$ -323 71 -131 333 310 -382 -107 -330 -54 332 -17 -269 18 -300 141 275 55 70 -269 -9 346 67
5510F7K04m92j5P40k63k18J45o11M78K27j95j41n13M09n3l4M91k81m16L79k85
$$ 67 271 -221 -236 504 241 23 168 -443 35 262 67 -74 -587 -178 -231 -265 226 -55 -471 -92 -377
5531c77N37J5k52k67J48J41M92l13p5J41l71M36j5k74J84m95K53M90l35rl27l68
$$ -377 160 175 -77 -344 -196 -55 437 124 49 190 -181 255 240 -34 150 -345 -92 398 63 54 -273 -641
5553f41M36J31K56lo54K97K11O8K46k96k40K57k24N62j23m86K63j74R1N35n01
$$ -641 -205 -74 182 179 -475 -178 33 101 347 51 -189 68 -156 406 283 -203 60 -114 -23 512 11
5574A1M6p2k10O01o7n24K93m08Q3L63j59J03l25k05O76l39J43O8l97M87q0j71
$$ 11 57 -15 -225 376 309 -215 78 -330 -247 116 -43 60 -265 -470 206 -133 10 78 -319 168 88 -83
5596h3J62k44N7L47k00L92k55n92M99j47Q4L66o94Q3J40mM78m21p2M4l38N50Q0
$$ -83 79 -165 -108 239 39 431 176 -416 83 -64 20 386 -308 -225 -85 -89 389 -32 -104 -60 -398 152 232
5619B32l03j08j70J90N91l63O6k00k40L43K83l06M15o64J10L03j80M90p54p8L19
$$ 232 -71 -179 -349 -159 432 69 135 -65 -305 38 321 15 430 -234 -124 179 -1 489 -265 -343 -24
5640b4O1m5K20m96L58j10o4M61m93Q0l5q0M38j88k62J99l41M00L74l92J02r9l26
$$ -24 37 -8 212 -284 74 -36 -100 361 -132 -52 -87 -167 271 83 -179 20 -321 79 453 61 163 64 -262
5663b62M69r4l4n7k27J13K27l11L75k43k08K71j85K22L7m60M01j15J3M27m74q9
$$ -262 207 113 79 22 -205 -92 135 -176 199 -44 -252 19 -166 56 93 -367 34 -81 -68 359 -115 -204
5685b04K08j07M28k34m60L57k48L16J25l50J36QrL80l76P8P4l79L53K27k85M61
$$ -204 4 -103 325 91 -369 -12 -260 56 181 -169 -33 -25 -34 346 -30 48 122 -257 96 323 38 499
5707D99r68L38K67j35K84m88QK80j98J86J19l77J32j1k1L71k66k97K08j21N32
$$ 499 -469 -131 136 1 285 -203 -195 85 -113 73 192 -185 -53 -64 -85 286 20 -277 -69 -190 342
5728C42K8n36K48m2j58N46l82j09mN1M35l12k22n8n1L41K45l95K69m46k13P34
$$ 342 370 -166 82 40 -118 428 46 -63 -67 -16 419 107 -115 -173 -224 117 362 -33 236 -210 -423 311
5750C11m49L41p3k77K24R1q7K97p06R0J75J8K90O4o20K96O2K47O0m86K91l47J73
$$ 311 -138 203 130 -147 77 168 81 378 -328 -238 -63 -45 245 309 -311 -15 47 294 354 -132 159 -188 -15
5773a5M50l14n9p5n48O23P9j71J48j62N4J30k19K51l3m18K96n6J98Om07J54J38
$$ -15 435 121 62 -13 -561 62 141 -30 118 -44 10 140 -79 172 139 -279 17 -39 159 165 -242 -88 50
5796E0k08N80m45k56L61k69L89R3l79O5K0k6L20m59K03J8m24M21J5j02P6l94K80
$$ 50 -158 422 -23 -279 82 -187 202 295 -84 -19 1 -25 295 -164 39 57 -367 54 69 -33 43 -351 -71
5819g1J81j59K09qm81N69j16j42J39m42L87p1J00J02j81L3m1Q1JK1k36K48k2L7
$$ -71 110 -49 160 152 -329 240 124 -18 121 -321 66 -5 95 197 16 49 8 89 90 111 -125 123 101 138
5843A38J02m95K95j09k86O28l30J70l2l46L55n0j99J41K4m3J69j45M1j32k06L46
$$ 138 240 -255 40 -69 -355 273 -57 113 81 -265 90 40 -159 -18 6 -37 132 -13 28 -104 -310 36
5865C6k13L18J16m77M46O4l60K24k9n12O33k30N9K02m36J28Jq8L76m99Q2K95k30
$$ 36 -177 141 257 -220 226 290 -70 154 125 -387 246 16 75 277 -159 -31 -30 -118 258 -241 -159 136 -94
5888i4K57j6l86L13o0O3K20l71K87k80L2K99m9j42j14n3J53M28n50K16l29r7M85
$$ -94 163 147 -239 74 14 77 297 -74 213 -67 -35 264 215 73 -41 -94 59 487 -63 153 -176 -273 212
5911B12k70J01l3k25m1K27q6L09k82k6J65l4M30l08n40M14N8K08l5m35J22J34
$$ 212 -58 43 10 -215 -256 -29 -115 194 -88 -114 51 17 447 139 -401 13 71 279 244 -191 -69 65
5933F5lJ32j99k15K29k07N31o7m53K26k75J45k6n1J57k35j27N52l37J16n6n10
$$ 65 62 194 -5 -220 9 -198 333 266 -187 39 -236 -91 -117 -168 -11 -246 -373 179 -158 -42 -98 -608
5955f08M60K79Kj6j32j10L88k79K03J64m98L49q0l15N92l75j81J24k33L85k53
$$ -608 -148 131 133 117 -15 -125 263 -16 187 351 -147 202 122 -193 399 24 -157 -33 -266 119 -134
5976a34j38L23k61K47J38j28K9k75P7O50l36m9k20j75K48L41k29J11k28J66p7
$$ -134 -272 51 -210 37 175 47 76 -199 -122 528 192 143 -77 -252 -4 337 108 219 -9 157 80
5997H0j45K40j62m20L79q0J95J61n74P0J71N4J93k31j02J58k64L55K62n37K75
$$ 80 -65 175 13 -407 -28 -108 87 248 -326 -256 -85 -31 162 -69 -171 -13 -277 78 340 -197 78
6018G8k73K96K28j10L3k37k45M52R1l28K65m75n8N25k77J86l03j19L94q8J29r0
$$ 78 -195 101 329 219 252 15 -230 222 313 -15 250 -225 -283 242 -35 151 -152 -271 123 35 164 74
6040G4m18K04K71j96M89o78LK66m23M89R8k19Rl08L96K88k42k02J35l30N68k90
$$ 74 -344 -140 131 -65 424 -254 -251 15 -408 81 179 -40 -31 -339 57 345 103 -99 36 -294 274 -16
6062a6J38m5m12K05K95j30J70k68j81N34k47M0J26n92K90P2J66M0m38K07N1l13
$$ -16 122 77 -335 -130 165 35 205 -63 -244 290 43 83 209 -383 -93 -21 145 185 -253 -46 5 -308
6084c08M73J40l96Q7k30K77J13j23R1j58j95M54k05O4k3l00K63J55j52J68m30
$$ -308 165 305 -91 -4 -234 43 156 33 124 -34 -229 225 20 84 61 -239 24 179 27 195 -235
6105b35O7L31k97J89J1m51M35j09p7M17m48J68j60k1M60l43m8J50j43J52J84k23
$$ -235 -168 163 -134 55 66 -385 50 -59 -136 281 -167 1 -159 -180 280 -63 -111 39 -104 48 232 9
6127IP9M5j54J19k73Q1K7m2L12k09q2K36n12L81J59m47L87O1m53M59j46j8J94
$$ 9 88 133 -21 98 -175 -94 -67 -109 203 -6 -88 148 -364 17 176 -271 116 177 -276 183 37 19 213
6150B13l05K66l7R8j00l98J76J91j96K05m4l10K11n2J42m2k67J71r9k9K75j33
$$ 213 -92 174 137 235 135 -263 -87 104 -92 113 69 -241 -30 -82 60 18 -249 -78 -177 -206 69 -64
6172f4l2J18k55M47l61oL62k35L5K37l01O7M4j39K55j76n9J64k51L20p3q6J81
$$ -64 -96 22 -233 214 -147 -153 209 -26 9 246 -55 12 56 -83 172 -4 -63 101 -150 170 97 11 192
6195A92l11k13N01k60L51k72r8lM1J46J22l31J42k9q4M20j46j73Nk06M32Nj43
$$ 192 -119 -332 169 -91 260 -12 -110 -113 -72 74 196 -135 7 -22 -106 314 168 -5 0 -206 226 231 88
6218H8rj69n7M56k57k35Q5j06L93n2l77L62k11n5L34k52m8J96m09L79k23K48K73
$$ 88 79 -90 -147 309 52 -183 -98 -204 189 137 -240 122 -89 -144 190 -62 -110 86 -323 56 -167 81 354
6241C54o68K03J36r4L37j65k03J92k99K79K16m26K78k57K74J83l51O2k0j45J50
$$ 354 -314 -111 25 -69 268 103 -100 92 -207 72 288 -138 140 -117 157 340 -11 51 31 -114 36
6262C6j4r9K95l61P0R7j00K84k47k66N55m04J54J45l97K19J35j38O4j10j40M73
$$ 36 22 -77 218 -143 -73 24 -76 208 -39 -305 250 -154 0 145 -252 -33 102 -36 28 -82 -222 251
6284B51m24M78j83l74J4K9J82K37k98J38k20j1N72k04j98M4j76L14k7k74J76k4
$$ 251 -173 305 122 -252 -238 -209 -27 210 -88 50 -170 -181 391 187 -11 33 -143 171 144 -130 46 22
6306B2j96M13k01J11o7k78J17K49j68O3q9J06J26l31L49j77r6j41j0K51L09l85
$$ 22 -174 239 38 149 82 -196 -79 170 2 65 -24 82 208 -123 226 49 -47 -188 -198 53 362 -23
6328b3j3j53K44K6j84N6O3m25N39o7k87L26j15j83M40k79J42j79j8J31j8o8J62
$$ -23 -36 -189 55 81 -103 -47 16 -409 130 63 -224 102 -13 -196 244 -35 107 -72 -90 41 23 -45 117
6351A17j78o2J68N9J31l70o1J17L9L14o7m85J61l0J14K26l65L4M7J95r2m4j31
$$ 117 -61 -123 45 104 235 -135 -196 -79 -40 274 207 -278 -117 -147 -33 193 -172 -138 -91 104 12 -32 -163
6374a63K23l17p0O22k46L6j6o2J88k44J44q3j91K96j71O2J29j28k3K93n85L73
$$ -163 60 -257 -327 295 49 85 69 7 195 -49 95 12 -179 117 -54 8 137 9 -14 279 -306 67
6396F7m3l26L32O7rr5k89L91O6k23K05k40m9K73k24L50j59j97R5J21j70M08k61
$$ 67 24 -302 30 97 88 -7 -296 95 161 -62 143 -97 -146 127 -97 253 94 -103 -8 113 -57 351 90
6419I0jj27p9L44j97j44J33k48J58j04K90j52k00M3M46k24j13K67m54K91L4j46
$$ 90 89 -38 -117 227 30 -114 19 -229 -71 -175 115 -37 -237 -194 252 28 -85 182 -272 19 53 -93
6441i3K71j79r1J58k9J80j91m39M47j8m2K73k89M4p8J53j25M0M6j0k23L08rj1
$$ -93 178 -1 -92 66 37 217 26 -413 34 16 -26 247 -42 2 -76 77 -48 -8 38 28 -195 113 104 93
6465I3Pl23j8M87l34K11k25q9J55J14j5M9l25L0L65j65K3q1J9K02k77K67L2k47
$$ 93 100 -223 -241 246 -88 123 -102 -191 -36 78 63 112 -213 -183 182 17 40 -41 -22 180 -97 170 202 -45
6489d5O2p6j8P7k30R0J35k97L31k6J0Q2k63L15Q0k98K10j51k58M72j35RQ7k76
$$ -45 17 -59 -77 0 -230 -140 -5 -302 29 3 13 95 -168 147 227 -71 139 -12 -270 202 67 76 163 -113
6513a13l4J81K05j66k79Q6M9K10j73L86l64mo3M4J28k91K72j53q8L23J2m21K66
$$ -113 -147 34 239 73 -206 -120 -71 139 -34 352 -12 -16 -79 -35 93 -198 74 -79 -167 156 168 -253 13
6536A3k57L40K84j95m9l00PM24j90M6n6j58PL52l98L49m55N1K52n15O40k35L8
$$ 13 -244 96 380 185 136 -164 -157 267 77 123 67 -91 -84 268 -130 219 -236 -185 67 -448 192 -43 -5
6559eJ11l45K16L15l37j99R5Q2K45j21l3J6l54M99j25k21J73l33P4L14J6K12k77
$$ -5 106 -239 -23 292 -45 -244 -149 -67 178 57 24 40 -314 185 60 -161 12 -321 -247 67 83 295 18
6582A8k53L13j1o4K10n34J68K18o1J52l43p4K26j44M60l28LJ64j39j26M01k00
$$ 18 -235 78 67 3 213 -321 -153 65 4 156 -187 -261 -35 -179 281 -47 -44 120 -19 -145 256 56
6604E6n7m5o6K58M2k98j2j65J92M21m47R4j85J60l4O5r8L7q9N5J01r8J63k26k21
$$ 56 -1 -46 -112 146 188 -110 -122 -287 -95 326 -121 -27 -212 -52 -86 -21 -119 -82 -171 -116 -15 -113 50 -176 -397
6629c97M14J70Pqm47J88Q5K04J54k86j86K19j60J52j2%j5p1L3N3j49N3j95J29
$$ -397 17 187 194 186 -261 -73 12 216 370 84 -102 117 -43 109 97 97 82 11 44 97 -52 1 -194 -65
6653f5R6L8n6N2l93L86K98m22K11k77J41R8j65L36l94J08J67k59L08M6m22L5J68
$$ -65 31 69 13 65 -328 58 356 -66 145 -132 9 107 -58 278 -116 -8 159 -100 208 254 -168 -133 35
6676C5j6J38j67k00J83j51J59l9k7J58k60M42L5m39O5O6k53N35m6k61J99l98L60
$$ 35 19 157 -10 -210 -27 -178 -19 -58 -85 73 -187 255 290 -149 -84 -18 -271 264 218 -43 156 -242 118
6699A18N6k69J20l19J52L10k0j16k5k26L40l34J70J2M1n0o2M9M18m62R1J83k52
$$ 118 174 -95 25 -294 -142 168 148 32 7 -219 121 -213 -43 -31 10 -40 -102 -53 365 -97 -6 177 -75
6722g5Q5K80l15Q5L1j49K06k82K37j5k10P2q4OL09k62K02K54l86J81j47l41M22
$$ -75 10 290 -25 60 91 -58 148 -134 103 88 -122 -50 -134 -128 181 -81 121 375 -11 170 23 -318 104
6745A04q2k5J65l07K94o9j17J93j51M7O2j6k0L9k57J3J19J03R4j91p9J76l70J20
$$ 104 22 -3 162 -145 149 80 -37 156 5 52 114 98 78 117 -140 -127 -8 95 189 -2 -81 95 -275 -155
6769a55L37k38M1l35L93K16m43M27l34j98M05l5R9l1n64K59K52j0J75n75L11O
$$ -155 182 -56 -15 -350 43 259 -184 243 -91 -289 116 81 180 149 -415 -156 96 86 261 -314 -3 3
6791Cj85L75j88k28L5J53J43J55l58K13j67P9L02l07p5k4Q9P9Mk84K13j71j36
$$ 3 -182 193 5 -223 -188 -35 108 263 -95 118 -49 30 332 25 -50 -74 15 94 98 -186 27 -144 -280
6814b80K82m2K68j38k58M17l12K57j37j19k46L62lK48l80j53J89k8O5J65m11K29
$$ -280 2 -40 228 90 -168 249 -63 194 57 -62 -308 54 51 299 -81 -234 -45 -73 -8 157 -254 -25
6836b5L1p3L20k58r8N5j28J11K50l77L94l85P5J98jM4j57j73K71QJ3k33K4K09
$$ -25 6 -67 253 -5 -103 -48 -176 -65 185 -192 202 -183 -108 90 89 133 -24 -197 74 82 95 -138 -114 95
6860I5j00k43M49j64r6J89l38K79j10k06L58j93m3J38o7k7N8j97L36n1j37Pk80
$$ 95 -5 -248 201 37 -59 130 -208 71 -39 -245 113 -80 -123 15 -52 -79 -21 -218 118 67 -70 -63 -343
6883c43M40K1j57j49J57nK63k89J24M4k30M15l56J0K74l91K20L06m84K29J7l17
$$ -343 97 118 -39 -188 -31 -36 227 -62 62 106 -124 291 -65 -55 219 -172 48 354 -130 99 116 -201
6905b01K07j81J39J04k02K22j44J28K25m98Q0J42p5J83k36J14L0l4j62K46j61
$$ -201 6 -175 -36 68 -134 88 -56 72 297 -201 -121 21 -54 129 -107 7 37 3 -159 87 -74
6926g4j46M28l44M03k72j94K40j71q9L99l25Q2J4q8K63j87n6m1r1K66l2j18L50
$$ -74 -220 208 -136 267 -5 -199 41 -130 -219 180 -145 -63 -49 -137 126 -61 -117 -158 -249 17 -15 -133 217
6949B17k97J25J43k78J71j74l6R7J10j30K53l14j32M56j17Jj84J17k02J07J28
$$ 217 -80 45 188 -90 81 -93 -129 -32 78 -52 201 -113 -245 211 94 95 -89 28 -174 -67 61
6970F1J4j80j56K37j60K75j37JR0j58R4J1j50P1N3P3P7j10J46k26JK84k22L02
$$ 61 75 -105 -261 -24 -184 91 -46 -45 45 -113 -19 -8 -158 -87 -34 39 116 6 152 -74 -73 211 -11 291
6994B91L8m98K54l03J28J98K7j41J80k02K45j10j29n8K4JK31m40K48p6k86M01
$$ 291 329 -169 85 -218 -90 108 135 -6 174 -28 217 107 -22 -80 -56 -55 176 -264 -16 -92 -378 23
7016B3j32Q5P3k71K91R7k66J01O9O2lm0J68j50k46K03n0mK13l00j19J01N1L18
$$ 23 -109 -24 49 -222 69 166 -100 1 70 132 129 89 257 107 -139 64 14 10 223 -77 -196 -95 -44 274
7040B74j68o4k9p5J28k5k39J32q2o5K96k08M8M6j64L85m6j55J67n3j09K49k18
$$ 274 106 42 13 -62 66 41 -198 -66 -148 -213 83 -125 -77 -31 -195 190 144 -11 156 103 -6 243 25
7063B5Q2k04J36j13M7j02L00k98J40R2l30M19k57j19K83j40J63J25m62L88k31
$$ 25 107 -97 39 -74 -27 -129 171 -127 13 105 -225 194 -63 -182 101 -39 124 249 -213 175 -56
7084e6M7K17l22J88L2k69L93l62J26J07m87N74j49o3qj66J32J56L1p0m3k41M75
$$ -56 -9 208 -114 74 106 -163 230 -132 -6 101 -386 188 39 -24 -32 -198 -66 90 121 51 8 -233 242
7107B42k22l24J84P6P6J15j55J26j32j61K73k17K32M5j49J0j4l6L32k04o8P5j04
$$ 242 20 -304 -120 -44 32 147 -8 118 -14 -175 98 -119 113 158 9 19 5 -31 301 97 29 104 0
7130@L4P8k50K7l8K45mqR2k92k66L74k2n5K07k92J94M3k15K95p7j85Q0J58O7o5
$$ 0 34 112 -138 -111 -149 96 92 84 176 -116 -382 -8 -30 -85 122 -170 24 67 -148 147 70 -115 -35 123 190 125
7156A25q1Q0j89JM18o01L63n7k69K93J43n1q4o3O2Q0l88J32j45P2L13l12R6n0
$$ 125 44 124 -65 -64 354 -247 116 59 -210 83 226 175 91 28 90 170 -218 -86 -231 -159 154 -158 -62 -112
7180a12K8J72K29k35m8o4kQ0J9J02k50j24L94l69L42l7j65J27o7J36J24k56rK7
$$ -112 -84 88 317 82 34 -30 -32 48 67 169 -81 -205 189 -180 162 125 -40 87 20 156 280 24 15 42
7204D2j83K33J14k72K66m34J51L14k71R2lk94M02k25j4J91l56J16J80J50k84L9
$$ 42 -141 92 206 -66 200 -234 -83 231 -40 52 49 -245 157 -68 -82 109 -247 -131 49 199 -85 -46
7226d6ML13n08L54j24o1J24J75k17K21m54l6J95r4J80Rj16R3k56K37J1lj90J02
$$ -46 -42 271 -237 117 -7 -68 56 231 14 235 -219 -255 -60 -154 26 35 -81 12 -244 -7 4 1 -189 -87
7250h7O3K15k05Q0K3j42K78k20O7p2n4j48L73j61p0J07l04M18l69K67j10j07L8
$$ -87 -24 191 -14 66 89 -53 225 5 72 0 -54 -202 171 10 -60 47 -257 161 -208 59 -51 -158 -120
7273a20J29PJ81j88L5J2nL0j61J31j78j32K34L44k32j88O8n8J37m3o3L06m20M9
$$ -120 9 16 197 9 44 56 51 81 -80 51 -127 -259 -25 319 87 -101 -33 -91 46 3 -60 246 -174 -125
7297a25K40k07J89j61p9L35o2oj00j43J27lo4K40k36j12K69j54L40m70J16L7P5
$$ -125 115 -92 97 -64 -143 192 130 124 24 -119 8 5 -59 181 -55 -167 102 -52 288 -182 -66 -29 46
7320D6p5K51j47l2j82J11J27N4k05R9k67L16L8k18J11J7j86P9JJ48J18m19L56
$$ 46 -29 222 75 43 -139 -28 99 153 -52 47 -220 96 134 -84 27 44 -142 -63 -62 86 204 -215 141
7343A41j51J06J50n38Q8J94k0O0k62K3K32j9M2J24j78J46k93j56M39p3p7N0k01
$$ 141 -10 96 246 -292 -204 -10 -30 30 -232 -209 23 4 46 170 -8 138 -155 -311 128 55 -22 28 -173
7366a73L80k31k4L60m62J76l2J27L7k19o7L96j56n8K49o47J97L30j00J65l20j66
$$ -173 207 -24 -48 312 -150 26 -6 121 158 -61 -128 268 112 54 303 -344 -147 183 83 248 -72 -238
7388b38M06q2j45O4j27%O8k07O10l50j69J67m0l7m3J24K43k39j4K69k96J25m9
$$ -238 168 86 -59 5 -122 -122 -54 -261 349 -1 -170 -3 -43 -80 -123 1 244 5 -9 260 -36 89 40
7411D0j47K98l34K66J0k50J12J8k13J28nN4J14j10n8J38k84M91k33j98K08j07
$$ 40 -107 191 -143 123 133 -117 -5 13 -200 -72 -77 -23 91 -19 -77 61 -223 268 35 -163 45 -62
7433f2J77o4jn8r5R3m8k19K47J50l30K65m4j07L10j21j14J64k15K09l62R2K08
$$ -62 115 51 50 -8 -103 -10 -58 -277 -30 120 -210 55 11 -96 214 93 -21 143 -72 137 -225 -133 75
7456G5k79O7J43r7J06j85o1M65j95RK6Q9m5M6k79K57k93PL53j40K11k51j53n0
$$ 75 -204 -137 6 -91 15 -170 -231 234 39 48 74 163 118 164 -115 142 -151 -144 209 69 280 29 -124 -174
7480a74J55k07L05l4j60J88l46L79k00j9K01j82M6J04j2j1p7r8P5Q0J32r9k45
$$ -174 -19 -226 79 45 -115 73 -273 106 -94 -113 88 -94 -48 56 44 33 -44 -142 -67 13 145 46 -199
7503a99L75j07o6K58m58L09O8k32N7J0OK47m49K11j22o6K37j34J21L9j70J94k32
$$ -199 176 69 3 261 -197 112 180 -52 5 15 21 268 -181 30 -92 -158 79 -55 66 105 -65 129 -103
7526a03r2O1P8l6j19R9J37K32m85K59m0k31M27o6j3P6l43L02L4m42N03k67N9K3
$$ -103 -195 -134 -56 -92 -211 -112 25 257 -228 31 -9 -240 187 121 108 184 -159 143 177 -265 238 -29 30 53
7550E3j34J42N9j24OK2p9J11r1P4M5j42R2J27k34L9J24J03n3j37K26k42L4O1j74
$$ 53 -81 61 120 -4 2 24 -55 56 -35 39 84 -58 34 161 -73 -34 90 193 140 3 229 -13 21 82 -92
7575i2J67k7k14K66m9j69K77k33J78o2q5J54Ml45J04M5J57O0m39L34m2k5J75k53
$$ -92 75 48 -166 100 51 -118 159 -74 104 42 -43 111 115 -230 -126 -81 76 136 -303 31 -11 -36 139 -114
7599a14k0J10j11K76O3l46J20M6p4J10p3L0J12k09K16k57K6L66n10J58L5qn3j1
$$ -114 -134 -24 -135 141 204 -142 -22 24 -50 60 -13 17 129 -80 136 -121 -95 271 -239 -81 -46 -54 -107 -118
7623a18l1J94l18L06O5k14K33j45k18L80J3R4j09q4J31rk91K74j86m0J16j01O1
$$ -118 -149 45 -273 33 98 -116 117 -28 -246 134 147 241 132 48 179 170 -121 153 -33 -73 43 -58 3
7646Cj86K17O9j30j32L40l49J34L9m1Q7k01L0J36j57M11k97L6J18k22R9J7om5
$$ 3 -183 34 103 -27 -159 181 -168 -34 5 -36 51 -150 -120 16 -141 270 -27 9 127 -95 4 21 15 -30
7670c0J72j27K27r5k29K20k07NK04j62q7J06J60K3j96J99k02q1K2j0P5J86k05
$$ -30 142 15 242 147 -82 138 -69 -64 140 -22 -109 -3 157 180 -16 183 -19 -100 -78 -88 -13 173 -32
7693c2j08J83j04J41L1l25L09j87J69k10Q3L0K3l15M12O3l64L10l67M85j90j18
$$ -32 -140 43 -61 80 111 -214 95 -92 77 -133 -50 -20 3 -312 100 163 -201 109 -258 227 37 -81
7715h1J09k91K04K22m47K76L4j79L53l50K01j24k35M22k18k6L27m34%K84j98L1
$$ -81 28 -263 -59 163 -284 -8 26 -153 200 -150 51 -73 -308 114 -104 -130 197 -237 -237 47 -151 -120
7737a20K77k04L0K5J18j18o3lO7k67L12j7L6k21j9K83k44j40P6J96K10p8k39J40
$$ -120 157 -47 -17 8 126 8 -55 -58 9 -258 54 37 73 -148 -167 116 -128 -268 -192 4 214 136 -103 37
7761C7Ko9J68J12k31J25j57M1O1Kj74M1j83M36m00J74J84k45M7Q1k2N5j19p1M7
$$ 37 39 -30 138 250 19 144 -13 28 89 91 -83 -42 -225 211 -189 -15 169 -76 -29 52 30 85 -34 -105 -58
7786e8J4r2K8J15j14L3J93l6k90J13J88M3J28j42l15K76o1j20L23l43J80k8R8
$$ -58 -44 -136 -108 7 -107 -74 119 83 -207 -94 94 137 265 123 -192 84 23 -97 226 -117 63 35 133
7809A33p5n1j50J21m26N21K32m21L20n80L87O6l56L08J8k31L61k89r8K85r1r4
$$ 133 58 7 -143 -22 -448 73 305 -116 204 -376 11 77 -279 29 47 -184 177 -112 -210 75 -16 -110
7831a10m1J65K83l44n3O8m6J41J65l47K05r2j10J51k27K53r5k07L58r8m6J8o4
$$ -110 -151 14 297 -47 -100 -32 -78 63 228 -119 86 -6 -116 35 -192 61 -34 -241 117 19 -27 -9 -73
7854g3j9j3J33q3R9k93K58j48K51nk26K04q5j30K78j80J17o4j19P1J94k89Q6k0
$$ -73 -92 -105 28 -55 44 -249 9 -139 112 107 -119 85 0 -130 148 -32 85 21 -98 -27 167 -122 -36 -56
7878e6o0J37l43M58k5l46L72n1o5J24j55N0R7K6j92J52k23K55j70M0N1j70K61
$$ -56 -116 21 -322 136 111 -235 137 86 21 145 -10 40 137 163 -29 123 -100 155 -15 25 76 -94 167
7901A67r3q6J43j83n1K15j02Q5j03k7L87m48J5K14k75O6P6j28L93j16j96J69j43
$$ 167 74 -12 131 -52 -103 112 10 95 -8 -35 352 -96 -81 133 -142 -76 0 -128 265 149 -47 122 -21
7924b1n8J56j70J50j12j98M50j55K7J41k10j13L8M0J24J8J01j51%K21m12N6Oj11
$$ -21 -79 77 -93 57 -55 -253 197 42 69 210 0 -113 -75 -35 89 107 208 57 57 278 -134 -78 -72 -183
7948a83P9K27k34J00j83M01m2k05P1j40J0J90j3j6k1l20K12J08j44K36l2j40J96
$$ -183 -104 123 -111 -11 -194 207 165 -40 31 -109 -99 91 78 62 41 -279 -67 41 -103 133 101 -39 157
7971A57k50R8m0j36K84j40O6R6k21P2K97k46P8K8k57L37k27j15J39o7K83k08k96
$$ 157 -93 5 -35 -171 113 -27 39 135 -86 -14 283 37 115 143 -114 223 -4 -119 20 -47 236 28 -268
7994b68L82p1q3J30k43K88j89o4J70j16J03R9j48l4K00j93J88j60O5K2k74N6K80
$$ -268 114 43 -40 90 -153 135 -54 -118 52 -64 39 138 -10 -44 156 -37 151 -9 56 78 -196 -140 140
8017A40j85J76k01n2P4RJ61m1k26J59J65j63lJ11k5J6k15q0K72k75L06o5n8J84
$$ 140 -45 131 -70 -122 -48 -39 122 81 -145 14 179 16 13 124 99 115 -100 -180 92 -183 123 58 0 184
8041A84l92J76k3N9J53j42k9K64j48j00J39k80M20m86P5J27L5K30k78J13J25l04
$$ 184 -208 -32 -55 4 157 15 -14 250 102 2 141 -139 281 -205 -130 -3 32 262 -16 97 222 -82
8063h2j6K97m58K52pN8J7j68J25J16k46J52L7k51J61M0l81L20p1L1Q7q2J62q7
$$ -82 -98 199 -259 -7 -14 44 61 -107 18 134 -112 40 77 -174 -13 27 -354 -34 -105 -74 13 -69 93 6
8087Fr5J47j03p9L37l66P4K39l85M20k46l5J84m37K23M2J27m1j24MK39q7j00j62
$$ 6 -89 58 -45 -124 213 -153 -79 160 -225 195 -51 -86 98 -339 -116 -74 53 12 -112 -108 131 44 -56 -218
8111b18r2J87K02r5M1P1j25M0K1K5j46M8J43k49K27k4J2q8M8j70L39j13j47l3
$$ -218 -310 -123 79 -16 25 96 -29 11 32 57 -89 -41 102 -147 80 56 68 -20 28 -142 197 84 -63 -96
8135i6j46L29k52J63L4p1r5M60l27Mj1l61N80k16J19kk20J94l5j29K39j72k90
$$ -96 -242 87 -165 -2 32 -39 -134 326 -1 3 -8 -369 211 -5 114 112 -108 86 51 -78 161 -11 -301
8158c01N63m06K06Nq9M4k02K73J33k35p2j30R3J96q2mK6j01K36j63NK34j87Pl3
$$ -301 262 -144 62 67 -22 22 -180 93 226 -9 -81 -211 -118 78 -4 -8 18 -83 153 -10 -5 229 42 49 16
8183A6K21k03R9k28J47l4M7J97
$$ 16 237 34 133 -95 52 18 65 262
8191B62
$$ Imaginary data points
##PAGE= N=2
##DATA TABLE= (X++(I..I)), XYDATA
0@%%%%%%%%%%%%%qJ6j6J6j6K4l2L5m3N6o4P2q8J04j20J36j56J80k04K32k64L01
$$ 0 0 0 0 0 0 0 0 0 0 0 0 0 0 -8 8 -8 8 -8 16 -16 19 -24 32 -32 40 -48 56 -64 72 -84 96 -108 124 -140 161
35A61l41L82m31M84n40O04o71P43q26R16j012J119j236J362j501J654j823K009
$$ 161 -180 202 -229 255 -285 319 -352 391 -435 481 -531 588 -648 714 -787 867 -956 1053
53A053k214K442k697K987l315L689m124M635n250O002o943Q169r834J2247j6093
$$ 1053 -1161 1281 -1416 1571 -1744 1945 -2179 2456 -2794 3208 -3735 4434 -5400 6847 -9246
68i246K3381o0404K77384J10612l32368l34347p1483L06105K25245P5501r7236
$$ -9246 14135 -46269 231115 341727 9359 -324988 -396471 -90366 134879 210380 113144
79A13144k63030j06737J70732K82513J61292k77094l35568L2438K60947K31885
$$ 113144 -149886 -256623 -85891 196622 357914 80820 -254748 -222310 38637 270522
89B70522p4122k94857j06251P0463K07595K03905q2343k41454j89261M5526L35088
$$ 270522 196400 -98457 -204708 -134245 73350 277255 194912 -46542 -235803 -190277 144811
100A44811J57866j91740k79783j57899J49462K52848P5801n4774k13152j67639
$$ 144811 302677 110937 -168846 -326745 -177283 75565 151366 96592 -116560 -284199
110b84199J29925K57718J85202j06820l14467m7048K03225J70636K762j92841
$$ -284199 -154274 103444 288646 181826 -132641 -179689 23536 194172 196934 4093
120D093j09096L4538L3645J05517M7919j03852j29471o9034J72965K33779p6617
$$ 4093 -105003 -70465 -36820 68697 116616 12764 -116707 -185741 -12776 221003 144386
131A44386k27800j23897R8225K25873J9398j24148q9658p6904M3537J13795R1132
$$ 144386 -83414 -207311 -109086 116787 136185 12037 -77621 -154525 -110988 2807 93939
142I3939L8166j52517j35145R5881J55282Q8829q1525j51373R138M8834L0455
$$ 93939 132105 -20412 -155557 -59676 95606 184435 102910 -48463 -39325 9509 39964
153C9964L1318o3352n8143k6680Q180J07739Q402j03744l3888L4612J04032L6491
$$ 39964 71282 7930 -50213 -76893 -68713 39026 47428 -56316 -90204 -55592 48440 84931
165H4931q7065k3915n332q554N6416L1441J4061n9739j22324M7950J30345L5934
$$ 84931 -2134 -26049 -31381 -39935 16481 47922 61983 2244 -120080 -72130 58215 94149
177I4149n0323r7163K5167Q5386l0096j7118J8323L804j1311p7416N434Q3000
$$ 94149 43826 -53337 -28170 57216 27120 10002 28325 32129 20818 -56598 -51164 31836
189C1836l0889n4978o062M6337O1588o8642n7616P1096N1206J1538m1387l8594
$$ 31836 947 -54031 -60093 -13756 47832 -20810 -78426 -7330 43876 55414 14027 -24567
201b4567M8357q157l2500L5657Q615o600l9963l6147O4107K0527l4796O508j478
$$ -24567 23790 15633 -16867 18790 27405 20805 -19158 -55305 8802 29329 -5467 1041 -437
214d37J9178p872m3775L7524J6116k8920O513q076M973j7557m1454O4005N1821
$$ -437 18741 10869 -32906 4618 20734 -8186 -1673 -9749 -4776 -22333 -63787 218 52039
227E2039l8490l8579j9874N7781M6169n3315k486K7246j3916k0660l2951M3532
$$ 52039 13549 -25030 -44904 12877 59046 5731 3245 30491 16575 -4085 -37036 6496
239F496N1380o9906m2061L1475M1862J3070p4767j1327Q5060Q863l5581l3472
$$ 6496 57876 -12030 -54091 -22616 19246 32316 -42451 -53778 31282 40145 4564 -28908
251b8908M218N4541k3036k5496M2547n055k9070l0046Q727Q2864m302o6719p202
$$ -28908 -24690 29851 6815 -18681 23866 18811 -10259 -40305 -31578 51286 46984 -19735 -26937
264b6937J2492L8046L152l6330K0073q189k7687K5605P595L175k3364l6234N2690
$$ -26937 -14445 23601 26753 -9577 10496 2307 -25380 225 7820 10995 -12369 -48603 4087
277D087L1042l5857j9122j0701L6349K4720l2157J7118L628m1701j495K2015N5170
$$ 4087 35129 -728 -19850 -30551 5798 30518 -1639 15479 19107 -22594 -24089 -2074 53096
290E3096J949r8547j8331O2279M1374n285o7508n320M8958j8772m525K0823M864
$$ 53096 55045 -43502 -61833 446 41820 36535 -30973 -36293 12665 -6107 -10632 10191 15055
303A5055p772n4018J4518Q6521q028o1480m0149K8175Q5602j4685o1955l907J379
$$ 15055 7283 -46735 -32217 54304 46276 -15204 -55353 -27178 58424 43739 -18216 -22123 -20744
316b0744K2888J4612m268K0180m2536m7729M2919M8281K1302m5684o9769L0318
$$ -20744 2144 16756 12488 32668 -9868 -57597 -14678 33603 54905 9221 -60548 -30230
328c0230M1672P466P255l5672k0065O41P823O4004N942o7159k5668J9970O5779
$$ -30230 11442 18908 26163 -9509 -29574 -28933 -21110 42894 48836 -18323 -43991 -24021 41758
341D1758K1237o7627j9072J3381L801K2006j945M141j9796o4892K6431P8207J7593
$$ 41758 62995 -4632 -23704 -10323 -6522 15484 13539 17680 -2116 -67008 -40577 37630 55223
354E5223m5653q0323K0704R2836M694l4553k8336p862K6836j0192J1470L9866
$$ 55223 9570 -70753 -50049 42787 47481 12928 -15408 -23270 3566 -6626 4844 44710
366D4710l8531m9390k674N0054O9085m3204p6091J1956L7774L9533r688m6170
$$ 44710 6179 -43211 -45885 4169 73254 30050 -46041 -34085 3689 43222 33534 -12636
378a2636K341j1742m906M2209O633j9910m0763k2995O6921L8481k7609k3130k0425
$$ -12636 -10295 -22037 -26943 15266 21899 1989 -38774 -61769 5152 43633 16024 -7106 -27531
391b7531K5397L0900o947J4282k2594m7254J1939L2494L5040k2218p8033Q435
$$ -27531 -2134 28766 21819 36101 13507 -33747 -21808 10686 45726 23508 -54525 -46090
403d6090N4166J7530p879l7695M650K2603k2139J6848K8314j6042l2257l7715
$$ -46090 8076 25606 17727 -19968 -15318 7285 -14854 1994 30308 14266 -17991 -55706
415e5706M0192O7668l5071n3864o933L9002N2021k7226l0366K2263j763N84M218
$$ -55706 -15514 52154 17083 -36781 -43714 -4712 47309 20083 -10283 11980 10217 10801 15019
428A5019N099J6650m6816l8526M0400K8696k556m2070l5746M4086K6569q085L457
$$ 15019 20118 36768 -10048 -48574 -8174 20522 17966 -24104 -59850 -15764 10805 2720 6177
441F177j6946J916O785m28L6436r273m6069jJ6633L1110l829m5634J0130J9545
$$ 6177 -10769 -8853 -2068 -2496 33940 24667 -21402 -21403 -4770 26340 22511 -23123 -12993 6552
455F552q77J4380m861K067j0674l2633L4293L6009k8419m2816k9499L9860M5948
$$ 6552 5675 20055 15194 17261 6587 -26046 8247 44256 15837 -26979 -56478 -16618 29330
468B9330l8390k8085O623J5275K0871j3059J2537K9070l3545j8999K4073L3815
$$ 29330 -9060 -37145 -30522 -15247 5624 -7435 5102 34172 627 -18372 5701 39516
480C9516J3625o1762l5087M7183K6615o180l3418k3267L2834N952o099K1280j1100
$$ 39516 53141 -8621 -43708 3475 30090 23910 -9508 -32775 59 6011 -88 21192 10092
493A0092j7951j5482L957N0821n762n2255j5023O997L6440J4337k9626J304m325
$$ 10092 -7859 -23341 -19384 31437 25675 -26580 -41603 -34606 1834 16171 -13455 -12151 -16476
506a6476l432L7749J9002r0k9122l5990M1331L8857j8912l0450l2070J5606K4829
$$ -16476 -19908 17841 36843 36753 7631 -28359 12972 51829 32917 2467 -29603 -13997 10832
519A0832j6905Q115J103k8716o491J1282M7532J9408o5080l1122L2547M2722J4839
$$ 10832 -6073 2042 3145 -25571 -32062 -20780 26752 46160 -18920 -50042 -17495 25227 40066
532D0066n2325k7118K7826M599Q624J0992j641j455l4350O104O4264J1386l4754
$$ 40066 -12259 -39377 -11551 -6952 1672 12664 11023 9568 -24782 -18678 45586 56972 22218
545B2218m4955o159N7264J1066l5080j8499j9843R309J5996M030J9894k5423l6590
$$ 22218 -22737 -28896 28368 39434 4354 -14145 -33988 -24679 -8683 -4653 15241 -10182 -46772
558d6772K3523L4155K7379j7569m9077J0960K3912P995J1766k1053j7365q614
$$ -46772 -23249 10906 38285 20716 -28361 -17401 6511 14506 26272 5219 -12146 -20760
570b0760k446M9665J8700m2372k9946n6M8925L1630m1319k2532n10r17J3691k368
$$ -20760 -23206 26459 45159 2787 -27159 -27215 21710 53340 12021 -10511 -11021 -11938 1753 -615
584f15R190l603n0810j885M6338L1057p118n6351p395N7373J8249j0372k1786
$$ -615 8575 4972 -45838 -47723 -1385 29672 22554 -33797 -41192 16181 34430 24058 2272
597B272j2572J8467p083J095K6683j8058l0290j3170J9552N2938j0755m8801p236
$$ 2272 -10300 8167 1084 2179 28862 10804 -19486 -32656 -13104 39834 29079 -19722 -26958
610b6958J2887L2551R199k5379k902j7048j1326L0529J4097k834k7075l0043L3884
$$ -26958 -14071 18480 27679 2300 -602 -17650 -28976 1553 15650 12816 -14259 -44302 -10418
623a0418L0333o368o272j6955P319J3512o865K0921k014l5367p382J1182L3208
$$ -10418 19915 13547 7275 -9680 -2361 11151 4286 25207 23193 -12174 -19556 -8374 24834
636B4834L501n3303j1454K7428J9682P690k4920k580J3732j9963P139K7349N444
$$ 24834 28335 -24968 -36422 -8994 10688 18378 -6542 -9122 4610 -15353 -8214 19135 24579
649B4579j4721m3799K261N1659M661k2309k1239j62L1248n824j0977J8140n263
$$ 24579 9858 -33941 -31680 19979 24640 2331 -18908 -19070 12178 6354 -4623 13517 8254
662H254q636o081K679K8618j4189l1941Q164J1674J4421q142k5461J2879N185
$$ 8254 -382 -6463 -3784 24834 10645 -21296 -13132 -1458 12963 4821 -20640 -7761 -2576
675b576m659J7565j21k901j2159j6874K9100J6514j6641p365j1797P529O274j3733
$$ -2576 -7235 10330 10209 7308 -4851 -21725 7375 23889 7248 -117 -11914 -4385 1889 -11844
689a1844K0028R499k3215j0789j163K7230J6671l2007n707J3662O42m23j4966
$$ -11844 8184 17683 -5532 -16321 -17484 9746 26417 -5590 -11297 2365 3007 2584 -12382
702a2382J2071K0351k6976j1993J5398J5583O024l2221p201L5369L867j0667j3573
$$ -12382 -311 20040 -6936 -18929 -3531 12052 18076 -14145 -21346 14023 17890 7223 -6350
715f350n026J9653q713o804K2637n584j7627j6794K759M2812M666k9161j1245
$$ -6350 -11376 8277 -436 -7240 15397 9813 -7814 -24608 -21849 20963 25629 -3532 -14777
728a4777o421J7938J6609m296Q491j8668k5414J6493K0215J6107j2744l6212R483
$$ -14777 -21198 -3260 13349 9053 17544 -1124 -26538 -10045 10170 26277 13533 -22679 -13196
741a3196J7448K805O902j4290o440j293p132K9913J3070l1528k2736j984L9849
$$ -13196 4252 7057 13959 -331 -6771 -8064 -15196 14717 27787 -3741 -26477 -28461 11388
754A1388K9121l4954k6801j879J1176K6060R02k93n984l9726j674L9795L1893
$$ 11388 40509 5555 -21246 -23125 -11949 14111 15013 14720 8736 -30990 -32664 7131 39024
767C9024j033n5958k7448L8259K8918P626k0139k7790N949Q30J0363K7678j3329
$$ 39024 37991 -17967 -45415 -7156 21762 29388 9249 -18541 -12592 -11762 -1399 26279 12950
780A2950k7561j6525J1827M9273K233m0200j8555J364L4449K3673j7322j4087
$$ 12950 -14611 -31136 -19309 29964 32197 -8003 -26558 -25194 9255 32928 15606 1519
792A519k5738r163L9283K7442p42l6836m4695K3837M2640J3393o401l6125j5059
$$ 1519 -24219 -33382 5901 33343 32601 -4235 -48930 -25093 17547 30940 24539 -11586 -26645
805b6645J1406J1657L4023K051m2284k4876N093M5290K7259m1591l0479N211K2759
$$ -26645 -15239 -3582 30441 32492 -9792 -34668 -29575 15715 42974 1383 -29096 -23885 -1126
818a126K7610j2219j5277l252j8176J4942L2011P044j9058n0105n926N4515K5873
$$ -1126 26484 14265 -1012 -4264 -22440 -7498 24513 31557 12499 -37606 -43532 10983 36856
831C6856j3100l8716k6194K7000K2481J0301Q334k7320k2077J81K0216L9822j1072
$$ 36856 23756 -14960 -41154 -14154 8327 18628 26962 -358 -22435 -22254 -2038 37784 26712
844B6712m2940j0234J0247L0478J0206k6260p913n658L983K8666L929j2495k2986
$$ 26712 -16228 -26462 -16215 14263 24469 -1791 -9704 -15362 -11379 17287 21216 8721 -14265
857a4265j6863L5901K6698j6231k3319k3220J3390K7092p15N291j0662k6679L300
$$ -14265 -31128 4773 31471 15240 -8079 -31299 -17909 9183 8468 13759 3097 -23582 -20282
870b0282J7278L2391P233m5792j7866J9504K3228J2003k7366j5320J1888m846
$$ -20282 -3004 29387 36620 -9172 -27038 -7534 15694 27697 331 -14989 -3101 -7947
882g947O351Q621l632k396k0510M730L5279j399k0657j8899J622L5011K557k0445
$$ -7947 -1596 7025 3393 997 -19513 -14783 20496 19097 -1560 -20459 -18837 16174 18731 -1714
896a714n622r816Q141J2270K751J2333j7385k1695J4586J6224J4391q051k7516
$$ -1714 -7336 -17152 -9011 3259 6010 18343 958 -20737 -6151 10073 24464 16413 -11103
909a1103N672P303j136Q844r456o054l860p956K2344O992j9676m871J152K0503
$$ -11103 -5431 1872 736 9580 124 -5930 -9790 -17746 4598 11590 -8086 -12957 -11805 8698
923H698J0426k4328j887O807q84O784m859N011K276k5126L518K2120Q333l130
$$ 8698 19124 -5204 -7091 -284 -1168 5616 757 5768 8044 -17082 -13564 8556 16889 13759
937A3759k6326p65K6874k117o725m317l439R428j3604n302J7800n351q300n066
$$ 13759 -12567 -13332 13542 11425 4700 383 -3056 6372 -7232 -12534 5266 -85 -8385 -13451
951a3451K147K1829p437j6129J0395N208Q100k669j3010J1087k023q549J0183
$$ -13451 -11304 10525 3088 -13041 -2646 2562 10662 7993 -5017 6070 4047 -4502 5681
964E681j439L18n423j2315J6120N677r871L149l546N093Q44j3523J2135N007j2627
$$ 5681 4242 4560 -863 -13178 2942 8619 -1252 1897 -1649 3444 4288 -9235 2900 7907 -4720
979d720m58m231Q060M188j7968Q799J2523n565k431q419J3169J6996j7880n462
$$ -4720 -5178 -9409 -1349 2839 -15129 -6330 6193 628 -1803 -10222 2947 19943 2063 -3399
993c399O824L101M919j5628j068J5236j1124o047L119M625J0076j7442r078K0515
$$ -3399 3425 6526 11445 -4183 -5251 9985 -1139 -7186 -4067 558 10634 -6808 -15886 4629
1007D629L885k685j0324q893J6840O5p852P382o861j895q86j394K0233k334j7054
$$ 4629 8514 5829 -4495 -13388 3452 3517 -4335 3047 -3814 -5709 -6595 -7989 12244 9910 -7144
1022g144K602K811J2924M000j5998K824k657n707J2678L93k507r585j6680J8808
$$ -7144 -4542 -1731 11193 15193 -805 2019 -638 -6345 6333 6726 4219 -5366 -22046 -3238
1036c238J6305q614p545j1930R429J5320q797M260J8j3043P22N12J5800J0197
$$ -3238 13067 4453 -3092 -15022 -5593 9727 930 5190 5208 -7835 -7113 -6601 9199 19396
1050A9396k7874j0655J2245J5382J1614k0758j2115J3352L63O305K814p436n65
$$ 19396 -8478 -19133 -6888 8494 20108 -650 -12765 587 950 7255 10069 2633 2068
1063B068j5194r2K6013P89j3005j6908n377K7786Q323j0684m273j1337N243J1202
$$ 2068 -13126 -13218 12795 13584 579 -16329 -21706 6080 14403 3719 -554 -11891 -6648 4554
1077D554J493R438j3906j9185R959J0870J1340n683k3807N000R655L863R228j0173
$$ 4554 6047 15485 1579 -17606 -7647 3223 14563 8880 -14927 -9927 -272 3591 12819 2646
1091B646p625j870l051K2455P647k1058j2618m271K0853J7552j8034r769k168
$$ 2646 -4979 -6849 -9900 12555 20202 -856 -13474 -17745 3108 20660 2626 -7143 -9311
1104i311o31J3998J172L758n02k4086N97J9540J1169q5k7303r027K2879O715k62
$$ -9311 -9942 4056 5228 8986 8484 -15602 -15005 4535 15704 15619 -11684 -20711 2168 8883 8621
1119H621r052j1101R732j63K654J3470j0637j1363l086O351K4417n515k2792l156
$$ 8621 -431 -11532 -1800 -1963 691 14161 3524 -7839 -10925 -4574 19843 14328 -8464 -11620
1133a1620J743J6152Q097j3170k317q825m076J9112N819k124j1849j6360J6180
$$ -11620 -9877 6275 14372 1202 -1115 -9940 -14016 5096 10915 8791 -3058 -19418 -3238
1146c238J3410m081k139j2120K015Q792l676R658j874j6025J516N305J4653L557
$$ -3238 10172 6091 3952 -8168 -6153 2639 -1037 8621 6747 -9278 -7762 -2457 12196 15753
1160A5753k5403l947J2720Q317O211j5085o536P682o504O904Q702m143m286j6053
$$ 15753 -9650 -13597 -877 7440 13651 -1434 -7970 -288 -6792 112 8814 4671 385 -15668
1174a5668K982K4209j504j0058r391k013J8862j033q020M495n629K060L456k458
$$ -15668 -12686 11523 10019 -39 -9430 -11443 7419 6386 -1634 2861 -2768 -708 2748 290
1188B90R030q846j1531J0679N049M049o122j5673R363O723q57N458q932l959J217
$$ 290 9320 474 -11057 -378 4671 8720 2598 -13075 -3712 3011 2154 7612 -1320 -5279 -4062
1203d062k763J5333R65j5425j402R1J0554N538j4253K080M461k533N769l955K169
$$ -4062 -6825 8508 9473 -5952 -7354 -7263 3291 8829 -5424 -3344 1117 -1416 4353 398 2567
1218B567K611j2289O962J0715n188n588j3092O572J9564p172q975m522p50J2969
$$ 2567 5178 -7111 -149 10566 5378 -210 -13302 -6730 12834 5662 -3313 -7835 -8585 4384
1232D384k462j509P394j0912m100M353N037J1410j2991j4360R857N676N779m264
$$ 4384 1922 413 7807 -3105 -7205 -2852 2185 13595 604 -13756 -3899 1777 7556 3292
1246C292j3059P929K832n9Q611p358n164j329j118J6686K32j6148l968k173J1296
$$ 3292 -9767 -1838 994 935 9546 2188 -2976 -4305 -5423 11263 11495 -4653 -8621 -10794 502
1261E02R954j0203j023n543n310J3948O558J944p693j8630R723J5462l52m354
$$ 502 10456 253 -770 -6313 -11623 2325 8883 10827 3134 -15496 -5773 9689 9337 4983
1275D983j5195P44J2310k945L589j64r714J162n24J1619J1992j7798j2060L531
$$ 4983 -10212 -9468 2842 -103 3486 3322 -6392 -5230 -5754 5865 17857 59 -12001 -8470
1289h470J0571J5263j2210j5874L052L20R596O288o523k27j1131k001J9446N234
$$ -8470 2101 17364 5154 -10720 -7668 -7348 2248 8536 2013 1786 -9345 -11346 8100 13334
1303A3334m400j2424j1425J5230Q881m191k543j2512k6Q555J964Q844p405j4335
$$ 13334 8934 -3490 -14915 315 9196 5005 2462 -10050 -10076 -1521 443 9287 1882 -12453
1317a2453O639P565J0491q31j8303M51N252K847Q337p015o877k722n510J5656
$$ -12453 -5814 1751 12242 11411 -6892 -6441 -1189 1658 9995 2980 -3897 -6619 -12129 3527
1331C527J0372j0266q845q078J1227J7135q740o950l750l062R082j057N41L432
$$ 3527 13899 3633 -5212 -13290 -2063 15072 6332 -618 -4368 -7430 1652 595 1136 4568
1345D568j4163j965R853O982O434j5131q812J4025O094K934n954j1355O094O90
$$ 4568 -9595 -11560 -1707 5275 11709 -3422 -12234 1791 7885 10819 4865 -6490 -396 294
1359B94o0Q142p814o416j873J76J5727K57j2561r51j485R036O666q372k01m923
$$ 294 234 8376 562 -5854 -7727 -7551 8176 8433 -4128 -5079 -6564 2472 9138 766 565 -4358
1375d358m565J0880J548p32m709j0774J0754R233l662n92o774L063P646m972L884
$$ -4358 -8923 1957 3505 2773 -1936 -12710 -1956 7277 3615 3023 -3751 -688 6958 1986 5870
1390E870p17r286J376n05P006M657j5904l694P233N540O504j0294n226Q149k105
$$ 5870 5153 -4133 -2757 -3262 3744 8401 -7503 -11197 -3964 1576 8080 -2214 -7440 709 -1396
1405a396L372K760m302J800q078r88J2937j696m122m839k860J3271O63o769K474
$$ -1396 1976 4736 434 2234 -5844 -6832 6105 4409 287 -4552 -7412 5859 6522 -247 2227
1420B227l608L562L322n199L916n072o600P230N72J483k565j0184P219N056j590
$$ 2227 -1381 2181 5503 304 4220 -852 -7452 -222 350 1833 -732 -10916 -3697 1359 -231
1435b31M265n578j110L496l434Q738Q48r344o5p11N833M171j1000J031M704r95
$$ -231 4034 -1544 -2654 842 -2592 6146 6994 -2350 -2415 -3126 2707 6878 -4122 -3091 1613 618
1451F18L674n706M45N984o851J977M225l523o41q110J893J2622m888n394k533
$$ 618 4292 -1414 -969 5015 -1836 141 4366 843 202 -7908 -6015 6607 1719 -3675 -6208
1466f208j037J1735j330m515M385m630J046K801j669O456n548p736O995N92K113
$$ -6208 -7245 4490 3160 -1355 3030 -1600 -554 2247 578 7034 1486 -6250 745 1337 3450
1481C450k487q818P118L906j950L082p093j249M257j027Q473l230j1677J125J736
$$ 3450 963 -7855 -737 3169 1219 4301 -2792 -4041 216 -811 7662 4432 -7245 -6120 -4384
1496d384P541M272j0800j062P80m24Q975m33j523j754r380P638R184l412m008
$$ -4384 3157 7429 -3371 -4433 -3653 -4077 4898 4465 2942 1188 -8192 -554 8630 5218 1210
1511A210r334L393J2479m142l833l191l387Q244J129Q16L057j1632l309O649O114
$$ 1210 -8124 -4731 7748 3606 -227 -3418 -6805 1439 2568 3384 6441 -5191 -8500 -1851 4263
1526D263Q204j1474j3073N441N515Q681j20j1644k51j288K768J1846k817n822
$$ 4263 12467 993 -12080 -6639 -1124 7557 7437 -4207 -4458 -5746 -2978 8868 6051 229
1540B29m988l456J3274M672q082l502o153N875R705l654q31p683o477J1522O399
$$ 229 -4759 -8215 5059 9731 1649 -1853 -8006 -2131 7574 3920 3089 -4594 -11071 451 6850
1555F850K087o723j5152M936J1318L943J282j1845o059M914J722J0255K000j1949
$$ 6850 8937 2214 -12938 -8002 3316 7259 8541 -3304 -9363 -4449 -2727 7528 9528 -2421
1569b421n241j869J0452J2957r863r242j802L593J2549k546p190n58n356N647
$$ -2421 -7662 -9531 921 13878 4015 -5227 -7029 -3436 9113 6567 -623 -1181 -6537 -890
1583h90P932j993j518j1480l825J4190N923q38r611j1738Q616Q662L040J520j1928
$$ -890 7042 5049 3531 -7949 -11774 2416 8339 7501 -2110 -13848 -5232 3430 6470 7990 -3938
1598c938n244M582M395J0892l996j2991k29J332R543N109r641k649j185J064J0678
$$ -3938 -9182 -4600 -205 10687 6691 -6300 -6529 -5197 4346 9455 -186 -2835 -4020 -2956 7722
1613G722j321n045m597n857J1069P906o508o009q290M519J2217k015j107n169
$$ 7722 6401 1356 -3241 -9098 1971 9877 3369 -2640 -10930 -6411 5806 3791 2684 -2485
1627b485o914O136M340N672K541j3314m553O092O206P109r463r037M805J646N302
$$ -2485 -9399 -3263 1077 6749 9290 -4024 -8577 -2485 3721 10830 1367 -7670 -2865 -1219 4083
1642D083Q99p190J394j976J264R344l673n038l500j879J1206J794p848k558n089
$$ 4083 4982 -2208 -814 -2790 -1526 7818 4145 -893 -4393 -6272 4934 6728 -1120 -3678 -8767
1657h767N355P593k276M90n677m791Q833L689J873j958j0316L726M408l77K741
$$ -8767 -3412 4181 1905 2395 -3282 -8073 760 4449 6322 4364 -5952 -2226 2182 1805 4546
1672D546o001k494L300k123N957O90p178P91O19N426M653j0055k429K453J301
$$ 4546 -1455 -3949 -649 -2772 3185 3875 -3303 -2512 -1893 3533 8186 -1869 -4298 -1845 -544
1687e44N642m936m201K531m272M015N410k085N31o223o24J0545m38k111l593m417
$$ -544 5098 162 -4039 -1508 -5780 -1765 3645 1560 2091 -4132 -4756 5789 5351 3240 -353 -4770
1703d770P487J90l632J308m871J403L729j756M149l765m574N861J289K765o41
$$ -4770 2717 2907 -725 583 -4288 -2885 844 -912 3237 -528 -5102 759 2048 4813 4172
1718D172q571K228K265m5M323n663l394J573j188P788R70o887R16p23M564M683
$$ 4172 -4399 -2171 94 49 4372 -1291 -4685 -3112 -4300 3488 4458 -2429 -1513 -2236 2328 7011
1734G011o816n05j7k237N292j958j558K35o575M573O594j427m72o888P11R624
$$ 7011 195 -310 -327 -2564 2728 770 -788 -553 -7128 -2555 4039 2612 2140 -4748 -4037 5587
1750E587r52j167l518m858N203K41m94L189p197j523K975J365P003l883o743L489
$$ 5587 4635 3468 -50 -4908 295 536 42 3231 -3966 -5489 -2514 -1149 5854 1971 -4772 -1283
1766a283J513M938R24q114M02k57M29O317l745l913q01k120Q479K610m764m28
$$ -1283 230 5168 6092 -2022 -1620 -1877 -1448 4869 1124 -2789 -3590 -5710 2769 5379 615 187
1782A87l810L110O374l021j6m281n042O235J943L26j804r067L896O896P27J520
$$ 187 -3623 -513 5861 2840 2824 -1457 -6499 -264 1679 2005 201 -8866 -4970 1926 2653 4173
1798D173o542j677O221l49L408n98p271K66r52L908O641p438m953L58K260R104
$$ 4173 -2369 -4046 2175 1826 5234 4636 -2635 -2369 -3321 587 7228 -210 -5163 -4805 -2545 6559
1814F559k311o289Q81j627M804L658m902n51m659j631Q035L89j616l471o080P798
$$ 6559 4248 -2041 -1160 -2787 2017 5675 773 222 -4437 -6068 1967 2356 740 -2731 -8811 -1013
1830a013N416n14K15p636j74O605O67L905n239q616L313K183M610J495r422n47
$$ -1013 4403 3889 4104 -3532 -3706 2899 3566 7471 2232 -6384 -3071 -888 3722 5217 -4205 -4752
1846d752K110K070O751l704m267k62k204P424L720p016l147m222M325R490m261
$$ -4752 -2642 -572 6179 2475 -1792 -2054 -4258 3166 6886 -130 -3277 -7499 -3174 6316 2055
1861B055l342l014j836Q829K422p28n47q473J111O510J942K243q196p164N783
$$ 2055 -1287 -4301 -6137 2692 5114 4386 3839 -4634 -3523 2987 4929 7172 -1024 -8188 -2405
1876b405K955L840j676q880K222K296K432N468n839l731Q81k4P802m87p475j208
$$ -2405 550 4390 2714 -6166 -3944 -1648 784 6252 413 -3318 -2437 -2461 5341 4854 -2621 -3829
1892c829k115N602O607m900k092l409q28R449J436j820l229p254N119N692j016
$$ -3829 -5944 -342 6265 1365 -727 -4136 -4964 4485 5921 4101 872 -6382 -1263 4429 3413
1907C413j69p112j768N438l58L440j592o393K481J268M047L474q359k294L265
$$ 3413 3244 -3868 -5636 -198 -556 2884 1292 -5101 -2620 -1352 2695 6169 -2190 -4484 -1219
1922a219J832N762n124n881K437n26M844K739n113l33k931P78Q361j201k570l221
$$ -1219 613 6375 1251 -4630 -2193 -2719 2125 4864 -249 -582 -3513 -2735 5626 4425 1855 -1366
1938a366m127P027K481l216k52n262J367N093j732J865l363m021O153Q15J503
$$ -1366 -5493 1534 4015 799 547 -4715 -3348 1745 13 1878 -1485 -5506 647 1462 2965
1953B965o57p032K695L352L31L265n944l701L062L64O158k70p406K30j19M253
$$ 2965 2308 -4724 -2029 1323 1654 4919 -1025 -4726 -1664 -1300 4858 4588 -2818 -2588 -2707 1546
1969A546N315o477k084q3o25N940j296l245M38m538M042M710k725j35n648n3Q782
$$ 1546 6861 384 -1700 -1783 -2408 3532 2236 -1009 -571 -5109 -1067 3643 918 783 -4865 -4918 3864
1986C864j63j344l510n260O361L291r1O28p393r14M448J114N129l831p228K425
$$ 3864 3701 2357 -1153 -6413 -52 3239 3148 3776 -3617 -4531 -83 1031 6160 2329 -4899 -2474
2002b474J071N110K011p534j017q2J872O753l781m375p23j504P210K362n509j185
$$ -2474 -1403 3707 5718 -1816 -2833 -2915 -1043 5710 1929 -2446 -3169 -4673 2537 4899 -610 -1795
2018a795l617L189P208k544o30m091m247P248L446L68j496r047J758O568J328
$$ -1795 -5412 -2223 4985 2441 1811 -2280 -6527 721 4167 4535 3039 -6008 -4250 2318 3646
2033C646K075p254m336M633R66M353k54p136M48m2K865O495n442m223n18L04Q092
$$ 3646 5721 -1533 -5869 -1236 -270 4083 3829 -3307 -2859 -2901 -36 6459 1017 -3206 -3724 -3420 4672
2050D672k31o112j071k652N158N985l694j193m085j460P599J615p33k724p017
$$ 4672 4441 -1671 -2742 -5394 -236 5749 2055 862 -3223 -4683 2916 4531 3798 1074 -5943
2065e943M153M506K7J314o965k582M453J195M585k581o934K222J290L862K629
$$ -5943 -1790 2716 2743 4057 -2908 -5490 -1037 158 4743 2162 -4772 -2550 -1260 2602 5231
2080E231p106j158Q35O15O000k347l976q1k640O032M118m220j189m378K006P791
$$ 5231 -1875 -3033 -2198 -1583 4417 2070 -1906 -1987 -4627 1405 5523 1303 114 -4264 -2258 5533
2096E533j687k139l062l762N678J663o68L98o365K00M351N85L528m116n145M102
$$ 5533 3846 1707 -1355 -5117 561 2224 1556 1954 -4411 -4211 140 725 4253 137 -5008 -906
2112i06J298L116J16o983R05J258J207M407m565l189J435o10O243M09n090K88
$$ -906 392 3508 3624 -3359 -2454 -1196 11 4418 -147 -3336 -1901 -2511 3732 4141 -949 -661
2128f61j918K873N161l480j513k868k469O774N80j330j405n598L683M183n93J420
$$ -661 -2579 294 5455 1975 462 -2406 -4875 1899 2479 1149 -256 -5854 -2171 2012 1419 2839
2144B839n002j333M957q11K242r75n455K352M08J495L604o121j529J912R74N393
$$ 2839 -2163 -3496 1461 650 2892 1917 -3538 -1186 -778 717 4321 -1800 -3329 -1417 -443 4950
2160D950k391m699J547j072L833K758n265j50k687l75N947j001j392j104m242
$$ 4950 2559 -2140 -593 -1665 2168 4926 -339 -489 -3176 -3551 2396 1395 3 -1101 -5343
2175e343N007K587j263J135m409K26M354j493J500k274l817M027j78J015P91n178
$$ -5343 -336 2251 988 2123 -2286 -2060 2294 801 2301 27 -3790 237 59 1074 1865 -3313
2191c313J428K581m83M013l526k643K052j495M031J160n374J92j969J702M679
$$ -3313 -1885 696 213 4226 700 -1943 109 -1386 2645 3805 -1569 -1377 -3346 -1644 3035
2206C035l545o04k6j705M542n48j667K379l381J686K242k714J452k353j224M706
$$ 3035 -510 -1114 -1140 -2845 1697 1149 -518 1861 -1520 166 2408 -306 1146 -1207 -2431 2275
2222B275j699k07o82l581M391J950j308J721m725M3L354j601K371j560m025K577
$$ 2275 576 369 -313 -3894 497 2447 1139 2860 -1865 -1822 1532 -69 2302 742 -3283 -706
2238g06q18J022K539m424J295Q34o78L945k937j743K101j061L695k94n059J065
$$ -706 -1524 -502 2037 -2387 -1092 -258 -936 3009 72 -1671 430 -631 3064 2770 -2289 -1224
2254a224j026K130M393l885j384p81j588O043M50j701j88m980K114M101j145P52
$$ -1224 -2250 -120 4273 388 -996 -1777 -3365 2678 3128 1427 1239 -3741 -1627 2474 1329 2081
2270B081m531k253M979j69J340p33m897L173J912O23K467n508j433K922M98M308
$$ 2081 -2450 -4703 276 107 1447 714 -4183 -1010 902 1525 3992 -1516 -2949 -27 471 4779
2286D779j990o037N66l02M687L965n571j768k107O72P444o93k564j808m581M620
$$ 4779 2789 -3248 -2682 -2984 1703 5668 97 -1671 -3778 -3106 4338 3645 1081 -727 -5308 -688
2302f88L576j488j8m947j104N367N11J503k658n035M142K339J842O52o968l13
$$ -688 2888 1400 1382 -3565 -4669 698 1209 2712 54 -4981 -839 1500 3342 3994 -2974 -3287
2318c287L152J655L874m124n185J332m12N661K702n500j609k644J993P068j168
$$ -3287 -135 1520 5394 1270 -3915 -2583 -2995 2666 5368 -132 -1741 -4385 -2392 4676 3508
2333C508k593k907l274N627K509j545l39n085J011M616n52J983l410l786M415
$$ 3508 915 -1992 -5266 361 2870 1325 986 -4099 -3088 1528 976 2959 -451 -4237 178
2348A78J289K170m08o853Q50K582J703L775m953m097J284M75N347P61n141n32
$$ 178 1467 3637 3229 -3624 -2774 -192 1511 5286 333 -3764 -2480 -2005 3342 4103 -1038 -1570
2364a570j926K358N143k775q65k080k382N225P39j438j65m229K626L650j442R99
$$ -1570 -3496 -1138 4005 1230 365 -1715 -4097 1128 1867 429 264 -3965 -1339 2311 869 1868
2380A868l514j190M782j49R67j496m742K376J449J054K531n265j870J804K48M753
$$ 1868 -1646 -2836 1946 1797 2764 1268 -3474 -1098 351 1405 3936 -1329 -3199 -1395 -1147 3606
2396C606j481m350R25j128K958K761m027L73j203k57M273k178p74M71k449L379
$$ 3606 2125 -2225 -1300 -2428 530 3291 -736 -363 -1566 -1823 2450 272 -502 -31 -2480 899
2412H99J607k178N19l152R80M350j483M17k444l176M048J070J56M58n004R33K257
$$ 899 2506 328 847 -2305 -1325 3025 1542 1959 -485 -3661 387 1457 1613 2071 -2933 -2000 257
2429B57m01K740k742k220J812p89K867O04l879R91n11J090L410l463j153P77r34
$$ 257 -144 2596 -146 -2366 -554 -1343 1524 2128 -1751 -760 -1271 -181 3229 -234 -1387 -610 -1544
2446a544M421n82l195P62k195K629K912k405M8k469j311M421m07J48m43m310K430
$$ -1544 2877 2295 -900 -138 -2333 296 3208 803 851 -1618 -2929 1492 1085 1233 790 -3520 -1090
2463a090K131m65J588m060n46L187j022K316j365l077K416n21J506J988m214J38
$$ -1090 1041 576 2164 -1896 -2442 745 -277 2039 674 -2403 13 -508 998 2986 -1228 -1090
2479a090N39j04L733j639k601O56j627L434J544l222M31j970M02M032k027j10
$$ -1090 -551 -655 3078 1439 -1162 -506 -2133 1301 2845 -377 54 -1916 -1514 2518 491 381
2495C81q03k395L403K54j013J252l639J130L082j665J756k321k091L652m03J100
$$ 381 -422 -2817 586 840 -173 1079 -2560 -1430 1652 -13 1743 -578 -2669 983 580 1680
2511A680J8m153K002Q50QK294l287r77J606j251L062m61k886J375j543J816K400
$$ 1680 1698 -2455 -453 397 405 2699 -588 -1565 41 -1210 1852 1391 -1495 -120 -1663 153 2553
2528B553l476L30o28m80L662j457j307M57k130K950J705k186R68k641N2L646j197
$$ 2553 -923 -593 -1221 -1701 1961 504 -803 -346 -2476 474 2179 -7 961 -1680 -1628 2018 821
2545H21Q54j100l427L080N61K23J144m401L70K503n23K564k578k622K074l64K351
$$ 821 1675 575 -2852 228 789 1012 2156 -2245 -1875 628 105 2669 91 -2531 -457 -821 1530
2562A530P02m020M73j94O24L902k623j373k50j424M364R04k532J68k632J747L285
$$ 1530 2232 -1788 -1315 -1509 -885 3017 394 -979 -1229 -2653 1711 2615 83 251 -2381 -634 2651
2579B651j511J73k400j694L803R3q6J51m105J656K016j43J823l489j903K810j42
$$ 2651 1140 1313 -1087 -2781 1022 1115 1029 1180 -2925 -1269 747 604 2427 -1062 -2965 -155 -297
2596b97K872j048m200J107J81J745K785l472n86j33m98M137n27k109J38k392K547
$$ -297 2575 1527 -2673 -1566 -1385 360 3145 -327 -913 -1046 -1544 2593 2066 -43 95 -2297 250
2613B50K443k267L41k324m99L719o77p6j290k711K994J358n46Q11l691J7K673
$$ 250 2693 426 767 -1557 -2056 1663 986 910 -380 -3091 -97 1261 715 1526 -2165 -2148 525
2630E25l52K199k012l193J932L8K035J397l810K25L99L58L428k358j509Q54j465
$$ 525 173 2372 360 -2833 -901 -863 1172 2569 -1241 -1016 -617 -259 3169 811 -698 156 -1309
2647a309K628O83k579N47j770N87L367j796l11j284j389L656N56r24p9l476J364
$$ -1309 1319 2002 -577 -30 -1800 -1213 2154 358 47 -1237 -2626 1030 1586 662 583 -2893 -1529
2664a529K756n87J212k898j602L044l71J669K6l394J195K98P83K381l244q89R61
$$ -1529 1227 640 1852 -1046 -2648 396 25 1694 1720 -1674 -479 -181 602 2983 -261 -1150 -189
2681a89n01K936j121k709O38r45K344J883k890j94p75j76L751q32q62l90l165
$$ -189 -690 2246 1125 -1584 -946 -1891 453 2336 -554 -748 -1523 -1699 2052 1220 358 -32 -3197
2698c197L067J897j077Q67l421j16K922l62J305j247k810K480J23Q66P32l405
$$ -3197 -130 1767 690 1557 -1864 -1980 942 580 1885 638 -2172 308 431 1297 2029 -1376
2714a376N63Q53k04K541k191k226J349n54K264J304l506K86o90P42L240j819p38
$$ -1376 -813 40 -164 2377 186 -2040 -691 -1245 1019 2323 -1183 -897 -1587 -845 2395 576 -162
2731a62p03j350L421K33j248N95k650J088K349j224R85j501j735L034m09K00J59
$$ -162 -865 -2215 1206 1439 191 786 -1864 -776 1573 349 1334 -167 -1902 1132 723 923 1082
2748A082l308J807J035k43J392l129j029K532o51K070n20l027J381l85J379K132
$$ 1082 -2226 -419 616 373 1765 -1364 -2393 139 -512 1558 1038 -1989 -608 -993 386 2518
2764B518k908j43l0p15L489j176j576N68j695K440J205k147L80j697K23L311j353
$$ 2518 -390 -533 -563 -1278 2211 1035 -541 27 -1668 772 1977 -170 210 -1487 -1264 2047 694
2781F94k70j038k186L215Q13m60J30l553O82K580K00J182k389k337K280J90K098
$$ 694 424 -614 -2800 415 1228 768 898 -2655 -1973 607 807 1989 -400 -2737 -457 -267 1831
2798A831L54l774M84N50Q16K659k466j594N06r20L561J59k557J76j872J756K960
$$ 1831 2185 -1589 -1105 -555 261 2920 454 -1140 -634 -1554 2007 2166 -391 -215 -2087 -331 2629
2815B629j953n83j850j006L947M23p22q15l373J919K351o8J294l249j928K829
$$ 2629 676 93 -1757 -2763 1184 1607 885 70 -3303 -1384 967 899 2193 -1056 -2984 -155
2831a55M38K290p51l933R66M99J560K328l406j255N41k62L361o51k320J3j569
$$ -155 283 2573 1822 -2111 -1145 -646 914 3242 -164 -1419 -878 -1140 2221 1570 -750 -737 -2306
2848b306K298K719k360k04k164l53L733j84k46j414k606K605J652m6P45l482m39
$$ -2306 -8 2711 351 147 -2017 -2370 1363 1179 933 -481 -3087 -482 1170 1124 1869 -1613 -2052
2865b052K392j17K127j292k988J363OJ727J368l041m43o5J17L186j451j620K36
$$ -2052 340 223 2350 1058 -1930 -567 -561 1166 2534 -507 -950 -1015 -898 2288 837 -783 -547
2882e47j158K196J177k190O30j719M97K736j223L9p32k159K981P33o22N14k720
$$ -547 -1705 491 1668 -522 108 -1611 -1114 1622 399 438 -294 -2453 528 1261 639 1153 -1567
2899a567Q24J718p37J737j872j565J826p15J066P28k665J111k31l42J991j845
$$ -1567 -743 975 238 1975 103 -1462 364 -351 715 1443 -1222 -111 -342 -684 1307 -538
2915e38l31Q49j017J886k99j711J157r60J095J512k297L27m5n07K360r72n44M69
$$ -538 -869 -20 -1037 849 550 -1161 -4 -964 131 1643 -654 -327 -372 -879 1481 509 -35 434
2933D34j783J487R93j295J063j484k87J972j335O09m57j460K203l58l87N70k284
$$ 434 -1349 138 1131 -164 899 -585 -872 1100 -235 374 -83 -1543 660 302 -85 485 -1799
2950a799J320J351q57J125j693j147K092o08J387L08l002J085j41O74K203k358
$$ -1799 -479 872 15 1140 -553 -1700 392 -216 1171 1479 -1523 -438 -579 95 2298 -60
2966f0n98J87m67K639n27j781P34j345J210J917k228J48q24l99K885p56r07j38
$$ -60 -658 -471 -938 1701 1174 -607 127 -1218 -8 1909 -319 -171 -995 -1394 1491 735 -172 -310
2984c10j918K142J581p60L63k908l31K932n5J164j288k676J447M73R84J603l112
$$ -310 -2228 -86 1495 735 1098 -1810 -2141 791 736 1900 612 -2064 -617 -144 840 2443 -669
3001f69j95M98j01K645j252j972P58q66J887J113k486k97r30J084K841j374r34
$$ -669 -864 -366 -467 2178 926 -1046 -288 -1154 733 1846 -640 -937 -1867 -783 2058 684 -250
3018b50j052j351L608R25j042j80l006P59K707J89J082k260k576K232N13J642
$$ -250 -1302 -2653 955 1880 838 658 -2348 -1589 1118 1307 2389 129 -2447 -215 298 1940
3034A940r4l366L67Q53N42K117k349j591R23n00L112m97k652J60j078J931K752
$$ 1940 1846 -1520 -1153 -300 242 2359 10 -1581 -658 -1158 1954 1457 -1195 -1035 -2113 -182 2570
3051B570j952j193j116o00L890M69j075r60k784J901K441r1J07k523j185K269
$$ 2570 618 -575 -1691 -2291 1599 2068 993 33 -2751 -850 1591 1500 1607 -916 -2101 168
3067A68N04J129o89l202J218Q07R68J404l284o41P25M54K498j203k527M63m62
$$ 168 672 1801 1112 -2090 -872 -65 903 2307 -977 -1618 -893 -439 2059 856 -1671 -1208 -1670
3084a670K539J844k729p10j313N87L683m60j253q18k511K958J828q37p5k871J66
$$ -1670 869 2713 -16 -726 -2039 -1452 2231 1771 518 -300 -2811 147 1975 1138 1063 -1808 -1642
3101a642K420j92J080j771k376K334M48P73M16l317J87J216P30K104k253k115
$$ -1642 778 586 1666 -105 -2481 -147 301 1074 1490 -1827 -1640 -424 306 2410 157 -1958
3117a958O65J27K875Q67k980n53q00J412L225j688r55j042j381L293M71q62j26
$$ -1958 -1293 -1166 1709 2576 -404 -957 -1757 -345 2880 1192 237 -805 -2186 1107 1578 716 590
3134E90k676J070K344p56N40k261j111K647K73N87m87l171J270J344N46J457l046
$$ 590 -2086 -1016 1328 572 1112 -1149 -2260 387 660 1247 760 -2411 -1141 203 749 2206 -840
3151h40j091J192K78K751m94k932L17n99J917K298k365l88j341m44L272o0j173
$$ -840 -1931 -739 -461 2290 1796 -1136 -819 -1418 499 2797 432 44 -1297 -1741 1531 1471 298
3168B98m00k211K232J413r65L36k182m20K718k92Q99j540k575K307R38N05P60
$$ 298 -102 -2313 -81 1332 367 703 -1479 -1899 819 527 1426 -114 -2689 -382 556 1061 1821
3185A821l236l74J541K28K315j398k079P94o79J909J304k449K09r88K9K888j416
$$ 1821 -1415 -1789 -248 -20 2295 897 -1182 -388 -1067 842 2146 -303 -94 -1082 -1053 1835 419
3202D19p10j84j161K056O65j263L73j896R16J945r41N38j373j499K560M5M69K20
$$ 419 -291 -475 -1636 420 1085 -178 195 -1701 -785 1160 219 757 -616 -2115 445 490 959 1179
3220A179k857J005J093j26J536j832r65Q36j93J495j15j982P13k24L09J812k134
$$ 1179 -1678 -673 420 294 1830 -2 -967 -131 -324 1171 1056 -926 -213 -437 -128 1684 -450
3237d50n1J56p93K299o74j220N60j471J646J442j798O10j145j31K270p81O5k90
$$ -450 -501 -345 -1138 1161 487 -733 -173 -1644 2 1444 -354 256 -889 -1020 1250 469 534 244
3255B44j671J735J97k69J179k131q6J527p94J183r43j564J438l59P51M86k213
$$ 244 -1427 308 505 236 1415 -716 -802 725 -69 1114 171 -1393 45 -314 437 923 -1290
3272a290P45J66Q3J645j578r09Q42p82K114J76j875P15j046P46K157j785Q1o06
$$ -1290 -545 -379 -296 1349 -229 -1138 -296 -1078 1036 1212 -663 52 -994 -248 1909 124 205 -401
3290d01r12K255p4p21K38k132J381J538j134P34j723m74K085n68O98m27k138J496
$$ -401 -1313 942 868 147 385 -1747 -366 1172 38 772 -951 -1425 660 92 790 363 -1775 -279
3308b79J92L18J360k303n39J004j35J962q73j795J002n51R79J474k139K9k33n24
$$ -279 -87 231 1591 -712 -1251 -247 -382 1580 707 -1088 -86 -637 342 1816 -323 -294 -527 -1051
3326a051K630j041o38k66j249K038P55j281O35j965K54K160p92M70q91j756K223
$$ -1051 1579 538 -100 -366 -1615 423 1178 -103 532 -1433 -1179 981 189 659 -232 -1988 235
3343B35J00L25M69k771P05J280k59J781j788j318J282m14J729K78k799N28j67
$$ 235 335 660 1129 -1642 -937 343 84 1865 77 -1241 41 -373 1356 1634 -1165 -637 -804
3360h04O27K049j924o49K1n01K406k56j171j0j359J259J631q34L7j539o16K499
$$ -804 -177 1872 -52 -701 -680 -1181 1225 969 -202 -212 -1571 -312 1319 485 522 -1017 -1633 866
3378H66k84J31m52k153J636R36J17L55j924m84J528j66J374p29k342Q40J56J196
$$ 866 582 713 261 -1892 -256 680 797 1152 -772 -1256 272 106 1480 751 -1591 -751 -595 601
3396F01J276k411n17J98J79K231q74j151J09j165K179J059j705j23j444O80K250
$$ 601 1877 -534 -1051 -853 -674 1557 683 -468 -359 -1524 655 1714 9 -114 -1558 -878 1372
3413A372o85j21o53j752K194N42M5J13k462K59J641KJ052j661j623J652l2J045
$$ 1372 687 566 -87 -1839 355 897 942 1055 -1407 -1148 493 495 1547 -114 -1737 -85 -117 928
3431I28M97k493L76r3Q59J780j645j039L78p79K394j47j639M65j249J063J898
$$ 928 1425 -1068 -692 -785 74 1854 209 -830 -452 -1231 1163 1016 -623 -158 -1407 -344 1554
3448A554j362K87r06j164K594J33o31j97j946J396J167o60P45j827m37J536m42
$$ 1554 192 479 -427 -1591 1003 1136 505 308 -1638 -242 925 265 1010 -817 -1254 282 -160
3465a60J287o47j939Q85L83Q55O75k220o3O48J7J769j074j357P89n91J426R62
$$ -160 1127 480 -1459 -574 -191 664 1339 -881 -944 -296 -279 1490 416 -941 -152 -743 683 1645
3483A645j865K64q74L56J958p08r80L0j285K096M40r54K81j962O66J814p26M28
$$ 1645 -220 44 -830 -474 1484 776 -204 -174 -1459 637 1077 123 404 -1558 -892 922 196 624
3501F24j084j478K185L25M89j47k487P24J058N8J480j834j250J032j00K105l69
$$ 624 -460 -1938 247 572 1061 914 -1573 -849 209 267 1747 -87 -1337 -305 -405 1700 1331
3518A331k175K86l15J072J943k004o59l44m20K475L9j108o66j610J657J942p39
$$ 1331 -844 -558 -873 199 2142 138 -521 -865 -1285 1190 1229 121 -545 -2155 -498 1444 705
3535G05k43j753l47K322J90J85p21k147J142J258M27Q07k501p23J175L04K069
$$ 705 462 -1291 -1638 684 874 1059 338 -1809 -667 591 1018 1825 -676 -1399 -224 80 2149
3552B149j074k435O20r2J825J151k473n98k63K13K507n61j431n03r95K172J367
$$ 2149 1075 -1360 -740 -832 993 2144 -329 -927 -1190 -977 1530 969 -462 -965 -1960 212 1579
3569A579j066k60j858J87K550k42L41j205k003J805Q39M67K8k494P9J253L62J458
$$ 1579 513 253 -1605 -1418 1132 890 1231 26 -1977 -172 667 1134 1162 -1332 -1253 0 362 1820
3587A820j570j779R40j25J752P34k665l0m17J091J940j343r64j65o94K427N02
$$ 1820 250 -1529 -589 -714 1038 1772 -893 -923 -1340 -249 1691 348 -616 -781 -1475 952 1454
3604A454j286m1j700R31J976m68J56j462j100J887L58J54n2k163N44J308l17J032
$$ 1454 168 127 -1573 -642 1334 866 1022 -440 -1540 347 705 859 807 -1356 -812 496 179 1211
3622A211j673j035J097J50J577l12k299N77kJ083J216j825l93r0o5K251l96j293
$$ 1211 -462 -1497 -400 -250 1327 1015 -1284 -707 -709 374 1590 -235 -628 -718 -783 1468 1072 -221
3640b21J38j518J641J341j020J3j211j10K171n74j39l58j706J623N48j90M11k087
$$ -221 -83 -1601 40 1381 361 374 -837 -947 1224 650 511 153 -1553 70 618 428 839 -1248
3658a248n7J561K0J091j483j447R65K72J042P03k029j87K04K72J922j042j023
$$ -1248 -1305 256 276 1367 -116 -1563 -598 -326 716 1419 -610 -797 -593 -321 1601 559 -464
3675d64P3o92J832M01j232op65N04J601j069Q8o10j098J998j0l02J5j737O29J310
$$ -464 -391 -1083 749 1150 -82 -88 -853 -349 1252 183 271 -339 -1437 561 551 249 264 -1473 -844 466
3695D66j67O24j470o92J125k1J113K2j820L74M4M01J690j733k41K15l69J426j67
$$ 466 299 923 -547 -1239 -114 -135 978 1000 -820 -446 -402 -1 1689 -44 -285 -70 -439 987 820
3714H20j160N42r53P27J015j201J01o39j00J655m75o27R2j175J216O52m34N86
$$ 820 -340 202 -751 -24 991 -210 -109 -748 -848 807 332 -295 -203 -1378 -162 490 56 642
3732F42j416j99J482n52P85l31j438J141J47L5P02j472L01P10p83J198r81o54
$$ 642 -774 -973 509 -43 742 411 -1027 114 261 296 998 -474 -173 537 -246 952 -29 -683
3750f83R64o72J330k96j501L45k40O26J219j343j69L5n77J559m5n97L02j225O68
$$ -683 281 -391 939 643 -858 -513 -753 -127 1092 -251 -420 -385 -962 597 552 -45 257 -968 -300
3769c00J232p92M54r87k51J481n41J00l62j211J385M03m18K36j390j90J294Q3
$$ -300 932 140 594 -393 -644 837 296 396 34 -1177 208 611 193 429 -961 -1151 143 226
3787B26Q72q35j663Q33J09J019P58j666k05l4R5J736k40j092j25p35J313O99j134
$$ 226 1098 263 -1400 -567 -458 561 1319 -347 -552 -586 -491 1245 1005 -87 -212 -947 366 1065 -69
3806f9K34j045O26R88n41q7m85q99J353O14r7k86j737L53J674k14O47j161j077
$$ -69 165 -880 -254 734 193 106 -379 -1278 75 689 592 306 -1431 -1078 596 382 1029 -132 -1209
3825a209J027k3R82N08j949J15j29M51J576q46r44J78n91J853l44j073L30q77
$$ -1209 -182 -205 777 1285 -664 -549 -678 -227 1349 503 -441 -263 -854 999 655 -418 -88 -965
3843i65O87J361r66n9p29m95J965rl50m62j435R26J255l54N85j442n93P95J40
$$ -965 -278 1083 117 58 -671 -1166 799 790 440 -22 -1457 -531 724 370 955 -487 -1080 -285 -145
3862a45J146j91j706P10j85M97R83j425k09M99k70J432o48j054M27o64J293O91
$$ -145 1001 810 -896 -186 -371 126 1109 -316 -525 -26 -296 1136 488 -566 -139 -803 490 1181
3880A181j001m09o03N2K103o70p41l66r73J335N93m44Q04j643l9J010m59J199
$$ 1181 180 -229 -832 -780 1323 653 -88 -454 -1427 -92 501 57 861 -782 -821 189 -270 929
3898I29r60r73J279k61M14M23j316J97J18K2J185j055o86N03k41J175Q3j159j8
$$ 929 -31 -1004 275 14 428 851 -465 -268 -150 -128 1057 2 -684 -181 -422 753 836 -323 -341
3917c41l72L31J564j013k48l52q77J544L8j59K25j382O69O61k20O33r21k88J070
$$ -341 -713 -382 1182 169 -79 -431 -1308 236 274 115 340 -1042 -373 288 68 701 -220 -508 562
3936E62o03L88O2j455R18L13m5O78j266l10O66k53J165l41j260N59m29O62Q68
$$ 562 -41 347 409 -1046 -128 185 140 818 -448 -758 -92 -345 820 479 -781 -222 -651 11 879
3955H79j304J42j53l98J656n40k41m8o76Q33O15p02L87o43j79J157m50J79m73
$$ 879 -425 -283 -436 -834 822 282 41 -7 -683 150 765 63 450 -193 -372 785 335 514 41
3974D1j024J189j43Q8L20j479L99P12k84R87r00o70P06l92Q49K78j300K33l3J19
$$ 41 -983 206 63 151 471 -1008 -609 103 -181 806 -94 -764 -58 -450 399 677 -623 -390 -423 -304
3994c04J291j166o3M36o38J024o1p09N48r24O54P88q99Q9o09k87J384k67p5j22
$$ -304 987 -179 -242 194 -444 580 519 -190 358 -566 88 876 -23 66 -543 -830 554 287 212 90
4014I0j330J056N43l64M47r83j27P43m43Q14o5j219P86K8K85N22j112J26L05l67
$$ 90 -1240 -184 359 -5 442 -541 -668 75 -368 446 381 -838 -52 -24 261 783 -329 -203 102 -265
4034b65J251p56o92K80l69R04N39j021K8m22n7J462q50j02j58q05R65M26l23L04
$$ -265 986 230 -462 -182 -551 353 892 -129 -101 -523 -580 882 32 -70 -228 -1033 -68 358 35 339
4054C39j129L52J059n56P71q96o86J013j44K96L11j249L57Pk1J137r78n61M21
$$ 339 -790 -438 621 65 836 -60 -746 267 123 419 730 -519 -162 -155 -176 961 -17 -578 -157
4073a57k77J041J29j152J19l83P65P46j068K34n16o13J695k76k70O1j028Q50R18
$$ -157 -434 607 736 -416 -297 -680 85 831 -237 -3 -519 -1132 563 287 17 78 -950 -100 818
4092H18q45O39r79k42J212l34K79k16j156N77L18J60N35j265JM28k35J116m29
$$ 818 -27 612 -367 -609 603 269 548 332 -824 -247 71 231 766 -499 -498 -70 -305 811 382
4111C82j123N59m29O89N36q91j71j15r9J476o00m42j4o78J303L34n84M47r66j08
$$ 382 -741 -182 -611 78 614 -277 -448 -563 -662 814 214 -228 -242 -920 383 717 133 580 -386 -494
4131d94J118l91L98o19q61J082j24K29K95j351L26O11m68J073q11j039Q64l37
$$ -494 624 233 631 12 -849 233 109 338 633 -718 -392 219 -249 824 13 -1026 -162 -499
4149d99Q38L98j240L80m33M10R48n46j80Q7r21J308N6m43Q3j069P04R55q14M27
$$ -499 339 737 -503 -123 -556 -146 802 256 76 163 -758 550 606 163 246 -823 -119 836 22 449
4169D49q70l96J083l16J71j48r57O49L05J76N07j090l32O44k73J015j63j124P64
$$ 449 -421 -817 266 -50 121 -27 -984 -335 -30 146 653 -437 -769 -125 -398 617 454 -670 94
4188I4l25L28Q88r30l8j43l38J310n90m60J79q12J124Q0m99L39o75r8J075m00
$$ 94 -231 97 985 55 17 -126 -464 846 256 -204 -25 -837 287 367 -132 207 -468 -566 509 109
4208A09ml59m68Q75k5P6M1j023O04M27k13Q17n32r74P36k18N46J90r24K91k34
$$ 109 105 -254 -722 153 128 204 245 -778 -174 253 40 857 325 -649 87 -131 415 605 -319 -28 -262
4229b62K32Q18o65l54K38o02J075r5q25O26q99N81Q77p01k6j76o32J247l09K27
$$ -262 -30 788 123 -231 7 -595 480 385 -440 186 -713 -132 745 44 18 -158 -790 457 148 375
4249C75o8q49M20N18k93M88r31j97P23j60K99J60j125N90j35R1Q19j221J75K10
$$ 375 307 -542 -122 396 103 591 -340 -537 186 26 325 485 -640 -50 -185 -94 725 -496 -321 -111
4269a11l96J235o67n26M20o60P83M39o83L70n15k39J244n23k6r1o34O16J78j61
$$ -111 -507 728 61 -465 -45 -705 78 517 -166 204 -311 -550 694 171 145 54 -580 36 214 53
4289E3M38j101K63Q00l05J48l37o84R75k18J16K90r76L51j5q8J063r69M3L72o54
$$ 53 491 -610 -347 453 148 296 -41 -725 250 32 148 438 -538 -187 -202 -290 773 -196 -153 219 -435
4310d35Q18lo56L74m24J4J063j065L09q3m74J176m27l41M05p33O26Q0k49L70o52
$$ -435 383 380 -276 98 -326 -312 751 -314 -5 -88 -562 614 187 -154 251 -482 144 224 -25 345 -307
4331c07j96Q31n43M27O3r63O45J38j7K24r45J34Q21l47M62l15o94O86m41M95O44
$$ -307 -503 328 -215 212 275 -688 -43 95 78 302 -643 -509 312 -35 427 112 -582 104 -337 158 802
4352H02r25n5J81j21Q72p42l1O9n54P65J79o14K02k98m5J026m89j68pq35R54n2
$$ 802 -123 -178 3 -118 754 12 -19 50 -504 261 440 -174 28 -270 -315 711 222 54 47 -788 166 114
4374A14j76L57j161M09P23l51N34n16l98N78l76P63Q1q84J98J35j16R03q57k81
$$ 114 -62 295 -866 -457 266 -85 449 -67 -465 113 -263 500 581 -303 -105 30 -86 817 -40 -321
4394c21N3l30J133J39r26J21o52O66N41m19L49o52m87J156l38J02M9r03Q17j8
$$ -321 -268 -598 535 674 -252 -131 -783 -117 424 5 354 -298 -785 371 33 135 184 -719 98 80
4414H0J81M21r92j92Q35k18O84l77r15M59j54L25J043j472O9K5m63J204j00o19
$$ 80 261 682 -310 -502 333 115 799 422 -493 -34 -188 137 1180 -292 -223 -198 -661 543 443 -176
4434a76J63p95P17N55n21J11m66n8Q36m81L61j38o94O72J59k17N28j030J27N99
$$ -176 -13 -808 -91 464 -57 54 -412 -470 366 -115 246 108 -586 86 245 28 556 -474 -347 252
4454B52l33P01m48p08N79l54M28M97j079L75m1l67J095p45n7L11p37Q13M6m74
$$ 252 -81 620 172 -536 43 -311 117 614 -465 -90 -131 -498 597 -148 -205 106 -631 182 228 -246
4474b46O50n01k23P44o72K55q1l09Q74m02J0Oo71O27k1o4L84n28p1P63m27J69
$$ -246 404 -97 -320 424 -248 7 -74 -383 491 89 99 105 -566 61 40 -24 360 -168 -239 524 97 266
4496B66q7q09O94M9k91N86r46M59K98l86N18l03n64O35j23M01J52p97J68j28L09
$$ 266 179 -630 64 113 -178 408 -538 -79 219 -167 351 48 -516 119 -4 397 549 -248 -80 -208 101
4517A01M99m69l89N33q42P66K3m78N40p54L18P33o08n1j37m41R64k7j38J05j028
$$ 101 600 131 -258 275 -567 199 222 -256 284 -470 -152 581 -27 -78 -215 -656 308 281 143 248 -780
4538g80N90J71j6O10p87m09P69l68Q24J38j286M35j23L77Q23q51j09j86k47Q37
$$ -780 -190 -19 -35 575 -212 -621 148 -220 604 742 -544 -109 -232 145 968 117 8 -178 -425 412
4558D12M1m44L05r96O61N08o58K55l94l18R79l30Q1R7r18Q96K39j39M39j298P6
$$ 412 453 9 314 -682 -21 487 -171 84 -310 -628 351 21 102 199 -719 177 416 277 716 -582 -506
4579e06Q68k21O42m11q76L80O7M77K70o64k08l4k31J038l84m82Q9l86P88J29o45
$$ -506 362 141 783 372 -504 -124 -57 420 690 26 -182 -216 -447 591 207 -275 -186 -572 216 345 -300
4600c00K09j64r6P49l12K6j30l99P67j02K8Q9p90K20O03l51O20o24l55O48o67
$$ -300 -91 -255 -351 398 86 112 -18 -417 350 248 276 365 -425 -205 398 47 667 43 -312 336 -331
4621c31N70K89r65K13j02j3R77q74k14K30l33Q77J13o24J80m13K48P43n57J56
$$ -331 239 528 -437 -224 -326 -339 638 -236 -450 -220 -553 324 437 -187 -7 -420 -172 571 14 170
4641A70m15p5Q40j66k40O1o15N36K84l99N67q90l36O55j73M41j03q59O77p0J23
$$ 170 -245 -320 520 354 114 175 -440 96 380 -19 548 -342 -678 -23 -196 245 142 -717 -40 -110 13
4662A3L44o57K08m3j34P46k05p06M63m82P51L44n39O8l31o3O85j90j03l9q65O45
$$ 13 357 -300 -92 -135 -269 477 272 -434 29 -453 298 642 103 171 -160 -223 462 272 169 130 -735 -90
4684i0O5RM29q73J11M44j51L36m35k87N25p3J40m1o33K96K21j77R52p34l59L50
$$ -90 -25 -16 413 -460 -349 95 -56 280 -155 -442 83 10 150 109 -524 -228 -7 -184 768 34 -325 25
4706B5k32N78R4n13N2m57L52O66q39K43j48l72Q65k72n7N38r36L06M25l78K28
$$ 25 -207 371 465 -48 4 -453 -101 565 -274 -31 -179 -551 314 42 -15 523 -413 -107 318 -60 168
4727A68m01j02O32m83N06j80o35N91j8j54L90n54j45N17j69M65k95m17M99m52
$$ 168 -233 -335 297 -186 320 140 -495 96 78 -76 314 -240 -385 132 -37 428 133 -284 215 -237
$$ [...]
8191c2
##END NTUPLES=NMR FID
##END=
