##TITLE=1H_66-2022
 CDCl3
 8 sc, 
 22.08.2022
##JCAMPDX= 6.0         $$ Bruker NMR JCAMP-DX V2.0
##DATA TYPE= NMR SPECTRUM
##DATA CLASS= NTUPLES
##ORIGIN= UXNMR, Bruker Analytische Messtechnik GmbH
##OWNER= root
$$ XWIN-NMR		Version 3.5
$$ Mon Aug 22 10:01:29 2022 Russian Standard Time (UT+4h)  she@DPX200
##.OBSERVE FREQUENCY= 200.1313499994
##.OBSERVE NUCLEUS= ^1H
##.ACQUISITION MODE= SIMULTANEOUS
##.ACQUISITION SCHEME= undefined
##.AVERAGES= 8
##.DIGITISER RES= 18
##SPECTROMETER/DATA SYSTEM= spect
##.PULSE SEQUENCE= zg30
##.SOLVENT NAME= CDCl3
##.SHIFT REFERENCE= (INTERNAL, CDCl3, 0, 15.7436)
##AUDIT TRAIL= $$ (NUMBER, WHEN, WHO, WHERE, WHAT)
$$ ##TITLE= Audit trail, XWIN-NMR		Version 3.5
$$ ##JCAMPDX= 5.01
$$ ##ORIGIN= Bruker BioSpin GmbH
$$ ##OWNER= she
$$ F:/spectra/data/she/nmr/H-F/1/pdata/1/auditp.txt
$$ ##AUDIT TRAIL=  $$ (NUMBER, WHEN, WHO, WHERE, WHAT)
(   1,<2022-08-22 10:00:01.14 +0400>,<she>,<DPX200>,
      <created by zg, POWCHK disabled, PULCHK disabled
       configuration hash MD5:
       00 E9 B6 7A A2 85 ED C7 34 08 36 98 17 FE 4E 26
       data hash MD5: 16K
       BF 36 D3 DC 37 60 FC 1E 5B DE 46 E4 13 CA 20 AA>)
(   2,<2022-08-22 10:00:05.62 +0400>,<she>,<DPX200>,
      <Start of raw data processing
       efp BC_mod = 2 LB = 0.24 FT_mod = 6 PKNL = 1 PHC0 = -18041.03 PHC1 = 17.40068 SI = 16K 
       data hash MD5: 16K
       F1 62 7E E5 23 D4 27 D9 F2 50 1D 20 F8 FA 9C 77>)
(   3,<2022-08-22 10:00:30.89 +0400>,<she>,<DPX200>,
      <pk PHC0 = 5.580848 PHC1 = -6.599999 
       data hash MD5: 16K
       34 93 5C EB C0 B1 6B D8 3A 25 79 FF 34 97 22 E9>)
(   4,<2022-08-22 10:00:34.34 +0400>,<she>,<DPX200>,
      <abs ABSG = 5 
       data hash MD5: 16K
       F4 32 63 9C 29 92 31 63 82 49 B3 9F 01 78 C9 4F>)
$$ ##END=
$$ 
$$ hash MD5
$$ F9 69 F9 EA 9B 00 B4 8B E9 C9 92 C6 23 0B 6C 86
##$RELAX= 
##$RELAX= 
##$RELAX= 
##$RELAX= 
##$RELAX= 
##$RELAX= 
$$ Bruker specific parameters
$$ --------------------------
##$DU= <F:/spectra>
##$EXPNO= 1
##$NAME= <H-F>
##$PROCNO= 1
##$TYPE= <nmr>
##$USER= <she>
##$AMP= (0..31)
100 100 100 100 100 100 100 100 100 100 100 100 100 100 100 100 100 100 
100 100 100 100 100 100 100 100 100 100 100 100 100 100 
##$AQSEQ= 0
##$AQ_mod= 1
##$AUNM= <au_zg>
##$AUTOPOS= <>
##$BF1= 200.13
##$BF2= 200.13
##$BF3= 200.13
##$BF4= 200.13
##$BF5= 200.13
##$BF6= 200.13
##$BF7= 200.13
##$BF8= 200.13
##$BYTORDA= 1
##$CFDGTYP= 0
##$CFRGTYP= 5
##$CHEMSTR= <none>
##$CNST= (0..31)
1 1 145 1 1 1 1 1 1 1 1 1 1 1 1 1 1 1 1 1 1 1 1 1 1 1 1 1 1 1 1 1 
##$CPDPRG= <>
##$CPDPRG1= <>
##$CPDPRG2= <>
##$CPDPRG3= <>
##$CPDPRG4= <mlev>
##$CPDPRG5= <mlev>
##$CPDPRG6= <mlev>
##$CPDPRG7= <mlev>
##$CPDPRG8= <mlev>
##$CPDPRGB= <>
##$CPDPRGT= <>
##$D= (0..31)
0 1.2 0 0 0 0 0 0 0 0.06 0 0.03 0 0 0 0 0.0002 0 0 0 0 0 0 0 0 0 0 0 0 
0 0 0 
##$DATE= 1661148000
##$DBL= (0..7)
120 120 120 120 120 120 120 120 
##$DBP= (0..7)
150 150 150 150 150 150 150 150 
##$DBP07= 0
##$DBPNAM0= <>
##$DBPNAM1= <>
##$DBPNAM2= <>
##$DBPNAM3= <>
##$DBPNAM4= <>
$$ [...]
##$SUBNAM2= <"">
##$SUBNAM3= <"">
##$SUBNAM4= <"">
##$SUBNAM5= <"">
##$SUBNAM6= <"">
##$SUBNAM7= <"">
##$SUBNAM8= <"">
##$SUBNAM9= <"">
##$SW= 18.0517283424941
##$SWIBOX= (0..15)
0 0 2 0 0 0 0 0 0 0 0 0 0 0 0 0 
##$SW_h= 3612.71676300578
##$TD= 16384
##$TD0= 1
##$TE= 0
##$TE2= 300
##$TE3= 300
##$TEG= 300
##$TL= (0..7)
0 120 120 120 120 120 120 120 
##$TP= (0..7)
150 150 150 150 150 150 150 150 
##$TP07= 0
##$TPNAME0= <>
##$TPNAME1= <>
##$TPNAME2= <>
##$TPNAME3= <>
##$TPNAME4= <>
##$TPNAME5= <>
##$TPNAME6= <>
##$TPNAME7= <>
##$TPOAL= (0..7)
0.5 0.5 0.5 0.5 0.5 0.5 0.5 0.5 
##$TPOFFS= (0..7)
0 0 0 0 0 0 0 0 
##$TUNHIN= 0
##$TUNHOUT= 0
##$TUNXOUT= 0
##$USERA1= <user>
##$USERA2= <user>
##$USERA3= <user>
##$USERA4= <user>
##$USERA5= <user>
##$V9= 5
##$VALIST= <valist>
##$VCLIST= <CCCCCCCCCCCCCCC>
##$VD= 0
##$VDLIST= <DDDDDDDDDDDDDDD>
##$VPLIST= <PPPPPPPPPPPPPPP>
##$VTLIST= <TTTTTTTTTTTTTTT>
##$WBST= 1024
##$WBSW= 4
##$XGAIN= (0..3)
0 0 0 0 
##$XL= 0
##$YL= 0
##$YMAX_a= 553294
##$YMIN_a= -527825
##$ZGOPTNS= <>
##$ZL1= 120
##$ZL2= 120
##$ZL3= 120
##$ZL4= 120
##$ABSF1= 15.7524
##$ABSF2= -2.299449
##$ABSG= 5
##$ABSL= 3
##$ALPHA= 0
##$AQORDER= 0
##$ASSFAC= 0
##$ASSFACI= 0
##$ASSFACX= 0
##$ASSWID= 0
##$AUNMP= <proc_1d>
##$AZFE= 0.1
##$AZFW= 0.1
##$BCFW= 0
##$BC_mod= 2
##$BYTORDP= 0
##$COROFFS= 0
##$CY= -3
##$DATMOD= 1
##$DC= 0
##$DFILT= <>
##$DTYPP= 0
##$F1P= 0
##$F2P= 0
##$FCOR= 1
##$FTSIZE= 16384
##$FT_mod= 6
##$GAMMA= 0
##$GB= 0
##$INTBC= 1
##$INTSCL= 0
##$ISEN= 128
##$LB= 0.24
##$LEV0= 0
##$LPBIN= 0
##$MAXI= 10000
##$MC2= 0
##$MEAN= 0
##$ME_mod= 0
##$MI= 1.114404
##$NCOEF= 0
##$NC_proc= -6
##$NLEV= 6
##$NOISF1= 3.799351
##$NOISF2= 2.8
##$NSP= 0
##$NTH_PI= 0
##$NZP= 0
##$OFFSET= 15.74358
##$PC= 1
##$PHC0= -18035.45
##$PHC1= 10.80068
##$PH_mod= 1
##$PKNL= yes
##$PPARMOD= 0
##$PSCAL= 0
##$PSIGN= 0
##$REVERSE= no
##$SF= 200.130005594711
##$SI= 16384
##$SIGF1= 3
##$SIGF2= 2
##$SINO= 5.538805
##$SIOLD= 16384
##$SREGLST= <1H.CDCl3>
##$SSB= 0
##$STSI= 16384
##$STSR= 0
##$SW_p= 3612.71676300578
##$SYMM= 0
##$S_DEV= 0
##$TDeff= 16384
##$TDoff= 0
##$TI= <>
##$TILT= no
##$TM1= 0
##$TM2= 0
##$TOPLEV= 0
##$USERP1= <user>
##$USERP2= <user>
##$USERP3= <user>
##$USERP4= <user>
##$USERP5= <user>
##$WDW= 1
##$XDIM= 16384
##$YMAX_p= 503967826
##$YMIN_p= -1438103
$$ End of Bruker specific parameters
$$ ---------------------------------
##NTUPLES= NMR SPECTRUM
##VAR_NAME=  FREQUENCY,     SPECTRUM/REAL,   SPECTRUM/IMAG
##SYMBOL=    X,             R,               I
##VAR_TYPE=  INDEPENDENT,   DEPENDENT,       DEPENDENT
##VAR_FORM=  AFFN,          ASDF,            ASDF
##VAR_DIM=   16384,         16384,           16384
##UNITS=     HZ,            ARBITRARY UNITS, ARBITRARY UNITS
##FACTOR=    0.220516191357247, 1,           1
##FIRST=     3150.76272636356, 0,            0
##LAST=      -461.954036642225, 0,           0
##MIN=       -461.954036642225, -1438103,    0
##MAX=       3150.76272636356, 503967826,    0
$$ Real data points
##PAGE= N=1
##DATA TABLE= (X++(R..R)), XYDATA
$$ [...]
6294A16969j1042j16211l0226L1209K941k1921L9902l476L9571j20941l3768O6550
6282d0443N0336J50120N529k5040L944k39325J18712j6327O7466r894j29216r9800
6270a63938l629L9220k8083N3082J90572J4680m1620P4383p969K7865R7718j50854
6258A01427n8670J27884o4885l5672q1475j07176j43970K82719n5387L0815M4297
6247C9907Nl2904L7385J35975m5132n1556r8155J8592K11401P9353k80881o8875
6235e4885J04998l1454q741P8411N1302n6990r4145L8600k10610O1898J57354
6224C5738j23380R2213m6751n7891J61610m212j08883J25154J1417l00n1832l625
6212B9258M6376j31937k48221K22878n5000o0552R5506P46R8903P0934l0078O445
$$ plain form
6294 116969 105927 -10284 -40510 -9301 -6360 -28281 11621 8145 47716 -73225 -106993 -40443
6282 -40443 9893 160013 165542 140502 144446 -94879 23833 7506 74972 65078 -64138 -163938
6270 -163938 -167567 -128347 -156430 -103348 87224 101904 60284 134667 126698 154563 252281 101427
6258 101427 42757 170641 105756 70084 -11391 -118567 -262537 20182 -35205 -4390 39907
6247 39907 39912 7008 44393 180368 135236 83680 -14475 4117 215518 294871 13990 -54885
6235 -54885 50113 18659 9918 88329 139631 82641 -11504 27096 -183514 -121616 35738
6224 35738 -87642 4571 -42180 -100071 61539 57327 -51556 73598 85015 84715 32883 29258
6212 29258 75634 -56303 -304524 -81646 -136646 -197198 -101692 -100946 -2043 68891 38813 45258
6200D5258J2674p9184P4844J04051o8841J8750j08806M9556N6307n1678J7189
6189G0120l1595M4835L8259j02605p2066J8004k9139l8498M8532R516k1575Q4632
6177A8420j2645J3745j30474J79751j11400q2093R9769m069j00100J57589L6040
6166F4533O8771N7203k3185L8980M497l3572r2806o4876J06310o9325q3166M7231
6154B0595j14727N5503N4460K0681R3481j31692j05354m9399J00768L6259n466
6143b4891Q697L5003j4314j00941K672J14332o4377r4113J14159J58199n7882
6132G6544K2800j29280O2749J62537k49992j30651Q540K37533n966j00855N669
6121d0372q2445P2012J45850m9639J562O3009o6559j59531M5810K3987K64169
$$ plain form
6200 45258 57932 -21252 53592 157643 88802 107552 -1254 48302 104609 52931 70120
6189 70120 38525 83360 121619 19014 -53052 -35048 -64187 -102685 -54153 -44637 -66212 18420
6177 18420 5775 19520 -110954 68797 -42603 -124696 -24927 -28996 -129096 28493 64533
6166 64533 133304 190507 167322 206302 210799 177227 84421 19545 125855 56530 -26636 20595
6154 20595 -94132 -38629 15831 36512 129993 -1699 -107053 -156452 -55684 -19425 -24891
6143 -24891 -16194 18809 4495 -96446 -93774 20558 -43819 -137932 -23773 134426 76544
6132 76544 99344 -29936 32813 195350 -54642 -185293 -176753 60780 54814 -46041 -40372
6121 -40372 -122817 -50805 95045 45406 46968 109977 43418 -116113 -70303 -46316 217853
6110B17853K3433p1496j52835J83451K04461k67064L6136M0618J80269k49495
6100A45331j95172K64336N3455j36707Q0612J5399k23518J33590J0980n8818o6390
6089B3098j2484O779N8778n0651N6847l1865j42259k3000m4937l9712J27143J22042
6077D9779J39407p2375q8686J00880j10436L2138J06612m5798j8720K9938q0246
6066D2493J05252q7977R0685p9376L0463r606M6103p5734j64397o436K7297J42194
6054F0961p3187N4587N2338K5597k14454k0970J6741J01546P5166j02963Q5254
6043F0616O6478n2724Q2237R622j3840q3088J66789J32560j50135j78920m2688
6032c093J01974j2386j01518N9641o5357j92791J60378J13980P5529r7559K8995
$$ plain form
6110 217853 241286 169790 16955 200406 404867 137803 173939 214557 394826 145331
6100 145331 -49841 214495 267950 131243 211855 227254 3736 137326 148306 89488 23098
6089 23098 10614 17393 76171 25520 82367 50502 -91757 -114757 -159694 -199406 -72263 49779
6077 49779 189186 116811 28125 129005 18569 50707 157319 111521 92801 122739 42493
6066 42493 147745 59768 150453 71077 101540 91934 138037 62303 -102094 -108530 -81233 60961
6054 60961 -12226 42361 94699 120296 -94158 -115128 -98387 3159 78325 -24638 60616
6043 60616 127094 74370 156607 166229 152389 69301 236090 368650 218515 39595 -3093
6032 -3093 98881 86495 -15023 44618 -20739 -213530 -53152 60828 136357 38798 67793
6021F7793m7487M1904k009l5404O2351o2053j32630j8023N9259P5133n397k6192
6009b2755O6065R1526p7935K492O989j00056q4484k0440J48998M4653J8263J25729
5997A99045m2885j10342l7387J7164J21924j13199k9970o9850N6085R4983M9000
5986A34568Q893P6735j68643N8774n0508M0390J30693p4693l3076O1735N84j14741
5974G0711L6334L2164O3646r6547r4637O2524M2826j05314P5954O2225j75593
5963b5707J66335j05743R584J40654j64464q6853o2261J30740K8231P7659r1875
5952A6300l6185K3596q6306J95844l8384j01156j07382n91J55792L2932r8571
5941d4111k226q1935P2709K99823n4496n5170L5356p5751j1145j9629Q4495J18654
$$ plain form
6021 67793 20306 62210 60201 24797 87148 25095 -107535 -125558 -66299 8834 3437 -22755
6009 -22755 43310 134836 56901 59393 66382 -33674 -118158 -138598 10400 55053 73316 199045
5997 199045 156160 45818 8431 25595 147519 34320 4350 -65500 -9415 85568 134568
5986 134568 143461 220196 51553 110327 59819 100209 230902 156209 123133 184868 185452 70711
5974 70711 107045 139209 202855 106308 11671 74195 117021 11707 87661 149886 -25707
5963 -25707 140628 34885 44469 185123 20659 -66194 -128455 2285 30516 108175 16300
5952 16300 -19885 3711 -82595 113249 74865 -26291 -133673 -134264 21528 54460 -44111
5941 -44111 -46337 -128272 -55563 244260 189764 134594 169950 94199 83054 63425 147920 266574
5929B66574j13512q582j90982j01469j9027J65817K21058O6417k18075o7557m0677
5918d0015K7407R6043m0749M577J8288J8420j0068j41240n6333J59292P2790j25631
5906a7219m5696n0027J34707q4386l0616J16460Q2752m0597q7852P5072J7003
5895F9601l3810J47994o4129j95648j4803J0023K2445J7373P6243j18226J73440
5884I0503N5980L3843O6393q8632j10462P0715N3417m6408q7137r3527P1631j15942
5872i9626J8957J3856J1181J16479l1820P659J02816M0689J18150j5511j31151
5861A51679n8990M0824k08459r0197m943P2679j9312J1507j5458P9208R1912j7370
5849C3080J59549k23636l665L2742K04976L7115j61467q2453J8738J39947O1867
$$ plain form
5929 266574 153062 144480 -46502 -147971 -166998 -1181 219877 286294 68219 662 -40015
5918 -40015 -12608 83435 42686 47263 65551 83971 73903 -67337 -123670 35622 108412 -17219
5906 -17219 -62915 -112942 21765 -62621 -93237 23223 105975 65378 -22474 52598 69601
5895 69601 35791 183785 119656 -75992 -90795 -80772 -58327 -40954 35289 -82937 90503
5884 90503 146483 180326 246719 158087 47625 118340 171757 125349 38212 -55315 16316 -99626
5872 -99626 -80669 -66813 -55632 60847 29027 36686 139502 180191 298341 282830 151679
5861 151679 92689 133513 -74946 -165143 -170086 -97407 -116719 -105212 -120670 -41462 50450 33080
5849 33080 192629 -31007 -34672 -1930 203046 240161 78694 -3759 14979 154926 216793
5838B16793k2873q9059J00551O9256j28502P2217l0550K7977j32595j73550L1594
5827e8741J19355P1847m4407p2810P6197P4850K7248J94096m1122j10562r5972
5816A39979j5080J00088j62999J06527J96268m7929o1688M8015K4784Q978l2743
5805C04200r5454r8675M491J05690L8467n6018J7010J01551n3064j63737J18312
5794B22773J13669j00421j15525r826L115M5523N5843M2275m0332j29375M2565
5783A30284K89544p7267L9799K26749j54433j08142J35844J16915j67503j72119
5773B59671k1491J16318l5399j83293o1101L0159k4144O5592j00897j33988J08341
5762A9768J17774K8487M5363R31N754j1857j11331m9101P4989J18194L2398J23635
$$ plain form
5838 216793 193920 104861 205412 274668 146166 218383 187833 215810 83215 -90335 -58741
5827 -58741 60614 132461 88054 15244 91441 166291 193539 387635 346513 235951 139979
5816 139979 124899 224987 61988 168515 364783 316854 255166 303181 327965 336943 304200
5805 304200 208746 110071 114562 220252 258719 202701 219711 321262 268198 104461 222773
5794 222773 336442 236021 120496 110670 113785 159308 215151 257426 217094 87719 130284
5783 130284 419828 342561 382360 609109 454676 346534 482378 599293 431790 259671
5773 259671 238180 354498 319099 135806 74705 104864 80720 146312 45415 -88573 19768
5762 19768 137542 166029 211392 212323 218077 206220 94889 45788 120777 238971 271369 395004
5750C95004j33990q1072J8648M8551J00160M1727m5101j15656Q9426j15781J20954
5739C22870N6260p5011l0960J63221n1188l4290k120Q085q0175p8133P809n7651
5727A48717j7542p388j9822J1595m5380R7992p5904N7614O0056R317J98389r1516
5715C26128r3510j8764k22015N3218J07277J19552p7685m1127n0296M1120Q1875
5704B25773j99986J33565J11944m795r025p462M3520r101p8229j6858p444N0300
5692B32202l7427L4736J17566K8239j26003K03194J779l5995j92440l0019q5004
5681A10828k7584M8864o5585M428O622L8884j6524J7371M8272n5358Q9374R7458
5669B97050M7246j13756k3274P3201r765O7441K9724p374o0840n1836n0981J08784
$$ plain form
5750 395004 261014 179942 198590 247141 347301 389028 343927 228271 317697 201916 322870
5739 322870 379130 304119 273159 436380 385192 350902 348782 356867 276692 198559 206368 148717
5727 148717 131175 123787 103965 115560 70180 168172 92268 149882 209938 219255 417644 326128
5715 326128 232618 213854 -8161 45057 152334 271886 194201 153074 102778 143898 225773
5704 225773 25787 159352 271296 266501 257476 250014 293534 284433 206204 189346 181902 232202
5692 232202 194775 229511 347077 375316 249313 452507 454286 418291 225851 195832 110828
5681 110828 83244 132108 66523 70951 77573 116457 99933 117304 165576 110218 199592 297050
5669 297050 344296 230540 207266 280467 270702 338143 367867 360493 299653 247817 196836 305620
5657C05620j6283O3147J89908r1318M184O0425q7023O0041J414j57224M3149J22367
5645D98407m2415k00719J38107J20329o6616j20405j49088P667J05068l1327r409
5634B49599k0404L0404J75163n0605j18287n7830J30946j15937J5186L5374q583
5623B65026j05309O0393Q7199M8951J6347J33711r8172k67461j5072J13660J33812
5612C73085O0542l3539M7686n6641l2451j48667O3109J96090M2578n0027j43982
5601C17783N8987o6369O2624J30513L7781J34674J0834j46071k0539k9216j07463
5590C83538n513J41439l4510J4718M705J79594J31135j42193n3706R0519n293
5579G04433p4951Q2740o4317l5717J26643j03557p0075m1322L4691n7259J2693
$$ plain form
5657 305620 289337 352484 542392 451074 455258 515683 428660 488701 490115 332891 376040 498407
5645 498407 455992 255273 393380 513709 447093 326688 177600 185267 290335 259008 249599
5634 249599 229195 259599 434762 384157 265870 208040 338986 223049 238235 273609 265026
5623 265026 159717 220110 307309 356260 372607 506318 408146 140685 125613 239273 373085
5612 373085 433627 400088 447774 391133 358682 210015 273124 469214 511792 461765 317783
5601 317783 376770 310401 373025 503538 541319 675993 686827 540756 520217 491001 383538
5590 383538 378025 519464 484954 499672 504377 683971 815106 672913 619207 709726 704433
5579 704433 629482 712222 647905 612188 738831 635274 565199 523877 558568 501309 514002
5568E14002J93508p440n3270q8451k2874j69492J42904J37949j4052o0375n292
5557E67117Q1965j47095J19106n4445M6185P1291j17425m11n688m2314k5318R7500
5545E90468P9125J8637Q2262l7133j29847K8067k6946n0686q1806j9767j72562
5534B79812P4497J40204J21947o325j8592K3737k3313J02476Q781m4736r1190
5523E67298J54967M6932p641j72536n0159P2082O3409J25958j2663j1239r010
5512G67398q7888k0454j2327J91592j48413p9556K25891r267m2856n3818j14130
5501F16172K29519J8033l6446Q7567L9375m8727P1579k506n6670n0824j25519
5490G41553L9544J62606k0787P8061m5695Q945p5651M2338M3925p1051J49753
$$ plain form
5568 514002 707510 700070 646800 558349 535475 365983 508887 646836 632784 572409 567117
5557 567117 649082 501987 621093 566648 612833 684124 566699 566288 560600 518286 492968 590468
5545 590468 669593 688230 770492 733359 603512 631579 604633 553947 472141 452374 279812
5534 279812 354309 494513 616460 610135 591543 615280 591967 694443 703224 658488 567298
5523 567298 722265 769197 761556 589020 538861 610943 674352 800310 787647 776408 767398
5512 767398 679510 659056 646729 838321 689908 610352 836243 826976 784120 730302 616172
5501 616172 845691 863724 827278 914845 954220 905493 977072 974566 917896 867072 741553
5490 741553 781097 943703 922916 1000977 955282 964227 888576 930914 974839 903788 1053541
5479A053541Q3204O831J79q1069K7510Q3213k4430j1537k2324l7887K8924O2024
5467A168179J3610M2907l256N2550j21261P3070m8745K29595o2765k2949J16183
5456A437118J89278j28832r2813J00176J81736l182k0645J43532k3498L6719M5993
5445A865582J30665K23512m9762r6378J27800J00135O8326J0220O3329M0033N7313
5434B540775J30186P6064k5349M4953N0532M7398J79072p320J26413m2223R2546
5423C213047K23424R8321m6152N9458l5052Q413R1839K87741J98519m13P0455
5412D169600K01722K36695k9793j13879K02424K79195K87558R8581P4470J87947
5402E594520K44923P6969K58458M47836J92720K82890K55772N3472K46086L64239
$$ plain form
5479 1053541 1136745 1143576 1143755 1062686 1090196 1173409 1148979 1137442 1115118 1077231 1106155 1168179
5467 1168179 1181789 1224696 1221440 1273990 1152729 1225799 1177054 1406649 1343884 1320935 1437118
5456 1437118 1626396 1497564 1404751 1504927 1686663 1683481 1662836 1806368 1782870 1819589 1865582
5445 1865582 1996247 2219759 2169997 2073619 2201419 2301554 2369880 2380100 2443429 2483462 2540775
5434 2540775 2670961 2747025 2721676 2766629 2817161 2864559 3043631 3036311 3162724 3120501 3213047
5423 3213047 3436471 3534792 3488640 3548098 3513046 3521459 3613298 3901039 4099558 4099145 4169600
5412 4169600 4371322 4608017 4578224 4464345 4666769 4945964 5233522 5332103 5406573 5594520
5402 5594520 5839443 5916412 6174870 6622706 6815426 7098316 7354088 7407560 7653646 8017885
5392H017885K92108L89525M17492M17373M68830O25773L91380N11831N15926O42620
5382A2690743O61941O83450O99152R24624R19761J102429J299949J619552J674910
5373B2276511K089449K474244L044605L695203M464091N148931O455638P394301
5365E7042973P794956P155558M928919J161264k809627o169022p665277p646036
5357E3793708o928172n920667n020613l970907l378327k872441k169744j705656
5349B1827181j592530j471428j165452j012554r74500p18948o51398o17550n06370
5340A3116451m42804l26177l64047l35843j95891j94095j89192r9175k23070l978
5330A0742179l2051j91875n6752J87378j370J946K25506J88271J66085o8863P6194
$$ plain form
5392 8017885 8309993 8699518 9117010 9534383 10003213 10628986 11020366 11532197 12048123 12690743
5382 12690743 13352684 14036134 14735286 15659910 16579671 17682100 18982049 20601601 22276511
5373 22276511 24365960 26840204 29884809 33580012 38044103 43193034 49648672 57042973
5365 57042973 64837929 71993487 76922406 78083670 75274043 69105021 61439744 53793708
5357 53793708 46865536 40944869 35924256 31953349 28575022 25702581 23532837 21827181
5349 21827181 20234651 18763223 17597771 16585217 15610717 14891769 14240371 13622821 13116451
5340 13116451 12673647 12347470 11983423 11647580 11451689 11257594 11068402 10969227 10746157 10742179
5330 10742179 10710128 10518253 10461501 10648879 10647509 10649455 10874961 11063232 11229317 11160454 11236648
5319A1236648J33559N15897L83463M74329J87149M52882L96883L96381N27735
5310A4704926N47299N77429O56857Q46554J029147J056719J229539J522318J963101
5301B4133889K171430K441333L091749L994466M419985N429226O711855P516459
5293E9910392P757376O427566L645394k83599m266424o997417p854230p497320
5285E0841738o691165n854526m631912l994985l237200k596042k174494j711636
5277A9949778j577723j343999j236317j172343j008227p85173p16463n18180p46873
5268A0844480n31916m69053l19289k69736o54189k78590m05846k15719k08685
5259G491457k70222k49381k11943l00422j61649l13681q5029n8357k11844k0072
$$ plain form
5319 11236648 11370207 11886104 12269567 12743896 12931045 13383927 13780810 14177191 14704926
5310 14704926 15252225 15829654 16486511 17333065 18362212 19418931 20648470 22170788 24133889
5301 24133889 26305319 28746652 31838401 35832867 40252852 45682078 52393933 59910392
5293 59910392 67667768 74095334 77740728 77457129 73190705 66193288 58339058 50841738
5285 50841738 44150573 38296047 33664135 29669150 26431950 23835908 21661414 19949778
5277 19949778 18372055 17028056 15791739 14619396 13611169 12825996 12109533 11591353 10844480
5268 10844480 10312564 9843511 9524222 9254486 8600297 8321707 7915861 7700142 7491457
5259 7491457 7221235 6971854 6759911 6459489 6297840 5984159 5899130 5840773 5628929 5608857
5249E608857r0452j26719k22314M4974j81095k38607O2052P0401l0461p7261j45070
5238D674305j37080j22253l5563O1053m6573j68338j29929k2062J00885K9423
5228D203868k07967k47345j10503l7935J2635m798k4557n6215j71495J72065J1512
5217C539265n986n9544K27847J17467k12574q6166n0939M6088o3777J6050r9482
5206C368249O4317P9575J30589O0247N0516N2409M7444l2662K09346j16733k91336
5195C621961R6702L17262L6190J83892r8232n5119J40407J07838r9984q9514K06221
5184D367624N942K70652K15295N5613J57048J4299R5481K76851j30651L58454
5174E686608J54679Q1309J40994j7600L29340L49571N6386J91227J25557n8665
$$ plain form
5249 5608857 5518405 5391686 5169372 5214346 5033251 4794644 4856696 4927097 4896636 4819375 4674305
5238 4674305 4537225 4414972 4379409 4440462 4393889 4225551 4095622 4073560 4174445 4203868
5228 4203868 3995901 3748556 3638053 3600118 3612753 3607955 3583398 3527183 3355688 3527753 3539265
5217 3539265 3533279 3473735 3701582 3819049 3606475 3520309 3469370 3515458 3451681 3467731 3368249
5206 3368249 3432566 3512141 3642730 3702977 3753493 3805902 3853346 3820684 4030030 3913297 3621961
5195 3621961 3718663 4035925 4072115 4256007 4157775 4102656 4243063 4350901 4250917 4161403 4367624
5184 4367624 4373566 4644218 4859513 4915126 5072174 5086473 5181954 5458805 5328154 5686608
5174 5686608 5841287 5922596 6063590 6045990 6375330 6724901 6781287 6972514 7098071 7039406
5164G039406M24162L83972J48945L92014K59733J29252L93866M47484K84863N65697
5154A0469394L74347K24281P82725N76290O79420P77644P88338R68578J019493
5145A6660510J235065J243598J441728J671399J789567J985890K201755K165270
5137C0394782J998902J685705J073864K55662M7337m89887q44475j200276j282057
5128C1639557j168781j107261r45489p05416n31170k71476l20494j8916L99545
5119B6970099L23067N25373P30704R60973R85804J223483J380273J603559J711502
5110C6414837J998663K007995J871817K013356J816426J545169J109772R17734
5102D9695769P19305K14686J6024m42254q06116j019868j209446j280770j351312
$$ plain form
5164 7039406 7463568 7847540 7996485 8388499 8648232 8777484 9171350 9618834 9903697 10469394
5154 10469394 10843741 11068022 11850747 12427037 13106457 13884101 14672439 15641017 16660510
5145 16660510 17895575 19139173 20580901 22252300 24041867 26027757 28229512 30394782
5137 30394782 32393684 34079389 35153253 35408915 35456252 34966365 34121890 32921614 31639557
5128 31639557 30470776 29363515 28418026 27712610 27181440 26909964 26589470 26570554 26970099
5119 26970099 27293166 27818539 28549243 29510216 30496020 31719503 33099776 34703335 36414837
5110 36414837 38413500 40421495 42293312 44306668 46123094 47668263 48778035 49695769
5102 49695769 50415074 50629760 50645784 50203530 49397414 48377546 47168100 45887330 44536018
5093D4536018j528807j674252j496818j532242j603002j318813j434339j272328
5085C2675417j272229j132578q75767q08872p28862o26421k47011j85857O6379
5076B6864199L13225O48181Q18046Q94827R51426J221729J646726J552747J536763
5067C6447869J088622N61293j6371n52416j250319j853531k157970k360139k250245
5058B7656793k035107j835906j824794j453537j215677j195551r84503j190598
5050A5921120p73353o91238o17929o35736m47122l84870m69533k13283k02330
5041A1485726j68508m94745j19875N9788p9715k39705k90306k7702l2749m8888
5031A0043321M2952Q4417j809K2130k4028J40880J74218k6675J21185K69815J95106
$$ plain form
5093 44536018 43007211 41332959 39836141 38303899 36700897 35382084 33947745 32675417
5085 32675417 31403188 30270610 29394843 28585971 27857109 27230688 26983677 26797820 26864199
5076 26864199 27177424 27825605 28643651 29538478 30489904 31711633 33358359 34911106 36447869
5067 36447869 37536491 38097784 38081413 37528997 36278678 34425147 32267177 29907038 27656793
5058 27656793 25621686 23785780 21960986 20507449 19291772 18096221 17111718 15921120
5050 15921120 15147767 14456529 13838600 13202864 12755742 12370872 11901339 11688056 11485726
5041 11485726 11317218 10822473 10702598 10762386 10682671 10442966 10152660 10124958 10092209 10043321
5031 10043321 10086273 10170690 10168881 10191011 10166983 10307863 10482081 10455406 10576591 10846406 11041512
5020A1041512J41302K64798J53703K48957K78958K16123L59111M61909M92903
5011A3659276O47990N52046M93950O02960P76304Q76919R17629J163584J348003
5002B1038661J287385J411110J398340J502672J447332J592685J306995R61843
4994C1947023P35983N90676K76457p944k81956j51105l37948m57435k15605j92031
4984C1906115j05599j14266N5751N8673L28778M31627N71698P80202R52291J019784
4974C5885054J223117J283598J241514J283759J379280J330518J159603J002603
4966D5789046Q67371P51676N94446L55286J27234l33810n54987o57696o62472
4957D6276094q78966r42304j099712j078906j352798j432128j321473j327220
$$ plain form
5020 11041512 11182814 11447612 11601315 11850272 12129230 12345353 12704464 13166373 13659276
5011 13659276 14307266 14859312 15353262 15956222 16732526 17609445 18527074 19690658 21038661
5002 21038661 22326046 23737156 25135496 26638168 28085500 29678185 30985180 31947023
4994 31947023 32683006 33273682 33550139 33542195 33260239 33109134 32771186 32313751 32098146 31906115
4984 31906115 31800516 31686250 31742001 31800674 32129452 32561079 33132777 33912979 34865270 35885054
4974 35885054 37108171 38391769 39633283 40917042 42296322 43626840 44786443 45789046
4966 45789046 46656417 47408093 48002539 48357825 48485059 48151249 47596262 46938566 46276094
4957 46276094 45397128 44454824 43355112 42276206 40923408 39491280 38169807 36842587
4949C6842587j287347j288326j189603j189859q39598j057584j007863n24898
4941B8457509n02305j00936p9005K6160K27381L99201P32287J026457R25456Q72566
4931C1984771R75693J063992Q27989N04858j3997n34695j077567j489968j831960
4922C0409116k164629k146857k085220j716775j884472j651003j411920j296207
4914A6052033j177727j016740j018350p01499o72784p32679n86534n79619l40897
4905I225204l31290n75033m13342j68158m26230n51574j63033k15716r7655k28769
4895F054404l16328k2959j90442j22621k75971j80267n2526l08265N3481L097
4885D641603j44053l21400k09652j30298j52887m9764L124j11096j08079l3009
$$ plain form
4949 36842587 35555240 34266914 33077311 31887452 31047854 29990270 28982407 28457509
4941 28457509 27955204 27854268 27775263 27801423 28028804 28428005 29160292 30186749 31112205 31984771
4931 31984771 32960464 34024456 34852445 35357303 35343306 34808611 33731044 32241076 30409116
4922 30409116 28244487 26097630 24012410 22295635 20411163 18760160 17348240 16052033
4914 16052033 14874306 13857566 12839216 12137717 11464933 10732254 10145720 9566101 9225204
4905 9225204 8893914 8318881 7905539 7737381 7311151 6759577 6596544 6380828 6283173 6054404
4895 6054404 5738076 5715117 5524675 5402054 5126083 4945816 4893290 4585025 4638506 4641603
4885 4641603 4497550 4176150 3966498 3836200 3683313 3633549 3636673 3525577 3417498 3384489
4875C384489j02434o7238p4722K8224L6156j17988k47247j40740j0019j0595p3987
4864B603899O2062j58801l2535Q8949j8255k90255K2153j4942m4968m7263n6591
4853B113453N5036r2014l317o7882q9968R7480j8793m2056l7266m5915N4491j3781
4841A909468j60612j8536J64389o6639k4657j65819R6641J54079j46398j17095
4831A624821P8561n6582m4757R3412j50323o1831J17840l1286J00269J9671j75152
4820A514643L893n0194l9396P2303j23293q6654o9194K16782o4753j4553k1647
4809A337937n1812L0883j0135J13234J112j83012j66902j12828L1826K37509j1920
4798A215892K17551O2329l3194j82651J10054r9047O918N1955Q287J1072l4026
$$ plain form
4875 3384489 3282055 3214817 3140095 3168319 3204475 3086487 2839240 2698500 2688481 2677886 2603899
4864 2603899 2665961 2507160 2474625 2563574 2545319 2255064 2277217 2262275 2217307 2170044 2113453
4853 2113453 2168489 2076475 2073158 2005276 1915308 2012788 1993995 1951939 1914673 1868758 1923249 1909468
4841 1909468 1748856 1730320 1894709 1828070 1803413 1637594 1734235 1888314 1741916 1624821
4831 1624821 1703382 1646800 1602043 1695455 1545132 1483301 1601141 1569855 1670124 1689795 1514643
4820 1514643 1518536 1468342 1428946 1501249 1377956 1291302 1222108 1438890 1374137 1359584 1337937
4809 1337937 1286125 1317008 1306873 1420107 1421219 1238207 1071305 958477 990303 1227812 1215892
4798 1215892 1433443 1495772 1462578 1279927 1389981 1290934 1297852 1349807 1358094 1369166 1335140
4787A335140K8462j37508l0967n3256J52911k9p1781K460J50006p239K9518q897
4775A388820j58010K951m4314P4782k5605P9625J3117L6152o4329j45077M8172
4764A206284j0793n0635q5901M9153K333o0461L10742J03410j49409j0552P4396
4753A378567Q6242J8097K3124n6617R3229j58625l7311q95j49292k0005M6590
4742A223104L6146J6957j0320P3068J67703m4973J5562n3103m8276n3374J21492
4731A443986K3065J3346K017k53309Q1080N8906J9568L6379j03123k0219K01758
4720A503454j4497j30559j14451P2605o0790j59501M1649J02862m4106K6414n7189
4709A165891n7941R1784J00470M2940J04178J04296k00854R010J41901K4437n0552
$$ plain form
4787 1335140 1363602 1226094 1195127 1141871 1294782 1294753 1222972 1225432 1375438 1368199 1397717 1388820
4775 1388820 1230810 1233761 1189447 1264229 1238624 1318249 1331366 1367518 1303189 1158112 1206284
4764 1206284 1195491 1144856 1058955 1108108 1110441 1049980 1360722 1464132 1314723 1304171 1378567
4753 1378567 1464809 1482906 1506030 1449413 1542642 1384017 1346706 1345811 1196519 1176514 1223104
4742 1223104 1259250 1276207 1265887 1338955 1506658 1461685 1477247 1424144 1375868 1322494 1443986
4731 1443986 1467051 1480397 1482414 1229105 1310185 1369091 1388659 1425038 1321915 1301696 1503454
4720 1503454 1488957 1358398 1243947 1316552 1255762 1096261 1137910 1240772 1196666 1223080 1165891
4709 1165891 1107950 1199734 1300204 1343144 1447322 1551618 1350764 1359774 1501675 1526112 1475560
4698A475560L4993p2032j78327o5323Q590L1920k6433o6393P2682Q0617O7306
4687A363160j14494J8499j18357j42662N2299l0188k6363J58597P3139m1423K124
4676A194331j02608j2494k5198j11863M5245Q4452j21739k06033O4244M4151j7407
4665H35081R9683N649j158P7037L9785J31197r9628j38758J41807j39982O3206
4654A013919j01419l2392J7697n0707Q5829J3661k8443n3221q9017M4098Q0212
4643I00217k83456p3347R8046R4456j51472j45628q9783Q2798P6887K8503Q437
4632E45658k3066p5673j00952R7223P0194k0614r8915Q3992J65894r4414k05508
4621C43819J29968J62745N1719k13128r0287M8714l9325K3586j09667o0874J23453
$$ plain form
4698 1475560 1510553 1438521 1260194 1194871 1203461 1235381 1208948 1142555 1215237 1295854 1363160
4687 1363160 1248666 1267165 1148808 1006146 1058445 1028257 1001894 1160491 1233630 1192207 1194331
4676 1194331 1091723 1079229 1054031 942168 987413 1071865 950126 744093 808337 852488 835081
4665 835081 934764 940413 939255 1016292 1056077 1187274 1087646 948888 1090695 950713 1013919
4654 1013919 912500 880108 897805 847098 932927 946588 918145 864924 775907 820005 900217
4643 900217 616761 543414 641460 735916 584444 438816 349033 431831 508718 537221 545658
4632 545658 522592 446919 345967 443190 513384 492770 393855 477847 643741 549327 343819
4621 343819 473787 636532 688251 475123 384836 433550 394225 417811 308144 247270 370723
4610C70723J63406M9870j23273K8525K4454l7742j73353N6261L8774j72172p0298
4599A55175O4978L3934j9891L9036q0177R8500L4513O3071j41401q7554Q2044
4588B42228j19554J65032N4875j28926j11676R4323q4241J25802M0766j427k1265
4577B55937l4958K5406j89687O8545Q946L9359j00139k4062J27984j26765j03506
4566e2940J62807Q5505J261r633o6227k9146P9603P9779p9142j00321Q7436J44583
4554C03565K4451l3436Q5296m3990o7599j03155m6160p1354J46780o7813r970
4543A16615R821K8047P422j7070j2313j50103J465k4312J66226o286o6185n1982
4531A345M585p1555L9781J5953P3882N0294M4647J907J25756j10953j02210P5581
$$ plain form
4610 370723 534129 583999 460726 489251 513705 475963 302610 358871 397645 225473 155175
4599 155175 220153 254087 234196 273232 193055 291555 326068 389139 247738 160184 242228
4588 242228 122674 287706 342581 213655 101979 196302 112061 237863 278629 277202 255937
4577 255937 220979 246385 56698 125243 134189 173548 73409 49347 177331 50566 -52940
4566 -52940 109867 195372 196633 187000 120773 91627 171230 251009 171867 71546 158982 303565
4554 303565 328016 294580 379876 335886 268287 165132 118972 47618 194398 126585 116615
4543 116615 126436 154483 161905 144835 132522 -17581 -16116 -40428 125798 119512 53327 1345
4531 1345 5930 -65625 -25844 -9891 63991 114285 158932 160839 286595 175642 73432 149013
4519A49013N488j0441l757p0703O3491O0235j46915k1643j4136J37279k7054O6403
4507A87260K3130j47500m813J16710O1318j21531q2796Q6092q3415N9677J17414
4496B11546Q9496J2473j30206j45538Q5698m9556j6512J01840j4826n6344J16195
4485B04266J0908k25110q6232O0822J50264J29658p9631n238l2829P662J11411
4474B45951k3664j1473k3366J6665l7020L1121J8349M3258m2692N1999j21730
4463A47398k0007L9748q3257P0562L8997q9300r88N5020l6844J00877J06596j06564
4451B22238m1831Q18j83782Q8190O2224J21251N4857n4838j75044J53265n2364
4440A94984k1091l0527q1731J11472j34953N5347J89985l634j0897K2803j40003
$$ plain form
4519 149013 154501 144060 140303 69600 133091 193326 46411 24768 10632 147911 120857 187260
4507 187260 210390 62890 58077 174787 236105 114574 31778 117870 34455 94132 211546
4496 211546 301042 313515 183309 37771 123469 73913 57401 159241 144415 88071 204266
4485 204266 215174 -9936 -96168 -35346 114918 244576 164945 159707 126878 134540 245951
4474 245951 222287 210814 187448 204113 167093 198214 216563 259821 217129 269128 147398
4463 147398 127391 167139 83882 154444 193441 104141 103153 158173 121329 222206 328802 222238
4451 222238 180407 181225 -2557 85633 147857 269108 323965 269127 94083 247348 194984
4440 194984 173893 143366 61635 173107 38154 93501 283486 279852 268955 291758 151755
4429A51755L0255J7654J15426j9942q8899J13307P0434k8913k4731j92924O0632
4418B04054l3249P9718M4714o9125Q5558N3460q6961j11300J38494J03151k7568
4407C80946K2171p7868k8257N8493j20780L321O3612j0886J30836m0862m3269
4396C37457n0126K4917J55785j41203j61210q4801J16066K24423q7031P3048O7718
4385D75043P0269j05667N8667R2926j58843N0442n7712j41292P6473P5825j7571
4374D18560m6538m698n488k3283k6599Q7660r2375j5010K3597r320j2828k643
4362B91035J26039K0508Q9626l5677m7910R7149m6163o8149l7374L2372J24634
4351E46090k67183n9278J97441P5019l6747Q7676j10742j03172j2055J69354O6569
$$ plain form
4429 151755 182010 199664 315090 295148 206249 319556 389990 361077 336346 143422 204054
4418 204054 170805 250523 295237 226112 311670 365130 278169 166869 305363 408514 380946
4407 380946 403117 325249 296992 355485 234705 238026 301638 290752 421588 380726 337457
4396 337457 287331 312248 468033 326830 165620 80819 196885 421308 334277 407325 475043
4385 475043 545312 439645 498312 591238 432395 482837 425125 283833 360306 436131 418560
4374 418560 372022 367324 361836 338553 311954 399614 307239 292229 315826 306506 293678 291035
4362 291035 417074 437582 527208 491531 443621 540770 494607 426458 389084 421456 546090
4351 546090 278907 219629 417070 492089 455342 543018 432276 329104 317049 486403 552972
4340E52972o4143j38249N5463M0777p7886p8854O0881m4800L3047K9504q6815
4329B81897J45915M2483k8358j58723O3545J26851O6123j13214q6516J65653j88031
4318C17625j90164M1809J33768J08653m9003r7044M1515l7194m4J55816k00305
4307B25432q1548m543K7523j27988M7632K39573p8512j9470K0817k7480O2797
4296B84233r8555q9772P5251J38420n8281r4924R7981K0440p4220O9327m3804
4285B26096l2638P8326p7249j26042k7006P7392j00129J00263M1557n1021N7597
4274A67146J07390P9252j11049j18629N4402r439Q5556J26813p2773j1742l7572
4263B59355j01153M2436J44057N7671P1539r9966q5796N5458J6458N825p6896
$$ plain form
4340 552972 488829 350580 406043 446820 368934 290080 350961 306161 339208 368712 281897
4329 281897 427812 470295 441937 283214 346759 473610 539733 426519 340003 505656 317625
4318 317625 127461 169270 303038 411691 362688 265644 307159 269965 269921 425737 225432
4307 225432 143884 139341 166864 38876 86508 326081 247569 228099 248916 221436 284233
4296 284233 185678 95906 171157 309577 251296 156372 254353 274793 200573 269900 226096
4285 226096 193458 271784 194535 68493 41487 118879 18750 119013 160570 109549 167146
4274 167146 274536 353788 242739 124110 178512 169073 254629 381442 308669 296927 259355
4263 259355 158202 200638 344695 402366 473905 373939 288143 343601 360059 365884 288988
4252B88988q7514o4816J48047K2981K8492J4040n8613n111p179L0528Q522k7698
4240B90667m7837j40705J03874M9312J18208P2486o057r279l3991J05507n0339
4229D51846q9626j05885K32425r0842q0000j09542P4805M8104L4552q2743o2521
4218B20573J23337o3810K8392J24644Q1861j26327N1231r1326j12023j0307J59320
4207C85565r7470j27811J66079M077j07062o811J32025k387j02389J05562P780
4196C57158j47680P0497K854O4207Q157N8150q2221l7068J83382q6259M5642o5066
4184C71753N2667p7039M1740O2198M9786J14766r9312m5273q8009J29367J06570
4173F19214J8898j28706q8535M1054r420M66p017q8849p8042O0599l957P1833
$$ plain form
4252 288988 201474 136658 284705 307686 336178 350218 291605 286494 279315 309843 318365 290667
4240 290667 242830 102125 205999 255311 373519 446005 439948 430669 396678 502185 451846
4229 451846 362220 256335 488760 397918 317918 208376 283181 331285 365837 283094 220573
4218 220573 343910 280100 308492 433136 514997 388670 439901 348575 236552 226245 385565
4207 385565 288095 160284 326363 330440 223378 216567 348592 346205 243816 349378 357158
4196 357158 209478 279975 282829 347036 355193 413343 331122 294054 477436 391177 436819 371753
4184 371753 424420 347381 389121 451319 501105 615871 516559 471286 383277 512644 619214
4173 619214 638112 509406 420871 461925 452505 452971 445954 357105 279063 339662 335705 407538
4161D07538J00817j8575k7050m8218K0154j4406N4182q3499n0549N982J25558
4150D71934m9743q727k967N4585J16303j05533J10119l2530o5176J32028p729
4139F12564j91376M697n2251R631O8692K8405m2926j23118J27154j7226J8122
4128D42368M216R9138j94725n4704J04233k2915l142m1779P8260j4205n223K4342
4116D15864L2673p1626l8567L8290J79646N4154m1686O216p4516n0323j0249R3569
4104E33445k0380r163P9362l5638j78323L2041Q7429j0499k3194J9954J88360
4093F63394q743j33523K9542J20508N4835m9744n7149j67379n9739J88464K2293
4082F02759j85375L7703K91100n6105k7791M7734R8532o2214r1440r4909J59360
$$ plain form
4161 407538 508355 489780 462730 414512 434666 420260 474442 390943 340394 346376 471934
4150 471934 422191 413464 410497 465082 581385 475852 585971 553441 488265 620293 612564
4139 612564 421188 425885 373634 383265 451957 480362 437436 314318 441472 424246 442368
4128 442368 446584 545722 350997 296293 400526 377611 374469 332690 410950 396745 391522 415864
4116 415864 448537 376911 338344 376634 556280 610434 568748 574964 500448 450125 439876 533445
4104 533445 513065 503902 583264 547626 369303 401344 488773 478274 455080 475034 663394
4093 663394 654651 521128 550670 671178 726013 676269 619120 451741 392002 580466 602759
4082 602759 417384 455087 746187 690082 662291 710025 808557 746343 654903 559994 719354
4071G19354P9720j23313n3066J19816j13861K4631J43602N8600j91656q0297J13078
4060F96608J00045M7372O1073k066r842M399J219Q234k1806r0603J44566L5260
4048I74459l4142J00659P159l5326k3027J8338o5229K17612N7979N1075L927Q5009
4036A358493q9292J99609N6876J30391R1397l4815p1494O8606n1287Q1579R2361
4025A832424m1013j15258R1859K47979J35363k7001j89470R9313J05052J58126
4015B297374M7915j61739K08351p4987K9574K57916J60002l6724N0609J48012
4005B926303K3067K15728J5168J88039J18807J14646K30655L27000O0648J74196
3995D394257L27785K26953j6009L30802M11061K92642K76008J31042K32765M61229
$$ plain form
4071 719354 799074 675761 622695 742511 628650 653281 796883 855483 663827 583530 696608
4060 696608 796653 844025 905098 903032 893190 897589 898808 907042 885236 794633 939199 974459
4048 974459 940317 1040976 1048135 1012809 989782 1008120 942891 1160503 1218482 1269557 1273484 1358493
4036 1358493 1269201 1468810 1525686 1656077 1747474 1712659 1641165 1709771 1658484 1740063 1832424
4025 1832424 1791411 1676153 1768012 2015991 2151354 2124353 1934883 2034196 2139248 2297374
4015 2297374 2345289 2183550 2391901 2316914 2346488 2604404 2764406 2727682 2778291 2926303
4005 2926303 2949370 3165098 3180266 3368305 3487112 3601758 3832413 4159413 4220061 4394257
3995 4394257 4722042 4948995 4932986 5263788 5674849 5967491 6243499 6374541 6607306 7068535
3985G068535K75048K63848N41908P32087O95651O46851Q47806Q92688J049219
3976A3013641J237745J461485J627823J730392K232712K330046K353692K201437
3968B8188973K098208J567628Q89331m40132j433362j833895k410016k479456
3960B4147279k399137k153139j823329j822841j447900j325303j210367r99466
3952A0965797r39819o45631o72064o25126l91073n46142n34043k58566l44053
3943F009280k97232k71530k70624k84629k51501k90714j67862l29461q0334j18651
3933C646742j70786j35962o2004k02104l0356n0728j10677m2912r2060l01157
3923B447996m9571p9740O6434J17174j00907j45245j36824j33494j10781J48831
$$ plain form
3985 7068535 7343583 7607431 8149339 8881426 9577077 10223928 11071734 11964422 13013641
3976 13013641 14251386 15712871 17340694 19071086 21303798 23633844 25987536 28188973
3968 28188973 30287181 31854809 32744140 32304008 30870646 29036751 26626735 24147279
3960 24147279 21748142 19595003 17771674 15948833 14500933 13175630 11965263 10965797
3952 10965797 10025978 9380347 8708283 8083157 7692084 7145942 6611899 6353333 6009280
3943 6009280 5712048 5440518 5169894 4885265 4633764 4343050 4175188 3845727 3765393 3646742
3933 3646742 3475956 3339994 3277990 3075886 3045530 2994802 2884125 2841213 2749153 2447996
3923 2447996 2398425 2318685 2385119 2502293 2401386 2256141 2119317 1985823 1875042 2023873
3913B023873K0640k73977L8030k2617J2683L8257j85257j9938r6572k2507l2967
3902A479648q0725J06183l09n4250o2120o1221j9421j04571o4395m5753P4132
3891A167198J69339L0545k41672N0976M5867k0563j42778K1594k5190j34420R7619
3880A018515J09060j23523P6654J4353r7659r0302j4931J15639o8259J7602l05
3869I56844k2376P290k6163k4998J72524j03593R8360q7775k12854P9999l5039
3858H02219j32599p9876O8658J93102j10508K90M9555j01770M7131j43692j08541
3847D83969O7849N5943k6683N9921O4759n240j166j19803Q284K0768O5869J85968
3835H60438l6078k16978o2623J34771m2856n9524j27703l1509J71552K03459j8849
$$ plain form
3913 2023873 2044513 1770536 1808566 1785949 1798632 1836889 1651632 1631694 1535122 1512615 1479648
3902 1479648 1398923 1505106 1504797 1450547 1388427 1327206 1307785 1203214 1138819 1093066 1167198
3891 1167198 1336537 1367082 1125410 1176386 1222253 1201690 1058912 1080506 1055316 920896 1018515
3880 1018515 1127575 1004052 1080706 1095059 997400 907098 892167 1007806 939547 957149 956844
3869 956844 934468 941758 915595 890597 1063121 959528 1057888 970113 757259 837258 802219
3858 802219 669620 589744 658402 851504 740996 741286 790841 689071 736202 592510 483969
3847 483969 551818 607761 581078 640999 705758 700518 699352 579549 587833 608601 674470 860438
3835 860438 824360 607382 544759 679530 636674 577150 449447 417938 589490 792949 774100
3824G74100k4753m5069l0821p0411m2086M3381j3435j7263p9564P6425J96783
3813G67287j89448j1139p6123P9715j42317K9472N0362L0172J12614k69220N035
3802C86410J37562k7598m6448J0581m3169K3811R5371m2790l6034j20611O4063
3791D01148N2246J27979j8485J22861m8270k575J63129o2543r8984k14700J2524
3780D34330J59455j65696j9710J48352j02634J15337m8207l1261N0421J40274
3770F80661J34919j33893q8728o6466r1337K3527P8526J3846L3757K8634r8343
3759E15103P2022J40671M6260J7067J4519j13376l9752O3687J7412k44519N6135
3748E45229O9790p4769P5754J14552j18627R4109M518J18840r5961p1390R1031
$$ plain form
3824 774100 749347 704278 673457 603046 560960 604341 590906 573643 494079 570504 767287
3813 767287 577839 566700 490577 570292 427975 457447 507809 537981 650595 381375 386410
3802 386410 523972 496374 449926 460507 417338 441149 536520 493730 457696 337085 401148
3791 401148 453394 581373 562888 685749 637479 634904 798033 735490 636506 421806 434330
3780 434330 593785 428089 408379 556731 454097 569434 521227 489966 540387 680661
3770 680661 815580 681687 592959 526493 435156 458683 537209 551055 584812 613446 515103
3759 515103 587125 727796 774056 791123 805642 692266 652514 716201 733613 489094 545229
3748 545229 615019 540250 616004 730556 611929 706038 710556 829396 733435 662045 753076
3737G53076o6149J21864k7265j05879Q9474q9155Q8019l8175L9175j48286P2834
3726F89533O6758q5526J18369k1462R0719o9985K5442k109J29092j86509N0061
3715H04383O7329j0366N1659r9482j10812R1977L4078K5262k137M073J28778j29189
3703H55553m504J18587l2798k2074M2730j3838K13850j10855k47904q4080P0100
3692G84767J77528o4065l4760j90019N2806J98886J9839n2432j79895J03270J09338
3681I25263J38050N114M3356Q044L4541j01307j5526k7418k25488R181J50467
3670I44277J75214l730k8506j7043J1043m2810r734r374P1120j8944l27j9709
3658A051477q7511J84683o9782j92179j3553O7840J89980L4952p2529J1333k6304
$$ plain form
3737 753076 686927 808791 781526 675647 765121 675966 763985 725810 764985 616699 689533
3726 689533 756291 670765 789134 767672 858391 788406 813848 811739 940831 754322 804383
3715 804383 871712 861346 913005 813523 702711 794688 828766 854028 851891 855964 984742 855553
3703 855553 851049 969636 936838 914764 957494 943656 1157506 1046651 798747 714667 784767
3692 784767 962295 898230 863470 673451 726257 925143 944982 892550 712655 815925 925263
3681 925263 1063313 1068427 1111783 1119827 1154368 1053061 1037535 1010117 784629 793810 944277
3670 944277 1119491 1115761 1087255 1070212 1081255 1038445 1028711 1019337 1090457 1071513 1071186 1051477
3658 1051477 963966 1148649 1078867 886688 873135 940975 1130955 1165907 1093378 1104711 1078407
3647A078407N6453p807K21089j35605m6837K412o7648J08390R0411n0164M9814
3636A298915J42930Q1226m7414j86316j9481j7249l3847o1872K43394K960O5984
3625A469230M1821n9156q726L2322N6898j04789N2022K30611p5230k2484j06826
3614A505693K32491J27357j18237Q5307L4424p393L7567r2509P9174N5583J29055
3603B068512k3403j55084L4806R8378J25366K09552q5938Q0198J54497p1276r3382
3592B342226j06610Q1072J88872J03376p3843J02868L1434R9756J83597r9035
3582B853713q1871Q3962J13076m0071J32983q7993o5015J26333K70944j4375j48092
3571C143594L5545J96091j16690R1370J50528L8277J51449K22877M0325J8355
$$ plain form
3647 1078407 1134860 1127053 1348142 1212537 1165700 1168112 1100464 1208854 1299265 1249101 1298915
3636 1298915 1441845 1523071 1475657 1289341 1269860 1252611 1218764 1156892 1400286 1403246 1469230
3625 1469230 1511051 1451895 1443169 1475491 1532389 1427600 1479622 1710233 1635003 1612519 1505693
3614 1505693 1738184 1865541 1747304 1832611 1867035 1859642 1897209 1804700 1883874 1939457 2068512
3603 2068512 2045109 1890025 1924831 2023209 2148575 2358127 2272189 2352387 2506884 2435608 2342226
3592 2342226 2235616 2316688 2505560 2608936 2535093 2637961 2669395 2769151 2952748 2853713
3582 2853713 2771842 2855804 2968880 2928809 3061792 2973799 2908784 3035117 3306061 3291686 3143594
3571 3143594 3179139 3375230 3258540 3349910 3500438 3538715 3690164 3913041 3953366 3971721
3561C971721R6076J13345q1423q2889K02731k979J13647J97298K05704K8769M1729
3550D803729L4202Q3070K6250K41577K40096k6440J02582L15005j53272J26652
3540E793451J78103J60606J55171N6334m8560K09799K46915K55523J11471K65156
3530G383969J55265J47048J87893J21682J73726K85537L30934K36538Q9136O3565
3520I175293J22193J78025L50384K91594L61131L31160L94340L85997K51741J99665
3510A2041523L67052L11808J65479N64289M77236M11723K62906M59327K32263
3501A5293606K64276L62143J18806L31676L33192K45693K10689L33226L32929
3492A7826236J95602K80895N17760L68852N75616N61388M37092L84968N60068
$$ plain form
3561 3971721 4067797 4181142 4099719 4016830 4219561 4216582 4330229 4527527 4733231 4762000 4803729
3550 4803729 4837931 4921001 4947251 5188828 5428924 5402484 5505066 5820071 5666799 5793451
3540 5793451 5971554 6132160 6287331 6343665 6295105 6504904 6751819 7007342 7118813 7383969
3530 7383969 7539234 7686282 7874175 7995857 8169583 8455120 8786054 9022592 9111728 9175293
3520 9175293 9297486 9475511 9825895 10117489 10478620 10809780 11204120 11590117 11841858 12041523
3510 12041523 12408575 12720383 12885862 13450151 13927387 14339110 14602016 15061343 15293606
3501 15293606 15557882 15920025 16038831 16370507 16703699 16949392 17160081 17493307 17826236
3492 17826236 18021838 18302733 18820493 19189345 19764961 20326349 20763441 21148409 21708477
3483B1708477P37060N58854N31369N25938P42579O74615O80841N67033N21319
3474B7248085O88289N12146L33941M58785M19393K75574M03892L47125L26684
3465C1013914K51776J07391J46789L34475K64285J30766J93422K11928K21318
3456C2876064L49428K41423M35922M13097L21472L20861L59877M92899K67844
3447C6078887L35354L45123L34851N07706J47816K60775L86275K52215J92138
3438C8841140L24617r1151n1624L9008j18759j64435j97176M9770j22723l10482
3428C8198185l27586n2392j15079m30820k53307j76189k88355k45395j21840N844
3418C6193066k65225l07422k67621l29797j13026j53873j53061j31566l11802
$$ plain form
3483 21708477 22445537 23004391 23535760 24061698 24804277 25478892 26159733 26726766 27248085
3474 27248085 27936374 28448520 28782461 29241246 29660639 29936213 30340105 30687230 31013914
3465 31013914 31265690 31373081 31519870 31854345 32118630 32249396 32442818 32654746 32876064
3456 32876064 33225492 33466915 33902837 34315934 34637406 34958267 35318144 35811043 36078887
3447 36078887 36414241 36759364 37094215 37601921 37749737 38010512 38396787 38649002 38841140
3438 38841140 39165757 39074606 39022982 39061990 38943231 38778796 38581620 38631390 38508667 38198185
3428 38198185 37870599 37818207 37703128 37272308 37019001 36842812 36554457 36309062 36187222 36193066
3418 36193066 35927841 35620419 35352798 35023001 34909975 34756102 34603041 34471475 34159673
3409C4159673j93733k10531j76259k82309k76025k12934k73149l21935l30707
3400C1882091m03402p35707l82062m00773m75537k30172m62253n89386m46501
3391B7756298m38839m72983m59560l78143l54991l92637j68124p3332m48659k87107
3381B4281923k47763k04937k58763j99120j90401j66698j40794k06581p9934j55944
3371B2430988j37567n7671j36520m86624j01703j15515k20154j96362M0518l6152
3361B0983238k11801Q6166k4938p9450L8919K20512P7915K30333J30956N9978
3351B1511828M9731J90030K96078L34445L23759M23407L17001K28469M61032L83629
3341B4519409M75827K63643L63701N73151M12554M74982N50430N93192P01160
$$ plain form
3409 34159673 33965940 33755409 33579150 33296841 33020816 32807882 32534733 32212798 31882091
3400 31882091 31478689 30742982 30360920 29960147 29484610 29254438 28792185 28202799 27756298
3391 27756298 27317459 26844476 26384916 26006773 25651782 25259145 25091021 25017689 24569030 24281923
3381 24281923 24034160 23829223 23570460 23371340 23180939 23014241 22873447 22666866 22586932 22430988
3371 22430988 22293421 22235750 22099230 21612606 21510903 21395388 21175234 20978872 21019390 20983238
3361 20983238 20771437 20857603 20832665 20753215 20792134 21012646 21090561 21320894 21451850 21511828
3351 21511828 21561559 21751589 22047667 22382112 22705871 23129278 23446279 23674748 24135780 24519409
3341 24519409 24995236 25258879 25622580 26195731 26608285 27083267 27633697 28226889 28928049
3332B8928049O41342N98568Q07787P48592P31497P62045Q09476Q19980R24018
3323C5771354J041825R55456J085834J093535J165102J229041J294305J452663
3315D5089115J323821J393426J535034J609103J578494J420058J433212J422704
3307E6804967J436437J459837J435394J381633J462969J485583J413048J439312
3299F8319180J361680J207083J362384J662310J767425J854417J940282K201130
3291H1675891K188479K255781K722066K666493K845671L116066L132844L319787
3283A03923078L396559L373085L654965L688689L715330L905515L832399L703974
3275A33193594L828847L741095L865385L705414M010542M114274M170125M238369
$$ plain form
3332 28928049 29569391 30167959 30975746 31724338 32455835 33217880 34027356 34847336 35771354
3323 35771354 36813179 37768635 38854469 39948004 41113106 42342147 43636452 45089115
3315 45089115 46412936 47806362 49341396 50950499 52528993 53949051 55382263 56804967
3307 56804967 58241404 59701241 61136635 62518268 63981237 65466820 66879868 68319180
3299 68319180 69680860 70887943 72250327 73912637 75680062 77534479 79474761 81675891
3291 81675891 83864370 86120151 88842217 91508710 94354381 97470447 100603291 103923078
3283 103923078 107319637 110692722 114347687 118036376 121751706 125657221 129489620 133193594
3275 133193594 137022441 140763536 144628921 148334335 152344877 156459151 160629276 164867645
3267A64867645M421502M562571M949935N154589N668599O069303O240252O681221
3259B08615617P048522P346560P710040Q194652Q552294Q985049R100967R643299
3251B75197000J0101063J0448665J1050015J1847203J2396867J3188275J4078760
3244C58307848J4877321J5895960J6832348J7309661J7482569J7055956J5681599
3237D73443262J3664041J0342381N801571P16571m696178r592335j3722459j5951826
3229D60005028j6980324j6970163j5980634j5024655j3547517j2255353j1268692
3222C57977690r901394r052964q031982p457170o536437n695960n235566m765012
3214C01301205m258644l623403l263133k539393k140673j554925p90497l01003
$$ plain form
3267 164867645 169289147 173851718 178801653 183956242 189624841 195694144 201934396 208615617
3259 208615617 215664139 223010699 230720739 238915391 247467685 256452734 265553701 275197000
3251 275197000 285298063 295746728 306796743 318643946 331040813 344229088 358307848
3244 358307848 373185169 389081129 405913477 423223138 440705707 457761663 473443262
3237 473443262 487107303 497449684 503251255 503967826 499271648 489679313 475956854 460005028
3229 460005028 443024704 426054541 410073907 395049252 381501735 369246382 357977690
3222 357977690 348076296 339023332 330991350 323534180 316997743 311301783 306066217 301301205
3214 301301205 297042561 293419158 290156025 287616632 285475959 283921034 283130537 282829534
3206B82829534J21281P74995O67907O37843L70277k7636o92209j026801j171703
3197B82483488j469712j794490j933871k399890k513946k736482l280932l538623
3189B62815542m023031m134811m450246m719839m448728m540406m483057m202914
3181B27812510m007622l791525l714257l260799l530010l347632l105667l428314
3173A99626684l464385l767257l833549l728861m163944m340075m225889m158430
3165A67944294m120434m109202m095669l879191l639616l413055l458756l329425
3157A37898946l230529l133601k987786l006187l197856k979316k905931k955495
3149A13502245l053959k930993k886839k917273k822914k668381k666278k346241
$$ plain form
3206 282829534 282950815 283725810 284393717 285031560 285401837 285374201 284681992 283655191 282483488
3197 282483488 281013776 279219286 277285415 274885525 272371579 269635097 266354165 262815542
3189 262815542 258792511 254657700 250207454 245487615 241038887 236498481 232015424 227812510
3181 227812510 223804888 220013363 216299106 213038307 209508297 206160665 203054998 199626684
3173 199626684 196162299 192395042 188561493 184832632 180668688 176328613 172102724 167944294
3165 167944294 163823860 159714658 155618989 151739798 148100182 144687127 141228371 137898946
3157 137898946 134668417 131534816 128547030 125540843 122342987 119363671 116457740 113502245
3149 113502245 110448286 107517293 104630454 101713181 98890267 96221886 93555608 91209367
3141I1209367k513936k389854k398527k139715k045562k033011j826014j760545
3133G4102203j603770j499637j485575j288844j417902j438096j261395j336430
3125F2770554j250094j318581j213010j184643j139232j076472j052714j032135
3117E3503673j065514j102803r95323j002323j008080q87157q70192q67327r55473
3108D4749481p14663o71334q74792p03932q69024p55603q21378p14167p10511
3099C7914077p22462p89963q97981o95512p33047o31746p99510n70141p14313
3090C1359402o69953m64975p00583o75152n22748m00823n75407n80481m90556
3081B6278724o14404o24269m55477n94602m43940m14865o16850o53112k93320
$$ plain form
3141 91209367 88695431 86305577 83907050 81767335 79721773 77688762 75862748 74102203
3133 74102203 72498433 70998796 69513221 68224377 66806475 65368379 64106984 62770554
3125 62770554 61520460 60201879 58988869 57804226 56664994 55588522 54535808 53503673
3117 53503673 52438159 51335356 50340033 49337710 48329630 47442473 46572281 45704954 44749481
3108 44749481 44034818 43363484 42488692 41784760 40915736 40160133 39338755 38624588 37914077
3099 37914077 37191615 36401652 35503671 34808159 34075112 33443366 32643856 32073715 31359402
3090 31359402 30689449 30224474 29523891 28848739 28325991 27925168 27349761 26769280 26278724
3081 26278724 25664320 25040051 24584574 23989972 23546032 23131167 22514317 21861205 21567885
3072B1567885l54727m17488n77168l26263m64827m90022l56846l36527l58065
3063A7885952k85660l95971k78087l25281m67686n12762k48213m51325l36702
3054A4584265j66926m4833l26963k52209k50474j70870k81318k11166k74972m28454
3044A2176080j75656k77893k69921q5611k34643k29969o7498k36002L429j82643
3034A0419673k23479j24404O6985j58815l1987j44297j23070R9532N1189j30209
3024I701118k06560J29080n5794j83981j37662k34991L4325P8130J0077k454J69977
3013I301265k0227j11567j76471O2344L9642L7635l135N1244Q9125O1672J43354
3002I474881J8598J21510J16836O2731Q8054J19907J86635K06023O0114O9266
$$ plain form
3072 21567885 21213158 20795670 20218502 19892239 19427412 18937390 18580544 18244017 17885952
3063 17885952 17600292 17204321 16926234 16600953 16133267 15620505 15372292 14920967 14584265
3054 14584265 14417339 14372506 14045543 13793334 13542860 13371990 13090672 12879506 12604534 12176080
3044 12176080 12000424 11722531 11452610 11366999 11132356 10902387 10834889 10598887 10602316 10419673
3034 10419673 10196194 10071790 10138775 9979960 9947973 9803676 9680606 9780138 9831327 9701118
3024 9701118 9494558 9623638 9567844 9383863 9246201 9011210 9045535 9123665 9133742 9131288 9301265
3013 9301265 9281038 9169471 8993000 9055344 9094986 9132621 9129486 9180730 9269855 9331527 9474881
3002 9474881 9493479 9614989 9731825 9794556 9882610 10002517 10189152 10395175 10455289 10524555
2992A0524555Q9271K01135K51196J83392J97703J98003R1044J08988K49608L54913
2982A2449808R1232J09198K72710L44920L80744K29882K95706L68852L38909K27400
2972A5109361K70995M24324M13834L80100L74443M06582M50490L04513L34442
2963A8469084N20246N00076M20770M51133K90343O58007M61982O82930O62883
2954B3117454M78079O80310P45215O95081P93993P38060P80012J112315J071596
2945C0212115J049286J130543J219611J264433J323993J474171J550460J720772
2937D0945384J919881K025476K066699K406421K654197K895212L267410L398243
2929F1578923L824794M148829M739234N103217N548083N951823N965858O024477
$$ plain form
2992 10524555 10613826 10814961 11066157 11249549 11447252 11645255 11736299 11845287 12094895 12449808
2982 12449808 12541040 12650238 12922948 13267868 13648612 13878494 14174200 14543052 14881961 15109361
2972 15109361 15380356 15804680 16218514 16598614 16973057 17379639 17830129 18134642 18469084
2963 18469084 18989330 19489406 19910176 20361309 20651652 21309659 21771641 22454571 23117454
2954 23117454 23595533 24275843 25021058 25716139 26510132 27248192 28028204 29140519 30212115
2945 30212115 31261401 32391944 33611555 34875988 36199981 37674152 39224612 40945384
2937 40945384 42865265 44890741 46957440 49363861 52018058 54913270 58180680 61578923
2929 61578923 65403717 69552546 74291780 79394997 84943080 90894903 96860761 102885238
2921A02885238N465843M859919L910095K542323J289844R9367p83510j108623
2913A19160496r32088q18040r12649p43924m64167j79193J3571M07893R56774
2904A16488673J279158J847989K610301L489654M267185N575905P147771R411575
2896A52118211J1619164J3032424J3206866J1406940Q123367L634018j184852
2889B11956138o077196j0782463j4690164j5786658j4506509j2380688j0496030
2882A27236430q568037p197184o141721n203661m381820l584786l244607k572240
2874H6342374k095769j606808j073735o64113j00436N55292Q63724J364511J761656
2865H5346696J995052K283463K159115J701252R99533p5440j211546k356926l784169
$$ plain form
2921 102885238 108351081 113211000 117121095 119663418 120953262 121052629 120269119 119160496
2913 119160496 118228408 117410368 116497719 115753795 115289628 115110435 115124006 115531899 116488673
2904 116488673 117767831 119615820 122226121 125715775 129982960 135558865 142706636 152118211
2896 152118211 163737375 176769799 189976665 201383605 209506972 213140990 211956138
2889 211956138 205878942 195096479 180406315 164619657 150113148 137732460 127236430
2882 127236430 118668393 111471209 105329488 100125827 95744007 92159221 88914614 86342374
2874 86342374 84246605 82639797 81566062 80901949 80801513 81356805 82220529 83585040 85346696
2865 85346696 87341748 89625211 91784326 93485578 94485111 94409671 93198125 90841199 87057030
2856H7057030m929670n389885n771346n642451n205115m826936m247780l774205
2848D7269642l276354k917241k570396k251947k189115j960650j745908j601066
2840B8756965j524702j289101j149704j204565j110081j016693j012009o55292
2832A9794818q63430o59177p84559n98494n42164p29997n98405m76334n81564
2823A3960694n10238n22671l99583l16159j71551m90998m24224l65942l32885
2814A0426443k60668k78282j94902j39460m81355l13188j28677k78420j22018
2805H229473j92474p0941j76383j13313k30749o5471k34102j23780k28363j67837
2795F626060j61113p5158r0951j55390k12433j82402k09135j01921p3846j22236
$$ plain form
2856 87057030 82127360 76737475 70966129 65323678 60118563 55291627 51043847 47269642
2848 47269642 43993288 41076047 38505651 36253704 34064589 32103939 30358031 28756965
2840 28756965 27232263 25943162 24793458 23588893 22478812 21462119 20450110 19794818
2832 19794818 18931388 18272211 17487652 16889158 16346994 15616997 15018592 14542258 13960694
2823 13960694 13450456 12927785 12528202 12212043 12040492 11549494 11125270 10759328 10426443
2814 10426443 10165775 9887493 9692591 9553131 9071776 8758588 8629911 8351491 8229473
2805 8229473 8036999 7966058 7789675 7676362 7445613 7380142 7146040 7022260 6793897 6626060
2795 6626060 6464947 6389789 6298838 6143448 5931015 5748613 5539478 5437557 5363711 5241475
2785E241475k64692j99174j39519o1071L0764k10919j23299L7783N7119M394k77857
2774D095004N7458K4449k51988j06214M8724m4656j52672o9504j60951L0161n076
2763C464735m4715n7945k0268j28443q7494K4945j17655q6809m6630o9925k7555
2752B802241q677j39680n4732L8675k2034N9315Q8306k2038r4521r7977n1899
2741B496979j47563m7285q5924J09854J896r4737q5355j13473L9025j7747L85
2730B056055p9606N0101k8425r8038k6839j1256l2844j34369J45320k7758j19027
2719A693314L9984L1508J1996m0606o1136j07911j8212o9988j08251J01705L6807
2708A509210q2872J11835L4114n1698k09626K8377L0244q3873J9645j76306r620
$$ plain form
2785 5241475 4976783 4777609 4638090 4577019 4607783 4396864 4273565 4311348 4368467 4372861 4095004
2774 4095004 4152462 4176911 3924923 3818709 3867433 3822777 3670105 3600601 3439650 3469811 3464735
2763 3464735 3420020 3362075 3341807 3213364 3125870 3150815 3033160 2946351 2899721 2829796 2802241
2752 2802241 2793564 2653884 2599152 2637827 2615793 2675108 2763414 2741376 2646855 2548878 2496979
2741 2496979 2349416 2302131 2216207 2326061 2327957 2233220 2147865 2034392 2073417 2055670 2056055
2730 2056055 1976449 2026550 1998125 1900087 1873248 1861992 1829148 1694779 1840099 1812341 1693314
2719 1693314 1733298 1764806 1776802 1736196 1675060 1567149 1548937 1478949 1370698 1472403 1509210
2708 1509210 1426338 1538173 1572287 1520589 1310963 1339340 1369584 1285711 1305356 1129050 1119430
2697A119430P6356j05091j3444M6721M5724P7655j7142L8107j32077l3095R4225
2686A197369j10040l4741k3546l1388r7076J9087J4205Q8891N8425m0935M2180
2675A082431k24705J74536J04174M1915o9302j07248j81564m42Q0569Q2527n4731
2664I28160J63257o8606k26516j45555r9651K50702J02555m3253Q1379J19154
2654A061626o6032J45764k61362q8653R8957O5075O2343J3974j09269m0750n3331
2643H28342J5150P7025J25075J21632J11830n1342R634J41965J8464l3482K9952
2632A394245l374Q6347j94848j01171N0454j8838o7331m6061p420m8238l784k7859
2620A012122Q4762o6057J35136q1882q9881J47766Q9235j43477K06998l925P8052
$$ plain form
2697 1119430 1195786 1090695 1077251 1123972 1169696 1247351 1230209 1268316 1136239 1103144 1197369
2686 1197369 1087329 1052588 1029042 997654 900578 919665 933870 1022761 1081186 1040251 1082431
2675 1082431 857726 1032262 1136436 1178351 1109049 1001801 820237 819795 900364 982891 928160
2664 928160 1091417 1022811 796295 650740 551089 801791 904346 861093 942472 1061626
2654 1061626 995594 1141358 879996 791343 890300 955375 1017718 1031692 922423 881673 828342
2643 828342 843492 920517 1045592 1167224 1279054 1227712 1237346 1379311 1397775 1364293 1394245
2632 1394245 1390871 1477218 1282370 1181199 1231653 1212815 1145484 1099423 1092003 1043765 1039981 1012122
2620 1012122 1096884 1030827 1165963 1084081 994200 1141966 1231201 1087724 1294722 1290797 1368849
2609A368849K03644j6714K33791J08419k35178k89684r741j3775r2861k28083
2599A028667J7913K2228j00781j20423m6612K6485n3316j06394l6584p4762Q3792
2588F40213M6204J44231K3790m0424l1141J37269k0563l0362P3309P3422k108
2577A013840n1937j27836P8310o0110M1240k17591k3434J46235j29710n1937L673
2566F20743J09566L4080r5261n9968k5766j844j09225j9411Q6504j830J58567
2555F96155k1411j12643P2108Q8065k12010J9787O1304j83601j188r6538J6472
2544C26500L5461o4409J84862j16554n7724K2931q2731j27557K65j12399j11404
2533a02759J99488J14325p006J69366q4301n0696K900J67335J05229k10749j18035
$$ plain form
2609 1368849 1572493 1555779 1789570 1897989 1662811 1373127 1363386 1349611 1256750 1028667
2599 1028667 1046580 1068808 968027 847604 800992 827477 774161 667767 631183 556421 640213
2588 640213 686417 830648 854438 814014 782873 920142 899579 869217 942526 1015948 1013840
2577 1013840 961903 834067 912377 852267 893507 675916 652482 798717 669007 617070 620743
2566 620743 730309 764389 669128 609160 583394 581550 472325 452914 539418 537588 696155
2555 696155 674744 562101 634209 722274 510264 530051 591355 407754 406566 310028 326500
2544 326500 361961 297552 482414 365860 308136 331067 248336 120779 121044 8645 -102759
2533 -102759 96729 211054 204048 373414 289113 238417 241317 408652 513881 303132 185097
2522A85097J74770j04691L0242q0570N8309k8240o0274q3318K0375l1807J10901
2511A90794M6851p8277J4206j92113l0210N9646l8008M9854M874j20913J85967
2500I2671Q4838j05873J50206j03629n4837n0025R3034j7589j87951P7684P6248
2489E4777L6355P844P1179L8512j31048r3082O1060n0579o1517J24250L934r7963
2477c6278l07N5670J47810k25898P4745J32063K826k3260n9228L6809k8195R7059
2465A73816R608k11829l769P3742j02695K3848N8536j0360k9856P0369O0744p7581
2453C4573J37217j42038j46017N1333J24693o7666N6252Q134R2053j63696m3303
2442e8465K28741o8647j11109J41714M1674j97610k5294J03870M2233n9996k0049
$$ plain form
2522 185097 359867 255176 285418 204848 263157 234917 174643 91325 111700 79893 190794
2511 190794 237645 159368 173574 -18539 -48749 10897 -27111 22743 27617 -93296 92671
2500 92671 177509 71636 221842 118213 63376 13351 106385 88796 -99155 -21471 54777
2489 54777 91132 98976 170155 208667 77619 -15463 45597 -4982 -66499 57751 61685 -36278
2477 -36278 -36585 19085 166895 -59003 15742 147805 150631 127371 68143 104952 76757 173816
2465 173816 183424 -28405 -32174 41568 -61127 -37279 21257 10897 -18959 51410 112154 34573
2453 34573 171790 29752 -116265 -64932 59761 -7905 48347 56481 148534 -15162 -58465
2442 -58465 170276 101629 -9480 132234 173908 -23702 -48996 54874 97107 37111 17062
2431A7062O6442j13413N5141J91235l0987p1424k01083O1500K6289P9396Q1590
2420A61748P2583l054j19563k3576m6103k1631J29302n6777l9978J44793L5054
2409B32798l5912r3524N7477N7675j82109k28632J34376J19510k2591j04812J08131
2398D2387J53045j01970M7877r8783J7592J25428O35j20470n972K193n5987p6984
2386g1009J19614J12778o8499k5957M3220m555K7833p6656j5783N0573q9769o6025
2374f4235J07309J17555L554n1951j52900Q9802J6875l6924J26033K19500k4357
2363C50261J04423j93905o0944J85669k9508j19992J0759J9266K8807N2172j51916
2352A95092p7027N8987k22268N8185J91809M4626o1693q7029j09296O3779M9392
$$ plain form
2431 17062 83504 -29909 25232 216467 185480 114056 -87027 -25527 762 80158 161748
2420 161748 234331 231277 111714 88138 42035 20404 149706 92929 52951 197744 232798
2409 232798 196886 103362 160839 218514 36405 -192227 -57851 61659 39068 -65744 42387
2398 42387 195432 93462 141339 42556 60148 185576 186211 65741 59769 61962 5975 -71009
2386 -71009 48605 161383 92884 66927 110147 105592 133425 56769 40986 91559 1790 -64235
2374 -64235 43074 160629 164183 112232 -40668 49134 66009 29085 155118 374618 350261
2363 350261 454684 260779 199835 385504 355996 236004 246763 266029 294836 347008 195092
2352 195092 118065 177052 -45216 12969 204778 249404 187711 100682 -8614 55165 104557
2341A04557m7628l537Q4152J2774j39422r1947N2056o8924Q7530n8791L0850L0217
2329h113J8719n2275O0483L7569k16746J73277J7587J22390n3542k260j4276j41339
2317e8526J9117K52232j48614j13588J36380j3192M1413l3062j09389m837O6033
2306C3967M958r8018m985k4404J79552J7657N0823R6314j70945n0097j1672k0006
2294C144K08314q1213M1115O2481n610j71366q8869n9211K1623K2810J29106L5090
2282A17414j26234J40991m4361q1202j741K0026O0695p1549k6533J6917O7011
2271G1434M402O3867L9514L3105n3680o6498M2872j3791j82412k3412J31627m8394
2259a366Q565J48788j1681K385L9250K3596M371j26157m0388o3369m0107P6714
$$ plain form
2341 104557 56929 53392 137544 150318 10896 -81051 -28995 -97919 -10389 -69180 -38330 -8113
2329 -8113 10606 -41669 18814 56383 -160363 12914 30501 152891 99349 97089 82813 -58526
2317 -58526 -39409 212823 64209 -49379 87001 73809 115222 82160 -27229 -32066 33967
2306 33967 38925 -59093 -64078 -88482 91070 108727 159550 255864 84919 34822 23150 3144
2294 3144 211458 130245 171360 233841 228231 56865 -32004 -91215 -69592 -46782 82324 117414
2282 117414 -8820 132171 87810 6608 4867 24893 85588 14039 -12494 4423 71434
2271 71434 75836 139703 179217 212322 158642 92144 135016 121225 -61187 -84599 47028 -1366
2259 -1366 7199 155987 144306 146691 185941 209537 213908 87751 47363 -16006 -56113 20601
2247B0601O7989Q1325k2534p0568J21515n7609l3355q3078M0656J56542j5860
2236B05624J4233l0048k9724p2274K1545J20992J11767J1192j40334l0287N1437
2225B34123o9013L2924J04519j6211j4506j55445p9461O9481J65396O7494j25079
2214B14222O0426K7144l5993m4333j0251J88085n7839j403M8085M1641r3111j07009
2202B29664N9183l8171J0653J38928p7393N341q4592J67700J39771n0205p5959
2191D24920r8273j09534L2975J55361J75067m5904r9288J05389P1940r1978j8383
2180E02292N171m1261J06254K8844P4295J01352J1070L3985J0567J06707K3951
2169I63227k6975J34034J00718O997j38361R0634K9811j0265J89157o3531j40962
$$ plain form
2247 20601 88590 169915 147381 76813 198328 140719 107364 24286 64942 221484 205624
2236 205624 219857 189809 160085 87811 109356 230348 342115 353307 212973 182686 234123
2225 234123 165110 198034 302553 286342 271836 116391 36930 106411 271807 339301 214222
2214 214222 274648 301792 265799 221466 211215 399300 341461 340058 388143 429784 336673 229664
2202 229664 288847 250676 261329 400257 322864 328205 243613 411313 551084 500879 424920
2191 424920 326647 217113 250088 405449 580516 534612 435324 540713 612653 520675 502292
2180 502292 507463 466202 572456 601300 675595 776947 788017 822002 832569 939276 963227
2169 963227 936252 1070286 1171004 1178001 1039640 1130274 1160085 1149820 1338977 1275446 1134484
2158A134484J53562K02355L6881j30334M9948J19342l3240L1178j0147Q6596O421
2147A647046J85072R1006M1069J52447p159q5132J14125J35208M3631K13227p2630
2136B457910l4452K62403J65375J53856K4884P5559J24350J60905L72104J82974
2126C945868N7685M23907P8525J72503L08290K18000L64712K19673K58914L59927
2116F408004L07342M38904N24773N50805O97921P27912P17311P06761N15863O22057
2106A2217653P44159J076418J699531K161881K432024L308841M087562O397218
2098C4125287R041605J1688187J0801504O232687j140194j0316193j1501582j0178420
2090C8752881p636549n460684l964114l150249k423965j688727j287490j055433
$$ plain form
2158 1134484 1288046 1490401 1527282 1396948 1446896 1566238 1532998 1564176 1554029 1640625 1647046
2147 1647046 1832118 1923124 1964193 2116640 2109481 2024349 2138474 2273682 2317313 2530540 2457910
2136 2457910 2423458 2685861 2851236 3005092 3029976 3105535 3229885 3390790 3762894 3945868
2126 3945868 4003553 4427460 4505985 4678488 4986778 5204778 5569490 5789163 6048077 6408004
2116 6408004 6715346 7154250 7679023 8229828 8927749 9655661 10372972 11079733 11595596 12217653
2106 12217653 12961812 14038230 15737761 17899642 20331666 23640507 27728069 34125287
2098 34125287 43166892 54855079 65656583 71889270 70749076 60432883 48931301 38752881
2090 38752881 31116332 25655648 21691534 18541285 16117320 14428593 13141103 12085670
2082A2085670q18166n95529o75158p40334p76399o91543p44725o06377n80811
2073E856628l20043k43702l27279k72258l70063k70243k76642l75790j64690j1941
2063C223977j66072l3088q5868k03194o8662q9016o470m5855q3724j43269k03382
2052B095377j24868l7425J9391J33970r6438j16133j47625l2906K5848m2822j34298
2041A542071j80909j1615K8976O1308j34485R745J40290j93446j00350L694r8658
2030A066621j17504j24630k63905O0157J4573J06409J11628j08715j39799r5329
2020E09506Q413k7709K8794P9595r4162P3356J27137o6810p4371j09748k3635
2009D30366R7719P6042q7399Q3617Q4809j66388k6020j5018n3095M787P0338K4327
$$ plain form
2082 12085670 11267504 10671975 9996817 9256483 8480084 7788541 7043816 6437439 5856628
2073 5856628 5536585 5292883 4965604 4693346 4323283 4053040 3776398 3400608 3235918 3223977
2063 3223977 3057905 3024817 2938949 2735755 2667093 2578077 2571607 2525752 2442028 2298759 2095377
2052 2095377 1970509 1933084 1952475 2086445 1990007 1873874 1726249 1693343 1719191 1676369 1542071
2041 1542071 1361162 1349547 1378523 1439831 1305346 1315091 1455381 1261935 1161585 1165279 1066621
2030 1066621 949117 824487 560582 620739 635312 741721 853349 744634 604835 509506
2020 509506 517919 490210 519004 598599 504437 577793 704930 638120 563749 454001 430366
2009 430366 528085 604127 516728 600345 685154 518766 492746 477728 424633 429420 499758 524085
1997E24085k9341L8334M6910k13292j29853k6677K9278J32384J58378j25603j4048
1986C90555m7518M7389l4412j22484J09665Q3407j32194O5107p1173l3133M194
1975B59403J16071l3082n261N5672j66293q6864k7559M7495M6487L8697n6037
1964A88729n226r395o8871k6141J95511M314j37688q2810J68085J4426J15019
1953C55953j3536j74496q907P4485j96191R6744p179j70104R1402p9618J383J3647
1941a6417o031r9920m4696J91391m536O8481j03619o2099J39800J6250R1329l0988
1929A38945j67374M2048N8070l0883q957j23249R7905Q4448M3423q319M4193p4610
1917I5640R7066m8131j05429L2717L6664o0971k5978Q9825r9580n9057M8889J78713
$$ plain form
1997 524085 494744 533078 579988 366696 236843 210166 239444 371828 530206 404603 390555
1986 390555 343037 390426 356014 233530 343195 426602 294408 359515 288342 255209 259403
1975 259403 375474 342392 337131 392803 226510 139646 112087 159582 206069 244766 188729
1964 188729 183503 174108 105237 79096 274607 278921 141233 58423 226508 240934 355953
1953 355953 342417 167921 159014 233499 37308 134052 126873 -43231 48171 -31447 -30064 -16417
1941 -16417 -22448 -122368 -167064 24327 19791 88272 -15347 -77446 62354 78604 169933 138945
1929 138945 -28429 13619 71689 40806 31849 -91400 6505 90953 134376 126057 170250 95640
1917 95640 192706 144575 39146 71863 108527 47556 21578 111403 11823 -47234 1655 180368
1905A80368N2574j296j79351n2267O5756J36057o1017o9210j13994J25618n1425
1894C1813P2353m2470j82435K14050l8402p2251q1544p5953R7644O6366p2145
1883h2974j4708L1985Q6896N0205j47972j1622J30678r142j58093J3111O3108
1872d8528J04475K15230j94306j01670m4753j27964J68332O8990j41354N8009
1862d3539J16808N238k08072Q1668J55860j22352l3439J86823j00197j33938J39587
1851D4447N9093l1538n1823m6712L516n3543m2092O0281L0172m2473m1289J9286
1839i2675J16142o3565o6038N7910M8721J30977J59956K7748j41453o1578n672
1828A10473R9007J8370L4797N0940j03723M490m5904Q125J9890M2174r5414j31490
$$ plain form
1905 180368 232942 231646 52295 28 65784 201841 140824 71614 -42380 83238 31813
1894 31813 104166 61696 -120739 93311 54909 -17342 -98886 -174839 -77195 -10829 -82974
1883 -82974 -97682 -65697 21199 71404 -76568 -88190 42488 33346 -124747 -111636 -48528
1872 -48528 55947 271177 76871 -24799 -69552 -197516 -29184 39806 -101548 -43539
1862 -43539 73269 78507 -129565 -47897 107963 -14389 -47828 138995 38798 -95140 44447
1851 44447 103540 72002 20179 -26533 -23017 -76560 -118652 -58371 -28199 -70672 -111961 -92675
1839 -92675 23467 -40098 -106136 -48226 495 131472 291428 319176 177723 116145 110473
1828 110473 209480 227850 262647 313587 209864 214354 168450 176575 196465 238639 143225 11735
1816A1735M011J55595k9653n4884r2617j54061Q439P4376N3834k143K4293O4078
1804F3003j31170j01751J91351J1197J42615j08609m136O928j24769L8945L1467
1793A5071j8461M0056J2486J2095k10888k7699P2478j2423O6462R0504k3015M0161
1781E6827L3969k9658j6838m1904K0239K04212J4681k39356m8607p0468J11938
1770d965N0915M7891j37817N6512J08331j09309o9380O3133R0718j52033p272
1759f3276K6780J6868r7316R937j3144m0684N2997J9785J32098K0969k1244j33366
1747h9596J1985O9744L2858J7234J9448p5671j16560J14921j398J18466j26394
1736b4963N5299P3125J3462K3965n3611l9753j00352m638l7175L8630J29225J3766
$$ plain form
1816 11735 15746 171341 141688 86804 -5813 -159874 -151435 -77059 -23225 -25368 -1075 63003
1804 63003 -68167 -169918 21433 32630 175245 66636 62500 69428 -55341 -16396 15071
1793 15071 -3390 36666 49152 61247 -149641 -177340 -104862 -117285 -50823 39681 16666 56827
1781 56827 90796 61138 44300 2396 22635 226847 241528 2172 -46435 -116903 -4965
1770 -4965 45950 93841 -43976 12536 120867 11558 -57822 5311 96029 -56004 -63276
1759 -63276 -36496 -19628 -116944 -107007 -120151 -160835 -107838 -88053 44045 65014 43770 -89596
1747 -89596 -77611 -7867 24991 42225 61673 -13998 -130558 -15637 -17035 101431 -24963
1736 -24963 30336 103461 116923 140888 87277 47524 -52828 -57466 -94641 -56011 73214 86980
1724H6980j30573m2116L9929j9566K2992L3771j25151J7804m0017K5163K88540
1713A57756n1678q1552J0834j19613J02905K5238O9086j30539J94593j46618k4044
1702F368O3527j41483l2729N4953l5214k9524P1872o733J33544o5317j30771J68921
1690E7414Q0001k44829q8137K1876n5508j9368L23459N5405j24332J66558J5006
1679A87545k5003o6317l43003J02282J05910o7636J6813M2666k0491n7641k6465
1668a51340J9301J04621j57419j4006N3337J60039r0386n8247j3590J01664j965
1657d7991j56519P7950m9135l5226J36310M0467Q8354O6066Q721j20746q1003
1646g2752j20176q488J42895j65811J43315P3304n1332P9995N5837m6000l8143
$$ plain form
1724 86980 -43593 -85709 -45780 -65346 -42354 -8583 -133734 -115930 -155947 -130784 157756
1713 157756 106078 24526 35360 -84253 18652 43890 112976 -17563 177030 30412 6368
1702 6368 69895 -71588 -104317 -49364 -84578 -114102 -42230 -48963 84581 19264 -111507 57414
1690 57414 137415 -107414 -195551 -173675 -229183 -248551 74908 130313 5981 172539 187545
1679 187545 162542 96225 -246778 -144496 -38586 -106222 -89409 -46743 -67234 -124875 -151340
1668 -151340 -132039 -27418 -184837 -198843 -145506 14533 -75853 -134100 -147690 -46026 -47991
1657 -47991 -204510 -126560 -175695 -210921 -74611 -34144 54210 120276 128997 8251 -72752
1646 -72752 -192928 -201416 -58521 -224332 -81017 -7713 -59045 20950 76787 30787 -7356
1635g356K03257p9305j37692J76700j45851k20369R998K8674p8161J76729Q0586
1624G210Q8738j52799l0037q1593J56168M909k8267K253j67674J22566Q0775j8299
1612a6050l5152M7054q6016R4748N9761j67340j8452J21173l023L8985K5707j67181
1600a05786P583n3648j286m6714J5429o9068K8880j3468N7267K1474j35183o2002
1588c56522J33234K32221J43288j58801j12387J631M8853J79784j56467j3903
1578e9069l0820n1401r4129M6377J97314N9797m7225R9o4260p9653N6828p0255
1566a36397P2398J31728k39219K7492P3728Q4764J2596O3095q1883j40833O2457
1555g0074J48287j1276l8185k01011J62999j5023P109O1382j32729N9861m0518
$$ plain form
1635 -7356 195901 116596 -21096 155604 9753 -210616 -200618 -171944 -250105 -73376 7210
1624 7210 95948 -56851 -86888 -168481 -12313 -7404 -35671 -33418 -201092 -78526 2249 -16050
1612 -16050 -51202 -4148 -90164 4584 64345 -102995 -121447 -274 -3297 35688 61395 -105786
1600 -105786 -98203 -151851 -153137 -199851 -184422 -253490 -224610 -238078 -180811 -159337 -294520 -356522
1588 -356522 -223288 8933 152221 -6580 -118967 -117336 -68483 111301 -45166 -59069
1578 -59069 -89889 -141290 -235419 -189042 8272 68069 20844 20943 -43317 -122970 -66142 -136397
1566 -136397 -63999 67729 -171490 -143998 -70270 14494 27090 90185 8302 -132531 -70074
1555 -70074 78213 66937 28752 -172259 -9260 -24283 -17174 44208 -88521 -28660 -69178
1544f9178p949M1493p5473L6472j6332l2754J3972K0597N6792j8182M3203p1803
1532g9142M1545o8241r459l89L1325m157N0574J3114n7452J45189p312O7689p4002
1519D9282j08599O6462j00372J8952l0482k503k1665J66856j30464r4658K65805
1508G8614L2614j57683N3292N2508N025L1642J16952j93766j42605J6997r2188
1497a98598J75208J44059r3752o6678p1992L677J2872n746L0484n3181K6251r4498
1485a91894N9298J27888J43326j73157J3763m0585j78062Q1233K8998L0209O2665
1474c6318o7762J80046K0603q9599j09134m1707J76666k2684P1898K2753J15817
1463B20579j28093p9689M9652n5557k8934L5823N2662l7644o1044l6542P6706
$$ plain form
1544 -69178 -77127 -35634 -111107 -74635 -90967 -123721 -109749 -89152 -32360 -50542 -7339 -79142
1532 -79142 -37597 -105838 -115297 -115686 -84361 -88518 -37944 -24830 -82282 62907 55595 123284 49282
1519 49282 -59317 7145 -93227 -74275 -104757 -107260 -128925 37931 -92533 -187191 78614
1508 78614 111228 -46455 6837 59345 64370 96012 212964 19198 -123407 -106410 -198598
1497 -198598 -23390 120669 26917 -39761 -111753 -108076 -95204 -100950 -70466 -123647 -97396 -191894
1485 -191894 -132596 -4708 138618 -34539 -20776 -61361 -239423 -158190 -129192 -98983 -36318
1474 -36318 -104080 75966 96569 6970 -102164 -143871 32795 10111 82009 104762 220579
1463 220579 92486 12797 62449 6892 -22042 13781 66443 28799 -32245 -68787 7919
1452G919j29665K975Q4320M7263r0345j09155L2177J51125j5080l7096j2434N5933
1440a2063P3613j71537m6064j882J91364J18613k24516r8040J05257J339j2137
1429g6053O2456k4981n2415j603j6843j4848O3386P1755j59489J08382J29170
1418H8917r5176j5842k35253N8561J22802p7838o3645K8042L1746J52939j21908
1407a26655r0222P1505P2214O316o5278J45809M7557j19358N7237p8161m4785
1396a23821k8838j90636J25833q9315J90367L09N2659K1595k2255k5797K2253
1385f7646K5029m2401J82392n0846j23251j44325R1476J39570k2349p4954j06669
1374a93974J47119j27740J2727R7699j4914L978P2563r1348O7514m9365M5813
$$ plain form
1452 7919 -121746 -118771 -34451 12812 -77533 -186688 -154511 -3386 -18466 -55562 -67996 -12063
1440 -12063 61550 -109987 -156051 -157933 33431 152044 -72472 -170512 -65255 -63916 -76053
1429 -76053 -13597 -38578 -90993 -92596 -109439 -124287 -60901 10854 -148635 -40253 88917
1418 88917 -6259 -22101 -257354 -198793 -75991 -153829 -217474 -189432 -157686 -4747 -126655
1407 -126655 -216877 -145372 -73158 -66842 -132120 13689 61246 -58112 -875 -79036 -123821
1396 -123821 -152659 -343295 -217462 -306777 -116410 -116101 -63442 -41847 -64102 -89899 -67646
1385 -67646 -42617 -85018 97374 46528 -76723 -221048 -129572 9998 -12351 -87305 -193974
1374 -193974 -46855 -174595 -161868 -64169 -79083 -75105 -2542 -93890 -26376 -75741 -29928
1363b9928J39070j60946j7590k8046P535M6548J88642n3099o6006j30764O7058
1352c7526k2029o632o805J05181N0303k41507J22671q3601o4110J30095j5190
1341f9150p770J25723j12156k3581J06582q9031r449k2349J4936R8102j50686
1330a38829R052R1386l929j33587J6550m5900J0516m8570O5534K6380m2560J97704
1318C747K1649J663R0862L3742j70403N5696j19838J44309K899j49693j9479k8997
1306a33843L5082k3318L2363L572Q7819m2231M3311N0250k9906M3717r0374n0002
1294g3560P9731p207j15392J66405k0988j00782k03705J20507J8846r7026R6584
1283a36587J12695j12720M5707J87989l9082K1018j10486j02658J6820J57420
$$ plain form
1363 -29928 109142 -51804 -69394 -97440 -89905 -43357 145285 92186 26180 -104584 -37526
1352 -37526 -59555 -66187 -72992 32189 82492 -159015 -36344 -119945 -184055 -53960 -69150
1341 -69150 -76920 48803 -63353 -86934 19648 -69383 -78832 -101181 -86245 11857 -138829
1330 -138829 -129777 -38391 -42320 -175907 -159357 -205257 -194741 -243311 -177777 -151397 -193957 3747
1318 3747 25396 27059 117921 151663 -18740 36956 -82882 61427 64326 -85367 -104846 -133843
1306 -133843 -98761 -122079 -89716 -86144 1675 -40556 2755 53005 23099 66816 -23558 -73560
1294 -73560 6171 -1036 -116428 49977 28989 -71793 -275498 -154991 -136145 -233171 -136587
1283 -136587 -23892 -136612 -90905 97084 58002 79020 -31466 -134124 -117304 40116
1273D0116J85815k01013j42855M2545j7423k0083J32198N0632j23122r9673O5775
1262h7088O0848J0464P7042L5640q5031o7932q1289P8697K1193j8747M3802K9068
1250A6667O2719O0193l1398j37070j11324P9618J76219j64379l5095R2628K8014
1239C6792q7035j8948L8020k6246m7041j1688j03616J98158L2230j85727P4310
1228a00791J13461l2494l6152j2511j13999K6080J33027k2806o616K2225K4353
1217f223q7612j6978J51793Q8744j03466M0388j07041J75348j55013j37957K3741
1206a34276J34889o0326N9490J54234m8656q331n5023j6740r1354P3755j92376
1195a84714L4123Q5009n747J1331k8867J37360q426j44612p8346J11557J89189
$$ plain form
1273 40116 225931 24918 -117937 -75392 -92815 -112898 19300 69932 -53190 -152863 -87088
1262 -87088 -26240 -15776 61266 96906 11875 -56057 -137346 -58649 -37456 -56203 -12401 16667
1250 16667 79386 139579 108181 -28889 -140213 -60595 115624 -48755 -83850 8778 36792
1239 36792 -50243 -69191 -31171 -57417 -104458 -116146 -219762 -21604 10626 -175101 -100791
1228 -100791 12670 -19824 -55976 -68487 -182486 -156406 -23379 -46185 -52801 -30576 -6223
1217 -6223 -93835 -110813 40980 129724 26258 66646 -40395 134953 -20060 -158017 -134276
1206 -134276 613 -59713 -223 154011 105355 97024 42001 25261 -66093 7662 -184714
1195 -184714 -150591 -65582 -71329 -59998 -88865 48495 40069 -104543 -182889 -71332 117857
1184A17857n1487j43384J21286k1147j63190J64417J37288o1303j22421j05085
1174a27169k7171J38820r0849K66710j18656k26930N3784O0374Q867P5232n7674
1163d4662p2216M1442N4494L2344Q21m3256k7537K4450m6328k6553J02010l244
1151h235q4960k1016K1799R593k17990J08224P5K16525M7833n0070J19065M2180
1139A83023j6090k09906L4611K18656N1071j07468j03047l8075q6660l3373L2413
1128g4845k225J15475O681k3525R452j31768N3501L4716o5103J33999q6583n9546
1116h9771j80812J30629P1940O7308K2547j01588J1551J16202P3951j47049P0251
1105D5159L1683m2262j51300J7651n0182P504l6141J64721N5077p4585K13078
$$ plain form
1184 117857 66370 -77014 44272 23125 -140065 24352 161640 100337 -22084 -127169
1174 -127169 -154340 -15520 -106369 160341 41685 -185245 -131461 -71087 -62220 13012 -44662
1163 -44662 -116878 -75436 -20942 11402 12223 -31033 -58570 -34120 -80448 -107001 -4991 -8235
1151 -8235 -93195 -114211 -92412 -82819 -300809 -192585 -192510 24015 71848 21778 140843 183023
1139 183023 166933 -42973 -8362 210294 261365 153897 50850 12775 -73885 -107258 -74845
1128 -74845 -77070 38405 45086 21561 31013 -100755 -47254 -12538 -77641 56358 -30225 -89771
1116 -89771 -270583 -139954 -68014 -706 21841 -79747 -68196 48006 121957 -25092 45159
1105 45159 76842 34580 -116720 -99069 -149251 -141747 -177888 -13167 41910 -32675 180403
1094A80403J1335q7697j28448O978J934j17049J48974L5265n1064j19708N3214
1083f5863J21484o1600M8449l0866l2626r3227Q2620N6179n4527l966M8140o9687
1071e5490o2529j5182P5982M3255l6551J83531o3438q290M6606J12610j15314
1060A05190j35684j1638L3566M7652P9141r2126n2019J31165K3004q8670n8282
1049a8701J46239l0065o5755J05031k33104r7556J25998j18099J46481J1585k40350
1038b68296l9288K54465J13661O519M9225k0973q9129Q493N791R3697o8296j59186
1026a13317P3974J53042o2997r2732r607j08709J68941r2183O7790j7605l3727
1015f7130L1617l8286Q1805j00877J43604j6637p572k4395K0657j1752o1457k6502
$$ plain form
1094 180403 191738 104041 -24407 -17429 -15495 -132544 16430 51695 631 -119077 -65863
1083 -65863 55621 -5979 42470 11604 -21022 -114249 -31629 24550 -29977 -33943 14197 -55490
1071 -55490 -118019 -133201 -57219 -13964 -50515 133016 69578 61288 107894 220504 105190
1060 105190 -30494 -42132 -8566 39086 118227 26101 -25918 105247 128251 39581 -18701
1049 -18701 127538 97473 31718 136749 -96355 -193911 -67913 -186012 -39531 -27946 -268296
1038 -268296 -307584 -53119 60542 67061 116286 95313 6184 14677 20468 114165 45869 -113317
1026 -113317 -39343 113699 50702 -42030 -51637 -160346 8595 -83588 -15798 -33403 -67130
1015 -67130 -35513 -73799 8006 -92871 50733 34096 26524 2129 22786 11034 -50423 -76925
1003g6925Q1953k2528Q061M0555K808m5732j37278Q6845N2223r816J21220q2278
991A9108k21019P1597N9362P1615L8928j66393O2226R0970j11861k9345l1979
980a46791O7847m0995m9833J00031L2574j6253m2921j16694M8145Q7372k03157
969b80675P8672J80770J04574k7376K4540q931j59390p136J07189N2392k2776
958D1853J8466j65286M2960Q6873L4425m3154K1501n6394j21875R6151L2889J34183
946A22592j31982j49346N0877L6567R9895J6808j7401m1114l1694J45428Q3546
935A84176k2596j77460M7353m2241P4870J1270j00512J3276J4710R9123M6021
924A47990q932n3374P753j80299J17405j52025l6270J15075J08031n4390k006
$$ plain form
1003 -76925 5028 -17500 -9439 31116 33924 -11808 -149086 -62241 -10018 -19834 101386 19108
991 19108 -201911 -130314 -70952 663 39591 -126802 -64576 26394 -85467 -114812 -146791
980 -146791 -78944 -119939 -169772 -69741 -37167 -53420 -96341 -213035 -164890 -77518 -280675
969 -280675 -202003 -21233 83341 55965 80505 71574 -87816 -94952 12237 64629 41853
958 41853 60319 -104967 -62007 24866 59291 16137 37638 -18756 -140631 -44480 -11591 122592
946 122592 -9390 -158736 -107859 -71292 28603 45411 28010 -13104 -44798 100630 184176
935 184176 161580 -15880 31473 -10768 64102 75372 -25140 -11864 2846 101969 147990
924 147990 139058 85684 93437 -86862 30543 -121482 -157752 -42677 65354 10964 8958
913H958J9969m5124l8010O3830o0618o8107k2657P3465J19505j87587l6224O4518
901a08082L8480N371J6827r7835N1812Q9352J54890j66544r7403Q0192k2776j0825
889f6541K39910j00806j19774k2300n2369J40661j06596Q6976J32279j47955p1132
878h7647J68881q2408k9772O2293n7539p262Q9602m0062r0759o2432R559j11065
866b38611Q8117J53275P5720L1883o6082k9218n2393o8055o270J86607p084j61001
854i3112J15727n0573j31888J54992o6361P2253q924o252J53948R0711j56008
843G4513j34027O0037l37P5898o6434p2659n8987P9805J50486p5900m5802O3671
831E0264j810J39360Q582q4559N9519m5302j35086L5233M1377n4334J3985j19289
$$ plain form
913 8958 28927 -16197 -54207 9623 -50995 -119102 -141759 -68294 51211 -136376 -172600 -108082
901 -108082 -69602 -64231 -47404 -145239 -93427 -4075 150815 -15729 -113132 -32940 -55716 -66541
889 -66541 173369 72563 -47211 -69511 -121880 18781 -87815 -839 131440 -16515 -87647
878 -87647 81234 -1174 -30946 31347 -26192 -33454 56148 16086 -74673 -137105 -127546 -238611
866 -238611 -150494 2781 78501 110384 44302 15084 -37309 -105364 -111634 74973 67889 -93112
854 -93112 22615 -27958 -159846 -4854 -71215 1038 -7886 -14138 139810 230521 74513
843 74513 -59514 523 186 76084 9650 -63009 -121996 -42191 108295 32395 -13407 50264
831 50264 48454 187814 196396 111837 171356 126054 -9032 26201 67578 13244 27229 -92060
819i2060J7930O5452l0118R2856K511L9433q687j04798J15525Q6509j51360N0817
807H4010m4059k0877Q8707j06174r6034R1870K0581J7294M1574m4084o0787j46565
795a74544J4712O5101K7636M4932J96772q2131J25969J7737j1813j38752j12645
784b7026K01445k40834N9185J06096j78533M025Q0587j24240N9889N6573p7795
773h0628J02517J09221q4832o1733R9646M0794Q0443p8864n1007j00154M700R8508
761G8611J35024R8235l5053n9036M2387j32012j21556j6776Q6677N8619j41415
750f295p74J40444j72365j33557J48565J2983J18121L2999n3675o2835K8395K5396
738G7402L9932L3386j28444J6042P7836j249k1027l7465m7500L6692M9336l3439
$$ plain form
819 -92060 -74130 -8678 -38796 54060 56571 96004 87317 -17481 98044 184553 33193 84010
807 84010 39951 19074 107781 1607 -94427 -2557 18024 35318 76892 32808 -27979 -174544
795 -174544 -159832 -94731 -67095 -22163 174609 92478 218447 236184 224371 85619 -27026
784 -27026 174419 -66415 -7230 98866 -79667 -75642 4945 -119295 -59406 -2833 -80628
773 -80628 21889 131110 46278 -15455 84191 124985 205428 126564 75557 -24597 -19897 78611
761 78611 213635 311870 276817 217781 260168 128156 6600 -10176 76501 135120 -6295
750 -6295 -7069 133375 -38990 -172547 -23982 -10999 107122 140121 86446 23611 52006 77402
738 77402 117334 150720 22276 38318 116154 114905 93878 56413 8913 45605 94941 61502
726F1502j30382M2766J58334n9574o952O6974r1237j07454N1532l6110n2014J28140
714B5525J7986j1990j94797O5610Q4118j11388K02544k9406k9774K26955j71867
703G3516o9537J37245j41843O0245P8761j7166q3814J0377R9708J5746m9613q0389
691C3236o2324L6107K0654N757j32269p8156O7135j0450m3095K28733O7720j12758
679B0290K4518p5322m3155j59292L7963P5797J08073O2139j02259Q6374N2065
668H7191J1885j11042J7021P0726j81825K5647J84124l9122P0965j9112j0616
657A05842k5701o2737j06844L9330j345L9951R0653n0170n9732P1115l0809P7261
645H6814l5127l5327L013j6894j46346J06415R9539k7703J09747r789l9756N3884
$$ plain form
726 61502 -68880 -26114 132220 72646 65694 132668 41431 -66023 -14491 -50601 -102615 25525
714 25525 43511 31521 -163276 -97666 -13548 -124936 77608 48202 18428 245383 73516
703 73516 3979 141224 -619 59626 138387 121221 37407 47784 147492 163238 113625 33236
691 33236 -29088 7019 27673 33430 -98839 -176995 -109860 -120310 -163405 65328 133048 20290
679 20290 44808 -30514 -73669 -232961 -194998 -119201 -11128 51011 -51248 35126 87191
668 87191 99076 -11966 5055 75781 -106044 -80397 103727 64605 135570 116458 105842
657 105842 80141 17404 -89440 -50110 -51455 -11504 79149 28979 -30753 40362 9553 86814
645 86814 51687 16360 19373 2479 -143867 -37452 62087 34384 144131 134342 94586 148470
633A48470j00212j9124l934M1568o748n7655J04250j21887N1995j05984j8532
622h7793n6724J60218J15142j55596N1910O6448p2786J0972O5272j3941j05511
611b2389R4703j625N583Q3797j43586N626m6165j79456J20701K09919k8547r3966
599D595J26801k8605L783N1831j02248J5796J7818Q2500K2846j14875J00773p3304
587A07711l0337K5306j3177j64420J16088J19896r2209j17932k7488R4710o4821
576d6673m5830J35409J05831J7354j44437k7882M1781m4005R7792J29519k02263
565A6596j92586J06565j12891J21695J26702j16200k7954J3335l8916R0375k4265
554c7544o5523J2643J66132l2303K5253m1052o3809K35150j12018q6355m3561
$$ plain form
633 148470 48258 29134 25200 66768 60020 2365 106615 -15272 36723 -69261 -87793
622 -87793 -144517 15701 130843 -24753 27157 93605 20819 31791 97063 83122 -22389
611 -22389 72314 70689 76272 160069 16483 22109 -24056 -203512 -82811 127108 98561 4595
599 4595 131396 102791 106574 158405 56157 71953 89771 172271 195117 80242 181015 107711
587 107711 77374 102680 89503 -74917 41171 161067 68858 -49074 -76562 18148 -46673
576 -46673 -92503 42906 148737 166091 21654 -6228 35553 -8452 89340 218859 16596
565 16596 -175990 -69425 -182316 -60621 66081 -50119 -78073 -64738 -103654 -13279 -37544
554 -37544 -103067 -90424 75708 43405 68658 27606 -36203 198947 86929 574 -42987
543d2987O8730m9665K8315n5280O095R9685k2185p6078j8184R701K7405q9649
531a14097R6542J34168M3488j90927K8700P1502l8660j05955k0477J40796m5520
520d40O7099l0395k57j8612j32213p5930K32217K18269J00405j15145k07705q0648
508d3355j65072L9652J42983k6873J20521j68758J23427J69408l3302k06105m733
497e2207J36291J07771j9003n7965r0533j21920O7834M3596N3769L3648n4889
486D6392j00045L9667J65851j69275Q6956j26925o9958P9319O9029K07346j69710
475E8647p9725m1568n0112J27663j57401L7133N3044N766J99490j16555J16737
464A53119R4789q9178J09243P4535j68285j57480n0300J68051J64555l1546j48308
$$ plain form
543 -42987 25743 -23922 4393 -50887 -44792 54893 32708 -43370 -61554 -51853 -24448 -114097
531 -114097 -17555 116613 160101 -30826 -2126 69376 30716 -75239 -95716 45080 -440
520 -440 66659 36264 36007 17395 -114818 -190748 41469 259738 360143 244998 37293 -43355
508 -43355 -208427 -168775 -25792 -52665 67856 -100902 22525 191933 158631 -47474 -52207
497 -52207 84084 191855 172852 114887 24354 -97566 -29732 13864 67633 101281 46392
486 46392 -53653 -13986 151865 -17410 69546 -57379 -127337 -48018 21011 228357 58647
475 58647 -21078 -62646 -112758 14905 -142496 -105363 -52319 -46553 152937 36382 153119
464 153119 247908 158730 267973 342508 174223 16743 -33557 134494 299049 267503 119195
453A19195r9871P5628M8244j7823j6858j60744N3226K8329j73476R5829L0965
442a7356J11927p4015o100o3800Q0725k5096P2544J5350L985r5010q6872P7706
430f012R8107j6575j4499K18479p5323p3781j69859o5693M3112l1821J42014r6366
418d8217q9980K36068K809n4673M8266J50843j66459K94K3803L0334j01865Q421
406C9644O4943L3717m3494L5146l0907P9112L0215p3860j52857q1852K6843J74047
394A00697p4767j23907M0383J970J26483J19498l6948j91720j68807N6976k1651
383a71793j26557J07916O7838J3363J11433J55037p6416j33664J04965J1539l5026
372B8635l7310J17356o8378j6930o1235N8770J11031o9761J8652m4384J46085
$$ plain form
453 119195 19324 94952 143196 125373 108515 -52229 997 29326 -144150 -48321 -17356
442 -17356 94571 20556 14456 -49344 31381 6285 78829 94179 98164 3154 -83718 -6012
430 -6012 92095 75520 61021 279500 204177 130396 -39463 -105156 -62044 -93865 48149 -48217
418 -48217 -138197 97871 100680 46007 94273 245116 78657 78951 102754 133088 31223 39644
406 39644 104587 138304 94810 129956 99049 178161 208376 134516 -18341 -100193 -73350 100697
394 100697 25930 -97977 -57594 -55624 70859 190357 153409 -38311 -207118 -150142 -171793
383 -171793 -298350 -190434 -122596 -109233 2200 157237 80821 -52843 52122 63661 28635
372 28635 -8675 108681 40303 23373 -37862 20908 131939 62178 80830 36446 182531
361A82531l8663j09563j5281P4467J4656K1776q4682j417j11868J7811O5243j04053
349h9043J73862j4768p2215K1282J47453k6296r7933J59730p4595O9468p8011
338A18934m0673K8668q4493j5872Q6099k7228P8829O52o443N3800j31216j31261
326g0204K435n8474J36633J7676L2493M9967p6502O9924l8720p2938m3042J11906
314F1154l5156k591l3146j4054p6578L9187l5464R4550q394L5746l3566n5558
302f3870R7050R4985K7123o3923O1498l6270Q4651r5819p7791P7339K9132j14322
290A9783p6407P8579m9994P0213P4932j22825N2479j3828q2697M6953N2120M4249
278I3557o104q8025P4896k3097M2291M2133n5579P9320r621m8184q2940k082N6147
$$ plain form
361 182531 143868 34305 19024 93491 108147 129923 45241 43824 -68044 -50233 15010 -89043
349 -89043 84819 70051 -2164 19118 166571 140275 42342 202072 127477 196945 118934
338 118934 78261 106929 22436 6564 92663 65435 144264 144916 138473 192273 61057 -70204
326 -70204 -67769 -126243 10390 28066 60559 110526 34024 103948 65228 -7710 -50752 61154
314 61154 25998 23407 -9739 -23793 -100371 -61184 -96648 -2098 -10492 25254 -8312 -63870
302 -63870 33180 128165 155288 91365 152863 116593 201244 105425 27634 104973 134105 19783
290 19783 -56624 21955 -28039 42174 117106 -5719 46760 32932 -49765 -2812 49308 93557
278 93557 87453 -572 74324 51227 93518 135651 80072 159392 149771 101587 18647 16565 72712
265G2712J336N764m678J6772j60873j21665J00686Q2973J7107J8018K4086q611
253D3627N1599L7302j06754J9385r283j04724j18626N4600O9889J11665M1514
242I0194j03373O7293N0651j27793n6115M6437L1121l3951Q657p0923J02531J23652
230A28381j9960j13153L4489R4250n5491j61325O1816j7406P5772Q6248j21358
219g737p2840J02257k3011J12171j95737L7123K63175j38604N5623K1809k4992
208A29237o5604N0831r0467m8496Q0083O7673j44058O2141o6609R2134r044j9694
196C8127l8433q5275O9348K2296j9503q9017J06076N4402j13409O341P5274M6613
184G2840o848O5124q8907J88157j44395j06592K8725K6800J59287l9842j24099
$$ plain form
265 72712 74048 79812 75134 91906 -68967 -190632 -89946 -6973 10134 28152 52238 43627
253 43627 95226 132528 25774 45159 35876 -68848 -187474 -132874 -62985 48680 90194
242 90194 -13179 54114 104765 -23028 -79143 -32706 -1585 -35536 -26879 -97802 4729 128381
230 128381 108421 -4732 29757 124007 68516 -92809 -30993 -48399 27373 113621 -7737
219 -7737 -80577 21680 -1331 110840 -84897 -47774 215401 76797 132420 154229 129237
208 129237 63633 114464 23997 -24499 55584 123257 -20801 41340 -25269 66865 57821 38127
196 38127 -306 -85581 -16233 6063 -13440 -102457 3619 58021 -55388 -49047 26227 72840
184 72840 65992 131116 42209 230366 85971 -20621 8104 34904 194191 154349 30250
173C0250J93864j15137q7161l5642J5849L4618j25746J30119R6387j21707K7850
162D3544L9639j7406k4387o1724J05860j9358n5200M3573Q2492j02472J205m8463
150a2697l7552j58371J02700J98790J03473j18426o4323M3475j548J7640m0774
139C2387o860K2597j6823J920J31057L6531n1785P248j019m3771l9392j07436
127c5346q3328P2369J43074j96469j13965J21701N2448l1953K4P8687R6735Q7842
115A91819o564o665q5714j18593K318Q0478j6718K3666n7216K0804o831J2941
103C3725P0942n2761K3897O1522J0875p6502j8514l8922P9548P7023k86541L9479
91g6229L3354K2592P2346o7706P636k3693j2587K2587N4624L6724m7797p9586
$$ plain form
173 30250 224114 108977 21816 -13826 2023 36641 -89105 41014 137401 15694 43544
162 43544 83183 65777 41390 -20334 85526 66168 10968 54541 137033 34561 35766 -12697
150 -12697 -50249 -208620 -105920 92870 196343 77917 13594 57069 55521 73161 32387
139 32387 25527 48124 31301 33221 164278 200809 149024 156272 155253 111482 72090 -35346
127 -35346 -118674 -46305 96769 -99700 -213665 -91964 -39516 -71469 -71445 7242 103977 191819
115 191819 185255 178590 92876 -25717 -23399 57079 40361 64027 6811 27615 20784 33725
103 33725 104667 51906 75803 137325 148200 71698 53184 14262 93810 170833 -115708 -76229
91 -76229 -42875 -20283 52063 -15643 -8007 -31700 -44287 -21700 32924 69648 21851 -57735
79e7735J19339O2412j56771K1429P0213o8289n235Q5211n6801n6489K8320O3061
67D8665j9151J1225q2532k0288N5905J5473O397N7555q7593K1606R6075q6272
$$ plain form
79 -57735 61604 124016 -32755 -11326 58887 -9402 -14637 70574 13773 -42716 -14396 48665
67 48665 29514 40739 -41793 -62081 -6176 9297 15694 73249 -14344 7262 103337 17065
$$ [...]
##END NTUPLES=NMR SPECTRUM
##END=
