##TITLE=1H_66-2021
 CDCl3, 8 sc, 
 6.08.2021
##JCAMPDX= 6.0         $$ Bruker NMR JCAMP-DX V2.0
##DATA TYPE= NMR FID
##DATA CLASS= NTUPLES
##ORIGIN= UXNMR, Bruker Analytische Messtechnik GmbH
##OWNER= root
$$ XWIN-NMR		Version 3.5
$$ Fri Aug  6 09:22:32 2021 Russian Standard Time (UT+4h)  she@DPX200
##.OBSERVE FREQUENCY= 200.131506
##.OBSERVE NUCLEUS= ^1H
##.DELAY= (6, 6)
##.ACQUISITION MODE= SIMULTANEOUS
##.ACQUISITION SCHEME= undefined
##.AVERAGES= 8
##.DIGITISER RES= 18
##SPECTROMETER/DATA SYSTEM= spect
##.PULSE SEQUENCE= zg30
##.SOLVENT NAME= CDCl3
##.SHIFT REFERENCE= (INTERNAL, CDCl3, 0, 15.7039)
##AUDIT TRAIL= $$ (NUMBER, WHEN, WHO, WHERE, WHAT)
$$ ##TITLE= Audit trail, XWIN-NMR		Version 3.5
$$ ##JCAMPDX= 5.01
$$ ##ORIGIN= Bruker BioSpin GmbH
$$ ##OWNER= she
$$ F:/spectra/data/she/nmr/H-F/1/audita.txt
$$ ##AUDIT TRAIL=  $$ (NUMBER, WHEN, WHO, WHERE, WHAT)
(   1,<2021-08-06 09:21:37.29 +0400>,<she>,<DPX200>,
      <created by zg, POWCHK disabled, PULCHK disabled
       configuration hash MD5:
       00 E9 B6 7A A2 85 ED C7 34 08 36 98 17 FE 4E 26
       data hash MD5: 16K
       1A C3 98 7C 32 B6 5F 75 0A 9A 3D CB 8B AF 11 03>)
$$ ##END=
$$ 
$$ hash MD5
$$ DA FF 53 76 1B D7 7B 0C 54 F0 EF 43 67 CD 16 E9
##$RELAX= 
##$RELAX= 
##$RELAX= 
##$RELAX= 
##$RELAX= 
##$RELAX= 
$$ Bruker specific parameters
$$ --------------------------
##$DU= <F:/spectra>
##$EXPNO= 1
##$NAME= <H-F>
##$PROCNO= 1
##$TYPE= <nmr>
##$USER= <she>
##$AMP= (0..31)
100 100 100 100 100 100 100 100 100 100 100 100 100 100 100 100 100 100 
100 100 100 100 100 100 100 100 100 100 100 100 100 100 
##$AQSEQ= 0
##$AQ_mod= 1
##$AUNM= <au_zg>
##$AUTOPOS= <>
##$BF1= 200.13
##$BF2= 200.13
##$BF3= 200.13
##$BF4= 200.13
##$BF5= 200.13
##$BF6= 200.13
##$BF7= 200.13
##$BF8= 200.13
##$BYTORDA= 1
##$CFDGTYP= 0
##$CFRGTYP= 5
##$CHEMSTR= <none>
##$CNST= (0..31)
1 1 145 1 1 1 1 1 1 1 1 1 1 1 1 1 1 1 1 1 1 1 1 1 1 1 1 1 1 1 1 1 
##$CPDPRG= <>
##$CPDPRG1= <>
##$CPDPRG2= <>
##$CPDPRG3= <>
##$CPDPRG4= <mlev>
##$CPDPRG5= <mlev>
##$CPDPRG6= <mlev>
##$CPDPRG7= <mlev>
##$CPDPRG8= <mlev>
##$CPDPRGB= <>
##$CPDPRGT= <>
##$D= (0..31)
0 1.2 0 0 0 0 0 0 0 0.06 0 0.03 0 0 0 0 0.0002 0 0 0 0 0 0 0 0 0 0 0 0 
0 0 0 
##$DATE= 1628227296
##$DBL= (0..7)
120 120 120 120 120 120 120 120 
##$DBP= (0..7)
150 150 150 150 150 150 150 150 
##$DBP07= 0
##$DBPNAM0= <>
##$DBPNAM1= <>
##$DBPNAM2= <>
##$DBPNAM3= <>
##$DBPNAM4= <>
##$DBPNAM5= <>
##$DBPNAM6= <>
##$DBPNAM7= <>
##$DBPOAL= (0..7)
0.5 0.5 0.5 0.5 0.5 0.5 0.5 0.5 
##$DBPOFFS= (0..7)
0 0 0 0 0 0 0 0 
##$DE= 6
##$DECBNUC= <off>
##$DECIM= 32
##$DECNUC= <off>
##$DECSTAT= 4
##$DIGMOD= 1
##$DIGTYP= 9
##$DL= (0..7)
0 120 120 120 120 120 120 120 
##$DP= (0..7)
150 150 150 150 150 150 150 150 
##$DP07= 0
##$DPNAME0= <>
##$DPNAME1= <>
##$DPNAME2= <>
##$DPNAME3= <>
##$DPNAME4= <>
##$DPNAME5= <>
##$DPNAME6= <>
##$DPNAME7= <>
##$DPOAL= (0..7)
0.5 0.5 0.5 0.5 0.5 0.5 0.5 0.5 
##$DPOFFS= (0..7)
0 0 0 0 0 0 0 0 
##$DQDMODE= 0
##$DR= 18
##$DS= 0
##$DSLIST= <SSSSSSSSSSSSSSS>
$$ [...]
##$SUBNAM2= <"">
##$SUBNAM3= <"">
##$SUBNAM4= <"">
##$SUBNAM5= <"">
##$SUBNAM6= <"">
##$SUBNAM7= <"">
##$SUBNAM8= <"">
##$SUBNAM9= <"">
##$SW= 20.0188882624521
##$SWIBOX= (0..15)
0 0 2 0 0 0 0 0 0 0 0 0 0 0 0 0 
##$SW_h= 4006.41025641026
##$TD= 16384
##$TD0= 1
##$TE= 0
##$TE2= 300
##$TE3= 300
##$TEG= 300
##$TL= (0..7)
0 120 120 120 120 120 120 120 
##$TP= (0..7)
150 150 150 150 150 150 150 150 
##$TP07= 0
##$TPNAME0= <>
##$TPNAME1= <>
##$TPNAME2= <>
##$TPNAME3= <>
##$TPNAME4= <>
##$TPNAME5= <>
##$TPNAME6= <>
##$TPNAME7= <>
##$TPOAL= (0..7)
0.5 0.5 0.5 0.5 0.5 0.5 0.5 0.5 
##$TPOFFS= (0..7)
0 0 0 0 0 0 0 0 
##$TUNHIN= 0
##$TUNHOUT= 0
##$TUNXOUT= 0
##$USERA1= <user>
##$USERA2= <user>
##$USERA3= <user>
##$USERA4= <user>
##$USERA5= <user>
##$V9= 5
##$VALIST= <valist>
##$VCLIST= <CCCCCCCCCCCCCCC>
##$VD= 0
##$VDLIST= <DDDDDDDDDDDDDDD>
##$VPLIST= <PPPPPPPPPPPPPPP>
##$VTLIST= <TTTTTTTTTTTTTTT>
##$WBST= 1024
##$WBSW= 4
##$XGAIN= (0..3)
0 0 0 0 
##$XL= 0
##$YL= 0
##$YMAX_a= 103754
##$YMIN_a= -198242
##$ZGOPTNS= <>
##$ZL1= 120
##$ZL2= 120
##$ZL3= 120
##$ZL4= 120
##$ABSF1= 10
##$ABSF2= 0
##$ABSG= 5
##$ABSL= 3
##$ALPHA= 0
##$AQORDER= 0
##$ASSFAC= 0
##$ASSFACI= 0
##$ASSFACX= 0
##$ASSWID= 0
##$AUNMP= <proc_1d>
##$AZFE= 0.1
##$AZFW= 0.1
##$BCFW= 1
##$BC_mod= 2
##$BYTORDP= 1
##$COROFFS= 0
##$CY= 11.3945322036743
##$DATMOD= 1
##$DC= 2
##$DFILT= <>
##$DTYPP= 0
##$F1P= 2.36226072786647
##$F2P= -0.459571619588291
##$FCOR= 0.5
##$FTSIZE= 0
##$FT_mod= 4
##$GAMMA= 1
##$GB= 0.15
##$INTBC= 1
##$INTSCL= 1
##$ISEN= 128
##$LB= 0.24
##$LEV0= 0
##$LPBIN= 0
##$MAXI= 10000
##$MC2= 0
##$MEAN= 0
##$ME_mod= 0
##$MI= 1.114404
##$NCOEF= 0
##$NC_proc= 0
##$NLEV= 6
##$NOISF1= 3.799351
##$NOISF2= 2.8
##$NSP= 1
##$NTH_PI= 0
##$NZP= 0
##$OFFSET= 15.70392
##$PC= 1
##$PHC0= -13512.84
##$PHC1= 10.20099
##$PH_mod= 1
##$PKNL= yes
##$PPARMOD= 0
##$PSCAL= 0
##$PSIGN= 0
##$REVERSE= no
##$SF= 200.130013532006
##$SI= 16384
##$SIGF1= 3
##$SIGF2= 2
##$SINO= 400
##$SIOLD= 16384
##$SREGLST= <1H.CDCl3>
##$SSB= 0
##$STSI= 0
##$STSR= 0
##$SW_p= 3612.71676300578
##$SYMM= 0
##$S_DEV= 0
##$TDeff= 0
##$TDoff= 0
##$TI= <>
##$TILT= no
##$TM1= 0
##$TM2= 0
##$TOPLEV= 0
##$USERP1= <user>
##$USERP2= <user>
##$USERP3= <user>
##$USERP4= <user>
##$USERP5= <user>
##$WDW= 1
##$XDIM= 8192
##$YMAX_p= 0
##$YMIN_p= 0
$$ End of Bruker specific parameters
$$ ---------------------------------
##NTUPLES= NMR FID
##VAR_NAME=  TIME,          FID/REAL,        FID/IMAG
##SYMBOL=    X,             R,               I
##VAR_TYPE=  INDEPENDENT,   DEPENDENT,       DEPENDENT
##VAR_FORM=  AFFN,          ASDF,            ASDF
##VAR_DIM=   8192,          8192,            8192
##UNITS=     SECONDS,       ARBITRARY UNITS, ARBITRARY UNITS
##FACTOR=    0.0002496,     1,               1
##FIRST=     0,             0,               0
##LAST=      2.0444736,     0,               0
##MIN=       0,             -198242,         0
##MAX=       2.0444736,     103754,          0
$$ Real data points
##PAGE= N=1
##DATA TABLE= (X++(R..R)), XYDATA
0@%%%%%%%%%%%%Qj6J6j6K3l1L2m0M8n6P2q3R3j13J35j52J76k02K28k62L00l41
34a81L84m34M89n46O10o83P63q47R38j039J152j274J405j552J712j885K075k285
52a198K519k777L064l390L759m180M663n230N904o720P735r031J0756j3178J6847
67I543k3133L6808j18936M1988M6547j91059J80245n26j30869J14220K2783j14637
79a27026Q4399J8301o7403M0390L4503n0677K6351K3635l2592J4360J3351k8828
91e1236K4595q103j2933K8711k2035J381K7877l5459K1187J1400l4262L6021o439
104a9295k5075M5989k2858j0827M4061k8566l306L5089k1708n440K4289m803j6823
117i273J7473J3994l3445J6499K5939m7245J9517K7659n0774K1496K1763m2625
$$ y = [0, 0, 0, 0, 0, 0, 0, 0, 0, 0, 0, 0, 0, 8, -8, 8, -8, 15, -16, 16, -24, 24, -32, 40, -43, 50, -63, 72, -80, 96, -106, 122, -140, 160, -181, 203, -231, 258, -288, 322, -361, 402, -445, 493, -546, 606, -668, 737, -815, 897, -988, 1087, -1198, 1321, -1456, 1608, -1782, 1977, -2203, 2460, -2770, 3134, -3586, 4149, -4882, 5874, -7304, 9543, -13590, 23218, -95718, -53730, -7183, -198242, -17997, -18523, -149392, -35172, -12389, -127026, -42627, -24326, -91729, -51339, -16836, -67513, -41162, -17527, -50119, -35759, -22408, -51236, -26641, -34744, -47677, -18966, -41001, -39620, -11743, -47202, -26015, -14615, -48877, -12856, -19295, -44370, 1619, -21239, -32066, 11995, -16571, -19877, 15212, -6496, -11936, 12353, 7550, -9273, 8200, 22194, -11251, 5248, 31187, -16058, 3459, 31118, -19656, 1840, 23603, -19022]
129a9022J8426J3125k6282Q148Q029r435o175R987J128j8577J7531J763k3276
142b4630K4985n188j8704K6472j3605p056J9423j7459O016O181j3629J3912p784
155a1066m017J4252j6704O083Q143j7145J1693L34j0231R166l777o21m7j227O128
170i036j0784O699O227j6985J5530L18j5521K0023p776o964J6857j2788M706O705
184b789j1402J3431n787l818J5115j5249O261J0029j7655J3335J670j2955J3967
197D153m894m593P753n341J912j540P11K793q983R856k601j0376J7114j0911n296
212a0243J8167j7125L337J2310j7480J0514K520j1247J2318o472j161P971j0125
225f716P207P5p507J0471p043p79P075q937N588o51m482P155p729L866L140j0404
$$ y = [-19022, -596, 12529, -13753, -5605, 2424, -7011, -13186, -3199, -2071, -20648, -3117, -1354, -24630, 355, -4833, -23537, 2935, -10670, -17726, 1697, -15762, -9746, -3565, -17194, -3282, -11066, -15083, -831, -17535, -11452, -3309, -20454, -8761, -8427, -18658, -9492, -13269, -13890, -13937, -15164, -9036, -19820, -13121, -6894, -23879, -8349, -8031, -23552, -3529, -11305, -18269, -1412, -14200, -9494, -2789, -14191, -760, -6547, -10365, 4750, -10499, -4238, 5791, -11864, 1471, 3141, -9814, 4153, -741, -5334, 2419, -2922, -1010, -2550, -1839, 954, -8029, 1827, -774, -11150, 5964, -4947, -10243, 7924, -9201, -5864, 6446, -11034, -520, 2000, -9247, 3071, -3401, -4562, 3409, -6716, 491, 566, -6941, 3530, -3513, -4292, 2783, -6154, -566, -1217, -5699, 1456, -6273, -2407, 733, -9671]
241i671J1773m963p070J5224j2536M79J2258j5682P935M706j2483J1325l120m537
255f362Q454p552M099J203n818Q688o562O39P138j0526Q070N01q478J2022p151
270a635j822J0754j2004N607N289j1507R497j056o454Q074m545J96J149k289M373
285C627p319M698L744j3106J2551j311j3517J7711p325q901J6673j0421k001J0175
299E278q437K666J477j562K924n580P039j597q041J3593p914n617J4874j2279
313c176n72J0860j2057L232M174o578K934j461J616j881l070Q689r027O1J1408
328E152j4569N252R452j5382R008M221j1013Q395k40l436K879j514M031n848J910
343a702P449j3577P849O143j6784J2699J883j4709J3565k137q801R245k915k210
$$ y = [-9671, 2102, -2861, -9931, 5293, -7243, -6764, 5494, -10188, -2253, 2453, -10030, 1295, -1825, -6362, 2092, -5460, -1361, -158, -5976, 2712, -3850, -3211, 3927, -6599, 1471, 1972, -6506, 5516, -1635, -3457, 7297, -4707, 900, 6189, -5318, 4179, 3123, -3331, 4743, 198, 394, 1543, -746, 3627, -3692, 1006, 4750, -8356, 4195, 2884, -10633, 7078, -247, -9148, 7525, -2896, -4897, 5278, -3159, -493, 984, -578, 2346, -3234, 3805, 2208, -5833, 7760, -154, -5771, 9103, -3176, -3748, 7112, -4945, -1713, 2461, -4117, -1183, -2644, -1028, -2909, -5979, 2710, -6317, -6256, 5152, -9417, -4165, 5287, -10095, -1087, 3134, -7879, 516, 276, -3160, -281, -1795, 2236, -3612, -1702, 5747, -7830, 19, 6162, -10622, 2077, 3960, -10749, 2816, 679, -8122, 1123, -1792, -4002]
357d002J312Q28J525o446P335N72j0522J3287l189j0171J5697p251n697J3046
371F324q538n54O456n310K199j077J503O67n819Q520l841o319J2663q969k626
386d721J1931j1085J992P146q821M401J068k762L062l384M426k038l525R441q071
401i40j83R717j1568M498O077j1007P266P27n921N850l194Q70P69l185N588n445
417h1J63O811r953N285L520j0035Q737j592n879Q250n577N13L770o487N949k419
433I75l637P797p266Q74N889q737M854J344n872N310k626o34K138l555L754k974
449b366r17N320p479M059K691q567Q278k143o037R753o774p50P204q140L882K003
465A7n631N935l433m10M129n908M833k35m638P204m719o13N554o278L599J106
$$ y = [-4002, -2690, -1862, -337, -6783, 552, 1124, -9398, 3889, 700, -9471, 6226, -1025, -6722, 6324, -2214, -2768, 3688, -1622, 577, -500, 1003, 1670, -4149, 4371, 530, -5789, 6874, -2095, -4721, 7210, -3875, -1883, 5263, -3558, 843, 1911, -851, 2211, -1173, 3253, 1215, -2310, 7131, -940, -1123, 8594, -2974, 1524, 7601, -3406, 3860, 4587, -1334, 4516, 1322, 2192, 2961, -224, 5364, -81, 82, 6893, -3060, 2225, 5745, -4290, 4447, 2855, -3024, 5226, -351, 162, 3932, -2555, 3394, 975, -2662, 5135, -2131, -1257, 4632, -4105, 749, 2093, -3779, 1531, -1095, -1729, 409, -3146, 608, -2366, -3283, 2037, -5442, -1383, 1308, -7259, 1019, -1124, -7161, 2592, -4182, -4932, 2272, -5868, -1986, 17, -5614, 321, -3112, -3522, 607, -5301, -468, -703, -5341, 1863, -2856, -3469, 2085, -4193, -594, 512]
481E12m361N672l787N6M567o558M929M32n295O878l779j226N343n743L412P98
497A850m480O047m057j2M749o591M800L84n335P600m929j004P126q751M202L710
513E309q701P243p67n572P049l624j159L761l704J912p58m74J996l629L574j202
529A254l492O610n463o9O294q732M684L231q557P639j069n532P521l912p68L762
545C401m003L383j715q97M631o294L542K714p641P030r63n554P186l552j620M164
561C812l732K055r32p47L038m992L817J310p008Q030k310n669R318n810j672P263
577E771o706J816L110m716L267j063o01J783l192L220j432k182M639m587O54L396
593C177n614L695k01l499M452l927J175J969n446N819k320m181Q575p095n36Q161
$$ y = [512, -3849, 1823, -1964, -1908, 2659, -3899, 1030, 1462, -3833, 3045, -734, -1960, 3383, -2360, 1052, 1850, -2630, 3417, -640, -652, 4097, -2494, 2306, 2690, -2645, 4955, 26, -978, 6148, -2603, 1599, 5309, -3392, 3851, 3084, -2488, 4561, 937, -222, 3539, -165, 1747, 989, 515, 2511, -1118, 2456, 1254, -2238, 4372, -1091, -1160, 5134, -3598, 1086, 4317, -4240, 3399, 2330, -3202, 4319, 407, -361, 3401, -602, 2781, 1066, 169, 4800, -1494, 2048, 4762, -2879, 4151, 3188, -2366, 4820, 1268, -352, 3812, 80, 2135, 1203, 456, 3494, -1498, 2319, 3629, -3379, 4651, 2341, -3328, 5990, 180, -1492, 5771, -935, 881, 3991, -725, 2542, 1479, 878, 2661, -531, 2689, 1257, -925, 3714, -873, -219, 3177, -2437, 1258, 1057, -2442, 2010, -1917, -742, 1227, -4219, 1600, -720, -4901, 3674, -3421, -3957, 4204]
609D204r487L190N467q808M989J660n170L874n70o57K85l77K284l661K232K448
625A903o060N291j18n544O874l017k591O008n178J109K971m342L170j055q50K581
641A152l470L068l26l370N933m103p99O039o758K876L147o580N782j131l763O366
657D063m694J93M453n883L146J469m502L551p93j445J139p47J069k552J578J470
673A515n121M994n48n773P931m330l221Q532p304L94O559q456M121K745o856N550
689G32o56l416M115k165K7P81r20J267k053J610M76l270M096k405j434M598n221
706c838K145K868o504N630n76n209P327l773k364O430n019N77L367l562J778k5
722g48k92Q49j959L438k107j587N429n263Q33N054p280L982K395o521N783q91
$$ y = [4204, -5283, -2093, 3374, -5434, -445, 1215, -3955, -81, -651, -1308, -1023, -1400, 884, -2777, -545, 1903, -4157, 1134, 1016, -4528, 2346, -671, -3262, 2746, -2432, -1323, 1648, -2694, 476, -579, -1429, 1152, -2318, 750, 424, -2946, 2987, -1116, -1915, 4124, -2634, 242, 3389, -3191, 2591, 1460, -2303, 4063, -631, -438, 4015, -1868, 1278, 2747, -1755, 1796, 1003, -442, 697, -50, 1019, -1533, 45, 1515, -3606, 1388, 840, -4933, 2998, -1332, -4553, 3979, -3325, -2931, 3628, -4828, -707, 2038, -4818, 732, 76, -3340, 775, -1390, -1363, -582, -1502, -235, -2288, -678, -202, -3472, 624, -1781, -3215, 1383, -3838, -1693, 1175, -5329, 301, -275, -5484, 1843, -1930, -4294, 2136, -2883, -2306, 1061, -2501, -723, -748, -1040, -191, -2150, 1288, -819, -2406, 3023, -2240, -1407, 3647, -3633, 349, 2744, -3777, 2006, 1115]
738A115l956N246k751o69K696k418J328p04K14J161k798L377j076l081N369l626
754e73r22N155n420J866K583m833L810p02k228L760l349J098J632l494L407j330
770D60j585L533l601J600J583l887L707j304j961M133l719J039K110m048L450
785A510j055j959L896l882J398K102m723M147n84l320M878l117o26L520l837J983
801C31P04k434K681j886N32J343k745K985j164j525L797l668J019K942m832L379
817A459L54l609M085k097o40K312k674K105q37j255L308l834J444K687n619M396
833A585K77m988N800k071k899M878k981o5J901j861J392j108P64R04l248L766
849B046r91l233N416l377j512N076m578O91K935l961K014K50j556J535j635J459
$$ y = [1115, -2841, 2405, -346, -1015, 1681, -737, 591, -113, 101, 1262, -1536, 1841, 765, -2316, 3053, -573, -1495, 3660, -1760, 106, 2689, -2144, 1666, 964, -1264, 2496, -853, 245, 1877, -1617, 1790, 460, -1125, 2408, -1193, 407, 1990, -1897, 1810, 506, -1455, 2678, -1041, -2, 2108, -1940, 1510, 455, -1504, 2392, -1490, -92, 2010, -2713, 1434, 850, -2470, 2408, -709, -1335, 2185, -1652, 331, 1035, -1399, 1282, -604, -72, 1271, -1474, 1511, 347, -1178, 2619, -1049, -30, 2912, -1920, 1459, 1813, -1796, 2289, 192, -448, 1864, -810, 1295, 458, -797, 2511, -1323, 121, 2808, -2811, 1585, 1862, -3126, 2674, 603, -2296, 2582, -399, -464, 1437, -424, 968, -140, 624, 1528, -1720, 2046, 1055, -2178, 3238, -139, -1651, 3425, -1153, -462, 2473, -1488, 526, 776, -780, 755, -880, 579]
865E79p16j443L481l682O33L374n243K999J762n073M528q70k976M324k532N9K014
882A218k560K228j039p23K819l547K027J505m190L680o13k658L621k230l12J801
898A027k079J723j168k85K249l779K760R40m614N171j659l210N592l429r52M197
914B484l895J293J612k476J990p42j30R67j984K507j294j123L169l255Q83K182
930B188l935K802r8k696L434k145m22K297l040K025j81j978L298k745L62K432
946A598l816K751L15l103L893k086r10L094l033J539P08k334K723j660k86K196
962A589k991J949L52k538L132k080n24K675l256J725P03k877L204j636j028K928
978A327l022J322J077k774K876j287o88K322k680J713M55k419L215j693q11L021
$$ y = [579, -137, -1580, 1901, -1781, -1148, 2226, -3017, -18, 1744, -3329, 1199, 329, -2647, 1677, -855, -796, 1218, -1342, 886, -153, -876, 1943, -1604, 423, 1928, -2262, 1418, 805, -1853, 1768, -462, -774, 1027, -1052, 671, -497, -782, 1467, -2312, 448, 1388, -3226, 1945, 286, -2924, 2668, -761, -1713, 2484, -1411, -118, 1494, -982, 1008, 266, 136, 1103, -881, 1626, 332, -791, 2378, -877, 6, 2188, -1747, 1055, 957, -1739, 1695, -450, -872, 1425, -1615, 410, 229, -1749, 1549, -1196, -834, 1598, -2218, 533, 848, -2255, 1638, -448, -1358, 1736, -1297, 242, 950, -1384, 1339, -321, -607, 1589, -1402, 547, 899, -1639, 1493, -587, -1111, 1564, -1692, 33, 736, -2141, 1063, -573, -1601, 1327, -1695, -373, 704, -2070, 806, -481, -1169, 1153, -1527, 186, 641, -1778, 1437, -256, -1067, 1954]
994A954l312J493J322l157K999r91j547L041k776P36J528k922K555q95j302K734
1010A460k871J181J320l151L040r55j787L371k581K64J965k763K091l60j360K350
1026A214k165R64J147k705K762j020j448K990k706O16J911l269K474m04k140L191
1042A412k380K13J801k856K319n87j864L309k718J98K712l847K238R52l132K919
1058F89q47j312K128j506O18K63r22J565j792J030R50k974L085q99k109L926k840
1075i47m72L355l823J492J535l148K616r35p27J824k107J611p4j871L039k179
1091h11m70L231l664J460J828l341K431m7j686K001j309M22L53j161K044k015
1107g34L41J934l193K211P47l199L265j206j680L252k606M74J419k085J669o90
$$ y = [1954, -1358, 135, 1457, -1700, 1299, 308, -1239, 1802, -974, -238, 1290, -1632, 923, 28, -1274, 1460, -1411, -230, 1090, -2061, 979, 24, -1763, 1608, -973, -709, 1256, -1507, 584, 224, -1136, 1214, -951, 13, 1160, -1545, 1217, 197, -1251, 1739, -967, -351, 1560, -1709, 765, 361, -1779, 1412, -968, -755, 1046, -1810, 509, -78, -1942, 1367, -1351, -1153, 1559, -2288, -50, 902, -2230, 689, -158, -1470, 658, -848, -230, 33, -889, 676, -1116, -86, 864, -2110, 975, 76, -2033, 1893, -947, -1419, 1936, -1887, -395, 1140, -2008, 608, -327, -1054, 770, -1337, 274, 200, -1671, 1368, -811, -1281, 1950, -1714, -254, 1574, -1767, 664, 617, -1069, 932, -377, 45, 398, -763, 1281, -734, -393, 1541, -1652, 559, 1306, -1893, 1372, 166, -1514, 1738, -868, -394, 1025, -1060, 609, -81]
1123h1p69J878k247J524L20k565L217j460j646L661k779Q2K188k841J620K42j483
1140a139J817j558P14P38k246K431q61j430K775k404K09K207k787J598J23j624
1156a437K135j490J67R63j643J879j015o81K460k900J326J526l656L182j98k766
1172b148L661j790j133K927k460P23Q91j562J651j152K02J070k159J924k28j728
1188a311K690j952j58K023k555J489K27j794K459j483m39K089k461J366N13j861
1204a158K241j413k91J940k595J723M45k429K894j575p97K390k389R17Q74k128
1220a351K183j109q64K376k573J129J012k383K238o27j296K208j732N18R01j681
1236a051J732j028l92J898k131J037O65k071K250j111r29K436k281P40J236k353
$$ y = [-81, -850, 1028, -1219, 305, 625, -1940, 1277, -183, -1829, 1832, -947, -865, 1323, -1518, 102, 344, -1139, 678, -880, -166, 572, -1674, 757, -104, -1534, 1241, -1163, -954, 1253, -1534, 64, 187, -1437, 698, -792, -625, 338, -1305, 574, -441, -1122, 1338, -1562, -236, 1290, -2366, 816, 618, -2148, 1513, -277, -1410, 1517, -943, -220, 671, -891, 760, -392, -190, 880, -1279, 645, 417, -1311, 1379, -573, -731, 1292, -1263, 226, 453, -1341, 1118, -365, -804, 1285, -1176, 190, 703, -1158, 1083, -330, -621, 1319, -1276, 447, 892, -1537, 1357, -218, -1015, 1375, -1014, -97, 777, -1351, 832, -277, -1141, 1235, -1338, -209, 803, -1580, 658, 31, -1265, 943, -789, -271, 630, -1051, 681, -347, -739, 1159, -972, 65, 730, -1341, 909, -202, -1131, 1305, -976, -236, 1000, -1353]
1252a353K081o60r66K035k048P40J042k255K407q00j305K642k274L73J733k764
1268a372K075R1j897K345j323k79J347j503J036j71q96J635j546N06R45j939J727
1285G81n09j115K216j986M44J364k451J995k26j808K683j630l76K081k429J077
1301A11P61j840J700q33l19J016j205J107m79p85J989k102O50J579l051K404q5
1318F18k429L228j619j140K830k463L90J566k129J502l68o71J330j327P62K75
1334C55j318J637j054l02J497j813J159K57j427J859j261q8J590k391J763L78
1350H41k331K883j350j122K785k442J81J832k235J231K07j173J355j043N52J53
1366C24j092J860j630j35K228k634J112J217k689K253k92j705K289j328k85J279
$$ y = [-1353, 728, 68, -898, 1137, -911, -171, 871, -1384, 1023, 223, -1082, 1560, -714, -341, 1392, -1372, 703, 794, -1103, 1242, -81, -360, 987, -516, 520, 349, -547, 1088, -458, 48, 993, -946, 781, 272, -843, 1373, -613, -169, 1195, -1256, 739, 513, -1295, 1388, -242, -618, 1463, -966, 111, 872, -968, 732, -101, -420, 596, -609, 498, 19, -766, 1223, -879, -229, 1350, -1701, 703, 618, -1811, 1417, -202, -1342, 1488, -975, -585, 981, -1148, 354, -14, -685, 645, -682, 80, 355, -963, 674, -380, -682, 815, -998, 161, 418, -1009, 850, -411, -499, 1091, -1300, 463, 841, -1490, 1393, 43, -1079, 1706, -736, -555, 1277, -958, 273, 480, -693, 662, -381, 171, 324, -768, 1092, -538, -673, 1555, -1079, 33, 1250, -1439, 814, 522, -1183, 1106, -222, -507, 772]
1382G72j452J086j78q15J526j597N62J058k167J874k94j504K270j641k7J379j763
1399i11J144j77o87J375j462N02Q34j916J859m00j546K506j813r6J885k227R75
1416a55O24j639J530o56j72J074j330R81j45r04J678j444J99J465k018J366K10
1433F64j582J813r33m35J449j823J245Q8j353J894j357m17J762k011J042P18j820
1450a056J699n59p21J596j405O31M89j102J390r83o6J206j545R43K88j414J732
1467A123r33n88J644j749P92M03j487J505o16p28J488j578P68M54j561J708p56
1484a11q03J819j615N61Q95j877J669m10r38J879j582L76R61j714J414k82j033
1501g91J655j259J69Q56j523J125l04o91J319j229M85N42j460J601o21q22J784
$$ y = [772, -680, 406, 228, -587, 939, -658, -96, 962, -1205, 669, 375, -1129, 1141, -500, -527, 852, -911, 233, 56, -631, 744, -718, -216, 618, -1298, 561, 161, -1385, 1121, -692, -788, 1097, -1130, -155, 469, -1170, 360, -296, -468, 606, -724, 257, 112, -792, 886, -558, -359, 1106, -912, 454, 664, -918, 895, -38, -473, 976, -847, 398, 486, -867, 1027, -330, -747, 1015, -996, 46, 764, -1056, 643, 84, -637, 959, -446, 185, 674, -428, 962, -21, -87, 1119, -426, 517, 805, -609, 1123, 190, -398, 1246, -503, 289, 692, -795, 710, 94, -634, 854, -724, 44, 498, -1063, 645, -111, -914, 905, -710, -149, 746, -1131, 538, 128, -810, 1069, -513, -137, 824, -890, 524, 242, -791, 864, -395, -226, 630, -893, 232, -72, -763, 556, -673, -188, 354, -1106, 495, -126, -948, 836]
1518H36j604L98J177k013J610n6j257J716r63k47J263j352Q31J02j061J452j090
1535b58P4J068j611J116O6j303J663j002j87J253j561Q79O8q84J261r65P2J005
1553G54j471J247k31j153J800j252j40J658k108J059M29j530J571o04n72J214
1569F71j217O30N5r40J532j182j21J380j589O59P59j687J292j79o87J013q86L59
1587a38L20r41J222r60m0J156j705J083M52j686J755o19q47J748j251KQ80j123
1605f92R07k19l39R08j295Q26L53j451J815q22q91J943j547J15J274j663R20K82
1623D24p63Q26o29K52K74r51J297p58m91J605j678M80J143j869J418n5j207J524
1641H42r85m9Q20j113J022m34o00J360j351M84Q44j617J099kj213J616q69k69
$$ y = [836, -768, -370, 807, -1206, 404, 348, -909, 807, -156, -403, 860, -492, 339, 441, -620, 832, -258, -184, 884, -727, 389, 455, -848, 815, -187, -374, 879, -682, 197, 265, -619, 642, -323, -251, 754, -717, 530, 299, -854, 946, -306, -446, 1212, -896, 163, 592, -938, 633, 29, -543, 671, -546, 84, 139, -801, 731, -451, -572, 808, -781, -122, 637, -1050, 242, 63, -624, 389, -497, -138, 182, -759, 463, -497, -537, 619, -1086, -3, 449, -1237, 518, -101, -948, 800, -451, -449, 431, -692, 215, -4, -343, 565, -730, 96, 449, -1002, 813, -9, -900, 1043, -504, -389, 885, -778, 142, 424, -339, 487, -142, 110, 384, -567, 730, -28, -519, 1086, -592, -112, 1031, -838, 580, 525, -682, 842, -143, -192, 628, -485, 537, 103, -497, 863, -488, -4, 840, -777, 322, 320, -893, 723, -146, -415]
1659d15J086j246P25N6q65J142q46M7R70j399R23J53j283J584q98l12J126j022
1677d74L79L67q65R76o80r1R21j221R57j08r75J484r55j25J137j475Q46M48j379
1696h33J388o13n06J240j212N32M43j031J098o49k41J097j378P17N69j322J161
1713D60l26o77J165r04K55N56j007R17k69m67J112j171N49M70j224J203m36o67
1731d61J190j065L04N62j205J148m20m81J081j045K14O66j130R86k30o54J109
1748E69r08L08M90j074J004l02o14J226j231L12P89j340J095j48j125J459q69
1765c59j50R60j191O71K34q23Q79o40P8N70j002R03j22o46J056q45J32Q28j296
1784g63R22j8r02J242q60o3Q19j032R07o9j065J386p84k04J093j180N00M29j124
$$ y = [-415, 671, -575, 150, 206, -659, 483, -363, -316, 654, -745, 178, 331, -952, 632, -266, -578, 548, -474, -95, 272, -593, 383, -297, -388, 533, -688, 269, 161, -814, 670, -285, -410, 727, -748, 98, 546, -833, 555, -58, -564, 676, -536, -4, 439, -592, 506, -143, -384, 713, -665, 52, 621, -701, 460, 134, -543, 622, -282, -27, 529, -478, 439, 170, -297, 815, -356, 193, 663, -561, 642, 206, -461, 729, -336, -32, 530, -675, 473, 53, -428, 653, -392, -178, 488, -642, 344, 114, -540, 569, -339, -31, 459, -615, 389, 87, -527, 699, -532, -220, 569, -771, 324, 176, -949, 510, -359, -509, 451, -740, -69, 165, -658, 221, -419, -341, 229, -773, 130, 8, -638, 418, -427, -295, 533, -763, 159, 141, -761, 481, -379, -442, 377, -655, 252, 183, -882, 504, -280, -484, 609, -571, -71, 358, -766]
1803g66J105l47m23R20q70K88K95n97Q81n69L5P35j213O81K44j167J370m41o73
1822e12J083q21K30M27q73Q04l75k11P25j012P65K7j019J239o04l55J309j315
1840d88L18P90j219Q09k2o61R51p07J88L23p46Q15l78m89J163j188K12Q69j205
1859f65P78J01n59N96m73k7M66n91O95m64k11R34j127L84Q43j620J288j01j141
1878h94J549p59k73Q78q12L57J80n72O71n39K47M59j059R21k6q91J103o89m9Q96
1898F98j058N60R9o35Q17n53J26M22q84R55j93q60J294q51j57J059j259O43K66
1917D89j006Q61j74l47Q92q96M54m1n28Q15m66j70P61j082N15L82r66R86l73l17
1937b11N91n73K48J97o50P97p92J99P13j073N19L77r97J130o08n28J243q73J22
$$ y = [-766, 339, -8, -431, 489, -381, -93, 202, -395, 486, -83, -48, 687, -526, 155, 399, -768, 602, 161, -512, 571, -250, -20, 407, -466, 338, -37, -248, 477, -535, 230, 257, -762, 477, -127, -482, 827, -488, -170, 620, -599, 210, 188, -473, 478, -229, -41, 282, -464, 351, -27, -516, 647, -541, -329, 540, -665, 113, 214, -345, 251, -222, -249, 217, -374, 321, -143, -354, 580, -547, -163, 680, -940, 348, 247, -894, 655, -104, -377, 501, -311, 46, 226, -346, 325, -214, 33, 492, -567, 354, 328, -563, 540, -149, -198, 698, -360, 200, 299, -336, 481, -72, 54, 476, -408, 547, 354, -506, 788, -63, -220, 839, -420, 223, 489, -517, 344, 170, -177, 715, -181, 273, 232, -296, 519, 53, -117, 644, -438, 77, 459, -507, 479, 106, -211, 380, -193, 55, 252, -398, 399, -393, -194, 519, -554, -35, 342, -655, 475, -133, -661, 582, -291, -169]
1956a69M59q52Q57l57l27R61r63K51M17p65P54k65m33Q14p06J42M79j009Q98j61
1976B5l89Q67q07K85K95q41Q11j49n67R34o65J12N75j045Q76j07n82Q96o40k3
1996a39N30q37O97n6n60Q61p69J68O80r40O89J14p95Q54n60o4O28q12N35M0o09
2017c45R09o96j48P81q68N27R2o43Q98o78m5N53p80O41J06r06J030n71j42P83
2037D98r76N24K44q81R93n23k40Q21q15L47K08o58P71m05k54P19p15K74K66p66
2057e68Q62l44j81N78o65K33M28r29Q51l39k08P62p55J82M79r26Q05l23k57P37
2077D22p85K71M51p30P74j91n85P47o25J84L62p38P58k78j89O62q46L26L59q81
2097e32Q55k23m79R44p72m7O49q00M84J17n63O49l42k4L51o74O57j74n29R33q97
$$ y = [-169, 290, -562, 295, -62, -389, 572, -391, -140, 277, -488, 266, 1, -432, 382, -324, -182, 297, -712, 186, 25, -364, 503, -304, -19, 276, -565, 246, 97, -470, 464, -201, -89, 486, -559, 317, 210, -372, 524, -116, -139, 391, -446, 251, 195, -365, 496, -273, -105, 575, -365, 324, 438, -357, 497, -63, -127, 501, -311, 224, 264, -345, 564, -132, -280, 501, -367, 160, 252, -391, 507, -171, -216, 337, -443, 198, 304, -602, 428, -143, -285, 498, -478, 46, 290, -591, 402, -121, -361, 460, -355, -8, 200, -458, 313, -92, -346, 373, -342, -68, 198, -568, 294, -50, -231, 347, -318, -85, 343, -586, 265, -74, -282, 480, -275, -93, 386, -540, 265, -58, -315, 422, -363, -92, 359, -371, 403, 212, -373, 374, -251, -67, 295, -443, 315, 37, -152, 510, -336, -10, 349, -532, 323, 100, -379, 565, -207, -254, 395, -405, 79, 196, -367, 282, -60, -84, 267, -407, 250, 76, -453, 480, -417]
2118d17J16N92p47N24P8n77O80m34o4N13o29M89l3n22Q57o79%O78r56N82K29o51
2140c71N86k02j82M16n87M81q9m66Q12n68p6O17r34O97J77q55R85l57m86Q68o00
2161a34R2L66n79N27j95o8L58o10M82n0n21O70m27j07N27o69M74K44p97P14k65
2182C2j19N92p66L29K89o58P06l26m50R08o79L0M26o15N72q4n06P44n52K6M11
2203C10o31N84j27l79O30m83N4L03n25O35l06l78O66o44L29L49q16P19k54m11
2223c75Q96p19k6O33p89O11j20m83Q48n66l9N39o88M16n4l92O62m60R7L68o51
2244b92N26k1m15P02n55o5M70n63L95O6o13P59l54l2M23o50L80O1m81O54m58m6
2266a09O54q10L63Q6n22P22l95k24O67q11N31J88o85O80l27k69O73o07K68K14
$$ y = [-417, -301, 291, -456, 68, 146, -431, 249, -185, -249, 264, -365, 124, 91, -431, 426, -253, -253, 425, -531, 51, 280, -371, 215, 13, -169, 247, -340, 141, 52, -414, 398, -170, -246, 371, -563, 134, 311, -544, 441, 84, -402, 466, -134, -42, 324, -255, 272, 77, 9, 367, -243, 239, 189, -332, 338, -89, -196, 331, -338, 136, 380, -417, 297, 32, -87, 505, -261, 68, 357, -301, 405, 79, -371, 537, -142, -112, 314, -301, 271, 187, -319, 425, -127, -101, 310, -321, 263, 136, -243, 387, -96, -42, 261, -264, 371, 65, -313, 353, -291, 38, 387, -429, 290, 36, -375, 521, -198, -224, 409, -380, 231, 111, -372, 476, -90, -129, 410, -278, 138, 84, -308, 354, -106, -9, 359, -292, 234, 213, -202, 500, -55, -120, 350, -213, 182, 248, -365, 394, 40, 8, 431, -219, 161, 222, -259, 395, -63, -109, 545, -265, 98, 184, -338, 384, -11, -235, 432, -379, 152, 340, -345, 335, 8, -261, 412, -195, 73, 287]
2286B87o08N98k88j67M49m88K98P8m54N43l31j74N79p44N32J79p29Q97m27l63
2306c33P44o00Q7M61o75O02k24l26N11m00J34K27n13M98j62j89M62n72J66L91
2326B89o47N43k01k36O00n92K82K76n59L86Pm20O41n24O0N26o26L00P8l77M80
2347B86m00J74L13n83L89j12k57P20n93J18L10p33O61j66m32P21n12j17O03o72
2367b82L74l5l47N34m38K9M22o05M09j0m99P57m47m4N33o23K04J67m93N01j69
2388f2j1L20o68M66Om63N83l10k10N31n88L14J54n41N61k04j21M95n16J85J04
2409B5l68M52k92k2N28o33L14J28m60M62j60k24N51m98K24K31m44M27k86j58L93
2430A90l89K65K15o24N09q8k95N59n18K17L08o26N14j24l28O60n46J31K67o14
$$ y = [287, -321, 277, -11, -178, 271, -217, 81, 159, -295, 248, -83, -257, 322, -422, 110, 289, -440, 457, 30, -333, 411, -189, -102, 359, -316, 286, 62, -264, 247, -153, -19, 208, -305, 193, 31, -158, 304, -268, -102, 289, -358, 185, -16, -252, 348, -244, 38, 314, -245, 141, 148, -272, 369, -155, -95, 431, -195, 105, 183, -194, 286, -114, 60, 373, -210, 179, 67, -190, 530, -63, 55, 365, -368, 293, 127, -305, 416, -96, -213, 390, -282, 92, 57, -290, 244, -194, -165, 257, -348, 61, 51, -448, 309, -138, -182, 351, -272, -68, 99, -394, 107, -62, -73, 247, -421, 45, 51, -412, 171, -139, -349, 182, -406, -92, 62, -479, 82, -122, -243, 252, -264, -79, 25, -343, 109, -183, -205, 323, -310, 4, 132, -328, 134, -26, -250, 301, -197, 27, 258, -186, 241, -45, -203, 190, -199, 66, 281, -343, 166, 78, -217, 342, -176, 41, 349, -277, 237, 113, -215, 445, -101, 30, 297, -317]
2450c17N43j75k89P44o52J16M77p23L97R9l00L36k66j40M21l91K80j23k15L33
2470A55k00k6K85m02M27k24l05M73l39p9M84n13L10l7m11O41l12l4L32n15L18
2491B8J45n09M98k50J6K72m84M29l6n62N87l40P1K98m33L73N5n55M56j56qK97
2513A92m25J94M4j37L97k93q5K95l82L04N9l63N13k56j97M46m84K56J25m75M96
2534B24j75j85N22m64R6L02m89L11k6j83L82n05J47K71m32M02k31r7M69n09J96
2555B6J84m65N65l52k22N20l66J43J44m60L86p4k48M44l06p2L24m10L88k27j54
2576b32M85m32J18J81m30M83j30k44M01k83q4L78m78K46J16l51M63l61M7L26m37
2597b18L90j23k67N09l18j15N22o16L64p0j67L96k90p2L52n01L49K8k14L61l14
$$ y = [-317, 226, 51, -238, 506, -146, -30, 447, -276, 121, 220, -80, 256, -10, -150, 271, -120, 160, 37, -178, 155, -45, -71, 214, -188, 239, 15, -290, 183, -156, -235, 249, -264, 46, 9, -402, 239, -73, -107, 225, -290, 28, 173, -336, 162, -88, -72, 200, -284, 145, 109, -453, 134, -206, -135, 163, -270, 103, 158, -397, 59, -97, -105, 192, -233, -39, 5, -132, 265, -28, -113, 182, -200, 104, 163, -200, 313, 57, -140, 306, -178, 78, 203, -272, 224, 49, -136, 386, -78, 18, 320, -169, 142, 116, -67, 315, -190, -43, 228, -204, 198, -33, -130, 339, -170, 26, 210, -255, 310, -42, -264, 256, -110, 33, 177, -283, 103, 29, -219, 225, -81, -153, 171, -239, 149, -78, -232, 253, -179, -61, 120, -310, 173, 43, -201, 200, -83, -167, 211, -267, -21, 95, -256, 207, -154, -107, 219, -218, 172, 49, -218, 291, -27, -142, 380, -236, 128, 58, -109, 287, -3, -75, 277, -224, 125, 153, -61, 300, -14]
2618a4m9L49n12L92J11l35M29k64k13L85m19K89J28m63L35j71j38M11m89K24J36
2639A22l74N15k33k96M57m57L17M5k72K34j20q3L66m52K60J47o73O86l38q2L43
2660A12j89K7J99l52L19j53k19M03l54J27K04l74L80k16j49M06k72M8K44m79M89
2681B01j68k48L66k62rK97n66N54j43k48M73l57J20K28m01L57j35l51N51n06R5
2702a52K38k55K73n2j92M26k82QK00n57N69o6k21L57l32r2L83m88L59l7k55L24
2724A56j77L4K73n18K31J32m02M06j86p9L94n43L19K69o54N49k46j08L05m37K38
2745d4Q3l57M74k58k4L29m52K36K00l95L75k74m8K33j44J22J33m61M55k33j32
2766a82M13l34J10J31k83K48j52q5K90l14R0K26l15L33j98j60L61k60J41K0j92
$$ y = [-14, -63, 286, -226, 166, 277, -58, 371, 107, -106, 279, -140, 149, 277, -186, 149, -22, -160, 251, -238, -14, 122, -252, 263, 30, -266, 191, -266, 51, 96, -176, 58, -62, -145, 221, -231, 29, 176, -497, 189, -149, -231, 112, -77, -50, 149, -203, 116, -37, -256, 147, -207, -80, 124, -250, 130, -86, -235, 171, -101, -53, 191, -288, 201, 33, -215, 151, -111, -120, 177, -389, 165, 22, -226, 247, -110, 10, 238, -163, 194, 59, -292, 259, -247, -152, 86, -169, 104, 52, -140, 286, 4, 12, 212, -345, 224, 158, -63, 294, -38, -130, 253, -235, 124, 87, -168, 156, -21, 13, 286, -232, -1, 131, -271, 135, -51, -130, 264, -279, 40, 309, -345, 204, -42, -150, 155, -282, -44, 39, -318, 156, -102, -126, 203, -249, -13, 187, -208, 167, -107, -155, 78, -66, 56, 189, -272, 183, -50, -182, 231, -103, 7, 138, -145, 103, -49, -134, 156, -158, -68, 158, -157, 176, -22, -182, 179, -81, 60, 80, -112]
2787a12K55j84o9K60j98N3O7j36J99m6k96M38l61N9L46m57K87j03j58M07l46J00
2809EJ98k61J81J01l61L12j39j49M18l80J26J00l24M15j40j56J92l78L23k7q9
2830c3J74k23K3K56l14K76j68j81L29j58j31K99k27J19j1k09L22j70m1J89k16
2851i5J77J6l04K91j25k1K55l63K21Q6m07L43q6j54L61k65J8K55l94L10k46oM80
2874C47m29K24l6l55K15ko8K53l06K89l1j65J88m7j07K63l92J29J88l56L28q5
2896D5k11M12m50K58R3l90L18O5k56K25j63J32L7k95L23j21j84M31l74J93J0m45
2918c47N34j24j66L14j97j12K00j44J18p2j58K53j63N0k4j29K54q8k05L68j57
2939Ek0J55m24L62o9k13K98j02l9O2n4Q3j3k08K15q6n6K71l58K11J9k56K78o1
$$ y = [-112, 143, -41, -110, 150, -48, 5, 72, -64, 135, 89, -207, 231, -130, -71, 275, -182, 105, 2, -156, 251, -95, 5, 203, -58, 123, 224, -137, 175, 36, -113, 305, -75, 51, 151, -173, 242, 102, -54, 138, -240, 83, 56, -33, 141, -82, -59, 197, -117, 159, -9, -190, 139, -19, -150, 149, -78, 41, 30, -179, 143, -27, -68, 121, -95, 82, 98, -206, 85, -40, -61, 194, -169, 52, 138, -269, 74, -12, -166, 195, -70, -52, 203, -191, 119, -127, -133, 347, -82, 142, 106, -249, -34, -36, -104, 149, -157, 132, 101, -64, 124, 77, -30, 233, -159, -30, 158, -198, 130, 45, -166, 246, -204, 54, 147, -243, 75, 140, -116, 109, -54, 78, 115, -180, 143, 22, -162, 269, -105, 88, 98, -347, 187, 63, -103, 211, 14, -98, 102, -42, 76, 4, -154, 99, -64, -14, -38, -167, 87, -1, -206, 162, 5, -15, 140, -284, 78, 9, -204, 94, -8, -47, 15, -39, 44, 31, -177, 38, -48, -104, 167, -191, 20, 39, -217, 61, 0]
2963@r3K75k99N9Q7k12L54j40j20J39k29J54N3j67L14j49j27K32k23J25J30l33
2985a70L76k67q2K99l39L24P9k96K13m1k13K87j68L6K8j21K16j38j61K85k27J22
3007D2K8k32L15k51MK19k25J82J79l17K94k45N1O1k29N8J05k69J98l0j36L10j79
3030f7J03Q8k53J56j36k7K61k01P6O9j20K16j45j93K57j69nL12l93Q7K15k58L27
3053B00k77J6K54l94K57l5j14J61j02L2N9j98J69l1j02K38p3m4O9k33J50J01k27
3076a24K77j83j92M16k91J19J18l01L45j12j82L46m00K46M4k33L34k31j36K41
3096A01k13m1K58j85K04k24M2J38p2Q9L7k08K22p4j20O0k21J87R4k66K20L4q6
3119b4K00k51J31M6k51K09j12m0K01k26O6J65k55J38o9j05L48k15K1R0j32R9J3
$$ y = [0, -93, 182, -117, -58, 29, -183, 171, 31, -89, 50, -179, -25, 28, -139, 175, 26, -101, 131, -92, 33, 163, -170, 206, -61, -143, 156, -183, 141, 220, -76, 137, 96, -117, 170, 2, 38, 66, -55, 161, 23, -138, 147, -80, 42, 70, -162, 153, -98, -94, 125, -100, 82, 261, -56, 238, -7, 44, 105, -124, -66, 39, -230, -32, -62, -198, 112, -67, 36, 124, -129, 27, -109, -136, 125, -76, 0, 69, -51, 165, 20, -173, 84, -85, -90, 222, -171, -84, 131, -127, 200, -77, -61, 193, -201, 56, 21, -93, 68, -34, -2, 57, -141, 28, -3, -105, 133, 60, 16, 85, -148, 2, 103, -124, 153, -30, -222, 194, -97, 22, 140, -161, 184, 72, -110, 236, -164, 82, 126, -107, 227, -4, -140, 101, -112, -153, 105, -80, 124, -100, -58, 80, 8, 97, 134, -74, 148, 74, -46, 14, -207, -20, 74, -192, 28, 62, -24, 176, -75, 56, 102, -149, 60, -52, -92, 109, -117, -51, 114, -141, -3, -72, -177, 171, -44, -23, 67, -65, 34, 47]
3142D7j00J85j00L8mj96M05k14j76K92k17pJ30j71K57j86q3K97k67mJ75j96J80
3165H5j04o5J87k39J85J62l04K08N2l08K88j60q3K51l12K05jj68K85j65n7J87
3187A29j41O4O4j55J62k07J05J42j57J52k1k71J36o4q8J89j21N1J18j03Qp3K9
3210e2J17j75J38L4j76J15m1k09K98k89K55J14k21J82j03q4P5j47J54R6j68P7
3232a0n2k0K33k34Q4J02j80K12q6o0J51r1q4Q6j19J36K4j39K14j61q6J51k70K81
3256H2l6m6J65j66j1J41j75J17k8j16K10k13K9Q4q2N6R3j90J69j60P5J22k56J26
3280a0J05m6Nq8nK13k14J44j00j12K26j73m9K59k76Q5J27k33J93K8j00J23k74
3303a72J86J08k49J64n1l0J71k70J91O7l38K80j12N4J32j70J8R3j76J34l3o3K32
$$ y = [47, -53, 132, 32, 70, 66, -130, 275, 61, -115, 177, -40, -47, 83, -88, 169, -17, -100, 197, -70, -74, 101, -95, 85, -19, -84, 103, -136, 49, 211, -93, 115, 167, -141, 147, -13, -96, 155, -157, 48, 47, -121, 164, -1, -58, 129, -12, 52, 116, -39, 123, -84, 21, 163, 6, 158, 137, -134, 2, -62, -150, 39, -82, -31, 87, -16, -8, -81, -52, 65, -110, 28, 62, -114, 1, -40, -249, 49, -240, 15, 129, -92, 90, -13, -97, -22, -169, -15, 81, -87, -10, -62, -82, 151, -83, 1, 103, -77, 135, 49, -11, 140, 49, -35, 51, -68, 68, 92, -47, 167, 6, -80, 71, -199, 82, 46, 0, 165, -1, -12, 129, -46, 71, 43, -73, 137, -76, -47, 37, -45, 11, 104, -86, 83, -77, -2, 120, -136, -10, 95, 49, 54, -34, -39, 174, -40, 104, 4, -108, 118, -55, -104, 155, -121, -36, 91, -142, 51, 79, -21, 102, -172, 14, 122, -127, 37, -14, -44, 127, -143, 48, 115, -223, 57, -55, -1, 131, -39, -21, 72, -104, 30, -3, -66, 166]
3326A66k48J52Jk39K24%j29K61j46O0J7k15J65K3l18L57j23j2O9j55J46k8k00
3349a72L41j22m0R0r4J39j29n2P0j50O7J38j59J37n0j45K30j64l1P0j64J95k5
3372b0m4O7r9J30N4j99J88q1l9K77l09M2J47k29J79J19j64J54k60J56J0j49J26
3395E6Jj65J05l3L0P1k65K26J2k31K80k18J5J78j44P7N0j21Q2o6N4P3j58J55o7
3420cn2K70j90n4J57j94J44J2j32O6LL8kj28J00J06k12J55o9k04L50j86LO2j72
3445a32J85l2qN8j64J39m5o0J90m8k07K15j24K7R3j22J29n2j05J84k07J17Q7j99
3469h1K19m4j44J25j24J41M3k02J94j57m5J51j76K21m6p1l3N2m8J59k21J2N5n4
3493g4O4N5q4K54k55q3K12j25P6l9k5M8r5m2J44j05J23l8l1J84j79n8J26j86K10
$$ y = [166, -82, 70, 71, -168, 56, 56, -73, 188, 42, 102, 119, -96, 69, 92, -226, 131, 8, -4, 65, -90, 56, 28, -172, 169, 47, 7, 97, 3, 142, 13, -39, 31, -119, -52, 86, -73, 64, 14, -131, 99, -65, -96, -26, -190, 5, -20, -64, 3, -96, 34, 88, -111, 77, -4, -43, 234, -75, -33, 114, -115, 64, 183, 19, 173, -87, 69, 79, -70, 56, 57, -108, -3, -36, -6, 65, -200, 26, 38, -193, 87, -131, -116, 62, -82, -5, 45, -76, 6, -60, -6, 67, -91, 64, -3, -55, 215, 25, -29, 128, -66, 78, 90, -42, 24, 27, 65, 63, -65, 35, 141, -71, 84, 15, -189, 161, -25, -22, 40, -132, 53, 21, 13, 71, -93, 46, 1, -59, 131, 83, -124, 91, -33, -6, 87, -35, 94, 42, -63, 121, -86, 31, 118, -81, 138, 94, -50, 75, -49, 92, 135, -67, 127, -30, -75, 76, -100, 121, 75, 4, -29, 23, -25, 134, -87, -75, -20, -74, -10, 45, -39, 215, -40, -123, 89, -36, 40, 1, -24, 24, -71, -113, 31, -74, 49, 11, -20, 164, -15, -73, 53, -133, 77]
3518G7J6j85J96j10n0R7r4L9O7j33J97k6j59J96j44M5Q7k06J80q2l5J26j41O6
3542B4M2k13K16j16K7J0p7Q4K5p7J47p0J1Q6j24Q0O5j95K45k33K1J69k76K42m5
3567F8k36O9J21n3R2k40K01l9k3R7o1j13K00k05J22J23j66O2k0p4J90l30K42j3
3591A4k59J42O6K7j3M2N4J27l04K68j19j17K62k62k1J92k41J50m2r0K72k22N4
3614b0Q9j47J37m7j05K82j38k7L4j26Q7n8j8P5p1j82K73m2l1L0j18K81k35R5L4
3639E2l2P9j19p3J23o6QJ69k76O4J95k97K31o9q5K61k89J38R5j75J13k11J45K9
3663A0m7J45j08j01K06j50o8K38j14q0K12k36J56r6N1Q6k35J8J71j29J15l9j43
3686a38J75m8k6r8OK02j6k8J4j75P9O7n1R3Kj01K03k05N0O1j87J18o3J8J68j12
$$ y = [77, 93, -92, 104, -6, -56, 41, -53, -14, 53, -80, 117, 91, -68, 128, -16, 29, 116, -90, 90, 8, -27, 99, -42, 24, 66, -147, 69, -47, -20, -10, -87, -3, 22, -55, 92, 22, 33, 119, -5, 75, 140, -55, 190, -43, -22, 147, -129, 113, 68, -168, -99, 22, -31, 61, -179, 22, -17, -40, 57, -4, -117, 83, -122, 0, 123, -43, 19, -1, -75, 115, -215, 27, 14, -245, -103, -37, -10, -23, 19, 73, 200, -104, 164, 45, -72, 190, -72, -93, 99, -142, 8, -34, -124, 148, -74, -20, 69, -78, 59, 12, -93, 189, 51, 24, 58, -68, 19, -39, -57, 18, -53, -235, 38, -4, -35, -5, -123, 158, -77, 18, 52, 20, 99, -20, -93, 30, -36, -28, 141, -135, -71, 124, -173, 58, -11, -96, 165, -124, 14, 109, -66, 47, -164, -19, 10, -37, 108, 0, -101, 105, -45, -113, 125, 11, -69, 143, -93, 63, -33, 18, 104, -131, -113, 58, -71, 44, 5, -138, 37, -11, -37, -135, -129, 73, 57, 29, 43, -132, -53, 14, -37, 56, 58, -43, 160, -45, 5, 66, -121, -3, -66, -48, 120, 8]
3712Hj8Q8k03J37Q3n9M0j05J1J15j95J11N2j46J28j36J32M8l4l0L0j69J49Kj04
3737f5K07j70J82p2k85L01j56K1J08j53J67j78k7K64j51J3m2j62K49r4j21J33
3759c1P1n9J12j50R9n1k9R1r2P2J06k10J30J5j63J33r1n9K42j96L0N1J2l2l4m3
3785g6O8n4Q0J03k23J97n1j41J63M4m3N6q9O5j27m7J17j94J82QK3j9m5n8J53j34
3811d2N4J5m5R7K6k54K04m8M9Mk1P0j08rN3n2K2L9j71J81m9r%K8q6J39j48j6J25
3840D8j54K9J46p5j5m4J10n5j73L51k50j1J80j24P0J0r5P7m8K4J00j06L8j19J09
3865B3j6N0q4J04j42Q3k4q1J91J3j78J09l5O6L2j10R4J8j29L0r9J11qj24K17j58
3891d7J31j3r0J22L3p7L1l7j32J14j21J53n4qQ4j55K7K37j67q5J07j60RJ69q8
$$ y = [8, -10, 78, -125, 12, 95, 36, 76, -29, -18, 97, -98, 13, 65, -81, 47, -89, 43, 91, 57, 27, 57, -112, 37, 39, -65, 142, -28, 154, 82, -203, 98, -58, -37, 71, -82, 85, -93, -120, 144, -7, 6, -36, -198, 51, -43, -164, -31, 40, -19, 93, -57, 42, -9, -38, 53, -39, 33, 139, -71, 59, 74, -89, 44, -47, -106, 136, -60, -30, 21, 33, 1, -33, -76, -8, -62, 18, 121, -102, 95, 44, -97, 66, 110, 67, 123, 34, 99, -28, -75, 42, -152, 30, 38, 61, 42, -3, -61, 92, -42, 12, 27, -18, 79, 105, -149, 55, 7, 56, 60, 39, 109, 1, -8, 45, -7, 15, 54, -117, 64, 15, 6, 6, 34, -52, 87, -61, -77, 48, -106, -77, 69, -6, -21, -65, 45, -10, -183, 168, -82, -93, 87, -37, 33, 43, -52, 25, -23, 1, 101, -5, 33, -86, 23, 7, 57, -27, 77, -65, 18, -6, -87, 104, 117, -61, 48, 13, 79, 111, 1, 95, 113, -16, 14, -85, 26, 18, -106, 111, -47, 84, 71, -19, 103, 136, 59, 90, 53, -79, 35, -86, 67, 13, 5, 89, -66, -39, 198, 31, -54, 53, -107, -98, 71, -17]
3916a7L9r0J37r0k3M9N4m8Q3o6K5Jj78J76j15K0J86j24q1K0jJ14n6j37J15q0R3
3943FJ0m8J86p4p3Q4q0q5J06p8J77q5j0j7J6KO9j10L9k3q2P4p6J76N8j76R8j1
3971G3j41R8j29J74L9q1j19M2M0l0L3RR5j11p7J03J01j6r3ML0n0%J11j84J14N5
3998I0j08O2jp4J2KO6kj15J54j28J7M1q9J45r9N0M4j15k8J33j70O7l0k6K43k29
4025h8oQ8k6P4qj4Jj01J02m0J4j52R3J41k8l5m7J06r8mL1q7M9J24l6p7L0KQ0k09
4055a21M8N0N9q2lJ39q3j6K5L6j56K8P8Po7J81m8r4R0q9J7N8m6j24K12o8J9J16
4083A66j24P7q4j25J69K6j09%p8N4Q3j36Q1j30O6jN2j7Q3k01J56k6q4R4j37J37
4109hp3K2N7K7n8J03m1q8J30r7P8n6l1J63j83K5J25j2o9Rn4Ol5QJ47j66k6R9M4
$$ y = [-17, 22, -68, 69, -21, -44, 5, 59, 11, 94, 28, 53, 54, -124, 52, -63, -43, 143, 19, -62, -42, -43, 71, 15, -122, -7, -87, 6, 16, -32, 154, 80, 7, 91, 11, -74, 32, -46, 131, 46, 36, 19, 35, 37, 106, -4, 35, 12, -70, 4, -72, 104, 162, -14, 84, 73, -68, 30, -99, 75, 114, 33, -86, -44, -4, -34, -1, 8, 103, -8, -85, 18, 119, 103, 10, 14, 44, -6, -6, 105, -79, 35, 90, -18, 44, 43, -31, -19, -17, 49, 47, -68, 86, -42, -25, 16, -73, 72, -27, 23, 67, -48, -76, 57, -113, -46, -76, -102, 141, -88, -94, -6, -32, 42, 34, 20, 21, -80, 22, -18, -4, -156, -63, 78, 50, 15, -32, 74, -24, -28, 3, -84, -35, 89, 53, -24, 6, 8, 88, -121, -73, -23, 36, -46, -49, 90, 7, -9, 16, 52, -104, -76, 2, 9, -58, 123, 75, -19, 71, -18, -1, 57, 11, -113, 99, 31, 50, 166, 42, 119, 35, -90, 79, 105, -4, -4, -82, -28, 55, -81, 0, -130, -64, -65, -13, -30, 53, -148, 8, -18, -102, -8, -145, -8, -81, -59, -2, 25, -33, 70, 29, -59, 71, -26, 52, -4, -35, 128, -55, -30, 95, 83, 14, 23, -31, -25, -60, -52, 95, -71, -97, 2, 46]
4138D6n3oJ6K1k7L5j57O6J22j15Q0M0o3l4J36j17K0j18J77j26n1J14K6k54L17
4163I5j57j8J12j85J73J29j55o8M4o2J06O6j29J19n9j13N2q4J58j3n3M5m6K3O5
4188D5j5k5j0K8l3j00J29O0j16J65j81J7n0l5K08n3q7pM8l4K3n2J51l4l0J00j47
4215c5J07p4k8J04n7J0J31j39l8R2j33JM0J05j6j91J14JL0L1j23O4j3n3J03J9
4241E2l1M3j3k3K4j87J51R2j48N5lo9J85j54R0j06k9J03n3J17o5j13N0L1j6m2
4267e9l7J17O5j55J00L9o1L5K9J0L6p7j23J13q8J34o9k1J02k01R5R4l5k1Nj98
4293a71N0R0l3J27j18O8Jq7J08l9o7P5m6N9n5qJ69r4j3L4j7K7k9n0Q9o3m2O3n
4322B3kO5j54M2N4n6J13j17J14m2mQ4j54O8l5j01J17J3k1M2q0o3J82j05J10j04
$$ y = [46, -7, -13, 3, 24, -3, 32, -125, -59, 63, -52, 28, 68, 5, -29, 107, -10, 10, -108, 69, -57, -108, 6, 32, -222, 95, -62, -80, 32, -153, 20, 149, -6, -74, -30, -92, 14, 80, -49, 70, 11, -102, -50, -134, 24, 11, -42, 3, -43, -20, 45, 30, 5, -5, 23, -10, -110, 19, 79, -37, 128, -53, -36, -86, -121, 87, 34, -53, -60, -12, -46, -23, -75, 76, 42, 12, 112, -35, 72, -2, -30, 74, 17, 27, 158, 19, -19, 73, -60, -59, -19, 86, 70, -121, -7, -6, 24, 55, -68, -4, -17, -70, 33, 52, 21, 64, 51, 28, 52, -135, 16, 108, -40, 15, 12, -57, 128, -26, 64, -42, -71, 32, -21, 96, 31, -82, -32, -1, -17, -59, -96, 21, 86, -69, 31, 70, 9, 44, 73, 83, 119, 42, -81, 32, -56, 78, 9, -12, 90, -111, -16, 78, 43, 22, 27, -171, -121, -31, -64, 63, -55, 13, 14, -73, 35, -4, -71, 4, -42, 17, -38, -46, 123, 29, 16, 50, 33, 60, 31, -19, 70, 7, -35, 28, 23, 21, 86, -68, -26, 28, -28, 85, -32, 82, 40, 36, 120, -34, 34, -1, -102, 15, 28, 7, 49, -31, -94, 88, -17, 93, -11]
4348a1Q8r0j6M8j2j0J24j04QLj6Kl7k1L6O0m3j5q2M5R7K1j06J50l6k7j39N9P9
4377E5l9oN5j58J08J5p5P3m5m0L6MP2l1mN8k05N5J00j04Q0L3n0J42j10m6O8p9
4405c8Q3j7j8P9j14J6J31j49J43m9r7R4K2p7l5l7R5j9k4m3R7m2O4o9J0O0o0r4
4433h8J65n8M0j05jJ18j86J33J48j30P7j53N5L4j74J22K5L8o7L4J3L9j21O2L0
4458E0k4O0p7l4%l2K34j43KJ21j70Q8n7O7M1r3kN9j60j2L9j9P9Kl3l0KJ2K6l1
4488c5J44j20KJ19j72J39L7%M4j28l8P0o3P1r5o8J23k0q5J03oN8m0l4j25J53q9
4515e5O1P5j00qm4O3M5o0N2K8J5j11n5j0P3K6J2j9n6K06k30J56j17L5RR5j17r
4543d0j6J40l8o0J45k78J38r7l9J68kQJ20j13q8M3q6J80K5k04J05L2p6N3J12j81
$$ y = [-11, 77, -13, -29, 19, 7, -3, 121, 17, 25, 28, 12, 14, -23, -44, -8, 52, 9, -6, -88, -43, 54, 75, -31, 119, 83, 56, -83, -24, 55, 16, 10, 65, -93, 15, 30, -45, 28, -17, -57, -21, -17, 55, 24, 20, 78, -127, -72, 28, -76, 4, 37, -13, 129, 19, -27, 41, -38, 45, 28, 10, 89, -25, -9, 122, -27, 116, 67, -30, 64, 86, 9, -26, -63, 32, 13, -11, -54, 43, 1, 65, -4, 6, 66, 6, -88, 77, 19, 59, -46, -47, 71, -115, 18, 166, 36, 113, -40, 15, 49, -125, -3, 22, 60, -7, 27, 40, 79, -42, 20, 50, 26, 86, 9, -25, -25, -57, 177, 34, 36, 157, -13, 75, 18, 85, 126, 33, 31, 90, -70, -82, -43, -62, 17, 19, -14, -44, -42, -30, -4, -35, 109, -11, -9, 110, -62, 77, 114, 114, 158, 30, -8, 62, -1, 70, -25, -93, 30, 10, -75, 28, 22, 80, 40, 6, -119, 34, -55, 6, 81, -19, -27, -71, -8, 37, -23, 29, 57, 72, -39, -94, -104, -31, -5, 7, -12, -68, 138, -92, 64, -53, -18, -9, 86, -31, -40, -56, 84, 46, -14, 131, -147, -9, -106, -145, 23, 21, 29, 149, 36, -52, -9, -95, 85, 110, -94, 11, 43, -33, 20, 132, -49]
4569d9J7L1M6q6Q1j40K0J69j43l7N9l6Q5Jk3m1R7j10J45q3k7Q6q7m2M2k9j0R3
4597B9r0J73o9k0M3o8J5o3N2P2p7L2l1N4Jo2j0NJ9r6K54q3l5o5L8R2j30R4m4l7
4627gL4L8k05J24j3K7K2j11J39l0j6j5j24J58n9j3M8N7k6M9m0q5R7m5Qk7k2J74
4655A37q4n8Q6j59L4J9k8J22j25O9J5kJ3q4l9J69n2j38K08j76O8r2MK06j05M0
4681D8M4r2P6p5m7M3NR4m8p2L7m3k6J02Jn0Q8K1j30%l7N2J6N3n0p2L1KnoN0l0
4713b0n5O1J12p5p3J7O5k5J71k33J38o9p1K0Q8r9J97k1k04M0l9J09j00RJ46j38
4739d9K3J26j25M3j8LJ07o1l1J5l6O0o1r2O6MR6m2r1R8l1k0m1M6p7J95k48J81
4767D0j9J0L2m8M6m0M1o3nP7j3j27L6J54j38R9q2L3Op1k9J68m2r1J21j46J33p6
$$ y = [-49, -32, -1, 45, -41, 40, -100, -80, 89, -54, -91, -32, -68, 17, 18, -5, -46, 51, -59, 86, 3, -24, 62, -25, -67, -25, -54, -64, 29, -61, 112, 43, 23, 66, -2, 13, -50, 2, 74, -3, 29, -2, 52, 53, -9, -19, -14, 5, -91, 163, 80, 45, -20, 18, 110, -20, 74, 30, -7, 27, 65, -140, -16, -29, -2, 20, -91, 48, 18, 2, -13, -137, 21, -38, -51, -3, 54, 28, 77, 37, -48, 49, 4, 12, -15, -37, 137, 53, -5, 81, -78, -44, -25, -53, 69, -56, 13, 28, 26, 39, -45, -84, 85, 33, -105, 103, -73, -5, -97, -93, 113, 8, 48, 92, 0, 76, 1, -46, -3, 2, 96, 48, -24, 13, -30, -56, 46, 47, -3, 85, 106, -24, -24, -61, -9, 7, 60, 10, -62, -31, -29, -34, -40, 10, -20, -75, -14, 98, 23, -50, -33, 32, 7, 178, -55, 83, 14, -57, -37, 51, -48, 149, 128, -76, -36, -75, 34, -66, -57, 89, -49, -26, 100, -25, 18, 0, 3, 110, 49, 18, 33, -3, 57, -4, -96, -30, -26, 70, 28, -63, 35, 4, -16, -57, -11, -88, 107, -141, 40, 21, 31, 63, 15, 61, 21, 62, -1, -6, 71, 58, -69, -33, 121, -17, 82, 0, 33, 39, -32, -61, 107, 65, -26, 95, -51, 82, 6]
4795FM7M9l0J6o5k5P3j78J04R2q2J4Po0k6M4j7J92j80KJ12j48J22j83J07P0j63
4822a00J05q5J26l7j95J04J05j67J27N6j08J10K9j54J05j6L4j0r4J11K7r8J09
4845H4j41J17r9m9J18j47J63Ll2j14Q7PJ09j13j00R7J8j15K68j92J61j6j54J51
4869A11n4j1m0M1j10J08j08J01Ko4M4n9O3m6L6R3j84R9m5j3PP5q8J58j79L5J9
4896im2M1jQ7P2j91k8P8j58O6L0oM9n1P5N6r3m0J41j28l7Q3m8P4lM2Kj56J20o1
4926c6q6J45q7M3J00j49J23j68Q1R0m4J78j33j59J70L6j17K08k23R8j88L3J72
4949H7o8j7j01k3K25j12q8Q4p4R2p2KJ17p8p0J11M8q1J98k07r8J06N9j6l2L7O3
4976I2k04M3J82j53J02j5r1J16o7M9j06r6K46q9Pl2k4N8k1r7J57l6O0j34J50j11
$$ y = [6, 53, 102, 72, 88, 23, -2, 71, -107, -3, 89, 7, 21, 28, -32, -58, -14, -31, 161, -19, -17, 95, -53, 69, -114, -7, 63, -100, 5, -80, 46, 9, -186, -82, 23, -144, -17, 39, -69, 41, 70, -84, 21, 5, 39, 29, -65, 46, 73, -25, 84, -57, 60, -39, -88, 30, -117, 46, 49, 17, -97, -10, -3, 106, -7, -107, -10, 8, -107, 161, -31, 130, 114, -40, 111, 57, 46, 6, 47, -63, 45, -63, 38, 40, -24, 20, -39, 24, -22, 14, 107, -77, 22, -23, -36, -29, 46, -42, 116, -63, -28, -9, -51, -10, -11, 76, 148, -43, -71, 7, -151, -85, -55, -61, -12, -63, 12, 68, -25, -65, 76, -52, -89, -6, -54, 20, 17, 59, 61, -95, 25, -36, -122, 23, -64, -21, 79, -70, 53, -115, -34, 56, 12, 190, 57, -102, 68, 104, -13, 195, -28, 70, -118, -85, 87, 19, 2, -99, -122, 103, -9, -97, -13, -87, 5, -67, -65, 52, -26, -96, 15, 63, -18, 180, -27, -125, -19, 40, 24, -8, 29, 92, -112, -69, 113, -40, 62, 47, -44, 72, 5, 54, -52, -148, 98, 9, 16, -16, -40, 18, -3, -100, 57, 21, 81, -53, 97, -14]
5002a4P7r0R5j14R2q3L3K2M1p8M5l6m3J4P8j03lP6K6J5n5N7j80R2R0M9K7j88n9
5031a17J53o8K2l8R0J7Nj09Q4k0j06M8RJ39j80l8K03j75rK61j92J1J22j40J03
5056G5j05j4o0MJ39pj3Q9j63P1O6j13PJ38j36J55j97m0K07o6k0%P7n3j00m8J40
5083C3k07J21O7lLn6m9J80r4j6J07j07L5j03M0j3k0M7P3j49O3N1l7n4P2P4j10
5110e2o3J64r8p5J83j09n8K12j87J12p6J30m0j92J34Qj10J97k01qJ69j24O9lN9
5135D1%Qr0K7j8R6Qp6K2j50J37Pr6J08m7j28J04J4J26j20l5M3J4j06Q4J35j66
5162e8R9j00R4pr6M1mp5J7K5L6p6NR3N6j19Q1o3J10L6l06J65J08j91K46q9j57
5189a29R9K4J5q8k7J37jR9Jk40J22j0M4J9r1q1K19j76j5N6NR6m6j18J27p7J4o6
$$ y = [-14, 63, -27, 68, -46, 46, -37, -4, 18, 59, -19, 26, -10, -53, -39, 39, -64, -67, 9, 35, 50, -5, 52, -128, -36, 54, 103, 130, -58, -117, 36, -32, -10, -48, 42, 59, 64, -45, 39, 19, -87, -39, -30, 109, -71, -109, 94, -81, -90, 171, -21, -10, 112, -28, 75, -30, -44, -104, -100, 39, 32, 19, 108, -55, 16, 82, -31, -24, 114, -22, 133, -64, -104, 103, 37, 17, 17, 94, 41, -59, -107, 33, -174, -53, 14, 11, 14, -42, -91, 89, -5, -21, 86, -21, 14, -89, -49, -62, -82, -35, 38, -111, -48, 3, -34, -88, -16, 58, -52, -115, 49, -49, -124, 59, -50, -108, 104, -83, 29, -47, 83, 43, -149, -15, -7, -117, 80, -121, -129, 40, -84, -15, -18, 41, 41, 49, -41, -14, -32, 64, 72, -4, 18, -132, 5, 12, -84, 24, -23, -151, -47, -33, 93, -27, -62, -19, -5, -111, -27, 108, -58, 41, -59, 35, 28, -68, -27, -31, -106, -89, -64, -28, -104, -99, -6, 50, -69, 12, -51, 59, 95, -211, -46, 62, -129, 117, 28, -129, -30, -6, 9, -79, -106, 31, 30, 129, 130, -110, 12, 2, 46, 65, -26, -107, 112, -64, -79, -23, -18, 78, 32, -86, 41, -36, -22, -88]
5217h8M3J48j27O7R4j73P7l3p8K7P8PN2j92K25p3r7J67j24q3J67p0m4J39k44J39
5243Dj15J42l1p4J37r9O1N9J4j24N7l4P8k5j98K52j77Q9O9q3M0j4j36J41m7L4
5269B0k4j02J05l2J5kPp5J69j25N8j5L0M7p8n2J62q4O4l2j50K3P2K8M6j17L9L5
5297C2K9q4J26k4mm6k0j7k1O9j3l8J18j77n4K05j40J07pk03K14k32J88lm6M5p2
5324f8J47Kp4p6J53j58k2J47K0n8Q7k05K3J06k0Nk3P4l4k6J31k44R1K1j15J86
5350G0Lj41R7k06J96O6j11R3m0j99K34ml3J7j83J63j20J56r2l2M7pL5m3J29n9
5376C6nn7JR8j67J40o6l9Q9p1J64r6j3m8J8RJ05q6k3Q4p8J01j08P4r3Q3n7K6L
5405B4L4J2k5q5m8J89r4j31J36K2j14K14j66J03j24L3jn4o6K71Lj94L7k4J19p
$$ y = [-88, -45, 103, -24, 43, 137, -36, 41, 8, -70, -43, 35, 42, 94, -98, 127, 54, -43, 124, 0, -83, 84, 14, -30, 109, -135, 4, -111, 31, 0, -74, 63, -36, 25, 84, 98, -26, 31, -3, 75, 50, -148, 104, -73, 16, 85, 2, 42, 28, -108, 33, -14, 20, -4, -106, -1, -33, -18, -20, -13, -88, 81, -44, 14, -1, 29, 76, -2, -54, 108, 24, 88, 56, -94, -71, 1, 29, 75, -42, -3, 32, 61, -23, 103, 79, 75, 29, 9, -8, -29, 40, 27, -11, 107, -70, -124, 81, -59, 48, 41, -162, 52, -180, 8, 5, -41, 4, -68, 79, 81, 7, -69, 84, -74, -96, 51, 71, 13, 100, -105, -82, 24, 4, 9, -14, 60, 26, 0, 131, -113, -22, -1, -116, 70, 73, -68, 29, -177, 19, 85, -26, 67, 27, -172, 62, 58, 25, 42, -141, 22, -98, 58, -34, -66, -19, -26, 9, -34, 95, 36, 31, -26, -25, 73, -94, 46, -20, -59, 30, -41, 123, 27, 14, -34, -16, -7, 98, 12, -11, 73, -5, 96, -12, 62, -31, 52, -5, 21, 24, 58, 70, 45, -40, -88, 101, 7, -124, 12, 34, -80, 134, -32, 71, -53, -20, -21, -75, -141, 130, 133, -61, -24, -48, 71, 64]
5431F4q5j2j7L7L6q2J59Pk13J78j28M2J69j97K1K4o9J52j42J6P6j12J20p7m6J78
5457I9j05l3Q7j46nJ20r2Q1p6j3O9J8q7J2R9n5k3N5J02r2J5K1j17J44p5JJ34j31
5485GL0k0l8O9n5J4l9j8O2M2q9J00Q9j66J38j26K0P6o4NK0j74J59o0l4J54j69
5512f7P1j75J58j39J31JrP1K7l8k10K61j65K5K28j22j55K54k04J18K5j68J31j21
5536g2P3l3oO8r2J13Mk28J89nN%nr7J76l3j9M9j61J69j91KM3j4Q6m9m1Q5p1P1
5566A6r1l7K39q7q9lR6n3P6k11J51N7k03J54J05j39M2m3L9O9r2pPR1k1om0n9J1
5595b8J67j55m0k6l2P4R5j38j6Q3J2nj2j0N8m5O8k4q7J03j00J05m4o9N4p7J37
5622D8k6p9Q5p0j1J29ko6l1KQ1o0j06J22kj82K42j63K6N0L4o6J14j39J82k36J54
$$ y = [64, -21, -33, -50, -13, 23, -59, 100, 107, -106, 72, -56, -14, 155, -42, -21, 3, -66, 86, -56, -40, 36, -76, 44, -33, -79, 99, -6, -39, 48, -98, -103, 17, -75, 6, -70, -83, -14, 4, -83, -71, 28, -27, -50, 5, 107, 15, 30, 51, -66, 78, 3, 4, 138, 7, 37, 17, -21, 48, -7, 7, -32, -50, 12, 54, -35, 65, 154, -12, 126, 0, 20, 96, 32, 37, 57, -117, 42, -18, -52, 102, -67, 4, -171, -13, -152, -21, -20, -29, 42, 69, 31, -179, 82, -83, -58, 170, 48, -107, 147, -57, 61, 86, -82, 49, -72, 1, -32, -38, 30, -62, 51, 55, -173, 16, 11, 16, 16, 11, -86, 90, 57, 38, 87, -74, 95, -96, -94, -51, -65, 21, -28, -69, 16, -55, 16, -75, -112, 127, 40, -49, -52, 44, -9, 67, -144, 7, 64, -139, 15, 120, -19, 23, -20, 19, 88, -4, -11, -4, 87, 66, 60, 20, -39, -28, 139, -16, -56, -82, -114, -40, 55, -83, -99, -16, -4, -9, -21, -31, 27, -18, 50, 26, -61, 42, -58, 47, 3, -66, -12, -89, 48, 22, -57, 28, -42, -53, 76, 74, 8, -23, -21, 60, 0, -106, 16, 14, -168, 74, -89, -63, -13, 21, -45, 69, -70, 112, -124, 30]
5649C0K0q2M4p8L5L0o1%J88o7k4q0P7J0MkM6k17J65m4l6M7oj31J47o9R2L6j02
5678b8J20j64J61p9J9jl0K1P3mo9jj29J85m1q8K0L8m5Q2o5J56j02p8N7nq2J47
5706F8j55l8J67j20J04J6j3L9j01P0p3K9PO2l4Rj13L0Q9J2lo9J2J01j61R0O2q5
5734BK12k27k0M2L6j35K47j99M5n4L3J3l0n9O6j9J27j91k4J75o3N1l2j8L6l6o3
5761h5J33n5J9J00r6L0j9n7O4m7l4J82k09J61j24p4L01j80LJ43j92j4N6j18K01
5786H9j27J4M4p5k4N5J7j4l5K4M2j22J22M8r0P3p0n7P9r9J88q0l8J10K4j53P1
5813A6q8J90p4J7l1m9L7l2M0k7L0n2n6J23p1P3j41J67J8r0r4J14L6K0p9j2J20
5840A05k20J60q7m3P5n9O9P4j30J14j9p6J16l3j26K10k47J42p3M2J12j45L3P0
$$ y = [30, 50, -32, 12, -66, -31, -1, -62, -62, 126, 59, 35, -45, 32, 42, 46, 44, 90, -127, 38, -6, -42, 5, -1, -132, 15, -54, 38, 74, -28, 92, -72, 89, 10, 29, 28, -2, 19, 92, 88, 19, 18, -111, 74, 33, -55, -35, 3, -42, 40, -25, 131, 29, -49, 8, 3, -79, 68, -87, -125, 42, -78, 26, 42, 29, 68, -33, 37, -36, -7, 0, 62, 28, 37, -76, -46, 43, 55, 52, -17, -5, 96, -65, 25, 87, 2, 214, -13, -33, 9, 45, -90, 157, -42, 3, -51, -18, -5, -35, -94, -28, -47, 80, -111, -135, 40, -23, 28, -4, -22, 14, -22, -85, 48, -7, 12, 112, 16, 46, 27, -30, 34, -13, -47, 135, -74, 87, -37, -111, 190, 10, 13, 156, -36, -50, 6, -112, 89, -38, -24, 20, -55, -79, -24, -7, -21, -56, -32, 10, -112, 10, 58, -32, 41, -29, -86, -7, -106, 82, 2, -36, 74, 98, -55, 16, -72, 118, 44, 61, 30, -19, 18, -14, 26, -1, 29, -23, -79, 44, -27, 46, -95, 72, 90, 0, -94, 20, 56, 76, -3, -15, 105, -115, 45, -42, -85, -10, -69, 0, 74, -56, 58, 39, -37, 79, 46, -80, 130, -117, 25, -48, -6, 106, -39, -6, 64]
5864F4j22J36j49K3R1j54Q6N2K0p7Q0K9pm8l7O5j79K17o0p6M9j71J86m8K4Nm1
5891d2P2Nj85Q0L3j40J90j52j8K05j5q8O7km0M3q5J53j17q1R0M7n4j3J2Q1l1j67
5919a52K56k18J21l2M9J37j80L3M4j73J28p5J7J46k15PQ5q6Q3Lj42K19j50J9J12
5944C6k4M4P3k67K76j41q6J98j38L4M8n1N5q2R1K2j48QJ70j70M7p8O1J05j33p8
5970a28K42j60J2k6P6K7j74K24r6OM3p5o6J71k01R1N7q3J53j8j59K26k08M6m4
5995f4j24J81l0l6K01k08O6J25j01l3o9%J54n7J0N4j35N8NqO4r4P9K8j00J06p9
6022gn0O5j20R5P8j14J07K7n1M3j43J93o5j65J74j17n8J46J6j21J23j57R2j3r
6047c1J26j69J21Q3j88K0Or6J49r3O4J1o5J09J3j51J52mj25K12k25j8J74j00J22
$$ y = [64, -58, 78, -71, -48, 43, -111, -25, 27, 47, -30, 50, 79, 72, 24, -13, 52, -127, 90, 30, -46, 3, -168, 18, -30, -6, -1, -42, 30, 35, -150, -70, -37, -177, 13, -139, -157, 48, 33, -55, 12, 10, -30, 13, -72, 81, -36, -117, -27, 20, -34, -47, -35, 46, 15, -152, 104, -114, 7, -25, 24, 161, -19, 14, 58, -115, 13, -62, -45, 101, -114, -107, -22, -108, -25, -22, -164, 55, -95, -76, 36, 12, 56, 129, -138, 138, -3, -89, 109, -29, 5, 53, 2, 57, -25, 66, 88, -60, -52, 118, -52, -5, -83, -22, 83, -50, -128, 114, -46, -34, -60, 16, 43, -131, 93, -3, 3, 46, -29, -95, 76, -125, -34, 23, -60, 93, 75, -84, 142, -66, -20, -64, -188, -7, -37, -73, 128, -80, -14, 111, 10, -23, -92, -92, 62, 5, 15, 69, -66, -8, -3, -11, 53, -41, 38, 66, -34, 72, -7, -57, 8, -112, -17, 61, -53, 54, 81, 30, 73, -70, 123, 58, -107, 67, -50, -108, 38, 54, -67, 56, -101, -9, -22, -31, 95, -74, 47, 130, -58, -38, -32, -128, 21, -72, -8, 3, -62, 47, 60, -91, 61, 57, -68, 144, -81, -99, 75, -25, 97]
6072I7o4m0J03j86P6M1l1Q1j82Q8K26j84j09J93j91J08j34L8J42j98J75Lp7J33
6096A08r6K3M2j37O1P3k15K27j65jJ41r2R1j05j01O8J21k0J23k10M7L4l0J14j14
6121a3m0J70j04j21J87j13J4o8j4R0l9O0No2M9j7j6O7m3L1L2j1l0n7k1J42j51
6148g3M9J18j09k1N6j48J55o7L9K7m6L6J05j22M9j16O6K9m0j21J38k3RK2m1M5
6174A6n1mQ2o8J5k7oL9p7Q2J08j14j6k6O1N6q6J62j01PJ47j65L2Oj23Q3j03N7
6202a4J23j18r0J69j00J3N3j20K09j76Q9n1J10j19R3j26K7J36k42K05j00P2j54
6225a11L0J11P5j27R8m1j0k5p6R8q4p2K14j35N3P3k42L13p3j39J17j80P2K00k50
6250a11R9J07j00O6j15L6q2K5L3Q6j90J48j0J7J4j67K16j94l9J54o4J6J58k50
$$ y = [97, 33, -7, 96, -90, -14, 27, -4, 77, -105, -17, 209, 25, -84, 109, -82, 26, -108, -70, 72, -126, 49, 52, -25, 108, 12, 35, 77, -60, 1, 74, -141, 86, -79, -80, 61, -31, 60, -45, -146, -78, 43, 23, 146, -64, -17, 17, -13, 101, -13, -53, 117, 13, -108, 79, -34, -20, -88, -102, -12, -51, 9, 14, -48, 1, -16, -32, 35, -8, 23, 55, 44, 14, -43, -64, 78, -73, -24, 94, -15, -36, 20, -128, 27, -40, -1, 26, -20, 16, 121, -1, 48, -68, -2, 27, -13, -134, 4, -19, -10, 12, -29, 16, -35, -39, 43, -25, -10, -37, -43, -4, -81, 1, 109, -5, -21, -47, 14, 70, -16, 146, 45, 52, 199, 34, 66, 72, -51, 32, -71, -14, 109, -9, -99, 70, -30, -17, 36, -84, 125, -51, 38, -13, 97, -22, 71, -55, -28, 108, -134, 71, -29, 43, -111, -81, 30, 105, -22, 76, 35, 25, 0, -76, 22, -62, -134, 80, -55, -2, 71, -171, 142, 69, -70, 47, -133, -61, 139, -111, -12, 95, -5, 61, -54, -18, -100, -75, -42, 44, -146, 2, -8, 9, 23, -144, 72, -122, -161, -7, -71, -55, 103, -147]
6274a47M3J24r2J40p8L4J25k00J43j00nn6Q3k3K16l32P8M2p1J06Mj0L3j74J30
6299A3K3j16J33j28J29m3n6K3L8j42J82r5oJ19j16MO6n2K9q1J13j3j34J44P8j98
6325h6Q7j5j1K2n0J84q5k14J90m7m8K01k13Q1p7K6J02q3j2R9n1k3J56k78K12j13
6351d6l1J41j56o1J45q7K35j95N1R4j12O7o6j42K04pq6J30j65p3J69l3O3oj25
6376i2J73j75m1K18q9O4k4o8N5m8j1M6N1n5J4m1N8j7j9k4J5KP2j19Q9j60J48K8
6404E0j27P3P2r3O0j52J00L7q3rM4RJ42j71M7P5n2N4J2j51P6p6J51q4k7j9kk6
6432g0J34o9N5J44k05nJ00k15J43N5r8N1m1J40j32o7R5K0q4J57r4%m8o4J39L1
6458G2k19J64q8Q7J1k4ok0rJ73k35O5J83l00J01J3R4m4p6l7R7j35J48l4l5Q1j32
$$ y = [-147, -104, 20, -72, 68, -10, 24, 149, -51, 92, -8, -13, -69, 14, -9, 207, -125, -47, -5, -76, 30, 34, 24, 57, -117, 13, 36, -80, 53, -75, 54, 11, -45, -22, 16, -126, 56, -39, -45, 74, -42, -38, 28, -24, 5, -76, 37, 24, -110, 34, 112, -86, 1, -14, -25, -3, -53, 131, 46, -168, 22, -25, -73, 128, -85, -4, -81, -55, 47, -36, -48, 51, 0, -23, 133, -145, 67, -46, -77, 64, -92, -153, -8, -95, 140, -55, -4, 90, -22, 45, -21, -163, 41, 34, -52, 78, -87, -160, 9, -24, 39, 33, -92, 81, -94, -135, 83, -6, 58, 34, -34, 21, -27, -38, 8, 59, 4, 18, -23, 35, 18, -1, -25, -10, -8, 64, -55, 34, -126, 22, 50, -77, -4, 68, -25, 35, -117, -17, 20, -63, -72, -28, -19, 123, -48, -1, 74, 22, 76, 88, -63, 13, -63, 88, 4, -23, -42, -44, -70, 64, -5, 50, 194, -11, -16, 84, -131, 12, 67, -31, 20, -21, 119, -13, -80, 15, 35, -49, 108, 14, 14, -34, -98, 41, 72, -147, 17, -71, 16, 27, 3, -3, -23, -32, 141, -94, -29, 154, -146, -45, -32, 62, 18, -58, -95, 2, -133, 15, -19, -54, 27, -105]
6485a05Q6lq2J63q9J4J15j98NJ82l3r8mJ5O3l5j33J56k01J84R3k81O1K14j25o
6511d2r3J19L0j03O5J03j37Q8j03J46mo9K4K5p1J6n8p8J18m4Q1p0LJ99k33J64
6537G6q8q3J35nk0n6M5J08l6q4pl5k7R1l4K4j6l3L7j07J36rn8J14nr6O1Lj07J17
6567D1j02J33N5j12Q9n4q6P5Jk7K5l6j1N0p9J67j14L3O9j96J37p7MQ7j75J14J5
6594B6q4J27q3q7P4n8M1j6MJ57q6j09J01o9K9J08j46N3Q9j29roO0N0r8L3oo4K10
6623A12j23l1J2j9J05r3m7J87j09m4J58j35J32j15r0Q4k0O7l3j1%N5r7Q1p1P2
6649B7k7N1OO1n7M6q6m7J35j79J74m6j14K31j99k7J56j40J38l3r7J5l7OP5j30
6675i8J12j6RL9mj20J14r0J4J55j19Q2j46M8N2o7N6N6j42Q7p7o2J66j49LJ25j09
$$ y = [-105, -19, -22, -104, 59, -30, -16, 99, -99, -94, 88, 55, -43, -47, -32, 31, -4, -137, 19, -182, 2, 95, -186, -125, 89, -36, -42, -135, -16, 14, -89, -24, 79, -58, 30, -73, 73, 69, 0, 24, 49, -22, -6, -64, -142, -24, -68, 13, -57, -54, 145, -88, 76, -12, -95, 40, 35, 15, -41, 4, 112, 76, -8, -15, -50, -77, 14, -20, 4, -12, -45, -8, -115, 21, 12, -46, 68, 63, -33, 28, 31, -76, 41, -61, 72, 127, 15, 104, 50, -36, 39, 40, 13, 38, 2, -9, 41, -38, 129, 15, 48, 117, -79, 58, -19, -15, 72, -103, 11, 26, -58, 69, -14, -101, -27, -85, -44, -60, -56, 101, 15, -94, 7, -62, -33, 75, -71, -18, 71, -58, -67, -73, -13, 37, -61, -28, -34, -98, 112, -11, -42, -30, -49, 56, -37, -84, 103, -6, -50, 108, -27, 105, -10, -100, -16, -36, 31, -2, -13, -13, 42, -55, 26, -45, 27, 0, 51, 57, 118, 61, 107, 21, -26, 109, -70, 104, 58, -56, 175, -24, -51, 105, -35, 103, 70, -27, -12, -49, -43, 32, -98, 14, -2, 7, 46, 42, -78, 36, -54, -40, 115, -4, 78, -68, -20, 32, -35, 21, 77, -65, 22, -55, -117, 49, -100, -97, 28, -81]
6702h1Q8q3l0J26m3K6l3n0P3Nj41K37r3l6Q6j73J96q6K2R3j60K9Q5j00J41n1j15
6729f8Q6OJ33q3m1l2ql1J27j67L3K6N3N1l7lL7m1qJ13k62K41j12q6K01l8p4K8
6757D4j46J66j04k7O5j02J57o0l8J55j03k4M0n3p5P2Lm3J51j13J33j79L7J03j45
6782h6L2k2l0K20j66mJ10j41L9M6kJ5n0K5R4j23N3m2l4J41j69p7K18kMm8m3R6
6810E4k9j4mm1pP1r5K07j13j01J25r6M5K8m3l5J3j5k0N5J03k8j71J16j42J07J21
6837I1k6n6O9j17P9j3rJ6k6Q3o9p3K7j4M5o0P6m0P3r9J3Q5o5J05j80J12P3j75
6865g5J52q9k0J06j65J8R2l7m2lo0J72q3n8J15j27J90p8j90L22k50L6J10j07P1
6890@N3k20J81K5q4J40j14J01lj89K41j88J31k1j21K75k00j22J59l7J7M7r1N9
$$ y = [-81, 7, -76, -106, 20, -23, 3, -30, -80, -7, -2, -143, 94, 1, -35, 51, -122, 74, -12, 10, 103, -57, -28, 57, -43, 98, 47, -68, 18, 24, 157, 74, 33, 1, -7, -38, 89, -78, -45, -19, 34, 85, 48, 45, 82, 41, 33, 146, -116, 125, 13, -73, 128, 90, 16, 44, -102, 64, -40, -67, -2, -104, 53, -7, -45, 110, 7, -17, 23, -30, -105, -33, -30, -73, 78, -35, 98, -81, -44, 59, -86, -54, -76, -106, 114, -52, -56, 54, -87, -48, -2, -4, 11, -39, -14, 80, -43, 10, -32, -66, 75, -94, -171, 47, 45, 49, 1, -42, 54, 25, 11, 7, -34, -41, 30, -65, 142, 29, -72, 53, -43, 2, 30, -13, -48, -35, -50, -70, -15, 88, 60, -111, 5, -137, -30, 91, 65, 9, 78, -39, 40, 27, 18, 34, 8, 91, 22, -51, -24, -38, 7, -53, 23, -17, 56, -43, -30, 55, -10, 95, -85, 27, 100, -75, 77, -12, -32, 74, -91, -73, 19, -18, -60, -63, -123, 49, -34, -92, 23, -104, 86, 8, -182, 140, -110, -74, 36, -71, 0, 53, -167, 14, 39, -45, 95, -19, 82, 79, -110, 131, -57, 74, 53, -68, 207, 7, -115, 44, 7, 24, 71, -20, 39]
6914C9p8n0P5qJ8M5j56J00o9M1J39n5j35J66j75J04J13j48M6Lj41J95j42J56j1
6939G2j36J29q3j03J63r2J53o1q4J41l1j19PK1K9k9K0M8j39L8J52j23n8J27m4
6964bJ2jj53J91j44N5J31j13J4j5Q4J33k70J06k4Pl3P6p8N0o5Q5k1j15J62m4j26
6991i8J39M5p5l5K6k4rJ8k0R0j71N8k9J50q7J8J60p6j23M2J4j25J63j15J65j14
7017a3Oor0J96n1j69J27m7J9J66j68J4N9j48K18j63l9Q0n7Q4k9r1Q0O4qM0j12
7044c8J49O5k13ol8P1P1p7k5J04r8qO0l3%l0O8k5n2J81k05k9J52j25K4M2m9N3
7072a1K7K8J08j77M9k5q3J67r4r2K17j16r1O8N2r8Q7r6R3J7m9J1q2K3K9R5q1r8
7100a22J49O0j64J29Qj52K38j28n6K09k09O6k4p3K31p2p2J5j12K20j13j36J54
$$ y = [39, -39, -89, -14, -22, -4, 41, -115, -15, -84, -43, 96, 41, -94, 72, -103, 1, 114, -34, 12, 15, -126, 69, -73, 83, 72, -64, 65, -18, -121, 42, -50, 103, 42, -42, 99, 68, -51, -44, -23, 6, -23, -3, 45, -94, -56, 96, -27, -85, 42, -2, 10, 9, -144, 47, -97, -42, 89, -24, -10, -25, 59, 192, -78, 28, 4, 11, -22, 54, -24, 26, -39, 46, 25, -90, 72, 28, -98, 41, 86, 11, -24, 2, -22, -31, -13, -33, 57, -114, -56, -85, 65, -22, -4, 156, 80, -43, -1, 13, -112, 51, -64, 101, -13, -7, -13, -103, 93, 42, -127, 0, -47, -28, 138, -30, -16, 43, -105, 113, -50, -89, -9, -66, 18, -11, -102, -22, 42, 34, 74, -38, 111, 176, -37, -43, -81, -10, 61, -16, -41, 63, -35, -43, 17, -16, -16, -46, 22, -3, -55, 126, -79, -108, 44, -81, -57, -15, -64, -11, 16, 44, 152, -25, 24, -1, -84, 83, -11, -103, 114, -2, -93, -25, 27, -71, 16, -80, 13, 30, -19, -8, -90, -67, -38, 57, -24, -122, 27, 87, -77, 52, 60, -92, 146, 18, -38, 171, -38, 28, 4, -69, 162, 90, 18, 33, -79, 141, 28, -108, 46]
7123D6q7N7N5k8%J7l0J3M2p5Qo8M1O3j33J72r2j13J34j18J08j08O1J07L4j07R8
7150I7j69J16n8kP3j57pQ1j4NK5n2R4k2J6m6Kl9M4q6J68n8j7J0j21J39j6jM9p7
7180b3j6J34j60N6m1J0J22j84J02J42r3N1j23o6J33M6j25M7j71J69O0n5N1o0j
7205EL2n8l5J46k12J54J05l07J41L9q2Q0O5r0m3J03R4k36J68l4j59n1J90M5n4
7230FP6k3M2m8ko2n7J64j32Q2Q4k33J46n1J0l5P8p8k4J00l7J09k03K40j35lJ49
7257A63k91K05j5j03J29r5J3l7j5J07k8k02J86O4j94J98k6j29J06p7L7j02J02
7280dK3m0N2R6j32JP0k7O4j86Q8%m4Q1k2j5Qj39N0J01o4j0J50p0L5OpKq1O1Jm
7312D4l8j09J54j3j05J14o9K8J40m3l2P0q7l3o7j12J69K3n4M2j35J70K9r9J6j26
$$ y = [46, -41, 16, 71, 43, 43, 60, 30, 43, 85, 10, 18, -50, -9, 54, -79, 93, 1, -112, 22, -96, 12, -96, -35, 72, 106, -1, 97, -72, 44, -14, -16, 57, -100, -107, -26, -40, -35, -10, -62, 32, 10, 26, -20, -18, -57, -13, -99, 69, 11, -6, 4, -117, 22, 6, 5, 54, -23, -39, 95, -65, -9, -50, -40, 82, -102, 0, 142, 49, 100, -23, -89, 44, 90, -35, 12, -159, 10, 70, 15, 66, 6, 5, 37, -21, -56, 90, -122, 32, 137, -170, -29, 10, -72, 8, 73, -17, -60, 43, 137, -99, 69, 35, -124, -175, 15, 60, 6, 82, 59, 101, 53, 51, -11, -68, 96, -36, 46, 130, -103, 43, -8, 2, -33, 45, -33, -57, 43, 6, 115, -88, 152, 17, 14, 163, -128, 77, 62, -41, 88, -7, 6, -31, -46, 61, 33, -169, 17, 81, -113, 85, 59, -70, 36, -41, -4, -106, -4, 19, -21, 31, 127, -5, -4, 66, 39, 103, -83, 5, 5, -39, 42, 20, 5, 13, -126, -76, 25, -39, -49, 101, 31, 66, 72, 65, 67, -14, 47, 48, 44, 6, -103, 51, 38, -67, 47, -22, 6, 146, 103, 71, 141, 54, 21, -46, -158, 11, 34, -20, 22, -113, 57, 86, -13, 3, -123]
7338a23rJ70n7Q9o3n2J15q8l3p0J14R7j6j77P2m7O7M2p0P0m1P2r5J08p4P7ko3
7366A3p4J44q2J3M1K4m4LJ00j21J11k71J92kr4O2l7j4R5j61J45P4k78K41j5Q3
7392A48j30j30J25L5p8K6Q8j21R3J07k03J45j05J6J3j35K08j11j1J69k22J45K6
7415I8j10J25p9p4O0k4Q4m1o0m1J7K3R4j07k7J24j39K4J7L5op2P3O3j57K06p6
7442C0oO7j55R6J4j02N2J15jq0m2O0n9O1K7j52J21N6j53j6J24j76K12l7q0J35
7468A11j7o3QQP9m3j76O3L9kLq8J6J28r8J27j63o0K93j39L7n2Oj28R6Q1J10k18
7496d2P0L6M5K0j58K3j5QL5k4k7P9mj32k4J44m5k2J30q6j0j19J68k2j37J22p6
7523f3J22l6n2P1l3l6P1M3J0j56N7L6M1j73J15q2K08j48j10J45o9J82k18J6Q7
$$ y = [-123, -132, 38, -19, 70, 7, -45, 70, -18, -51, -121, -7, 90, 74, -103, -31, -78, -11, 31, -39, 31, -10, 62, -33, 75, 1, 78, 76, 13, -61, 83, 1, 14, 55, 79, 35, 38, 138, 17, 128, -143, 49, 47, -47, 15, -22, -36, 59, -102, 43, 117, -161, 80, 65, 148, 18, -112, 13, 48, -30, -4, 84, -37, 56, 163, -40, 105, 0, 16, 29, -106, 102, -9, -20, 149, -73, 72, 98, -12, 113, 34, -40, 20, -4, 80, 39, -21, -62, -45, -22, 72, -35, -62, 62, -77, -53, -36, -1, -7, -79, -6, 57, -100, 106, 30, 24, 91, -64, 32, 46, -56, -4, 111, 110, 30, -12, 48, -11, 50, 77, -75, 46, 102, -51, -67, 57, -119, 93, 56, -24, 111, 94, 31, 39, 47, 126, 83, -93, -30, 9, 7, 10, -78, -62, 66, -32, 95, -68, -128, 165, 26, 63, 11, 17, -111, -15, 66, 176, -42, 28, 64, 109, 129, -29, -6, -21, -13, 22, -2, -29, 50, 46, -86, -110, 34, -11, -33, 97, 11, 1, -118, 50, 28, -109, 13, -63, 59, 23, -29, 42, 9, -27, 44, 87, 97, -59, -2, 34, 75, -98, 17, -65, 143, -5, -115, 30, -39, 143, -75, -59, 28]
7548B8j05J1J05L9n2l5M6q1O9r2P0n4J3J30l3j4J8m3N6q9o0lj15J96m3j3R2r8
7576e7L8O2r4J8NNK9k9R2l3j11P1k1n0R1q6O9P3o7L2p0lMj6Q0J0n7N5M9k34J81
7607C6K4j74K19n6j21J52j11qq5R5Q8j38J23n2o8M4O2qk1r4Q5q2M2Q6j0l1J04
7634A01j60J65j26k3j7n0Q8R6o8J8m6N8p5L6l3N1m1k9J18o6J26j49N5Q1j06n7
7660e3J74j43P8n0NL0O0q9J8o0M6L4j80J43o3J04J2k36J03J7j8N8O1J0J3j60O
7687h0M0OJ01j65N2K09k27J6K09j08j6J58j81K2p8J04q2n1Q1l4L3Q9r1Op2J67
7713A08l5j04m0L9l3J24L1j39K3J02k48K62o7Or7M3J4Q5p1J68k65R5N0l7J1j17
7739i2J91m9q5J53q6o9J85j40n9J53k8m0J7K6nl4m5O0o8M4R4r2Q2r4j20O5k5P9
$$ y = [28, -77, -66, 39, 78, 26, -9, 37, -44, 25, -67, 3, -51, -38, 92, 59, 45, 63, 20, 76, -13, -73, -76, -191, 5, -38, -51, 41, -57, -19, 43, -51, -33, -28, -23, 6, -23, 69, 36, -75, -4, -25, -75, 16, -70, -1, 72, 5, 37, -33, -36, -32, -48, 32, 42, -15, 40, 89, -145, 36, 60, -114, 105, 49, -72, 80, -31, -39, -124, -29, 59, -79, 44, -8, -76, -32, 30, 22, 1, -93, -8, -90, -48, 38, 28, -3, 101, -59, 106, -20, -43, -60, -110, -22, 74, 6, 24, -22, 36, -39, -3, -36, 15, -26, -55, 63, -3, 123, -26, 29, 110, 4, -53, 121, -22, 56, 6, 11, 41, 101, 12, 30, -30, 16, 50, -130, 13, -50, 54, 66, -170, -67, -50, -68, -10, 51, 61, 74, -86, -80, -40, -34, 67, -98, -46, 163, -64, -48, 161, 53, 37, 195, 14, 36, -42, 62, -20, -71, 10, -24, 9, 98, 7, 13, -59, 108, 73, -31, -71, -32, -65, 59, 90, -49, -26, 76, -172, 90, 23, 29, -68, -25, -11, 74, 3, 171, -94, 1, 51, 14, 25, -92, 99, 50, -35, 118, 32, -37, 148, 8, -51, 102, 74, 34, 51, 77, 72, 38, -7, 53, -15, 29, 123, 31, 113, 19, -101, -36, -61, 18]
7767A8M2j17P1m3r3J39n6O2lo1J08q1n2M1M6m2J11j12J56j44k7Q2p3l5J72j61
7793e2O9K5n6J08r1m1J23j7j76M9R8J8k08K07j01OK1K6m3L2M0j04J25o1o9J5P4
7820A7NJ0j26N1O0M6n2P5o2lj12J01J4nJ5MJ20k03J06l4q2N4PO9p3nq3O8PO1o5
7851a5l7M4m4L5J25k23J45o9Jk5j6Q0P3q8L2J7j12RO1K3k2p5J6J16p8R2q0P4r
7880E0q0J24j47K0J25j02j01J00%J17j41p0J48Kj33J46o5Q4j15J07r1j0j3J09
7904F4j68J53pj05J4J57k45P6J31j07J25p8j32J5J00j1m7P2k4K2M1j60M5J72j7
7929H6o4l7k0kN8n3n0R3j01J12r6L2qK4O9n4o1O7k3N1n7k0k7O6m5J36j72J74K
7958H0k1L8j22Q9l4r8%J8n2K38r9n3l6PO2q3O2mKl1J5oM7L0p7J2L7O7k4r9m8j7
$$ y = [18, 60, -57, 14, -29, -122, 17, -39, 23, 20, -41, 67, -14, -66, -25, 21, -21, 90, -22, 134, -10, -37, 45, -28, -63, 109, -52, 17, 42, -14, 94, 3, -38, 85, 68, -108, -59, 39, 57, -151, 56, -45, -39, -18, 8, -35, -3, 37, -67, 58, -3, -72, -57, 17, 22, 32, -94, -43, 17, 63, 11, 86, 24, 21, -91, 10, 24, 19, 34, 38, 158, -45, 61, 27, -55, -1, 6, 75, 2, -3, -86, -18, -11, 50, -15, -52, -8, -52, -17, 108, -115, 30, -39, -38, -63, -79, 1, 74, -14, 18, 35, -77, -68, -7, 16, -6, -81, -65, 51, -27, 65, -15, 59, 50, -30, 94, -53, -33, 92, -10, -111, -11, -11, 106, -35, -105, 43, 45, -88, 58, -7, 77, -38, 69, -22, -32, -45, 64, -104, 49, 42, -63, -49, 108, -137, -61, 70, -37, 88, 10, -122, -107, -7, -18, -65, 7, -17, 5, 46, -114, -69, 103, 86, 22, -15, -35, -37, 21, -32, -82, 11, -90, 22, -74, -42, -50, -26, 43, -11, -72, -5, -28, 23, -34, -54, -81, -15, -60, 76, -96, 78, 80, 59, 97, -25, 64, 30, -68, -68, -50, -102, 136, 37, -16, -52, -45, 17, -66, -4, -8, -6, -37, -22, -28, 19, 49, -28, -16, 21, 88, 64, -35, -83, -100]
7990a00M0J71j37N4Mq6Q8m3LJ7J8n5J06r2pJ00j55J87j30J9l5K2k5L6PJ6q3Q0
8018B0m6J38j00m6R7km2M2Nk3j49J18O7Nj27K5J37k00J28j52O6J18j2j44J76q7
8044A2j16J51o2J13r4K2N0j72N7mj7J22j06p4J10q3k4J73l6K4q9l1J48nn0J9j54
8071a16J62L6j65K3Q9l0M6p0j2P7k8l1Q2j01Q8r5j1Q0q7J26q7N2pj09M1j6l1M8
8099d6Q4m7M8j49J10K0L8j3q6Q8J05j83m7J6K7P4j29M8J60k08J25K3rj37P1k9
8125d6O8P9q4j00N9J12q1Q9k31K04j22J01o3L3k2j23J04l9O1O9j18J16j16P7j06
8150g9R6k0N0J1l3N0p4K1Pm5k3lR0k3R2j62M6r0Q0l0J08j36N2%Kk4P2j0J04j05
8180B4kJ1l7j05J80j87J44j50J19p6M3
$$ y = [-100, -60, 111, -26, 28, 32, -54, 34, -9, -6, 11, 29, -26, 80, -12, -19, 81, -74, 113, -17, 2, -33, -11, -36, 0, 7, 23, -60, 20, -26, 112, 12, -34, 63, 61, 19, 61, 66, 43, -106, 12, 79, 84, -43, -18, 119, -81, 47, -105, -39, 79, 67, -77, 99, 12, -104, 47, -15, 98, 4, 26, 76, -96, -39, -43, -60, 62, -44, -118, -8, -91, -115, 58, 22, 46, -43, -74, 74, 69, 19, 38, -116, 46, 82, -83, -60, 29, -1, 45, -25, -37, 40, 12, -19, 63, -38, 50, -45, -56, 24, -63, 63, -24, 28, 21, -88, -47, -63, -94, -46, 38, -9, 39, -110, 0, 20, 58, 45, -41, 47, 152, -31, -78, -62, -35, 39, -90, -42, 118, -90, 35, 58, 49, -88, -17, -46, 22, 101, 17, -83, -24, 88, 7, 96, -135, 69, -53, 48, -15, 18, -4, -127, -23, -62, -1, 68, -50, 66, -50, 27, -79, 17, -3, 47, 58, 25, 75, 1, 22, 29, -16, -39, -42, 48, 25, 117, -45, 1, -89, -9, -39, 69, -67, -15, -15, -13, -37, 35, 25, 129, 24, 22, 33, -4, -109, 71, -116, 28, -122, -3, -79, -36]
8191c6
$$ Imaginary data points
##PAGE= N=2
##DATA TABLE= (X++(I..I)), XYDATA
0@%%%%%%%%%%%%%%%%%%%%%%mJ2j6J6j6J6j6J6j9K4k7L0l2L6m0M2m7N3n8O4p0P7
44D1q4R3j00J07j20J32j45J60j77J96k17K44k76L15l62M20m97N97p34R32j226
65g01J699k541M265q877L7997P1912j98637Q9123J02725j73653P6002Q4854j30478
78d6310M1954O4249r0247J1566M8200n5191m082L9523l4457l643K7238k8756O609
91b3347J1203k8064K2247n997j9513L3933k1591k908L3539l3997J6879K0098l8557
104c6075L4130K536l4217M3138j0385k5417L9544j2069j9275K5816j642j9669
116a3585R572J7249k6199j833L5680l5429n447M5156m1177k896M2795l9013J439
129a3688L1318k6812J675J7899r387m403Q784O266j4763P782J4306k4345J3386
$$ y = [0, 0, 0, 0, 0, 0, 0, 0, 0, 0, 0, 0, 0, 0, 0, 0, 0, 0, 0, 0, 0, 0, 0, -4, 8, -8, 8, -8, 8, -8, 8, -11, 13, -14, 16, -16, 20, -20, 22, -25, 28, -30, 34, -36, 41, -43, 50, -50, 57, -63, 69, -76, 84, -93, 103, -114, 130, -146, 169, -193, 227, -270, 327, -407, 525, -701, 998, -1543, 2722, -6155, 31842, 103754, -94883, -5760, 96965, -76688, -686, 84168, -46310, -4356, 59893, -30354, -18788, 29412, -25779, -29861, 9662, -24795, -28438, -1200, -29956, -23347, -12144, -40208, -17961, -23958, -43471, -9538, -31129, -34037, -498, -34495, -17616, 2482, -36075, -1945, 591, -33626, 9512, -873, -26290, 13254, 1185, -18090, 7726, 6084, -13585, -4013, 13236, -12963, -14796, 20884, -14545, -19992, 25164, -16013, -18909, 23886, -15127, -13688, 17630, -9182, -7507, 10392, 1005, -3398, 5386, 11652, -3111, 4671, 18977, -5368, 8018]
142H018J2314k7274K0256K418k1182K1838q957q406J5608j5387N451L484j3958
155e777J4590r093o280J5470j6192K337R598j4860O676J712o445L970l159M466
169b987m780j836J1889j4824M998J1721j9908J2894N011j7341J6877m695p486
182a0467J3939j1975N188M266j2316J4448p171o660J6837j5639K283J2227j7202
195a2242Q859M054j1582R311k305k510L385k551M527n913L399O128j3158J2270
209A672J145j4512J8988p072r152J9322j3557k02J2845j4690P911K283r208J0712
223F485o783n43P254j0636P196%p756R704o301p60N837p924O051k125l443Q261
239D517r726N026M568j2809J2802k985r934J6298j0621k577J3247j3701N189N593
$$ y = [8018, 20332, -6942, 13314, 15732, -5450, 16388, 7431, -975, 14633, -754, 4697, 8181, -5777, 8813, -280, -6560, 8910, -7282, -4945, 4653, -10207, -3531, -1819, -8264, -4294, -7453, -2987, -7767, -9603, 2286, -12538, -7540, 4181, -15727, -2833, 2178, -15163, 1714, -2981, -10467, 3472, -8503, -3315, 951, -11365, 3083, -4088, -10748, 6089, -9550, -7267, 4960, -12242, -3383, 671, -10911, -1600, -3905, -6415, -3030, -5581, -1054, -6967, -3568, 2560, -10598, 1672, 2817, -11695, 7293, 221, -8931, 10391, -3166, -3368, 9477, -5213, 2698, 4981, -4227, 6485, -298, -841, 6413, -4223, 2973, 2973, -4783, 4921, -1380, -2140, 3697, -4227, 1824, -301, -3744, 4517, -5209, -183, 4385, -8424, 4378, 1393, -8541, 7757, -2864, -5441, 7806, -5895, -706, 4887]
253D887j0738Q856k897k724O614p444N381K0n973R742p428L82P997j1286P726
268C115J288r680J2325o843l565J1422j1559L435O122j0643O929l7m698M550l328
283a167K995k483j447Q274j0972M697Q460j6382J1622M338j6375J5570j711j1150
297e731J3734n594l251O332m340K626l005J174M103j0429Q590Q70j2783J4144
311F440m642r716J4528q183m101R869p307Q51K395j777J686m131O447k099o436
326f176J3025q150m371J5202j2816K60J1986j2971L869N389p633L593p38P05j408
341b34l202Q724q927j291J2725j5129L509J1603j7054P681O901j3363Q070K109
355B122o263L771j45J532l806K070N732j1087P191N339j4722J1671J593j3294
$$ y = [4887, -5851, 3005, 108, -2616, 3998, -3446, 1935, 1955, -4018, 5724, -1704, -1322, 6675, -4611, 3115, 4403, -5277, 7048, 205, -3360, 8062, -3497, -62, 6060, -4583, 2346, 2309, -2389, 2161, -1167, 1828, -655, -2102, 6172, -4800, -103, 8357, -8025, 3597, 7935, -8440, 7130, 5419, -5731, 8003, 2409, -842, 5490, 1150, 3776, 771, 1945, 6048, -4381, 4209, 5079, -7704, 6440, 1798, -7918, 6610, -1573, -5674, 4195, -3112, -2261, 134, -1643, 43, -4088, 2359, 260, -6176, 6849, -1301, -5672, 9530, -3286, -3026, 8960, -4011, -142, 5247, -2386, 1207, 469, 1174, -234, -3436, 5288, -3639, -4930, 7795, -7334, -3825, 7778, -9276, -1595, 5306, -8057, 13, 2122, -4141, -370, -515, 1017, -2789, -719, 5013, -6074, 1117, 6456, -8266, 3405, 4998, -8296]
369h296J2935k925p810R634m621j472K523k020K555n195L966K421r849J0021j259
384F08r709J3092n580n923J1812p646n55N874n361K906j239N48K224n912P057
399B196k014o374J1296p040l391J1223r915J423P005q578M538R58l437L895l540
414a755L446m93m277Q468n940j266R202r830L591N751r596P125k40m952P014n011
430A237J517L362o781O896k038m671Q625o455k62O371p306L461J341m009L910
445E198k656J104Q48l911N601l938j660P070q397L319M334r647P648o29p094R035
461F225n395j816O454o970L081J083m791N485m306K30M018o994M867m8n635O827
477B315m015j408N029n915L445K92m320O071m695N9M769o799M350R88n618O478
$$ y = [-8296, 4639, 1714, -6096, 3538, -1083, -2555, -32, -2052, 503, -4692, -726, 1695, -8154, 1867, 608, -9101, 3991, -1589, -7512, 4300, -3346, -3901, 1973, -3388, -482, -1721, -1173, 1051, -4861, 2196, 182, -6192, 5104, -1936, -5327, 5896, -4019, -2596, 4409, -4169, 369, 1327, -2110, 1785, -1755, 1691, 1198, -3079, 5389, -551, -1817, 7385, -2445, 1146, 6897, -2699, 4426, 4186, -766, 6248, 1237, 2754, 6116, -665, 6231, 4193, -478, 8147, 1692, 1430, 7801, 495, 3956, 5297, 1288, 5198, 2542, 3646, 4494, 583, 6184, 2246, 586, 7656, -741, 2578, 6912, -2735, 4913, 4284, -2810, 6225, 830, -986, 5468, -1502, 1579, 2662, -2129, 3356, -950, -720, 3298, -3696, 1171, 1123, -4512, 2315, -1700, -3108, 1921, -3994, -549, -257, -4577, 1494, -3201, -3142, 1627, -5172, -822, 166, -5452, 1026]
493A026l358r83M782n727L866M81m382O378m251p6N105o817M969N85n968Q339
509C969m813j944Q095q241K502N052q385N677P91n275N408k367n02K066k240K527
525B320k159O91K479m980M995r97m592P890n340j359P965q617K809M894q567O017
541C449K43n025N533l124J11J961l791M478l267j392O060p290K507M336q069N220
557A940R63n535N382k206r07K247k780L332k544k62M977p085M022L359q610P548
573C841k07o906Q488l480k928O297m751Q48K229l192K812k032O84J595l999M070
589C369j340k833N425m376M21L524n044L693l91k664M420m321J959K731o892P087
605D768j498o127R821n613l169R378p876L46O208o744K127J971k895J324q92J496
$$ y = [1026, -2332, -3315, 1467, -4260, -394, 87, -4295, 2083, -2168, -2244, 2861, -3956, 1013, 1598, -4370, 3969, -844, -2788, 5307, -2934, -432, 4620, -3765, 1912, 2703, -2572, 2836, 469, -33, 2033, -207, 2320, 161, 852, 3331, -1649, 3346, 2349, -2243, 5647, 307, -1052, 6913, -1704, 1105, 5999, -2568, 3449, 3692, -1333, 4200, 1076, 1187, 3148, -643, 3835, 568, -824, 5236, -2054, 453, 4789, -3280, 1940, 2903, -2632, 2750, 544, -363, 1884, -896, 2436, -108, -370, 4607, -2478, 1544, 4903, -3707, 3841, 3634, -3272, 5216, 1736, -1192, 5105, 354, 1202, 3431, 239, 3051, 1019, 1703, 3298, -701, 3369, 2029, -804, 4621, 245, 666, 4190, -854, 2839, 2448, -216, 4204, -117, 1842, 4573, -2319, 4768, 3270, -2857, 6964, 1351, -1818, 7560, -316, 30, 6238, -506, 1621, 3592, 697, 2021, 1129, 2625]
621B625j686j103M194n061J211L994o984M300J408o102N906j909l011N183l906
636i41O42K133l171K993k053J75K670m587M010l7m703O816l728k011O445o255
652a602J724L561o396N112n35m277O120m205p40M706n214J873J814l183J965m67
668B56J79m33o57L097m027J628L607o954N164J309p200Q065k444n106R030n959
684d45j245P096p083K088L520n770L497R0k363K104j230N36o25m90K100l335K153
701E98R39l991M566k291k018N377n483J673L959p104N156R09o307O583j932l525
717b891N544l368k49K024j798J341j632J283N81l820M730j959l440O759m996r30
733b821O112o852K446L306o349M349K94l667L703j569m86J300j468J930k153J025
$$ y = [2625, 939, -164, 4030, -1031, 180, 4174, -2810, 1490, 2898, -3204, 2702, 793, -2218, 2965, -941, -299, 1834, -1337, 1656, -397, -222, 2448, -2139, 1871, 1834, -2869, 3947, 219, -1792, 4653, -1602, 122, 3683, -2713, 2399, 1864, -2413, 3707, -498, -1238, 3468, -1746, 127, 1941, -1242, 723, 256, 435, 2, -655, 2442, -1585, 43, 3650, -3304, 1860, 3169, -4031, 4034, 1590, -3516, 5514, -445, -1690, 5406, -1677, 411, 3931, -1839, 1658, 1748, -615, 1489, 259, 795, 170, -320, 1780, -1555, 598, 1537, -2454, 2112, -179, -2197, 3180, -2303, -630, 3329, -3775, 1381, 2290, -4017, 2566, 634, -2891, 2653, -715, -964, 1060, -738, 603, -1029, 254, 835, -2985, 1745, -214, -3654, 3105, -1891, -2821, 3291, -3561, -1115, 2191, -4158, 191, 485, -3182, 521, -1048, -1534, -234, -1702, 228, -1925, -900]
749i00J805m381L993j95m387N947k912k175N330m552J128K637m230L276q00j900
765b316L590l172J247J551l420L520j383j636L663l486J467J736l990L903j231
780D3k157M089l492R94K019l658L449j196j893M136l947J241K692m838L602J67
796A251l467M598k418q42L147l160J706L25j913K720k349R33J412l527L578j286
812G08k263M597l687J52L275m441K392P89l158L175j691k87J688k803L035j542
828f1j564M360m500J072L730n886L422J881n292M507o41k819L441j677N8M93j005
845d81J995k812J431J834m584L944N9m686N488k177k669M923l441j11K422k623
861a488J422l15j45J094k402K942j059k320M784l480n92M645n036J901K754m899
$$ y = [-900, 905, -3476, 517, 322, -4065, 1882, -1030, -3205, 2125, -2427, -1299, 1338, -2892, 384, -416, -2316, 1274, -1898, -651, 900, -2520, 1000, -383, -2019, 1644, -1842, -375, 1361, -2629, 1274, 43, -2114, 1975, -1517, -523, 1496, -2162, 1287, 91, -1802, 2334, -1613, -372, 2320, -2518, 1084, 1251, -2216, 2382, -36, -878, 2269, -891, 815, 1140, -773, 1947, -402, 531, 1943, -1584, 1994, 708, -1555, 3042, -645, -493, 2782, -1659, 733, 1522, -1636, 1539, -152, -439, 1249, -1554, 1481, -61, -1625, 2735, -1765, -693, 3037, -2849, 573, 2454, -2838, 1669, 1028, -1791, 1650, -27, 31, 524, -481, 1514, -1298, 133, 1967, -2617, 1327, 1386, -3300, 2188, 11, -2658, 2265, -1176, -1287, 1135, -1488, -66, -381, -526, 568, -1834, 1108, 49, -2271, 2513, -967, -1559, 3086, -1950, -49, 2705, -2194]
877b194L560jk749L428k234N06J105k321K663j667j115L501l861J375K102m205
893b107L076k06k208K795j714L00O55j813K784k170k0L166m592K540J929n186
909b771M634j68m132N080k295j500L468k769P30P89j448J598j759Q79P99k745
925a610K964j401j796L762l380M88K605m020K659J67k610L298k112p2K144l180
941b094K651l81k101L642k708J79K830l917K413O89l241L484j562r46K789l010
957a283J591M30k286K802j790l67K353l165K090L85k766L302j809o32K907l223
973a461J538R82k776L268j498r73K850k787J353J011k611K902j507n20K445l019
989h03J623P48k820L240j691j224L258l351J086J572l282K872q79j688K878k618
$$ y = [-2194, 1366, 1365, -1384, 2044, -190, 316, 1421, -900, 1763, 96, -1019, 2482, -1379, -4, 2098, -2107, 969, 763, -1445, 1350, -364, -64, 591, -1222, 1562, -608, -628, 2538, -2054, 486, 2415, -2771, 1863, 1695, -2437, 2643, 348, -1152, 2316, -453, 277, 1066, -382, 1216, -543, 336, 1135, -1610, 1354, -47, -1843, 1919, -1461, -973, 1632, -2388, 271, 438, -2172, 1126, -986, -1058, 1086, -2094, 557, 176, -1925, 1717, -991, -812, 2018, -1899, 514, 1203, -2038, 1446, -116, -1062, 1727, -1283, 308, 738, -1548, 1254, -536, -903, 1450, -1715, 375, 760, -2006, 1296, -513, -1145, 1762, -1461, 77, 1059, -1717, 1551, 53, -920, 1930, -857, 496, 1507, -1104, 1798, 291, -229, 2216, -803, 820, 1568, -1252, 1988, 297, -927, 2331, -1020, 66, 1638, -1644, 1228, 349, -1339, 1539, -1079]
1005a079Q98J373k837K586j057j223L043l033J199J616l324K975o61k022L117
1020A571k298L63J781k681K191p38j232K489k436Q13J252l045K850p31j815L222
1036A556k784N44J998l279K359n5k027K883k102J99J901k988K597n11k037L716
1052A970k631k87L035l441J610J324k908K394o61r46J520j299J109n92o86K114
1068A625k696J300J486l616L221m14k901M190k388j042L374l241J090J210k429
1083a231K191j110k89J735k558K136n0k536L517k113j059L548l236N84K007k859
1099a323J631M2r55J159j383J087j77j468K582k218O3K438l415J689J352l303
1115b199K899o41j684K749k073L55J186j801J814j154m44K238k885J707R23l263
$$ y = [-1079, -181, 1192, -1645, 941, -116, -1339, 1704, -1329, -130, 1486, -1838, 1137, 476, -1546, 1571, -727, -364, 1417, -1264, 927, 189, -1043, 1446, -990, -177, 1075, -1970, 880, 149, -1666, 1556, -1228, -684, 1314, -1965, 394, 339, -1688, 1195, -907, -708, 1193, -1795, 802, 291, -1746, 1970, -661, -948, 2087, -1354, 256, 1580, -1328, 1066, 405, -541, 979, -320, 789, 197, -489, 1625, -1071, 229, 1715, -1901, 1320, 906, -1995, 2195, -193, -1235, 2139, -1102, -12, 1198, -1231, 960, -150, -439, 1296, -1262, 874, 824, -1712, 1805, -308, -1367, 2181, -1055, -471, 1536, -1323, 308, 350, -605, 554, -829, 258, 81, -1387, 1195, -1023, -960, 1478, -1937, -248, 1104, -2199, 700, 59, -1625, 1124, -949, -594, 592, -1209, 605, -549, -993, 1245, -1640, 67, 990, -2273]
1131b273L405q58k155L352k092n06K265k305J306p4r32J770k036R89R57k576K676
1148I13p23j898L104k065r4K016k429J389M6j285J919j568P15P85j890K219j201
1165d7r88K974l184R69K295l991K652O17l252L290j161j245K249j832N13O06j353
1182h88J736j637M58J392k428J882K4k058K582j602k40K035k422J381L14j894
1198a365K426j402m65J887k204J303K23j825K357j597j23J914k680J666O66k550
1214a769K610j071j060K336k299R44R09j986K149j054r32K396k256R06J111k336
1230a402J967l84j067J770j617N64Q26j746J854r31o43J902k243J225O99k080
1246a306K064p41r85K330k191P84J001k112J885n38j080K093k007Q34J025k394
$$ y = [-2273, 1132, 274, -1881, 1471, -621, -1127, 1138, -1167, 139, 65, -867, 903, -1133, -144, 813, -1763, 913, 190, -1708, 1396, -669, -763, 1253, -1176, 213, 259, -1026, 893, -675, 40, 825, -1065, 1154, -47, -1035, 1939, -1245, -276, 2019, -1972, 680, 1297, -1955, 1335, 174, -1071, 1178, -654, -141, 465, -888, 848, -789, -331, 1061, -1367, 515, 539, -1519, 1063, -539, -779, 1256, -1166, 215, 529, -1365, 1061, -341, -806, 1081, -1123, 180, 403, -1422, 935, -662, -785, 1129, -1551, 115, 781, -1769, 841, -230, -1290, 1046, -1253, -309, 600, -1386, 763, -291, -1223, 1173, -1083, -177, 934, -1402, 565, 181, -886, 884, -733, -169, 657, -1089, 765, -166, -809, 1093, -1150, 75, 774, -1306, 758, 17, -968, 1362, -829, -45, 956, -1156, 729, 191, -889, 1204, -803, 31, 1056, -1338]
1262a338K464q59j511K706k207L20J865k571J513L28j739J766r97j36J157j606
1278h45J198k84q85J684j664N91J105k248J998n87j304K477k051L72J596k698
1294a545J970J02k097K560j263p20K021j940O70N74j272J379q86M2P87j350J547
1311E79p86q55K339k527P79J973l296K178N77k827K931j052j231K471j851K66
1327c32J153j712J356m18n24J291j642J141J84j428J941j176j90J359j672J021
1343C52K16j519K129j494N3J746k733J795O26k614K680r51j639K752j734j28J544
1360A081j770Q95jn62J065j437J065j1j475K411j513o82K416k531P49J570k650
1377a380J767J54j600J872j169L3R47j498J377n77q79J829j666N90J030k122J741
$$ y = [-1338, 1126, 267, -1244, 1462, -745, -425, 1440, -1131, 382, 710, -1029, 737, -260, -396, 761, -845, 353, 69, -816, 868, -796, -205, 900, -1348, 650, 63, -1241, 1236, -815, -443, 1153, -1545, 425, 527, -1570, 990, -273, -993, 1028, -912, -242, 332, -940, 439, -447, -405, 382, -968, 579, -207, -1062, 1277, -1250, -471, 1502, -1794, 384, 961, -1866, 1065, 13, -1218, 1253, -598, -332, 821, -891, 465, 47, -477, 814, -828, 313, 497, -931, 1010, -166, -356, 1003, -669, 352, 568, -951, 1178, -316, -263, 1483, -1250, 545, 1171, -1443, 1237, 286, -1353, 1399, -335, -463, 1081, -689, 206, 205, -357, 708, -729, 336, 325, -1150, 1261, -252, -934, 1482, -1049, -300, 1270, -1380, 387, 541, -1059, 813, -356, -323, 624, -874, 503, -74, -953, 876, -790, -200, 830, -1292, 449]
1394D49j84j421K064j402R6J014j549J160k55p82J772j767O48J077k370J965m2
1411D73j764K413j194p03J805j701P76M48j132J299q63J38P60j521J493l04j184
1428g61K015j620oJ614k051J179K59j569J836j192j64J351j825J358R5j577K098
1445A040j166m07J892k025Q42P69j732J633o13n20J218j156M77L25j130J418r39
1462g4l70J459j911J062L59j608J723p86o87J717j818P83N63j484J662p88m56
1479f54J563j642Q48N47j714J850p59o11J704j655N25R35j810J583m35j099J833
1496A009j535L73R92j721J270r8j058J434j172K59Q89j356J159k83p38J424j363
1513e15O23O77j475J610m93j051J995j713L38J333k001J295J84j479J729j099
$$ y = [449, 265, -1156, 908, -494, -398, 616, -933, 227, -28, -810, 962, -805, -157, 920, -1450, 515, 473, -1291, 1122, -72, -775, 1030, -671, 105, 553, -579, 720, -143, -5, 755, -766, 727, 423, -761, 1254, -366, -372, 1242, -809, 370, 629, -940, 896, -296, -460, 891, -934, 424, 519, -1058, 1040, -126, -533, 1359, -666, 176, 945, -787, 846, 233, -287, 931, -225, 252, 577, -553, 865, -74, -444, 1015, -896, 166, 525, -1083, 640, -146, -833, 884, -934, -151, 412, -1072, 590, -198, -654, 909, -733, 115, 662, -1052, 798, 39, -572, 1132, -523, 2, 937, -873, 710, 275, -824, 1009, -526, -153, 839, -882, 388, 290, -768, 666, -506, -247, 642, -714, 445, 162, -576, 848, -515, 108, 785, -690, 920, 427, -624, 1371, -342, -4, 1329, -672, 623, 807, -672, 1057, -42]
1529d2j69J017j416J114p6r80J534j237L2J242j893J171K02j217J571j032j53
1546c32J105j250Q51J05j074J416j153K04R35j589J350j35j452K004j240m24J767
1563A088j874Q65M54j416J295n36m14J085j331R26J23j229J577q55n27J594j561
1580g36M90O97j248J087l17m57R43j055Q01j23q74J469r82j47J467j915R59P08
1598G67j743J607l32r83J479j080J45P13j081R74o44j49J191j584Q95O06j761
1615i80J702n69j024J813j162j66J080j141P81j01n59Q66q36O16J14j137J454
1632G51o28p90J703j350L2J275j766J088N5q95J106q37J42N91j154J074m39o32
1650f74J492j324J66J095j673J138J11j200J526p52m34J112j266P68R6q97J233
$$ y = [-42, -211, 806, -610, 504, 428, -552, 982, -255, -223, 1019, -874, 297, 499, -718, 853, -179, -332, 773, -477, 374, 479, -595, 821, -332, -128, 807, -782, 568, 433, -1019, 985, -255, -679, 1088, -786, 79, 533, -883, 412, -124, -538, 547, -784, 142, 265, -964, 613, -242, -769, 825, -736, -246, 451, -797, 290, -27, -484, 459, -596, 205, 82, -792, 677, -305, -452, 1015, -900, 59, 767, -976, 631, 299, -684, 795, -285, -140, 573, -508, 466, -178, -327, 864, -720, 175, 781, -980, 722, 153, -871, 942, -220, -386, 694, -447, 334, 233, -326, 540, -296, 320, 434, -703, 751, 123, -667, 1036, -314, -282, 993, -773, 315, 370, -525, 581, -256, -114, 477, -677, 397, -42, -674, 818, -506, -340, 755, -918, 220, 331, -869, 657, -95, -529, 583, -683, 85, 181, -716, 517]
1667E17r22J4J023j504R95K09j218J349n21m97J079r64M59J86q35J230q41m7Q45
1686E57j292R88N6j113J560q61l76J143j300P16L95j190J299p18k50J033j161
1703e14O63M04j183J332p88k85J230j325N35P07j329J123l15n92J085r91L11N16
1721E84j178J103l53n95J149j101M43N73j270J093k97p70J298j048L26N62j196
1738f77J161l72p59J397j053J04O76j121R65j42p38J144r25K96M94j112R72k12
1756I8p43J353j287K98Q48j383J044J77j175J350p34j91Q25j032O96m7n51R71
1774E17p01R0M87p40P89k93n87J178r88J69P80j302Q47R8j012J362q97o3Q62j297
1794g01R37J90j146J370p00l02J122j067J71P12j002O92p1m61P86p38L76P8p96
$$ y = [517, -405, -391, 632, -872, 123, 332, -886, 463, -58, -555, 524, -440, 19, 205, -630, 600, -241, -288, 557, -735, 253, 309, -804, 756, -105, -481, 662, -638, 78, 473, -717, 582, -136, -386, 647, -514, 149, 553, -630, 702, -86, -371, 859, -466, 69, 776, -553, 570, 255, -337, 748, -243, 68, 584, -594, 509, 156, -439, 710, -391, 52, 625, -645, 448, 151, -619, 679, -369, -43, 519, -677, 484, 112, -647, 750, -303, -199, 477, -644, 321, 179, -559, 585, -340, -44, 450, -662, 310, 98, -645, 708, -579, -281, 567, -816, 228, 405, -770, 580, -154, -345, 480, -552, 144, 97, -454, 517, -184, -94, 393, -347, 442, 149, -438, 740, -248, -79, 701, -601, 246, 344, -668, 694, -203, -266, 596, -701, 236, 426, -720, 650, -50, -352, 770, -297, -126, 586, -416, 276, 205, -256, 530, -208, 168, 246, -550]
1813e50J199r24l2R96j268N86M13j231J277l08o36R35p80K19L77p26P72m53j41
1832b75Q09j199P58J84j090J369n60p20J374j130J67R40j203P28l8m59P33q79
1850d91M30L91j053J083l26o28J200r48MQ14r13M96Nm20O22m42K60J34o63Q79
1870D34m32n45J255j150K90R91j363P05K62r39R33l39l61O51n66L88o6m86R08
1889E70q20J23P42j265Q71J80r24R73m86k69P75o78L55O8n73O86o34K61N32j091
1909f04R79k5j058J286p10m52J164j067M28M12q09P13l79q9N68q12M43K00p11
1928e23Q51n63k19J100j073L69L85r61Q57l80k41P97p10L72J50o24Q59n19j24
1947a97Q64j159N67M82j149J057k86n79J020p56J29M41p49P32k72l31P94p67L53
$$ y = [-550, 649, -275, -307, 689, -579, 7, 420, -811, 466, 158, -478, 457, -323, -104, 273, -453, 319, -134, -275, 534, -665, 93, 277, -813, 556, -4, -724, 650, -480, -313, 627, -576, 152, 114, -345, 388, -491, -61, 330, -723, 360, 34, -594, 606, -342, -338, 476, -437, 59, 64, -356, 266, -176, 84, 218, -445, 434, 2, -543, 712, -438, -148, 843, -520, 185, 447, -492, 441, 102, -259, 392, -174, 214, 148, -338, 570, -250, -127, 615, -650, 221, 401, -523, 450, -36, -305, 470, -208, 147, 215, -358, 328, -306, -45, 487, -604, 375, 350, -708, 578, -132, -584, 580, -487, -59, 353, -456, 257, -122, -211, 357, -455, -12, 188, -523, 328, -235, -454, 646, -427, -58, 327, -634, 223, -157, -398, 399, -311, 61, 211, -413, 446, -73, -197, 667, -492, 75, 557, -592, 465, 179, -400, 620, -136, -7, 434, -315, 417, 145, -186, 608, -159, 194]
1966A94K97q57P56j10o60J039q93L33M47r09P84j43n71R04p40M3O23j067P95p9
1986A86o66J051p54N7N29p95O95k46n26P79n51J51N88r61O87l6o92J047p42n8
2006b57O50r07N73J94p33P94n31NN89p75N79J9p17Q18n30m8N18p88N76M2n81Q41
2028C31n68n1O68r36O67P9p11R16n21k12Q40r29L50M40q45Q84m30k86P59p25K73
2049gL70p72P21k46k96O99q33M69J44n80P71n71j17P34p41L86J96o28O89k78m65
2070c55P99p10L31L06p73P58k92m64R50q25J43N52q15P52k74l55N85o43L25K02
2090A97p08Q08l13k48Q25j066M61N56j089P94l1o65R29n49k25O79p25M23K9n51
2110d69Q23o11J15L92p47O29K0o61R17p00K5O65q01N75j44m01N66l64J19L55p87
$$ y = [194, 491, -366, 390, 280, -380, 659, -234, 99, 546, -363, 421, 278, -293, 611, -129, -86, 537, -530, 265, 186, -480, 571, -183, -126, 403, -392, 303, 57, -469, 310, -241, -90, 498, -463, 224, 188, -504, 543, -199, -257, 393, -514, 59, 253, -480, 314, -217, -212, 377, -398, 181, 200, -517, 301, -229, -277, 241, -547, 29, 71, -510, 331, -237, -288, 380, -556, 111, 190, -521, 395, -126, -338, 502, -427, -77, 363, -482, 402, -28, -314, 445, -280, -7, 363, -409, 312, 66, -230, 469, -364, 105, 249, -331, 440, -131, -248, 486, -255, 131, 327, -301, 388, 110, -355, 444, -266, 65, 371, -402, 356, 64, -400, 550, -275, -132, 420, -395, 357, 83, -272, 313, -330, -5, 197, -511, 297, -16, -264, 561, -505, -44, 512, -577, 217, 186, -479, 450, -99, -324, 355, -370, 53, 82, -469, 354, -257, -142, 250, -497, 132, 152, -509, 408, -292, -267, 398, -403, 172, 28, -373, 193, -171, -52, 303, -484]
2131d84P31j09o71J062o90j80P71p92N52M4n63O42l52mL52o17N03M2o30Q88p82
2152b87O7P44r44N93L33r53Q13k49l40O65n42J46Q1l09M49l19MM82q53N24J44
2173B49p27Q51m15l54P66o56M45M8n60O28l60k76P11r25M60N12r49Q82l66l42
2193c78Q01o94J54M24p03M77j03l42N73m50Q8K79n77N46j64l80O91n56P2L66o83
2214e59O23r9m51P37n75K27L30p96Q29k55n22Q47o13J18N65q45N59qn08O98m12
2235a10o3N01o94M57J10m92P04n01m3M94n98M13Rn95P91n47L5M36o95N09Q7n36
2257c28P49m75j09M61p19N34J3n60O92m68o5O35o81M61J08o88P54l49k62P61p29
2278b65K82K62q11P64k97l09O57o49K82K63n72N41k81k14N34m88L90K0m10O30
$$ y = [-484, 247, 138, -533, 529, -161, -341, 430, -362, 190, 234, -329, 313, -39, -43, 309, -308, 195, 237, -393, 495, -287, -220, 524, -420, 173, 506, -447, 366, 117, -223, 442, -100, 46, 127, -182, 267, -52, -48, 434, -419, 105, 249, -478, 373, -42, -396, 370, -286, 159, 207, -353, 275, -85, -361, 350, -575, -115, 397, -552, 330, -36, -378, 423, -271, -117, 307, -396, 81, -22, -364, 209, -241, -153, 126, -451, 95, -69, -449, 242, -314, -242, 124, -559, 64, -35, -486, 251, -324, -97, 233, -563, 266, 11, -511, 336, -277, -159, 406, -439, 120, 112, -396, 302, -110, -173, 328, -366, 91, 201, -291, 413, -88, -131, 363, -235, 178, 187, -408, 383, -164, -129, 307, -388, 121, 208, -328, 421, -54, -163, 298, -421, 113, 126, -434, 258, -210, -275, 360, -321, 140, 248, -440, 314, -35, -297, 464, -265, 17, 279, -532, 232, -65, -374, 283, -366, -84, 179, -393, 148, -133, -347, 187, -301, 89, 109, -301, 329]
2298C29m16j86N87o41K89L34o32O39l56k37N58m46O5L82n10L56J2l85O13o19K44
2319b0L57o72N95k79k61P03o09J56L05o32M94P9m13O46o04K20K43o79N97j36k34
2340a44O48n44q9N30n95M63j84l05N65l65r9M58o21N48j50n06Q35o55M7N80q42
2361d25N91k0n27O99m69l0M87o08M31r8k96N97n08J44L39p13O21N1o47P30n34
2382a85p2O64o08J19J79m47N20l65l6N50o56L56Nl96M86l12j55P20p10K86K93
2403B36n70N85l83J1L01m81K75K22n20O06k77k86O44p35L10K70n81O27j89k15
2423a50M35m78K07J59l28L85k63k96N17m96K27K28m54N15j91k26M57m89K78J16
2443A53m16N24p4m14L93l20R8M02o53O14k90m57P75n68Q4M44o08M25n4l28M36
$$ y = [329, -87, -273, 314, -327, -38, 296, -336, 303, -53, -290, 268, -178, -113, 269, -241, 115, 127, -258, 355, -264, -20, 337, -335, 260, -19, -280, 423, -186, -30, 275, -357, 137, 216, -197, 449, -155, 65, 308, -371, 226, 90, -144, 504, -40, -129, 401, -194, 269, 85, -220, 345, -20, -119, 339, -282, 266, 116, -390, 445, -210, -163, 417, -425, 166, 146, -381, 318, -151, -181, 306, -302, 129, 31, -265, 332, -176, -32, 307, -406, 215, 266, -381, 349, -185, -257, 407, -201, -82, 97, -350, 170, -195, -231, 319, -337, 19, 24, -372, 114, -198, -353, 367, -343, -57, 236, -334, 251, -132, -121, 180, -301, -26, 196, -324, 282, 5, -281, 363, -372, -62, 208, -373, 254, 65, -150, 285, -193, 14, 173, -155, 230, -33, -329, 188, -308, -81, 147, -307, 208, 17, -209, 248, -241, 37, 153, -263, 261, 187, -227, 166, -154, -56, 346, -307, 307, 17, -440, 335, -233, -149, 295, -313, 112, 58, -270, 166]
2464A66l11rL34n31M75j15k17M33m25J96J05l87M86j33l55O08m23J1L95o15M95
2485A83j2m66O37l84m7L55n81M29K9m12M78l56N4L32n55M06O6l55L83k94o8L65
2507A87m24K33J97n16O10l48m2L87n25L69O9l85M37k21j22L90n51L86L1m52O35
2528C45m22r0M19m44K42J64m58N23l29j52M25l86J21K25m23N14j46k93M50m19
2548a34P7J49l86M16j77j34M41n21K85J55m69L79l5j85M66m91O3K79m58L92n2
2569F0k39M90m58J12K68m74K72M0k58L43l18Q9L44n71M82l7l00L24l55K25K03
2590B42m63L69p7k61M18l83N5L86m11L61k32j99M65l44J7L59n13L99j10k89M01
2611A90k25l8K79m67M11j86k24N34k17l5L38n86K40K31m85M74j91q2L51n35L01
$$ y = [166, -145, -154, 180, -351, 124, 9, -208, 225, -200, -4, 101, -286, 200, 67, -288, 320, -103, -92, 303, -312, 183, 171, -295, 342, -42, -89, 266, -315, 114, 143, -269, 209, -147, -93, 239, -316, 90, 156, -199, 184, -110, -178, 187, -237, -4, 193, -323, 287, -61, -103, 284, -241, 128, 197, -188, 249, 28, -94, 296, -255, 131, 162, -290, 345, -77, -167, 252, -192, 50, 214, -244, 279, -50, -202, 223, -163, -42, 183, -240, 274, 128, -165, 285, -134, -57, 92, -294, 122, -55, -189, 252, -269, 16, 171, -298, 81, 46, -139, 327, -164, -101, 178, -280, 112, 60, -179, 311, -147, -35, 233, -241, 31, 71, -187, 156, -162, -73, 271, -300, 182, 145, -155, 169, -186, 39, 242, -221, 148, 71, -190, 228, -155, -100, 286, -125, 236, 4, -195, 270, -74, -57, 302, -211, 188, 78, -211, 190, -35, -73, 206, -261, 150, -36, -260, 274, 57, 22, 360, -226, 14, 245, -240, 234, 43, -39, 312, -223, 78]
2632G8N9m16N19l10p2L42m00K68J06m18L65r9j07L41l49J41J4k16K80k45p4M32
2654B39n00K32L46o04M98k05l13N49l88J49Q7l88L30j48j13L51l62K71J05l32
2674a96L23j14j94M33l19r3M28m18K27p8k37L96j73L6J93m58L71p5k77M61m37
2695b01J24K42m33L17M2k43M16k98K5K00l57K36R2l27M36l27J4K27l65L76l6k68
2717a08K81k32qL35m58L02M4l41M46k93o1L28m00K46L0l75M42k22p6K78l06J6
2739a32K05l66M64k90l9L34l44J82J40m19L87j63j68M10l97K20J29l57L41j67
2759c0j14L31l89K71k8j70L29j31j92M36l74N9K08l20K16k2j05K22l80J89L3k83
2781b44M50j39j47L46l51J37J20k92L10k16q5L39l54K5K33l89L84j70o0M07l32
$$ y = [78, 137, -279, 240, -70, -142, 200, -200, 68, 174, -244, 121, 22, -85, 256, -93, 48, 62, -154, 126, -119, -193, 239, -261, -29, 317, -287, 211, 6, -307, 242, -146, 3, 90, -298, 32, -116, -229, 122, -240, 31, 136, -196, 127, 13, -181, 252, -67, -160, 268, -150, 77, -1, -238, 158, -15, 21, 214, -244, 127, 52, -225, 236, -201, -77, 165, -268, 49, 91, -152, 264, -34, -9, 191, -166, 70, 162, -165, 271, -56, -42, 185, -180, 196, 160, -108, 173, -59, -67, 268, -190, 112, 156, -185, 261, -32, -93, 235, -165, 81, 111, -264, 178, -44, -120, 158, -148, -132, 73, -293, 171, -119, -158, 176, -168, 14, 154, -265, 122, -41, -209, 201, -196, 24, 153, -204, 137, -30, -144, 187, -202, 69, 41, -129, 200, 69, -123, 313, -61, -2, 206, -114, 102, 80, -25, 197, -183, 6, 39, -244, 206, 67, -80, 266, -85, 52, 172, -120, 190, -26, -111, 228, -126, -101, 132, -257, 127, -43, -103, 304, -28]
2802b8qJ91l41L36j14k76M08k45k1L79n15M50j12m17M53k98O6K77m53L02j04j53
2824b23L65k06p0K18k53J49M4k21L49k67kK69l16K71j03k33L77k34Q8J35l63K36
2846A0J87m04L66j32l7J64j49L0J82l38J83Jj49J42j51M7J41k83L55j02k01K67
2868A29k39M6K41k60J01n1NK44k68K7O4r7K98k24j28L52l34N0K30l35K58j20l0
2891d1K41j33j29K01k78L04Kk20L20k46O6J80m12J47M3j59K94k23j1K08m06L58
2913A06p3k14L81l45J52J0k75L35j06j38K93l55J92K10m28K36N1j62K03k58K7
2934a58L12m08L60q1k29L91k98P2K30k94J56M7k33J99p9QK43l54K03q8j41K81
2956A39k78J16K53m35K30M9j33J91j44J2K33m17J66j9j15K78j58N1J91l42J33
$$ y = [-28, -36, 155, -186, 150, 36, -240, 168, -77, -98, 281, -234, 216, 104, -313, 140, -158, -92, 185, -268, 34, -70, -223, 142, -64, -134, 84, -169, -20, 24, -197, 152, -115, -117, 152, -164, 107, 4, -229, 148, -86, 2, 137, -226, 10, 197, -207, 159, 27, -10, 154, 5, 35, 217, -121, 62, 63, -86, 56, -95, -48, 93, -190, 165, 63, -138, 129, -110, -64, 177, -83, 18, -33, -28, 216, -52, -25, 39, -58, 240, 16, -112, 240, -94, -44, 186, -149, 109, -11, -41, 200, 67, -62, 139, -139, 165, 167, -53, 267, 21, 87, 267, -145, 2, 45, -114, 180, -43, -54, 154, -252, 106, 33, -181, 200, -145, 7, 17, -258, 77, -29, -167, 126, -229, -37, 173, -255, -19, 32, -130, 73, -185, -158, 154, -254, 106, 25, -204, 187, -111, -39, 191, -103, 53, 100, -133, 66, -13, -5, 238, -116, 87, -1, -142, 139, -139, -23, 230, -205, 25, 74, -59, 132, -12, 0, 233, -184, -18, -37, -152, 126, -32, 19, 210, -132, 1]
2977AP6k55L49p4j72K31k03K9N4k00L38j61M5J69l19O8O9j34J42o3j80L82l33
3000a41J73J14l16K25k04L7K30k76J34J32k42K22j25o7K55l05N8K35k95K44j34
3021d6OL37m40J71J69k52K31j53j77J98p0n0K01k79K99r3j78K84k88J24J88k68
3043h6J29L9j47J53j84Q5L22n12K25j6j01J99j16NJ64k66J88L3k62K29j11K1J23
3066A14l64K21J49k23J54m8l7K55k56m4K58l73K73q9j09K48j65J07Kk06K10j14
3088c7j46K99q6p6K27k65J45q6j23J63l05L18K7j53J34n5j38K47j49P3O6j97J17
3111@j5j76L35k11K6J62k61L30l14j3K59j97P1J18k36J99j43k8K55k07L4J99l75
3134a88L41j07j62K91j59Q1Q8l23K45L4k79J47K7M0M4k84K37J4r3K26l64J58N8
$$ y = [1, 77, -178, 171, 97, -75, 156, -47, -18, 36, -164, 174, 13, 58, 227, -92, -24, 45, -89, 53, -10, -190, 192, -141, 32, 146, -170, 55, -149, -112, 118, -158, -24, 108, -134, 88, -37, -104, 151, -154, -96, 139, -156, 88, -46, -40, 297, -143, 28, 197, -55, 176, 23, -154, 44, -26, -76, 125, -154, 145, 52, -126, 158, -130, -6, 182, -86, 43, 82, -65, 88, -96, -11, 311, -201, 24, 8, -93, 106, -10, -5, 159, -107, 81, 114, -148, 81, -30, -9, 114, -250, -29, 120, -103, 51, 3, -34, 221, -35, -79, 179, -194, 79, -10, -119, 129, -36, 71, 73, -133, 77, -37, -183, 116, 30, -46, 181, -84, 61, -25, -148, 15, -290, 28, 55, -98, 36, -19, -157, 90, -59, 14, 80, -117, 0, -15, -191, 144, -67, -41, 121, -140, 190, -124, -137, 122, -75, -4, 114, -122, 77, -66, -94, 161, -46, -12, 187, -188, 153, 46, -116, 175, 16, 97, 185, -138, 107, 141, -138, 9, 36, 76, 120, -164, 73, 87, -6, 220, -144, 14, 72]
3157G2j90J90o4o8J89k50J18J21j68PM6j96L44r5q9J67k66J63J2j01K12j98R1
3180D7P1k02O9J82j66J04j77J2J31k41K17P8l21K68j0j15J44j69J6J17j72L30
3202B13j98j79K74k25J2J13j68J53o6o5K38k41R9Q3j18K60k31k7K46j58lJ45k58
3225a01K52j35n3J21j83K25Ok46J47l5k07L61k57R5J07j92J03K2j42K69k86J80
3247E1M9k29J55rm4K22l65J02K19k94J10R2o5P1j82Q8K08l68J68K4o5P6j04pK89
3272A92m08K43L4k60L84k35j9J21k32K20n4j85K71j34%R4k33K27m0r4J75k42L3
3295a42J70j66R8J33k20K13n0p0J85k25K83o6j53J18j09k3J31k17J41J7j56K74
3317A66j44l6J02j47K08K1k69K62j55p2J39j73J25J04k19K64k20L5J45j75J96
$$ y = [72, -118, 72, 8, -60, 129, -121, -3, 118, -50, -43, 3, -193, 151, 56, -33, 134, -132, 31, 43, -58, 154, -44, 47, 118, -84, -15, 167, 1, 105, -72, -60, 71, -170, 47, 125, -196, 72, 62, -53, 91, -78, -62, 55, -117, 213, 15, -164, 110, -115, -103, 10, -158, -5, -71, -136, 102, -139, -40, 43, -75, 185, -46, -73, 173, 15, 12, 157, -101, 151, 16, -37, 84, -99, 126, 132, -114, 33, -2, -209, 152, -105, -10, 97, -95, 8, 30, -112, 157, -129, 51, 100, -129, 26, 17, -27, 195, -170, -68, 151, -143, -33, 59, -6, 65, -117, -29, 179, -189, -21, 3, -62, 14, -90, -97, 192, -216, 27, 61, -199, 185, -50, -69, 52, -180, 40, -14, -199, 72, -62, -62, 32, -201, 26, -14, -108, 67, -175, -142, 28, -138, -40, 93, -127, 86, 36, -34, 151, -74, 209, 143, -10, 108, -1, -24, 107, -110, 31, 48, -108, 166, 22, -14, 88, -59, 149, 170, -99, 163, 8, -64, 75, -98, 27, 131, -88, 176, -44, -9, 136, -39, 157]
3338A57l1k48J91r3l3J36j93J40N7j60O2Q9p5J63k57M4O3j99K45j6k77L77k08
3361f6N3J09k50J72l9m9J43j01qJ18k13K21n3o8J16j03n2K06k99J40R1k16K61
3384A13j67p4J72j41K63n5k56K59j29n5K27j59R3rk21K96k50QJ71j68O2M5q5J58
3408I8j24n0J33j27J61m2j80L36k72J81Q3k70J02p6N9J49j94j0J46j18L2J58j94
3431a9J12j06n2J20j60J86n9m8M1j1o7K08k14M9Q4j09J21j00o2O1j69J50Q1o3
3455b6Om6R2O8j71K9K3o0J60j9j85K20j95P3O8q0P7p6n5J29j32J66P0j81J40j43
3481d8m1J57n8k5J11j17O6j09l8K04q4l6J12j46K03l9j60O2j05J65K3j74K03r4
3505C2m5N1j22J09J40k97J71J0m4J36j95N4J61k38O9J34j56O2L4q7K46k91J38
$$ y = [157, 126, -122, 69, -24, -57, 79, -114, 26, 83, -77, -15, 74, -1, 162, -95, -51, 12, -187, 58, 42, -235, 142, -66, -13, 96, -154, 18, -21, -70, 73, -28, -36, 82, -131, 90, 37, -31, 85, -18, -70, 136, -163, -23, 68, -148, 113, -54, -128, 44, -97, 166, 111, -145, 114, -15, -70, 157, -2, 91, 82, -139, 157, -93, -85, 86, -82, -20, 25, -60, 98, -26, -76, 57, -70, 91, 49, -131, 205, -67, 114, 197, -73, 29, -47, 12, 161, -33, -43, 103, -15, 17, 175, -19, 93, -13, -65, 55, -105, 81, 22, -26, 15, 4, -63, 145, -69, -20, 64, -45, 76, -24, -86, -25, -194, -44, 37, -26, -20, -66, 26, 94, -77, -48, -25, -85, 75, 56, -129, 91, -104, -31, 37, -43, 34, -42, -97, 32, -100, 66, 136, -45, 95, -48, -89, 68, 10, -15, 96, -21, 45, -64, -102, 102, 18, -18, 94, -52, 151, 112, -48, 14, -91, 74, 97, -77, 126, 32, -13, 38, -84, 25, 165, -132, 39, 49, 5, 141, -54, 0, 161, -77, -8, 126, -30, 32, 66, -21, 225, -66, 72]
3528G2J1j31Q5mlQr5R4L6j74J62K6j69K54k96J71P5k23J19r0P0Pj46K78j18j68
3554a49J65k0p1K39k11O8J01j95R6o8j19K01j55J14J25k01R8k5j04J77j15K5J04
3577H0j44NJ18j00J00j24O5kj61K25o4K9J32l20J35J40k80J63l3m8K20k24O0J67
3601A39j94J57r1M1K11l19J37K5j90K17p7j34J11n0p0K46k19J03j32J34J13k22
3623f4L1J55k02Q9q7PJ89j09j34J35k7l1J14j44J66j23P8P1j85J88J0k32K16o3
3647D8p1K7j04N1P0r3J00j2j52L11j65O6p2j02K33r1r0J38j86J66Lo3L7q4P5N8
3673I8j61JJ41j05N3j17k2J69n5k3%K1J06r0L2J33k24P7L3j56J46j36N9L9j93
3698a74J30K6p9L6J27n6M5J2q1L3q7M9J6j60K46l9k2L8q4j5P0RNj29O4Q3r8N4
$$ y = [72, 83, -48, 37, 33, 30, 38, -57, 37, 73, -101, 61, 87, -82, 172, -124, 47, 122, -101, 18, -72, -2, 5, -141, 137, 19, -149, 16, -4, -75, 164, -47, 21, 122, -73, 23, -45, -164, 37, -118, -4, 121, -80, 18, -7, -111, 66, -49, -24, 80, -64, -59, 59, -41, 59, -65, 0, -2, -163, 62, -2, 27, 159, -161, -26, 114, -166, -3, -36, -84, 136, -88, -28, 139, -55, 102, 11, 52, 263, -56, 81, 106, -84, 133, 56, -78, 33, -17, -87, 159, -60, 43, -89, 45, 158, -64, -33, 122, -80, 9, -78, -71, 118, 9, -125, 10, -17, -48, 66, -78, 88, -35, 43, 114, -71, 117, 127, -105, 111, 48, -23, 4, -100, -49, 21, -72, 28, 16, -136, 175, 10, 76, 4, -98, 135, 44, -46, 92, -94, 72, 75, 12, 49, -35, 40, 98, -63, -62, 79, -26, 27, -90, -112, 57, 2, -21, -21, 0, 106, 16, 48, 181, -43, 34, 67, -89, 57, -79, -20, 19, -174, -44, -18, -97, -61, 66, 10, 55, 67, -14, 19, -68, -19, -3, -163, 83, 44, 22, 60, -24, -39, 31, 40, 45, -84, -20, 63, -35, 19]
3726A9J9p8J2J4R9o1j41P6j4P4M4j73J49k7j20J46l9j16K26r6q3N9j28K19O5j05
3752D0J01j65J1O3p7J11j13j53K36q7q8J90j19rJ60k09J86j46L9J5j0M3Q4j05
3776bRP3k14O4m4O0R2j63K02l5j3N2j40M7J64j80J21l7p9O1p8j5J51j62L8K3n2
3803e7J47j40rJ33j02J14p3j49K85j10q7K1q0O7J9Qj5j75J76N9qJ04j40K3k7J3
3829cq1J29j11J4J8j12J56j30L5J47l2j1M6j33Q8n3N0l5Q6N3j67%J3L5j13J54
$$ y = [19, 38, -40, -28, -14, 85, 24, -117, -41, -55, 19, 63, -110, 39, 12, -108, 38, -1, -117, 109, 13, -70, -11, -139, 80, 145, 40, 141, -24, -13, 50, -27, 84, -29, -182, 54, -33, -121, 69, -50, -59, 101, -108, 78, -68, -29, -14, -24, 19, 103, -2, 7, 80, -134, -70, -114, -54, 38, -125, 77, 42, 29, 81, -59, -12, 152, -28, 93, 56, -23, 38, -40, -55, 96, -66, -28, -5, -57, 90, -50, -59, 74, -28, 86, 13, -136, 149, 39, -48, -27, -107, -40, -21, -13, -28, -203, -27, 32, 24, 128, -12, 11, -16, -3, -84, 45, -66, -52, -34, -146, 10, -120, -85, 62, 30, 19, 65, -68, 20, -33, 17, -18, 68, 121, -46, -46, -33, 2, -111, 43]
$$ [...]
8191B7
##END NTUPLES=NMR FID
##END=
