##TITLE=1H_65-2023
 CDCl3
 8 sc, 
 4.9.2023
##JCAMPDX= 6.0         $$ Bruker NMR JCAMP-DX V2.0
##DATA TYPE= NMR FID
##DATA CLASS= NTUPLES
##ORIGIN= UXNMR, Bruker Analytische Messtechnik GmbH
##OWNER= root
$$ XWIN-NMR		Version 3.5
$$ Mon Sep  4 13:58:59 2023 Russian Standard Time (UT+4h)  she@DPX200
##.OBSERVE FREQUENCY= 200.13135
##.OBSERVE NUCLEUS= ^1H
##.DELAY= (6, 6)
##.ACQUISITION MODE= SIMULTANEOUS
##.ACQUISITION SCHEME= undefined
##.AVERAGES= 8
##.DIGITISER RES= 18
##SPECTROMETER/DATA SYSTEM= spect
##.PULSE SEQUENCE= zg30
##.SOLVENT NAME= CDCl3
##.SHIFT REFERENCE= (INTERNAL, CDCl3, 0, 15.7039)
##AUDIT TRAIL= $$ (NUMBER, WHEN, WHO, WHERE, WHAT)
$$ ##TITLE= Audit trail, XWIN-NMR		Version 3.5
$$ ##JCAMPDX= 5.01
$$ ##ORIGIN= Bruker BioSpin GmbH
$$ ##OWNER= she
$$ F:/spectra/data/she/nmr/H-F/1/audita.txt
$$ ##AUDIT TRAIL=  $$ (NUMBER, WHEN, WHO, WHERE, WHAT)
(   1,<2023-09-04 13:57:55.93 +0400>,<she>,<DPX200>,
      <created by zg, POWCHK disabled, PULCHK disabled
       configuration hash MD5:
       00 E9 B6 7A A2 85 ED C7 34 08 36 98 17 FE 4E 26
       data hash MD5: 16K
       DA 5A 01 FF 65 49 CF 52 FA F3 BA 02 AF 44 D8 D5>)
$$ ##END=
$$ 
$$ hash MD5
$$ 91 51 59 D8 CB D5 67 5A B4 A6 88 23 2E 0D 7E D2
##$RELAX= 
##$RELAX= 
##$RELAX= 
##$RELAX= 
##$RELAX= 
##$RELAX= 
$$ Bruker specific parameters
$$ --------------------------
##$DU= <F:/spectra>
##$EXPNO= 1
##$NAME= <H-F>
##$PROCNO= 1
##$TYPE= <nmr>
##$USER= <she>
##$AMP= (0..31)
100 100 100 100 100 100 100 100 100 100 100 100 100 100 100 100 100 100 
100 100 100 100 100 100 100 100 100 100 100 100 100 100 
##$AQSEQ= 0
##$AQ_mod= 1
##$AUNM= <au_zg>
##$AUTOPOS= <>
##$BF1= 200.13
##$BF2= 200.13
##$BF3= 200.13
##$BF4= 200.13
##$BF5= 200.13
##$BF6= 200.13
##$BF7= 200.13
##$BF8= 200.13
##$BYTORDA= 1
##$CFDGTYP= 0
##$CFRGTYP= 5
##$CHEMSTR= <none>
##$CNST= (0..31)
1 1 145 1 1 1 1 1 1 1 1 1 1 1 1 1 1 1 1 1 1 1 1 1 1 1 1 1 1 1 1 1 
##$CPDPRG= <>
##$CPDPRG1= <>
##$CPDPRG2= <>
##$CPDPRG3= <>
##$CPDPRG4= <mlev>
##$CPDPRG5= <mlev>
##$CPDPRG6= <mlev>
##$CPDPRG7= <mlev>
##$CPDPRG8= <mlev>
##$CPDPRGB= <>
##$CPDPRGT= <>
##$D= (0..31)
0 1.2 0 0 0 0 0 0 0 0.06 0 0.03 0 0 0 0 0.0002 0 0 0 0 0 0 0 0 0 0 0 0 
0 0 0 
##$DATE= 1693821475
##$DBL= (0..7)
120 120 120 120 120 120 120 120 
##$DBP= (0..7)
150 150 150 150 150 150 150 150 
##$DBP07= 0
##$DBPNAM0= <>
##$DBPNAM1= <>
##$DBPNAM2= <>
##$DBPNAM3= <>
##$DBPNAM4= <>
##$DBPNAM5= <>
##$DBPNAM6= <>
##$DBPNAM7= <>
##$DBPOAL= (0..7)
0.5 0.5 0.5 0.5 0.5 0.5 0.5 0.5 
##$DBPOFFS= (0..7)
0 0 0 0 0 0 0 0 
##$DE= 6
##$DECBNUC= <off>
##$DECIM= 32
##$DECNUC= <off>
##$DECSTAT= 4
##$DIGMOD= 1
##$DIGTYP= 9
##$DL= (0..7)
0 120 120 120 120 120 120 120 
##$DP= (0..7)
150 150 150 150 150 150 150 150 
##$DP07= 0
##$DPNAME0= <>
##$DPNAME1= <>
##$DPNAME2= <>
##$DPNAME3= <>
##$DPNAME4= <>
##$DPNAME5= <>
##$DPNAME6= <>
##$DPNAME7= <>
##$DPOAL= (0..7)
0.5 0.5 0.5 0.5 0.5 0.5 0.5 0.5 
##$DPOFFS= (0..7)
0 0 0 0 0 0 0 0 
##$DQDMODE= 0
##$DR= 18
##$DS= 0
##$DSLIST= <SSSSSSSSSSSSSSS>
$$ [...]
##$SUBNAM2= <"">
##$SUBNAM3= <"">
##$SUBNAM4= <"">
##$SUBNAM5= <"">
##$SUBNAM6= <"">
##$SUBNAM7= <"">
##$SUBNAM8= <"">
##$SUBNAM9= <"">
##$SW= 18.05172834244
##$SWIBOX= (0..15)
0 0 2 0 0 0 0 0 0 0 0 0 0 0 0 0 
##$SW_h= 3612.71676300578
##$TD= 16384
##$TD0= 1
##$TE= 0
##$TE2= 300
##$TE3= 300
##$TEG= 300
##$TL= (0..7)
0 120 120 120 120 120 120 120 
##$TP= (0..7)
150 150 150 150 150 150 150 150 
##$TP07= 0
##$TPNAME0= <>
##$TPNAME1= <>
##$TPNAME2= <>
##$TPNAME3= <>
##$TPNAME4= <>
##$TPNAME5= <>
##$TPNAME6= <>
##$TPNAME7= <>
##$TPOAL= (0..7)
0.5 0.5 0.5 0.5 0.5 0.5 0.5 0.5 
##$TPOFFS= (0..7)
0 0 0 0 0 0 0 0 
##$TUNHIN= 0
##$TUNHOUT= 0
##$TUNXOUT= 0
##$USERA1= <user>
##$USERA2= <user>
##$USERA3= <user>
##$USERA4= <user>
##$USERA5= <user>
##$V9= 5
##$VALIST= <valist>
##$VCLIST= <CCCCCCCCCCCCCCC>
##$VD= 0
##$VDLIST= <DDDDDDDDDDDDDDD>
##$VPLIST= <PPPPPPPPPPPPPPP>
##$VTLIST= <TTTTTTTTTTTTTTT>
##$WBST= 1024
##$WBSW= 4
##$XGAIN= (0..3)
0 0 0 0 
##$XL= 0
##$YL= 0
##$YMAX_a= 301317
##$YMIN_a= -339877
##$ZGOPTNS= <>
##$ZL1= 120
##$ZL2= 120
##$ZL3= 120
##$ZL4= 120
##$ABSF1= 10
##$ABSF2= 0
##$ABSG= 5
##$ABSL= 3
##$ALPHA= 0
##$AQORDER= 0
##$ASSFAC= 0
##$ASSFACI= 0
##$ASSFACX= 0
##$ASSWID= 0
##$AUNMP= <proc_1d>
##$AZFE= 0.1
##$AZFW= 0.1
##$BCFW= 1
##$BC_mod= 2
##$BYTORDP= 1
##$COROFFS= 0
##$CY= 11.3945322036743
##$DATMOD= 1
##$DC= 2
##$DFILT= <>
##$DTYPP= 0
##$F1P= 15.7292609196834
##$F2P= 12.9074282941183
##$FCOR= 0.5
##$FTSIZE= 0
##$FT_mod= 4
##$GAMMA= 1
##$GB= 0.15
##$INTBC= 1
##$INTSCL= 1
##$ISEN= 128
##$LB= 0.24
##$LEV0= 0
##$LPBIN= 0
##$MAXI= 10000
##$MC2= 0
##$MEAN= 0
##$ME_mod= 0
##$MI= 1.114404
##$NCOEF= 0
##$NC_proc= 0
##$NLEV= 6
##$NOISF1= 3.799351
##$NOISF2= 2.8
##$NSP= 1
##$NTH_PI= 0
##$NZP= 0
##$OFFSET= 15.70392
##$PC= 1
##$PHC0= -21044.97
##$PHC1= 9.25272
##$PH_mod= 1
##$PKNL= yes
##$PPARMOD= 0
##$PSCAL= 0
##$PSIGN= 0
##$REVERSE= no
##$SF= 200.130013532006
##$SI= 16384
##$SIGF1= 3
##$SIGF2= 2
##$SINO= 400
##$SIOLD= 16384
##$SREGLST= <1H.CDCl3>
##$SSB= 0
##$STSI= 0
##$STSR= 0
##$SW_p= 3612.71676300578
##$SYMM= 0
##$S_DEV= 0
##$TDeff= 0
##$TDoff= 0
##$TI= <>
##$TILT= no
##$TM1= 0
##$TM2= 0
##$TOPLEV= 0
##$USERP1= <user>
##$USERP2= <user>
##$USERP3= <user>
##$USERP4= <user>
##$USERP5= <user>
##$WDW= 1
##$XDIM= 8192
##$YMAX_p= 0
##$YMIN_p= 0
$$ End of Bruker specific parameters
$$ ---------------------------------
##NTUPLES= NMR FID
##VAR_NAME=  TIME,          FID/REAL,        FID/IMAG
##SYMBOL=    X,             R,               I
##VAR_TYPE=  INDEPENDENT,   DEPENDENT,       DEPENDENT
##VAR_FORM=  AFFN,          ASDF,            ASDF
##VAR_DIM=   8192,          8192,            8192
##UNITS=     SECONDS,       ARBITRARY UNITS, ARBITRARY UNITS
##FACTOR=    0.0002768,     1,               1
##FIRST=     0,             0,               0
##LAST=      2.2672688,     0,               0
##MIN=       0,             -339877,         0
##MAX=       2.2672688,     301317,          0
$$ Real data points
##PAGE= N=1
##DATA TABLE= (X++(R..R)), XYDATA
0 0 0 0 0 0 0 0 0 0 0 -8 8 -8 8 -8 16 -16 23 -24 32 -40 42 -56 64 -72 88 -103 118 -136 157 -178 206 -234
32 -234 264 -301 339 -381 427 -480 536 -598 663 -736 818 -906 1002 -1106 1221 -1345 1482
49 1482 -1633 1798 -1982 2184 -2413 2664 -2950 3278 -3653 4091 -4607 5229 -5994 6964 -8235
64 -8235 9984 -12546 16683 -24475 44320 -204644 -339877 88023 228651 220307 -89031 -202637
76 -202637 -77742 45572 212050 240732 -2234 -145841 -191485 32100 285568 127380
86 127380 -130655 -212754 -108931 175678 188782 14789 -88745 -180826 -62073 137067 144898
97 144898 66255 -177613 -290371 -53739 135894 172717 22413 -218703 -163260 8376 147773
108 147773 239944 66214 -108953 -106649 -16397 197292 191836 -38066 -129215 -128104 1554
119 1554 121229 24212 -41001 -99757 -126535 36963 114899 75011 -32152 -184451 -64579
130 -64579 127476 112312 23467 -128633 -136051 14920 48173 88441 75406 -57571 -79107
141 -79107 -44685 80154 205562 57069 -91612 -82908 -14651 102596 45474 -65119 -41257
152 -41257 -65734 -46361 12246 825 24833 -40410 -90855 38021 84341 45323 -21970 -90254
164 -90254 17332 82490 22867 10853 -42451 -46341 4423 -3556 65615 63586 -46197 -43621
176 -43621 -16703 44338 84661 -17232 -34375 -11052 -37601 3178 -9327 -18233 9057 -53228
188 -53228 -25682 31009 -2688 6974 -10665 6825 72387 8704 -16301 12430 -7324 24577
200 24577 4466 -14576 30064 -30510 -51017 3483 11436 38832 -9690 -51207 24270 15411
212 15411 -10920 1175 -13045 31826 5392 -57636 -1313 9477 -2243 3667 -21630 32505
224 32505 28433 -44841 -3447 30326 41515 30075 -47474 -13314 29994 -14881 -4369 -10042
236 -10042 -4297 13252 -49938 -21797 34001 -451 -1541 -17067 860 51402 -13320 -28881
248 -28881 15258 9572 29257 -5136 -28818 19269 -14450 -15838 27646 10222 15238 -23784 -43774
261 -43774 33741 25496 -3453 -3191 -30738 6591 4828 -25175 20762 -506 -25110 -1417 -6792
274 -6792 31760 14089 -45192 4068 27921 23187 17185 -34484 -3814 20822 -12747 21021 15775
287 15775 -13512 -17184 -45523 15478 58558 -11190 -33045 -34037 -1838 46551 -5500 -13866 10262
300 10262 -21635 -984 9275 15526 35272 -35979 -41303 28774 33392 25982 -29196 -51225 24449
313 24449 23201 7016 13145 -24057 -11665 -11977 -8811 55375 18773 -42750 -37582 -20285 47719
326 47719 41030 -34640 -22782 -17154 -1615 34880 8957 12735 -6320 -47991 12919 44998 25283
339 25283 -3215 -59912 -16229 40419 10698 5549 -22655 -36341 2835 -1514 29275 38848 -33515
352 -33515 -35742 -5702 32462 62325 -14564 -46270 -7831 -2660 28502 17139 -15519 -4250
364 -4250 -37169 -16502 48384 28325 -66 -40893 -39758 44704 37693 -6907 -16264 -37902 -1651
377 -1651 13146 -3551 26650 -8856 -43062 -5564 18586 55913 24407 -49189 -13195 23037
389 23037 29670 27652 -25658 -20023 -4435 -25864 15086 19671 -13449 -24337 -45960 10186 56360
402 56360 2119 -19527 -24482 -5160 39249 6732 -3671 5621 -29568 -9132 12696 18201 29318
415 29318 -28164 -32534 27606 30155 27977 -5502 -29961 14288 4879 -3053 13384 -21531 -25096
428 -25096 -26373 -21342 32222 4707 -38296 -18380 -5086 35615 30041 -17060 6274 5613 -1134
441 -1134 24169 8337 12356 -3742 -40477 8976 31489 7072 -5823 -33804 4090 37081
453 37081 -2719 -1535 -6596 -16457 2926 -15345 400 12298 -40042 -33574 -4768 14084 29664
466 29664 -22427 -26331 23130 21393 29223 16360 -3645 18331 -4827 -2620 33001 3714 -15230
479 -15230 -28902 -22670 32747 11358 -27849 -15427 -15234 14835 17277 -13398 5476 -13024 -27944
492 -27944 7175 8047 12637 -11758 -49318 2038 31247 18379 12784 -18618 3004 30242 10761
505 10761 30452 18142 -16862 -10836 -14378 17998 27315 -35927 -40920 -18770 1113 25779 -12734
518 -12734 -22723 -172 -14312 10949 25847 7520 2175 -34535 -17329 39854 21638 -3311
530 -3311 -26349 -26358 29115 25531 7462 15057 -12699 -6096 10265 13669 37836 -7076 -50323 -18859
544 -18859 2116 23447 945 -49806 -23120 -3575 2055 25387 3129 -3706 -7002 -19117 33367
557 33367 43934 1007 -17639 -32719 9141 41956 131 -10311 -16526 -18944 16383 13449 17763
570 17763 13207 -36918 -20206 17768 25559 20814 -36119 -45207 2038 5670 14113 1479 -25948
583 -25948 -9127 -11214 10048 48231 12288 -14796 -18185 -2740 47014 23376 -21037 -16290 -19991
596 -19991 5492 17665 -4831 2899 -21011 -31981 15347 26551 21690 -8860 -46333 -352
608 -352 29115 15136 6624 -27612 -21773 1413 -3902 25789 19169 -21673 -18852 -10679 28581 46178
622 46178 -9762 -21615 -8489 1563 25856 -288 -13237 -5114 -28574 -5976 19908 8670
634 8670 1867 -32400 -20455 33860 25274 7875 -11957 -25348 10680 11851 6438 19126 -15076
647 -15076 -25561 -11088 2457 37422 9584 -31075 -12417 -1791 19420 19694 -13192 -1566
659 -1566 -7293 -17081 12217 7602 1958 -9194 -31468 8715 26663 2044 -2296 -17629 1312
672 1312 25317 1807 9626 5542 -18955 -5361 -3690 14410 23633 -23882 -25774 -4278 3036
685 3036 21171 -3101 -11622 6292 -14351 -3922 14151 6482 11474 -16769 -19998 17423 7204
698 7204 576 -1611 -10699 14015 2875 -9448 14908 2009 -3413 -1240 -7484 20053 6346
711 6346 -23239 -6244 -4498 6591 9619 -14560 1362 -2337 -20041 4790 10348 15383 7654
724 7654 -28827 -7553 14924 7784 15929 -4462 -8301 1779 -15870 8517 24345 118 -6216
737 -6216 -21720 -4562 27277 744 -7516 -5215 -12376 9463 1691 -1881 11115 -18660 -16102
750 -16102 9179 12916 20195 -15298 -33756 5110 14472 19988 11402 -19935 -9784 -8646 -844
763 -844 35525 16890 -12669 -25503 -25803 24089 33060 -2796 -11546 -24777 -8260 17865 6238
776 6238 13233 -3770 -31584 -3747 14845 23983 11151 -35823 -19915 14330 17175 20304 -13204
789 -13204 -27037 -5581 -4076 24305 31035 -10816 -25220 -28264 7302 50886 16361 -17198 -26619
802 -26619 -23274 19274 24071 7425 2771 -31833 -23903 13905 22685 25102 -15939 -39718 2718
815 2718 19707 21235 5059 -30424 -13868 785 6609 27710 -713 -27231 -21912 -7858 39035
828 39035 35837 -15451 -25094 -20622 11931 39982 11079 -2889 -18499 -31963 6509 24098 19564
841 19564 890 -42280 -20997 20176 19789 14672 -17762 -25007 5941 4605 14517 12323 -21171
854 -21171 -17535 -9375 12562 36236 -5205 -29390 -13953 4181 37779 21470 -12253 -8408 -16726
867 -16726 1424 27979 13139 2742 -26596 -35851 11451 21476 8404 -9115 -32912 -4000
879 -4000 14638 4976 12974 -7190 -15933 471 1134 21852 11217 -26391 -13962 2404 19747
892 19747 24406 -14685 -15950 149 2284 24498 14370 -4491 -7911 -25097 759 27341 4647
905 4647 -10116 -29005 -19777 17289 6351 -1530 -2099 -16871 1481 7301 7723 19572 -9913 -16842
919 -16842 6791 10786 20038 -3978 -26477 1408 7392 10652 13017 -11090 -5390 -4502 -5735 24144
933 24144 12306 -10826 -15324 -21262 10119 18054 -10395 -8959 -14627 -8175 11450 -38 8055
946 8055 5575 -15865 3376 12983 13061 11647 -18003 -7619 14305 4274 6333 -7980 -14147 4388
960 4388 -4651 5015 15090 -8354 -8281 -9059 28 23673 -494 -14724 -5791 -9412 7736 3268
974 3268 -8608 6204 -8067 -8940 10223 5152 12071 -29 -13264 13035 10284 756 2094 -11753
988 -11753 3105 4792 -10956 5113 -1275 -9135 -301 -7746 8997 11401 -12442 -1066 1114
1001 1114 1472 9186 -9787 -1359 7329 -10517 -817 132 -1106 9339 -8991 -2228 12690 -2344
1015 -2344 2986 840 -573 13272 -7072 -8616 6781 -2787 2204 -4715 -11256 8392 -2961 -5447
1029 -5447 8038 -2202 3167 -1505 -7410 15967 4799 -8698 -1652 -7440 7695 6497 -11753
1042 -11753 2625 -3112 -7038 6900 -144 8130 3235 -16643 3630 9926 4275 4762 -15283 -4222
1056 -4222 8847 -3823 5571 -433 -9472 1192 -6217 8212 17647 -8555 -8406 -4687 2605 19425
1070 19425 -2638 -11061 -1722 -10144 4147 7143 -1854 3957 -14563 -10605 14698 8522 6035 -7115
1084 -7115 -15316 11304 9091 1467 4585 -11553 -3687 2485 -806 15832 -1030 -17430 -3803
1097 -3803 242 17195 11167 -17046 -7254 -2944 1462 14710 -2107 -4579 -6189 -17241 8088
1110 8088 14877 1527 -2624 -18165 -1129 19424 3469 2781 -5243 -9417 9005 2738 5607 7992
1124 7992 -16039 -7937 3739 7559 15105 -12057 -18766 2307 2929 12529 4187 -13662 -3311 -7982
1138 -7982 -328 18533 2019 -5663 -11569 -11556 17777 12194 -4712 -2928 -10696 4237 11612 -1497
1152 -1497 6700 -4713 -11624 6564 4872 9011 -85 -21316 -1385 9437 5580 5990 -14787 -9907
1166 -9907 4042 -2095 11317 5633 -10890 -5281 -8878 7933 20128 -4829 -7625 -6282 -2204
1179 -2204 15394 1340 -4245 2362 -9381 1770 7722 131 5185 -10907 -8451 13412 5166
1192 5166 1899 -7100 -14338 8045 5989 -433 4396 -11048 -6563 987 -119 15150 1343 -14525
1206 -14525 -2248 -685 11264 9769 -11214 -1203 31 -2398 8843 -2461 -1622 674 -10262
1219 -10262 7117 9214 -3993 -1498 -9347 4051 16273 -3003 -3083 -4601 -7232 8333 936 259
1233 259 3134 -15157 -5504 5578 4414 10025 -9005 -10976 7980 2863 6423 2009 -9045 3616
1247 3616 -1288 -1191 10234 -4783 -6143 -1705 -1689 15460 3307 -11563 -1564 -1850 9265 10302 -7770
1262 -7770 -1906 -6657 -8265 9119 2961 -16 -5839 -17972 3901 11681 2148 2500 -10181 -2022
1276 -2022 11109 945 6863 1139 -10143 1563 116 6442 9035 -13634 -7968 3110 5331
1289 5331 13489 -5007 -10987 1607 -2712 7985 8353 -7107 -4884 -13028 -4862 15095 1683 -5488
1303 -5488 -9389 -10312 12348 9584 -167 3917 -7335 136 9417 3535 9735 -4745 -14584 3159
1317 3159 5094 7533 447 -17222 -2701 5115 3445 9479 -5623 -8170 -1654 -4845 11475 8275
1331 8275 -10837 -8767 -10357 4097 15275 -3992 -5012 -4181 -4049 12726 7119 3430 3780 -10843
1345 -10843 505 11416 4395 3866 -12932 -11867 7989 2530 2529 -2919 -13212 654 1733 3301
1359 3301 11290 -6600 -9408 -2110 337 14573 1297 -13957 -4371 -3771 6913 10255 -4903 -166
1373 -166 -3374 -3820 13584 7786 2160 -2634 -12690 5390 10183 -1756 -1813 -12197 -6021 6275
1387 6275 -1715 3448 -1114 -11085 1250 2913 7678 9120 -11511 -6748 3281 3344 9980 -4438
1401 -4438 -10122 456 -3638 6359 9607 -3281 -732 -6517 -658 15747 3333 -3097 -4885 -8499
1415 -8499 6931 3447 -4709 470 -9430 -4141 4500 -100 6627 -3065 -10056 5802 5412 6005 2643
1430 2643 -11075 162 3857 -628 6445 -3993 -6148 -830 -4825 8718 8190 -5940 -1782 -3948
1444 -3948 3328 11048 -3547 -1760 -963 -6298 3922 -589 -2031 2797 -8864 -1304 5835 -375
1458 -375 3517 -4702 -3514 9375 444 298 452 -6947 2882 153 -1943 6313 -5089 -4834 1180
1473 1180 -1009 8815 1630 -6534 4011 -487 1715 4251 -4847 3077 110 -6401 3505 -2240 -2026
1488 -2026 1518 -5272 4974 3571 -6730 671 -1150 2520 7177 -5421 -1052 606 -5490 4556
1502 4556 852 -349 3019 -7799 149 6887 -88 3537 -3169 -2381 8029 -1533 -607 1415 -5555
1517 -5555 3021 112 -2094 4381 -7901 -5513 3251 1080 7196 -2557 -10091 2090 662 4510
1531 4510 6434 -5581 -1416 -2709 -3389 9931 2865 -2402 -1612 -6916 6521 7036 -3402 848 -4304
1546 -4304 -591 6994 -2088 1110 -2017 -9259 3451 3706 2033 835 -12519 -3738 6409 3029
1560 3029 6139 -4667 -8548 1827 -252 7433 8386 -5897 -3824 -4243 1628 12777 -223 -4887
1574 -4887 -2469 -4561 7274 3943 -3828 520 -6584 -1108 7773 305 1134 -6630 -9206 7592 5967
1589 5967 1922 -1854 -12082 -489 5614 2763 7273 -4309 -8519 192 692 11276 6524 -8747
1603 -8747 -3587 -2229 4054 9916 -3992 -4061 -2380 -5062 6592 3306 -3035 -1441 -8367 2213 10155
1618 10155 10 -1158 -7880 -5221 9318 3265 1135 -1925 -10931 -880 3879 4299 7545 -7266
1632 -7266 -8413 2009 3081 10578 2209 -8398 -475 -1410 3066 7104 -4280 -2916 -3851 -4113 9009
1647 9009 1995 -4675 -2958 -6034 6628 8478 -2709 -1230 -6628 -2989 7526 1455 2027 -3521
1661 -3521 -11808 817 4963 4946 4794 -8744 -3787 5092 3020 8285 132 -5995 706 -2764 3861
1676 3861 6023 -6186 -4023 -3748 -498 8966 -1692 -5066 -944 -3318 6886 4961 -2737 -163
1690 -163 -7069 -2477 7085 1048 1038 -5218 -9423 4846 4544 3070 3181 -6038 824 4600 1439 7352
1706 7352 -1378 -5855 399 -2385 4317 1989 -9208 -2553 -1673 935 6322 -4117 -2452 377 -2942
1721 -2942 6713 3401 -2633 -839 -7297 374 7125 -1387 108 -4125 -4150 6669 2202 2400 3649
1736 3649 -4550 2243 3423 864 5407 -5291 -5825 1597 -2063 2468 -2341 -8237 784 -638 975
1751 975 5230 -3500 -121 394 -1508 7787 1485 -3842 -703 -4411 3284 4295 -4046 1162 -2061
1766 -2061 -1075 6487 148 2191 1905 -5122 3623 2722 -1030 1031 -7528 -2849 2765 -3456 856 -2770
1782 -2770 -5078 3109 -721 2442 5029 -3962 1033 1525 564 6378 -2942 -3831 1672 -2622 2932 874
1798 874 -4519 2232 -1742 551 6345 -1380 540 -508 -3714 5634 361 -3794 -764 -6221 180
1813 180 2245 -3854 1849 -2291 -2871 4998 434 3210 2318 -4566 3187 2927 -46 2411 -5480 -1920
1829 -1920 2833 -2288 2789 -976 -4357 2124 -968 3565 5539 -4511 -970 -640 -964 5645 -2910
1844 -2910 -4345 -595 -4980 2197 2164 -2993 1984 -2987 -142 7137 346 1384 -920 -3982 5842
1859 5842 1891 -1336 503 -6501 -474 3267 -678 3873 -2669 -5309 2792 1094 5160 2967 -6725
1874 -6725 -532 -321 -14 4884 -3952 -3607 -1067 -4182 4433 2450 -2909 644 -3407 2555 7349 -1574
1890 -1574 29 -2155 -2850 5847 834 -759 -242 -7382 815 4215 1152 3961 -5075 -4486 4149 1334
1906 1334 4588 551 -6635 234 -1551 503 4531 -4540 -3017 -1104 -2413 6283 790 -3557 993
1921 993 -1865 4218 5445 -2870 489 -2454 -2293 6121 213 -260 -1634 -6914 2828 4232 627 2275
1937 2275 -5791 -2252 3787 -576 3614 -696 -5846 548 -1560 1391 3526 -5697 -1478 337 -118
1952 -118 5896 -1623 -2967 2279 -1181 4488 3486 -3382 546 -3230 -321 6653 -1060 -1189 -2525
1967 -2525 -4972 4693 2147 -1008 1328 -5406 -394 3167 -1195 3003 -2437 -4697 2704 -553 2016
1982 2016 1193 -5916 1625 2134 271 4364 -3096 -1920 2570 -884 5171 1602 -4711 174 -2267
1997 -2267 2371 5623 -3442 -1924 -2155 -2731 5217 -122 -1854 302 -5390 1395 3576 -1395 1766
2012 1766 -4025 -2426 5092 -282 1414 -622 -4973 3433 1861 759 3327 -4731 -1423 2545 385
2027 385 5566 -1304 -5238 991 -1160 3218 3792 -5189 -1308 -2341 -1414 5323 -1352 -2027 -1102 -4503
2043 -4503 3996 3228 -2134 727 -3751 187 5543 -798 1184 -1773 -4287 4159 1480 1191 1779 -6161
2059 -6161 -193 3339 919 4447 -3337 -4206 2194 -551 3440 1475 -5539 -809 -1972 115 5309
2074 5309 -3018 -2423 -875 -2217 5793 1783 -2798 737 -3298 2068 4810 -1793 869 -3115 -3215
2089 -3215 5211 1031 646 -225 -6074 2242 3627 661 2921 -4762 -2747 2772 -435 3527 -527
2104 -527 -6662 -251 -1266 1919 4472 -4901 -1933 105 -227 6489 443 -2438 867 -2954 3676
2119 3676 4400 -2748 -202 -3969 -1251 5931 -284 -291 -1512 -4735 4033 3155 301 1773 -5942 -1847
2135 -1847 3007 44 3353 -2934 -6558 846 -363 3130 3148 -4987 -495 488 943 6703 -726 -2344
2151 -2344 627 -2687 4501 2860 -3686 -536 -3937 421 5748 -1285 -449 -2050 -3961 4956 2485
2166 2485 340 327 -6769 -931 3076 -56 2421 -4145 -5143 2146 -6 3728 2675 -4297 683 101
2182 101 1372 6049 -2020 -1884 49 -1963 4481 511 -4067 -67 -3315 1291 4297 -2293 351
2197 351 -2391 -2653 5139 998 -199 -519 -6222 697 2195 -574 2559 -3890 -3067 2526 -573 4003
2213 4003 1814 -3179 2117 7 1190 3867 -3334 -609 507 -2026 3212 -1251 -3302 1119 -2510
2228 -2510 2359 3113 -3065 340 -1906 -915 4913 -1093 -875 -614 -4580 2247 1002 -1242 1921 -3190
2244 -3190 -393 3108 -1012 2974 300 -2049 3870 -448 195 1239 -4326 1338 1295 -1479 2164 -3558
2260 -3558 -2742 2181 -928 3374 985 -4039 819 -1128 806 4109 -2959 -1014 -619 -3056 3291
2275 3291 -47 -1560 1788 -2592 2080 3439 -1817 1881 -974 -667 4922 -1020 -891 -768 -4561 2531
2291 2531 1924 -1038 1239 -4894 -2030 3035 73 3672 -872 -4760 1239 -516 2070 3092 -4036
2306 -4036 -683 -474 -1217 4615 -762 -1756 1212 -1854 3816 2824 -2739 737 -2060 459 4877 -1495
2322 -1495 -943 -2257 -4454 3501 1695 -253 467 -5705 -742 3072 281 3509 -1896 -4035 1738
2337 1738 -692 2636 2069 -4392 66 -156 61 4324 -2142 -1505 1174 -1108 4532 1229 -3111 384
2353 384 -2341 1384 4457 -2250 -994 -2919 -3389 4203 1138 -256 -74 -5320 888 2917 118 2768
2369 2768 -2884 -2661 2062 -817 2666 863 -3848 1211 344 1013 3402 -3187 -756 1652 -443 4035
2385 4035 -351 -3551 66 -1997 2419 3379 -3460 -851 -2801 -1676 4729 -78 -526 -719 -4078 2395
2401 2395 2251 -377 1998 -3461 -996 3214 -500 2094 -881 -3480 2811 932 1262 1974 -4303 -146
2417 -146 1629 491 3891 -2206 -3820 379 -1256 3304 2269 -4096 -827 -2409 -27 4573 -980
2432 -980 -846 -1120 -3097 3944 1706 -862 813 -3894 695 3810 -379 1493 -2284 -2887 3444 960
2448 960 1563 488 -4890 404 1550 899 3266 -3317 -3589 402 -870 3840 833 -4003 -658 -2122
2464 -2122 1293 4236 -1990 -839 -1371 -1766 4621 1330 -761 249 -3382 1904 3380 -506 1139
2479 1139 -3258 -2157 3534 465 1832 -543 -4931 968 929 914 2737 -4195 -2199 431 -689 3829
2495 3829 -46 -3370 141 -1644 2038 3274 -2265 -168 -1384 -848 4518 -5 -725 27 -2800 2597
2511 2597 2519 -1039 771 -3083 -1189 3003 -536 1375 -1261 -3980 1559 589 716 1728 -3865 -522
2527 -522 1088 -670 3073 -983 -2621 911 -1038 2231 2045 -2841 680 -739 227 4021 -1166 -673
2543 -673 109 -2038 3069 1124 -1757 683 -2976 2 2502 -1652 715 -1503 -2436 2781 -286 299
2559 299 804 -3376 1088 1514 -391 2128 -2424 -1426 1946 -612 2327 438 -2977 1273 -62 934
2575 934 2977 -2283 -401 232 -1241 3148 -393 -1894 315 -2345 1240 1767 -2088 503 -1637 -1017
2591 -1017 3303 -761 -86 -320 -2970 2268 1180 -502 1419 -3089 -263 2711 -416 2313 -802
2606 -802 -2685 2020 1 1329 2074 -3001 82 -15 -807 2676 -1682 -1755 489 -1780 1826 922 -2703
2623 -2703 705 -1424 347 3295 -1383 -57 -660 -1968 3053 783 -400 592 -2923 796 2649
2638 2649 -295 2014 -1628 -1748 2444 -239 1386 868 -3196 808 83 -212 1878 -2729 -1415 809
2654 809 -1077 2350 -210 -2671 785 -1167 1313 2611 -2140 -69 -896 -925 3612 19 -961 9
2670 9 -2559 2021 2140 -1017 1134 -2119 -957 2802 -422 946 -630 -3064 1614 272 -188 939
2686 939 -3621 -571 1200 -313 2414 -1306 -2467 1082 -427 2372 2018 -2944 -5 -936 351 3898
2702 3898 -871 -974 -326 -2105 2870 1611 -1129 421 -2693 99 2665 -978 659 -1919 -2674 2396
2718 2396 190 485 105 -3814 19 1600 449 2556 -2419 -2311 1428 -38 3070 1191 -3000 -59
2734 -59 -827 969 3479 -1485 -835 -620 -1478 3225 1010 -1286 218 -2887 801 2545 -1103 451
2750 451 -2435 -1936 2483 -167 511 -199 -3546 1041 1426 536 2077 -2480 -1541 1654 -173 3078 193
2767 193 -2711 639 -896 1248 2788 -1847 -444 -651 -1233 3048 -312 -1152 52 -2398 1369 1266
2783 1266 -1650 496 -1916 -565 2773 -823 407 -290 -2662 1880 1083 173 1620 -2453 29 1725
2799 1725 -264 2157 -824 -2159 1456 -641 1271 1245 -2635 255 -314 -457 2568 -1653 -1300 380
2815 380 -1415 2003 591 -2171 409 -1395 584 2542 -1488 231 -690 -1410 2815 701 36 649
2831 649 -2581 1262 2044 -426 1466 -1974 -1626 1986 -342 1351 -57 -3145 554 25 86 1708
2847 1708 -2552 -1091 563 -603 2578 -305 -2396 294 -1229 1884 2448 -1960 -402 -824 -561 3575
2863 3575 305 -153 -321 -2466 2029 1875 -333 676 -2886 -1069 2282 22 1352 -909 -3321 1097
2879 1097 142 1053 1566 -3080 -769 371 -115 2935 -1012 -2083 612 -903 2563 2076 -1995 -166
2895 -166 -1404 183 3649 -311 -332 -843 -2220 2389 1555 -248 351 -3321 -418 2021 -319 1326
2911 1326 -1377 -2864 1221 -168 1275 965 -2851 9 457 105 2592 -1345 -1387 661 -786 2292
2927 2292 1298 -1898 417 -1284 508 3043 -1160 1 -874 -2134 2360 570 -284 247 -2820 14
2943 14 1344 -593 1182 -1823 -1652 1484 -475 962 676 -2129 1129 170 51 2073 -1779 -289
2959 -289 898 -458 2143 17 -1676 840 -1063 855 1938 -1901 231 -886 -1247 2423 -498
2974 -498 -519 252 -2534 759 554 -1103 1139 -1386 -428 1712 -1198 752 55 -1417 1970 163 -121
2991 -121 1017 -2097 556 1116 -449 1709 -1133 -1557 1372 -692 1274 1057 -2015 402 -733 -374
3007 -374 2012 -1428 -427 281 -1883 1650 -116 -1256 1092 -1353 823 1796 -1676 773 -349 -743
3023 -743 2562 -164 -193 400 -2273 1258 1305 -349 1337 -1961 -1229 1568 -811 1367 235 -2273 809
3040 809 -688 -127 1391 -1984 -150 354 -1155 1892 -703 -1281 1310 -907 1394 1176 -1523 624
3056 624 -511 -1 2556 -642 -440 -77 -2007 1834 722 -267 930 -2074 -457 1327 -948 1291
3072 1291 -466 -1786 1134 -1026 81 941 -1893 689 595 -776 1948 -1199 -881 1407 -578 1822
3088 1822 835 -1925 690 -593 418 2196 -1476 -80 -430 -1526 1905 -23 -812 980 -1990 348
3104 348 1038 -1483 895 -828 -795 1754 -896 -98 416 -1689 1591 591 -374 1115 -2014 -268 1675
3121 1675 -289 1636 -406 -1895 1258 -414 1030 1756 -2094 -100 -436 -812 2096 -965 -1234 444
3137 444 -1569 1482 598 -1837 562 -1148 101 2086 -1130 -8 -419 -1409 2219 751 -54 469
3153 469 -2313 673 2023 -115 1598 -1412 -1748 1314 -206 1368 783 -2543 158 -103 114 2149
3169 2149 -1748 -1140 270 -990 2101 154 -2022 185 -1333 955 2393 -1257 -257 -1171 -848 3191
3185 3191 748 -23 -128 -2565 1030 1934 249 1268 -2218 -1627 1500 -122 1625 -59 -2871 403
3201 403 -89 480 1923 -2328 -1139 108 -498 2552 -161 -1917 -57 -1502 1539 2337 -1376 127
3217 127 -1579 -452 3111 311 134 -460 -2643 1482 1388 111 1266 -2533 -1330 1460 -199 1429
3233 1429 -821 -2707 673 -414 1167 1436 -2618 -490 -165 -84 2864 -701 -1363 429 -1161 2043
3249 2043 1601 -1265 142 -1369 140 2788 -470 102 -874 -2242 1956 871 -127 556 -2625 -239
3265 -239 1284 -520 1346 -1069 -2067 1000 -522 972 721 -2324 382 71 349 2434 -1275 -841
3281 -841 365 -723 2238 912 -1432 486 -1323 515 2257 -1222 223 -623 -1348 2040 -32 -337
3297 -337 256 -2289 629 1170 -620 1086 -1716 -1228 1477 -536 1138 144 -2246 1097 292 448 1759
3314 1759 -1455 -363 686 -598 2213 -277 -1567 624 -987 984 1255 -1685 54 -656 -830 2172
3330 2172 -343 -415 -81 -1973 1000 735 -664 645 -1774 -499 1508 -608 997 -215 -1400 1632
3346 1632 64 432 1186 -1899 448 682 -350 1696 -916 -1255 816 -941 1007 654 -1996 391
3362 391 -841 -213 1790 -1421 -204 -56 -1348 1707 74 -791 668 -1604 391 1405 -872 947
3378 947 -650 -907 1950 -125 355 448 -1829 834 416 -247 1298 -1562 -813 945 -756 1051 -164
3395 -164 -1894 902 -609 415 1337 -1725 -15 91 -714 1880 -405 -822 638 -1314 1153 1235 -1065
3412 -1065 802 -687 -295 2003 -623 159 -1 -1894 1518 429 -197 646 -1874 -250 1351 -583
3428 -583 930 -827 -1613 1208 -401 714 1046 -1896 267 54 -128 1887 -789 -617 642 -792
3444 -792 1775 907 -1270 482 -1327 220 1929 -778 111 -684 -1410 1702 -181 -423 236 -1904 498
3461 498 1090 -431 893 -1321 -1167 1359 -508 886 310 -1990 555 -70 126 1676 -1466 -443
3477 -443 519 -529 2018 151 -1280 426 -965 703 1521 -1493 -125 -853 -889 1522 -399 -236 127
3494 127 -1838 818 619 -525 870 -1718 -454 1320 -469 987 -77 -1492 1035 -75 156 1254
3510 1254 -1418 171 778 -337 1867 -522 -877 773 -822 812 653 -1535 360 -718 -393 1685
3526 1685 -879 -452 -63 -1617 1417 302 -795 571 -1182 434 1339 -736 873 -425 -1097 1783
3542 1783 -112 380 536 -1704 650 679 -307 1258 -1034 -578 979 -785 940 59 -1670 335 -677
3559 -677 177 1427 -1438 -252 -36 -561 1698 -60 -940 302 -1041 858 1523 -666 555 -797
3575 -797 -631 1914 -89 354 55 -1770 1071 418 -331 860 -1642 -439 745 -550 1104 -502
3591 -502 -1890 720 -423 674 895 -1840 116 190 -83 1813 -344 -688 367 -1126 1541 1342 -842
3608 -842 433 -1194 -87 1861 -448 222 -133 -1387 1323 105 -153 687 -1788 88 890 -613
3624 -613 1309 -1135 -1556 1162 -314 988 442 -1660 325 8 315 1849 -829 -388 284 -688 1776
3641 1776 577 -1131 591 -977 371 1387 -757 306 -541 -1260 1253 -179 -247 420 -1876 654
3657 654 750 -447 479 -1295 -438 1417 -268 1038 -43 -1622 633 22 608 1479 -1199 -346 375
3674 375 -410 1865 -24 -787 486 -940 590 956 -1165 345 -629 -544 1380 -644 -559 -249 -1471
3691 -1471 1272 535 -550 434 -1516 -110 1279 -260 1233 -353 -1676 1164 140 822 759 -1424
3707 -1424 -22 292 -71 1539 -670 -849 448 -1049 779 463 -1507 76 -752 -52 1539 -991
3723 -991 -453 -267 -1046 1759 386 -537 184 -1546 256 1543 -64 877 -899 -1039 1280 8 759
3740 759 540 -1446 321 123 14 1203 -991 -643 131 -682 1102 -121 -1525 98 -851 583 1433
3757 1433 -1237 -125 -425 -594 1885 280 -364 -41 -1643 822 1252 -114 903 -1196 -777 1172
3773 1172 8 1022 10 -1580 629 -90 86 910 -1470 -422 438 -394 1328 -372 -1213 639
3789 639 -424 750 900 -1164 -71 -497 -260 1981 -34 -223 -217 -1502 1165 702 -394 749 -1169
3806 -1169 -297 1018 -657 731 -202 -1241 775 -290 24 639 -1629 151 339 -522 982 -974
3822 -974 -792 747 -474 985 669 -1376 147 -323 12 1497 -707 55 -138 -1164 1059 378 -280
3839 -280 997 -1114 8 894 -461 604 -383 -529 1161 -499 -38 231 -1293 743 340 -263 639
3856 639 -1068 -326 596 -440 1155 136 -960 415 -351 273 1026 -1065 365 -84 -671 1153 -393
3873 -393 -384 628 -657 706 424 -1090 530 -394 -201 1139 -993 -146 17 -1067 1208 145 -207
3890 -207 623 -1345 -92 1131 -346 825 -503 -852 909 -18 475 637 -1261 544 277 -388 1312
3907 1312 -880 -465 537 -396 816 -88 -1631 165 -561 178 1092 -1130 -233 -523 -706 1710 151
3924 151 -445 360 -1132 851 1186 -215 608 -791 -551 1326 -122 618 100 -1298 452 192 158 828
3942 828 -1374 -525 902 -292 1058 -629 -1554 160 -720 778 1012 -1191 -242 -594 -334 2002 -3
3959 -3 -237 -137 -1075 972 939 -407 603 -1135 -447 1101 -27 781 -198 -1306 702 192 356 603
3977 603 -1469 -224 441 -244 1048 -651 -1075 84 -638 1245 863 -1272 -94 -464 244 1742 -109
3994 -109 -66 -50 -1169 1099 692 -178 511 -1380 -238 999 -276 553 -617 -1108 913 -180 160 338
4012 338 -1599 27 240 0 1253 -802 -680 372 -144 1288 515 -960 236 -504 302 1393 -830
4029 -830 -105 -203 -770 1331 -67 -456 321 -1180 450 856 -691 473 -794 -819 917 -350 264 -18
4047 -18 -1486 503 363 72 987 -1135 -299 512 -109 1317 65 -892 462 -470 436 1059 -978 -45
4065 -45 -454 -497 1508 -319 -514 24 -1111 647 600 -848 374 -879 -408 1084 -311 507 -189 -1228
4083 -1228 936 287 -28 664 -1225 23 670 -289 1271 -341 -877 735 -184 902 692 -1137 326
4100 326 -197 -156 1105 -959 -265 121 -870 821 85 -740 116 -1121 106 1100 -744 327 -537 -843
4118 -843 1030 50 164 520 -1039 549 850 -117 934 -675 -340 765 -379 697 177 -1254 630
4135 630 -492 -69 793 -1103 -116 -48 -718 752 -168 -745 156 -900 566 852 -701 636 -350 -375
4153 -375 1162 -241 239 339 -1099 774 434 -180 869 -987 -12 803 -522 543 -249 -1124 842
4170 842 -416 30 607 -1207 83 26 -290 1161 -504 -487 689 -587 916 379 -786 742 -128
4187 -128 -49 1130 -617 127 35 -723 1259 69 -464 382 -1104 345 627 -752 622 -558 -868 749
4205 749 -314 132 -51 -1054 478 412 -86 619 -1031 -46 924 -449 774 -45 -869 573 -240 323
4223 323 976 -1005 30 -255 -366 1291 -409 -541 251 -871 654 579 -771 398 -615 -366 1081
4240 1081 -642 259 -149 -991 938 222 -23 616 -895 125 494 -140 863 -346 -895 557 -443
4257 -443 531 774 -1249 144 -131 -193 1324 -608 -322 54 -686 1062 314 -867 135 -935 -60 986
4275 986 -569 277 -317 -805 1006 95 -58 480 -1182 259 618 -80 1062 -626 -641 709 -248 657
4293 657 155 -1245 178 -46 10 911 -886 -392 221 -716 1296 111 -902 104 -972 344 777
4310 777 -857 264 -511 -581 837 -285 170 299 -1115 687 643 -129 719 -990 -305 1078 -429 774
4328 774 -272 -1089 521 -490 168 739 -1050 -73 -89 -536 1120 -492 -439 318 -846 575 783 -755
4346 -755 317 -560 -186 1263 -181 61 -128 -848 982 185 -278 609 -899 5 700 -563 654 -578
4364 -578 -881 585 -457 427 273 -1258 256 311 -203 958 -904 -460 494 -552 939 351 -747
4381 -747 418 -280 350 1066 -800 5 -71 -707 1142 -153 -253 226 -993 545 520 -523 497 -930
4399 -930 -396 913 -401 292 -65 -1018 573 287 -30 738 -988 -156 429 -181 1178 -101 -912 639
4417 639 -200 800 784 -1103 -22 -274 -135 1082 -546 -401 -137 -963 834 578 -443 255 -773 -288
4435 -288 1110 -469 389 -150 -875 805 -56 279 565 -1090 213 693 -155 879 -662 -810 542
4452 542 -306 811 348 -1205 162 -380 90 1297 -646 -518 -268 -706 958 270 -634 116 -987 3
4470 3 880 -491 352 -425 -636 986 -63 309 384 -1054 427 508 -142 699 -595 -408 687 -117 745
4489 745 50 -1232 145 -251 306 887 -1062 -218 -197 -598 955 -154 -467 84 -842 413 806 -551
4507 -551 449 -534 -271 1316 -263 134 136 -810 859 337 -305 790 -1139 -145 557 -335 828 -457
4525 -457 -1077 479 -433 305 535 -961 0 -277 -333 1052 -504 -497 99 -633 1024 302 -774 337 -445
4544 -445 213 1283 -442 185 -132 -720 1111 255 -99 139 -1160 101 557 -376 499 -944 -1156 569
4562 569 -282 451 369 -1246 133 -138 -4 969 -701 -377 184 -371 1143 226 -597 197 -707 546 974
4581 974 -496 129 -373 -493 1205 104 -130 -148 -1138 199 427 -263 473 -954 -668 572 -361 366
4599 366 61 -1014 461 -8 82 865 -739 175 487 -158 858 -92 -419 413 -436 563 612 -573 180
4618 180 -517 -393 1096 -468 -163 154 -935 522 85 -386 556 -842 -16 835 -201 620 -157 -681
4636 -681 662 -32 246 546 -783 478 148 -379 645 -504 -399 388 -444 639 268 -884 383
4653 383 -558 58 805 -831 45 -49 -489 899 -223 -355 422 -762 313 638 -407 438 -224 -201 1115
4672 1115 -434 17 183 -803 493 87 -144 625 -828 -343 459 -265 561 -179 -770 613 -293 357
4690 357 739 -895 100 162 -272 895 -262 -491 186 -324 578 535 -610 194 -313 -108 1061 -175 194
4709 194 -161 -675 847 313 1 315 -922 195 469 -209 689 -500 -610 752 -328 292 409 -1090
4727 -1090 240 -53 -68 1019 -866 -349 170 -568 740 405 -629 356 -413 379 1048 -434 236 -428
4745 -428 -539 1017 146 197 259 -1038 414 265 -446 418 -690 -648 590 -217 451 154 -910 286 41
4764 41 127 712 -878 -192 425 -304 1111 28 -307 376 -562 494 649 -501 196 -467 -330 914 -187
4783 -187 -46 33 -1134 228 230 -307 273 -799 -225 761 -248 289 -277 -788 756 52 330 642 -885
4802 -885 63 118 -158 855 -390 -497 272 -362 799 529 -722 88 -444 -49 784 -541 -71 57 -1047
4821 -1047 620 171 -361 136 -784 105 581 -343 499 -419 -535 665 -19 566 191 -983 238 413
4839 413 -16 925 -488 -635 241 -550 548 343 -934 229 -603 123 646 -683 11 -18 -685 820
4857 820 -96 -213 416 -864 291 548 -192 442 -517 -717 623 -338 530 343 -908 517 42 176
4875 176 796 -710 -114 312 -321 431 -55 -616 349 -369 89 673 -783 42 -249 -255 786 -298 -144
4894 -144 249 -571 632 552 -348 339 -418 -97 491 -422 496 35 -590 626 -14 115 770 -717 -118
4913 -118 256 -303 632 -444 -501 398 -415 216 39 -858 241 -137 -174 747 -523 -95 280 -220 903
4932 903 234 -392 728 -440 399 682 -517 298 -110 -312 540 -364 -336 44 -745 443 117 -396 354
4951 354 -729 -389 595 -268 457 -91 -937 398 -133 431 867 -654 192 342 -185 1050 -153 -395
4969 -395 331 -428 428 559 -624 42 -500 -442 756 -452 -315 -262 -845 515 153 -282 61 -833 -79
4988 -79 697 120 784 -113 -767 332 -33 560 617 -772 139 5 13 979 -354 -579 -97 -527 605 242
5008 242 -859 0 -438 -151 693 -461 -130 -144 -669 875 234 -61 307 -631 266 823 6 662 -405
5027 -405 -519 725 -83 698 370 -951 68 -189 35 839 -629 -431 166 -540 527 103 -733 157
5045 157 -621 249 837 -402 144 -209 -539 843 86 -17 313 -774 270 638 -107 751 -389 -299 505
5064 505 -81 602 -10 -776 156 -381 -22 682 -696 -191 -30 -396 657 56 -443 461 -390 454 505 -682
5084 -682 108 -168 -166 921 -292 -19 200 -617 608 328 -276 421 -725 -104 605 -226 408 103 -680
5103 -680 425 -118 146 459 -513 -61 213 -152 672 -474 -474 338 -440 658 104 -842 265 -296 -20
5122 -20 757 -589 -116 17 -505 710 111 -358 463 -590 148 514 -552 98 -312 -330 686 -297 155
5141 155 237 -910 453 -46 -187 432 -796 -264 416 -367 522 -48 -766 23 -524 377 749 -550 150
5160 150 -157 -361 914 64 -284 329 -462 438 407 -369 268 -504 -108 671 -485 168 -87 -594 685
5179 685 47 -116 214 -859 -218 349 -245 877 -88 -453 383 -268 345 514 -659 338 66 -195 705
5198 705 -435 -28 126 -595 360 178 -496 208 -677 -126 529 -705 -58 -52 -862 437 -118 -124 374 -585
5218 -585 408 245 -36 659 -85 -510 547 -247 582 221 -393 628 -126 -117 795 -504 57 193 -639 336
5238 336 -192 -307 411 -580 132 259 -588 341 -240 -147 841 -97 -161 364 -532 535 448 -398 544 -402 -56
5259 -56 646 -377 585 17 -614 580 -325 -57 273 -976 171 -45 -477 226 -487 -507 424 -285 583
5278 583 372 -805 203 -157 161 885 -346 -44 84 -295 711 99 -328 291 -768 81 589 -494
5296 -494 374 -360 -516 609 -272 -90 201 -973 235 15 -223 647 -540 -289 439 -390 724 -138
5314 -138 -893 389 -182 329 773 -618 119 75 -451 830 24 -85 326 -670 506 586 -505 386 -441
5333 -441 -361 685 -374 36 -170 -935 197 227 89 432 -637 46 502 -254 827 -153 -588 257 -164
5352 -164 549 739 -505 191 -87 -64 714 -195 -218 82 -546 439 96 -533 281 -652 -330 386 -377 293
5372 293 -252 -847 483 -76 34 312 -727 40 392 -297 871 -191 -346 483 -204 527 413 -594
5390 -594 128 -136 -73 805 -523 -278 19 -708 280 -237 -844 232 -658 63 411 -381 236 -360 -620 763
5410 763 -13 -97 338 -672 489 373 -90 729 -363 -243 624 -331 329 -73 -756 351 -349 118 598
5429 598 -570 -174 87 -201 539 -163 -340 142 -718 452 401 -561 318 -328 -126 844 -87 206 259 -620
5449 -620 491 104 -120 448 -606 -131 299 -397 392 -358 -690 363 -296 178 287 -772 103 -76 -185
5468 -185 685 -375 -190 656 -412 770 406 -673 471 -344 56 658 -326 285 -101 -476 600 -119
5486 -119 -401 109 -804 -55 343 -238 376 -318 -445 510 -173 234 316 -840 447 180 26 848 -467
5505 -467 16 274 -365 727 150 -517 399 -379 45 620 -579 68 -17 -520 545 -223 -330 298 -620
5524 -620 430 296 -442 538 -336 -189 601 -215 275 120 -716 347 21 -265 512 -625 -93 109 -269
5543 -269 792 -16 -373 400 -404 371 722 -498 254 -13 -268 898 -422 123 379 -581 582 160
5561 160 -393 275 -629 -147 569 -469 438 -152 -622 600 -232 170 149 -641 116 162 -161 822 -370 -296
5581 -296 519 -188 357 523 -382 393 -38 34 589 -612 60 -39 -383 518 -74 -426 288 -670 82 441
5601 441 -538 239 -345 -346 576 -98 81 301 -513 276 373 -124 733 -336 -159 500 -329 624 45 -524 635
5622 635 -451 -240 385 -581 216 77 -293 692 -272 -413 220 -483 266 305 -406 572 -250 -301 695 -108
5642 -108 307 320 -604 666 111 -388 387 -528 -41 293 -260 347 -98 -766 596 -457 -64 285 -964
5661 -964 133 -50 -158 387 -515 -329 312 -498 595 218 -427 567 -229 27 781 -386 114 102 -531
5680 -531 406 -181 -169 159 -651 116 279 -507 236 -377 -381 680 -99 182 -11 -648 503 109 -170 415
5700 415 -565 -105 439 -324 611 126 -419 500 -294 329 482 -609 55 -334 -466 892 -228 -125 204
5719 204 -655 528 305 -436 275 -279 -188 579 -332 42 -28 -735 270 133 7 381 -732 -5 300 -247
5739 -247 649 -192 -364 505 -513 520 303 -619 296 -214 -219 558 -570 -138 -62 -573 533 138 -402 36
5759 36 -659 145 486 -516 336 -275 -365 346 -232 315 506 -659 308 255 -306 607 -526 -344 489 -376
5779 -376 470 118 -601 515 -208 -136 627 -765 -105 -235 -569 399 -190 -261 251 -560 247 503 -468 326
5799 326 -251 -70 643 -193 292 290 -592 384 96 -37 445 -512 -200 449 -193 342 -142 -609 46 -443 288
5820 288 439 -622 -4 -297 -422 687 -165 -204 294 -452 480 387 -336 293 -218 21 892 -120 253 26
5840 26 -478 531 55 -25 412 -653 -15 282 -558 502 -277 -544 215 -304 239 216 -359 126 -139 -142 631
5861 631 -320 45 225 -484 487 166 -372 378 -364 22 583 -173 173 -52 -353 517 -193 -115 221 -871
5881 -871 176 318 -223 448 -361 -207 421 -384 319 169 -468 413 -273 87 653 -501 163 243 -355 736
5901 736 111 -414 332 -348 203 450 -524 97 -280 -462 651 -247 -257 192 -537 135 230 -301 398 -663
5921 -663 132 624 -478 519 -111 -695 249 -92 -52 383 -599 159 309 -314 544 -233 -405 216 -245 341
5941 341 200 -222 154 -361 -163 587 -432 169 -155 -546 521 159 -470 191 -492 13 364 -391 463
5960 463 -235 -657 437 -143 54 392 -480 484 166 -169 582 -234 -198 172 -464 409 176 -356 307 -297
5980 -297 5 465 -363 51 4 -650 579 -93 -294 292 -384 163 234 -265 540 -176 -163 520 -299 55 64
6001 64 -433 215 71 -117 387 -482 43 393 -421 496 -64 -272 457 -389 -214 307 -713 245 -152 -369
6021 -369 633 -348 -28 -42 -590 410 311 -291 305 -327 -56 477 -249 222 -79 -369 541 -247 17 459
6041 459 -329 116 -98 -355 168 -170 -331 176 -396 89 72 -432 396 -93 15 422 -422 63 206 -304
6061 -304 688 21 -279 369 -275 197 429 -297 318 99 -294 615 -99 72 -27 -383 198 -110 -462 407
6081 407 -262 -142 547 -380 98 -54 -534 480 87 27 395 -497 179 267 -214 516 -41 -276 390 -342
6101 -342 226 180 -431 314 -326 -43 512 -172 87 -97 -654 465 -89 -253 175 -449 58 458 -184 367
6121 367 -98 -291 619 -125 103 304 -618 83 303 -172 425 -495 -143 222 -295 404 -27 -395 233 -334
6141 -334 -61 428 -362 141 96 -234 510 -44 -205 137 -556 405 450 -299 240 -358 -262 516 -61 125 346
6162 346 -618 291 58 -86 331 -516 -301 304 -322 280 -185 -417 112 -393 112 416 -641 13 -227 -245
6182 -245 518 -117 -180 45 -455 106 279 -474 447 -321 -150 660 -48 194 137 -513 424 179 53 132 -498
6203 -498 -42 147 -271 453 -200 -573 202 -404 267 236 -503 325 -122 -161 718 -61 -156 165 -285 574 291
6224 291 -172 323 -547 55 412 32 253 -182 -496 378 -201 -128 236 -610 -7 72 -91 389 -517 -361 431
6245 431 -381 333 195 -544 69 -129 9 611 -322 157 291 -206 626 255 -285 229 -516 329 475 -346
6265 -346 184 -160 -230 490 -305 -73 185 -736 100 21 -113 516 -539 -17 535 -267 397 5 -491 283
6285 283 -252 -15 876 -376 114 32 -140 758 -318 -281 216 -509 107 137 -475 331 -261 -286 375 -354 166
6306 166 92 -480 283 -224 -64 392 -477 -48 217 -291 428 47 -216 434 -131 221 377 -401 230 21
6326 21 -167 401 48 11 381 -630 200 121 -304 298 -250 44 343 -215 88 -94 -321 605 -257 -131 316
6347 316 -242 227 176 -429 280 -280 -382 268 -89 203 256 -559 279 7 35 444 -461 4 294 -372 473
6368 473 15 -436 259 -400 124 183 -333 175 -73 -374 517 -329 -89 380 -483 332 258 -277 579 -259 120
6389 120 669 -254 244 -72 -255 333 -286 -123 372 -571 -56 300 -269 496 -244 -306 388 -197 259 215 -612
6410 -612 350 -131 -98 741 -277 10 -102 -242 332 15 -261 361 -309 -26 405 -482 254 -275 -37 453
6430 453 -227 -94 333 -480 224 134 -372 440 -476 -210 318 -317 -7 148 -554 449 -160 -62 525 -264
6450 -264 228 29 -254 586 -11 -95 337 -361 267 359 -355 498 -323 -360 350 -423 -44 -129 -548 230 -93
6471 -93 -179 384 -489 14 467 -319 392 26 -370 331 -108 203 593 -324 174 5 -342 624 -197 -225 363
6492 363 -503 275 268 -173 267 -119 -82 306 -380 -88 -26 -262 460 -48 -313 390 -558 11 389 -265 523
6513 523 -111 -497 373 -213 145 250 -395 197 -40 -189 458 -593 -61 -10 -432 274 -119 -501 98 -345
6533 -345 -144 492 -498 87 20 -340 538 -57 -73 338 -389 270 221 -316 261 -339 -414 572 -341 393 367 -570
6555 -570 309 -216 23 397 -541 -70 194 -301 490 6 -373 330 -439 114 414 -300 415 98 -181 393
6575 393 -94 168 250 -474 394 -21 -189 338 -283 -16 317 -370 470 10 -404 477 -156 -92 242 -525 68
6596 68 -54 -187 350 -278 -302 199 -363 111 105 -429 457 -77 -81 463 -265 359 233 -723 587 -9 -107 507
6618 507 -570 20 260 -407 244 146 -332 310 -259 -77 248 -613 231 -117 -338 478 -454 -145 248 -464
6638 -464 380 228 -289 297 -117 -61 415 -409 164 178 -422 558 -56 69 259 -593 297 194 -408 252 -313
6659 -313 -224 391 -317 210 51 -529 376 -208 -330 396 -511 -56 283 -317 278 -44 -294 572 -80 282
6679 282 342 -447 156 -73 -282 488 -158 -326 307 -612 148 143 -336 300 -522 -84 244 -129 281 107 -599
6700 -599 492 43 -186 287 -344 190 357 -157 452 -252 -252 567 -192 120 286 -265 220 -58 -125 425 -389
6721 -389 6 34 -358 206 -120 -161 220 -406 -4 357 -244 320 98 -436 477 -206 112 144 -447 197 126
6742 126 -273 423 -235 -61 286 -274 398 96 -473 156 -19 -162 531 -432 135 92 -347 425 39 -186
6762 -186 282 -436 233 403 -411 344 -153 -8 607 -306 119 176 -179 374 158 -256 238 -499 -7 240
6782 240 -267 210 -8 -472 468 -143 -21 206 -451 243 -104 -249 407 -121 -188 240 -371 298 108 -396
6802 -396 360 -203 -253 233 -314 408 112 -234 472 -162 -250 376 -427 42 335 -451 319 -175 -166 262 -220
6823 -220 38 221 -337 106 -187 -249 456 -299 -41 347 -359 378 144 -207 423 -70 163 352 -464 344
6843 344 44 -466 179 -96 -197 256 -531 198 167 -411 229 -432 -207 262 -416 93 144 -501 461 -150 -226
6864 -226 270 -390 169 166 -322 420 -16 -188 455 -137 99 181 -404 378 -66 -197 246 -323 25 38 -406
6885 -406 367 47 -529 446 -332 -4 472 -205 137 117 -302 443 -114 -77 388 -404 319 143 -331 265 -69
6906 -69 -79 422 -73 175 73 -480 242 130 -169 547 -601 -35 194 -435 306 120 -196 246 -254 137
6926 137 477 -333 173 77 -213 419 -250 -48 76 -323 278 150 -201 378 -319 -161 439 -267 10 -77 -412
6947 -412 324 -269 -62 415 -490 66 22 -278 357 -162 -282 243 -286 389 190 -204 409 -78 17 444 -323
6968 -323 -76 -9 -640 446 59 -165 319 -219 -112 394 -300 53 -202 -384 47 -74 -95 256 -579 -23
6988 -23 -109 -53 475 -313 -67 361 -235 230 127 -21 282 -120 -60 291 -329 53 152 -445 477 -69 -177 251
7010 251 -521 -38 346 -376 239 -256 -370 393 -192 34 349 -455 201 180 -68 603 -411 -151 110 -338
7030 -338 483 249 -303 403 -198 45 324 -388 143 -22 -249 243 -395 1 66 -556 170 69 -196 262
7050 262 -399 14 226 -217 46 193 -414 200 -10 -26 280 -392 57 13 -286 263 102 -391 449 -181 171
7071 171 43 -287 228 -412 -254 350 -300 -161 56 -230 327 -179 -244 251 -333 -17 289 -222 168 65
7091 65 -545 307 -14 -67 467 -356 80 66 -201 566 -220 -188 149 -171 271 -94 -436 68 -383 -47 457
7112 457 -268 -49 247 -306 289 51 -214 93 -304 97 100 -226 205 -4 -202 301 -174 72 347 -220 441
7133 441 41 -173 278 -127 97 81 -352 23 -22 -470 148 -350 -77 343 -517 59 -17 -332 425 -128 -156
7154 -156 -80 -601 163 238 -224 296 49 141 290 -317 -256 153 -209 283 98 5 284 -322 115 272 -348 309
7176 309 -76 -156 257 -333 78 -25 -360 83 127 -102 510 -99 -72 335 -338 123 159 -343 242 -152 -69 369
7198 369 -369 103 101 -401 294 52 -111 127 -303 207 143 -275 3 -267 -346 357 -296 258 -174 -276 69
7219 69 -250 2 411 -151 -18 258 -273 452 -199 -277 285 -205 89 291 -449 95 -119 -384 305 -96 -108
7240 -108 -49 -375 318 233 -268 78 -561 -304 333 -157 174 89 -508 305 -275 -87 285 -513 68 21 -88
7261 -88 391 -135 -86 240 -355 226 136 -276 281 53 -224 217 -110 -60 -112 -372 303 -53 11 101 -427 -122
7283 -122 288 -121 136 -154 -251 428 -76 193 134 -377 7 -169 -120 468 -329 -17 36 -251 248 150 -368 212
7305 212 -394 3 414 -406 146 108 -234 346 51 -102 180 -438 108 228 -214 456 -129 -257 288 -168
7325 -168 14 147 -402 191 -32 -310 290 -360 -25 265 -154 116 -53 -294 271 -242 -49 322 -399 67
7345 67 53 -246 165 -167 -86 284 -424 62 263 -343 262 -280 -23 189 -144 188 54 -286 210 -201 -18
7366 -18 424 -332 107 85 -326 361 -154 -14 198 -428 77 284 -461 289 -131 -194 447 -362 37 334 -189
7387 -189 550 10 -245 277 -356 79 265 -334 199 63 -227 244 -247 -307 18 -245 237 48 -249 317
7407 317 -333 44 306 -296 262 -4 -263 202 4 -118 231 -286 -119 1 -196 310 -196 -294 301 -201
7427 -201 -97 152 -404 95 -168 -309 306 -33 -256 219 -285 168 114 -143 262 -57 -34 117 -175 257 -123
7448 -123 -223 434 -24 132 265 -553 164 239 -164 306 -374 -138 115 -367 -56 118 -346 100 -190 -155 224
7469 224 -149 -107 9 -215 324 -84 -157 124 -164 314 250 -209 227 -262 -265 492 -114 64 196 -205 21 178
7491 178 -112 226 -325 -60 176 -125 90 74 -429 371 -353 29 177 -327 326 17 -300 352 -12 36 246
7512 246 -122 321 354 -234 175 -262 -289 400 -301 196 -28 -347 405 -69 64 229 -397 -101 -8 -245 172
7533 172 -157 -265 290 -362 -12 113 -328 8 -5 -100 296 -242 -183 331 -365 338 305 -93 113 -142 -30
7554 -30 253 -379 133 94 -287 493 72 74 135 -457 181 171 -450 113 -329 16 283 -277 103 290 -274 114
7576 114 78 -90 252 -278 -58 142 -169 364 -83 -119 244 -141 -223 420 -165 85 -212 -149 283 -17 53 73
7598 73 -461 245 130 21 142 -190 81 156 -460 134 131 -258 312 -46 148 338 -243 56 -32 -139 234 33
7620 33 -186 154 -363 -2 147 -415 191 -211 -225 138 -137 229 91 -193 301 -137 -220 248 -172 -91 195
7641 195 -245 271 -41 -309 211 -92 120 21 -406 181 -3 -263 225 -269 -162 241 -350 275 28 -277
7661 -277 439 -267 25 332 -152 207 41 -271 297 -151 46 165 -167 27 177 -215 138 -83 -22 293
7681 293 -236 231 163 -253 222 7 -51 187 -410 84 28 -364 315 -100 -51 247 -254 -9 328 -204 54
7702 54 -99 -359 208 -249 80 56 -527 167 107 -135 289 -48 49 283 -230 256 80 -276 287 -249 9
7723 9 423 -410 -77 219 -226 391 -151 -117 373 -159 393 181 -397 293 -105 -126 514 12 -59 179 -469 293
7745 293 -61 -65 174 -84 12 279 -276 270 19 -355 286 -310 80 106 -332 1 93 -188 347 -212 -290 165
7767 165 -195 203 203 -351 423 -241 -2 234 -144 5 165 -388 354 -47 -2 231 -227 153 255 -48 141
7788 141 -70 -219 20 -155 22 200 -343 93 -11 -383 292 -384 126 219 -231 166 -36 -257 326 -100
7808 -100 199 278 -307 197 123 -217 370 -41 85 189 -498 106 154 -176 104 -264 87 384 -182 64 69 -241
7830 -241 146 -327 -233 326 -417 235 290 -247 217 -296 -224 227 -186 27 281 -181 186 217 -136 448 -244
7851 -244 -141 150 -269 21 98 -379 211 -460 71 310 -268 249 -7 -182 299 72 -70 352 -100 -27 158
7872 158 -224 175 -234 9 479 -477 216 154 -394 147 -240 -185 296 -447 -1 -72 -260 292 -24 -43 213
7893 213 -186 14 7 -355 244 -203 -335 335 -209 75 305 -274 198 75 -73 261 -199 -10 168 -114 138
7914 138 -140 -333 182 -204 -72 165 -192 108 48 -280 49 22 -75 369 -206 3 137 -289 112 -148 -353
7935 -353 323 -283 50 174 -155 273 -29 -277 193 -191 112 -5 -121 245 -249 -267 287 -214 2 180
7955 180 -121 -21 160 -11 322 -252 -97 128 -169 308 133 -171 289 -5 -35 258 -300 34 -199 -288 153
7976 153 -200 -53 149 -430 57 221 -259 122 -295 -229 484 -208 229 -65 -73 62 -88 -123 375 -200 120
7997 120 243 -412 330 -73 -268 412 -124 70 80 -178 1 119 -136 235 -227 20 163 -240 291 15
8017 15 -135 113 -261 -99 182 -243 394 105 -174 276 -161 -157 278 -157 -12 313 49 246 28 -142 234
8038 234 -81 99 229 -357 131 368 -90 227 -137 -38 395 -293 177 22 -359 170 -32 51 245 -229 68
8059 68 -9 -30 285 -14 19 121 -222 153 157 37 -30 -243 -11 224 -3 206 -36 -418 116 -68 32 155
8081 155 -304 51 -75 -267 146 92 -12 106 -315 106 308 -276 80 -79 -102 201 -112 -17 77 -128 134
8102 134 -30 -210 216 -166 64 105 -200 114 -140 -167 403 -124 88 52 -446 160 48 -188 320 33 -117
8123 -117 70 -59 107 265 4 102 -103 83 276 -232 141 110 -189 295 69 -38 46 -342 -7 57 -200
8144 -200 141 -156 94 274 -326 106 303 -198 284 102 -94 269 -222 133 234 -298 403 101 -136 154
8164 154 -68 -115 330 -253 137 50 9 286 -92 -197 68 -32 32 264 -246 229 123 -2 210 -138 99
8185 99 97 -275 190 -124 202 137
8191A37
$$ Imaginary data points
##PAGE= N=2
##DATA TABLE= (X++(I..I)), XYDATA
0 0 0 0 0 0 0 0 0 0 0 0 0 0 0 -8 8 -8 8 -8 8 -16 16 -20 24 -31 32 -40 48 -55 64 -72 84 -95 108 -124 140
35 140 -156 174 -198 222 -247 277 -308 340 -378 417 -464 512 -564 621 -685 754 -832 916 -1012
54 -1012 1112 -1232 1364 -1513 1689 -1889 2129 -2419 2772 -3219 3807 -4618 5815 -7767 11653
69 11653 -37450 195412 253508 12247 -239754 -324812 -52903 97573 149214 113303 -120400
80 -120400 -200320 -68538 125157 301317 77660 -212497 -169727 9650 215115 176433 -90459
91 -90459 -145936 -99697 34410 219083 144832 -15886 -153510 -186914 83589 235504 101315
102 101315 -94521 -276387 -170053 72041 117829 89640 -81381 -227250 -97664 64378
112 64378 199126 166692 -85203 -127926 -6027 102764 176868 34786 -86666 -69457 -62962
123 -62962 66366 123387 -1454 -88056 -146947 -19336 182005 98218 -52256 -131767 -106647
134 -106647 68719 88516 17961 -10967 -124803 -118604 -7306 73803 140768 -2426 -146978
145 -146978 -42778 72997 143574 86568 -55174 -18863 13397 -1152 48035 9439 -20474
156 -20474 -46264 -95419 18544 71863 -20113 -61878 -78280 20806 106125 9030 -29280 -32485
168 -32485 -39603 29477 22268 25333 31054 -75578 -62347 20166 50608 75141 -13242 -47844 26305
181 26305 12702 28018 34740 -11032 9461 -30284 -41148 26214 -17458 -37235 -20806 -23366
193 -23366 34526 -3661 -49346 15158 14528 23931 30857 -9968 26493 -1197 -43077 25260 28725
206 28725 12221 -12451 -59676 13529 33917 -20413 3703 2980 17999 18327 -48730 -1633 34788
219 34788 -10396 -5090 -21809 -2268 16959 -54649 -20419 41526 21222 10722 -37901 -15089
231 -15089 58397 10852 -1887 16893 -740 15588 -26193 -27177 40178 -2662 -28928 -14354
243 -14354 -13568 30685 -10965 -46490 21725 20699 10723 718 -32997 16095 10439 -19270 28995
256 28995 10424 -10185 -14568 -34565 35172 42862 -18610 -6182 -13463 5660 26742 -17844 9547
269 9547 11532 -33491 -1968 1521 6553 7546 -50309 -9018 37756 3942 -1714 -29546 -11522
282 -11522 39083 625 8831 23087 -20010 -10606 -11214 19100 61274 -17225 -50295 -11714 8725
295 8725 43608 -2400 -39060 6536 -11972 -8742 19606 2330 12539 -27605 -43120 39645
307 39645 38336 -1907 -28249 -44266 30943 43740 -9542 -328 -19961 -15869 13666 2950 39651
320 39651 16646 -56428 -25085 12826 45136 37245 -48947 -38150 5448 3156 28954 1830
332 1830 -20219 -9408 -36484 12915 55566 6471 -18229 -39987 -4139 63628 18066 -15704
344 -15704 -16679 -30535 12543 16654 6710 17058 -43819 -45651 16696 33802 40876 -20801 -58077
357 -58077 10568 26892 25290 18767 -27104 -13243 -12463 -10580 47760 19040 -31332 -35196 -24057
370 -24057 49579 48524 -25190 -21851 -15942 7480 33378 -3895 1869 -11133 -51007 -3580 24203
383 24203 22461 523 -61777 -19290 45644 29023 17971 -17262 -17748 24996 5419 18934 29530
396 29530 -21492 -26482 -22794 8416 49864 -14069 -48086 -17258 958 36313 10218 -23635
408 -23635 2428 -15851 -8326 25378 7656 3626 -30537 -42001 28545 30082 817 -10681 -26348
421 -26348 22317 35358 4995 22948 908 -13689 6926 927 27061 5455 -54630 -25847
433 -25847 404 11168 9311 -40726 -20309 10153 -5531 18756 12279 -2692 2875 -23873 11923
446 11923 43332 -3710 -17758 -21949 2470 42885 -301 -14264 7541 -2339 18436 13203 4243
459 4243 21155 -23441 -29107 13186 8588 2160 -37949 -52784 8290 9851 -6421 -3980 -20748
472 -20748 6904 11932 1678 38979 17273 -13797 -2384 2318 38496 21852 -35620 -14502
484 -14502 2402 11735 20201 -17035 -6042 2866 -17835 16702 20107 -2481 -13935 -43911 -3822
497 -3822 31997 -8648 -22305 -33116 -18491 24332 4716 6433 16056 -14607 4323 22666 32145
510 32145 40851 -18242 -29561 14626 18228 20497 -14427 -40246 -3197 -6549 -1472 19159 -9332
523 -9332 -14963 -21490 -11631 43368 19729 -27123 -27484 -21239 23727 24647 -18556 -7905 -13940 -10381
537 -10381 23754 20485 27730 4236 -35152 10518 40528 29502 6051 -43085 -20614 15994
549 15994 -944 4895 -14207 -33232 -14354 -15979 19010 35975 -18048 -27373 -11631 18063 48867
562 48867 -1112 -26944 -7944 -9014 18487 18554 -2535 848 -28945 -13415 39651 30592 10684
575 10684 -24947 -32963 25749 27873 3644 -6190 -35398 -18217 -1885 -2021 24549 -7968 -40677
588 -40677 -14649 8203 41848 25063 -29500 -10882 7970 17334 29075 -4841 -10188 -10744 -24928
601 -24928 18150 28012 -2141 -19140 -38741 5898 46267 10200 -7238 -21521 -18878 17515
613 17515 7743 9313 7992 -36139 -25738 2400 20590 32181 -20101 -34169 7770 17185 28687
626 28687 9260 -17333 2649 -6811 -184 26800 343 -16202 -27760 -20594 32306 20147 -17857
639 -17857 -18820 -20022 15057 27222 1268 8955 -10803 -24733 6110 14291 25029 3208 -42052
652 -42052 -12984 14429 16301 16726 -16549 -10192 7060 -7000 15396 15449 -8373 -8703 -21608 4853
666 4853 28069 -11255 -19456 -14508 -3467 24832 1385 -6806 6470 -13794 1098 16191 14102
679 14102 19988 -19472 -27240 12085 12356 13321 -3752 -23676 2482 -4789 -7175 18076 3408 -2131
693 -2131 -11355 -19580 19078 13596 -10932 -3471 -10008 5611 7744 -14761 7882 6538 -9645 4017
707 4017 267 14310 12654 -21528 -2271 12758 6723 11271 -13344 -8530 4672 -16318 3369
720 3369 14529 -204 -3195 -27873 -10670 25049 7002 2318 -5770 -16364 5294 -2802 5095
733 5095 25569 -5706 -15403 -9545 -106 29951 4950 -18194 -148 -4222 9191 10306 -7938
746 -7938 5482 -10150 -16176 17093 12724 3266 -15951 -33106 11001 25228 5980 -848 -25653
759 -25653 -14155 7945 5418 27264 10295 -28412 -20225 -6039 28837 36539 -14649 -22814 -12235
772 -12235 -628 25937 8255 -4255 -5806 -27563 582 26067 12392 -332 -32580 -17084
784 -17084 29986 19631 4336 -16537 -29601 4740 12544 15136 18718 -24715 -33270 -8700 16468
797 16468 45631 6171 -37978 -21368 -3538 28180 31300 -6237 -10991 -22802 -16477 27428 24112
810 24112 4337 -20857 -37898 11051 33487 10366 -4202 -28174 -10163 20386 11033 15125
822 15125 -6160 -35824 -12694 7828 29374 22018 -35176 -35721 -3569 19559 38548 3083 -22045
835 -22045 -12629 -14154 19360 36120 7683 -10972 -34830 -14105 34690 19989 -3455 -20461
847 -20461 -25195 13603 17042 4883 6227 -21457 -16431 7874 13232 22663 -14017 -41929 -7046
860 -7046 13698 25617 9883 -30082 -15544 259 9473 33734 11901 -9445 -15524 -18318 25066
873 25066 34057 -2807 -16409 -26919 -2829 23752 654 -2746 -9029 -20109 5254 9058 10530
886 10530 6744 -28415 -13894 15532 14723 11262 -21855 -26190 7930 8766 15864 10522 -15167 -6719
900 -6719 -5192 10895 37308 6185 -16414 -14915 -7460 24939 12025 -15554 -8907 -16780 -4678
913 -4678 10021 -2371 4688 -10753 -21136 12216 15664 8240 -4594 -25383 4385 19362 3655
926 3655 4688 -13652 -11768 6337 1186 19866 14179 -16695 -9078 -1696 17061 26170 -11204 -15310
940 -15310 -4890 -6011 10371 -1130 -9477 -1861 -19917 -4616 14655 2635 1891 -13898 -8231
953 -8231 23421 9691 -241 -2509 -11686 8667 6142 -966 11576 -9735 -13713 1627 4053 20616
967 20616 2507 -20403 345 2846 7508 8428 -12368 -1799 -3905 -14619 6803 2014 -3840
980 -3840 -3318 -16155 7940 15622 -4504 2061 -2551 3931 14658 -5667 2640 6330 -10141 836
994 836 -1458 1525 9598 -14955 -7422 8198 100 7105 -4299 -5519 11565 -5561 -4406 5809
1008 5809 -4300 3546 -6808 -10384 10564 -2946 -5616 4000 -2218 9914 187 -9473 12837
1021 12837 5204 -813 1867 -8991 6188 3131 -11156 4806 -2177 -5860 925 -7325 10179
1034 10179 8208 -12932 436 2158 5953 10711 -11063 -2623 3716 -8288 5487 1272 -2694
1047 -2694 2091 -15214 751 16239 -191 366 -8976 -4697 16179 128 -1513 2156 -11488
1060 -11488 327 967 1450 13038 -11184 -14125 4475 5948 15997 22 -15808 3234 753
1073 753 4133 11410 -6173 -3243 -8823 -11445 15330 7463 -7405 -7993 -13904 10346 14791 -5367
1087 -5367 261 -6835 -4130 10757 1517 7521 361 -20012 -197 9667 10472 7919 -19348 -9609
1101 -9609 9704 4668 12705 -982 -11766 -1253 -8391 7104 17011 -7452 -10738 -12990 -2626
1114 -2626 20396 698 -9674 -3936 -8249 9720 8752 -1539 5638 -11157 -7212 14089 8279
1127 8279 7325 -9505 -19651 9175 11476 5568 2047 -16518 -4668 3200 340 15539 -417
1140 -417 -15476 -6996 -5195 15055 12828 -14332 -7929 -5116 2221 14153 -3693 -2309 -533 -10352
1154 -10352 8763 10539 1370 -30 -16205 617 18915 3373 -496 -11185 -10680 11244 3431
1167 3431 3414 4069 -15738 -6671 599 5442 16435 -8320 -15910 -98 1267 12930 3406 -11442
1181 -11442 1904 -3480 -486 11065 -2127 -974 -4887 -8396 14730 7513 -6252 -4423 -8939
1194 -8939 9327 12878 -4815 448 -6714 -7540 7772 1802 6644 184 -19045 -2009 6476 5930
1208 5930 7315 -12631 -5902 7265 -1449 6741 844 -6664 2860 -5799 2960 10847 -8668 -5594
1222 -5594 -2552 1963 15747 -3410 -9666 1382 -1892 9989 7107 -4781 2290 -9609 -5844
1235 -5844 11647 2553 1007 -8983 -14472 8765 6198 -1516 1373 -9237 1876 5952 -2960 7779
1249 7779 -2449 -9869 2913 552 8447 2632 -16689 -1491 5662 6516 10026 -8007 -4849 3647
1263 3647 -2256 11920 7248 -6451 -4650 -12299 3023 14481 -5007 -7066 -9317 -5950 11777
1276 11777 750 -2077 2041 -9256 2651 7785 2757 6650 -11315 -9704 10117 5778 5906 -5280
1290 -5280 -14288 5388 5969 5570 9645 -7594 -5448 -955 -121 16351 2029 -14446 -7987 -7532 8086
1305 8086 8282 -10850 -4876 -6173 -3217 11471 2652 2189 -959 -11504 8157 12842 2890 -327
1319 -327 -14129 -2468 12818 1730 3291 -5242 -10827 4319 2913 8472 9088 -12566 -8520 179
1333 179 4764 13211 -7614 -14962 -3137 -4315 6898 4859 -7533 -1158 -7003 195 16632 4735
1347 4735 102 -5294 -6886 14358 9097 -3068 -2235 -11167 535 7591 -777 4982 -6626 -12187
1361 -12187 4214 5317 9565 1771 -16803 -3053 4383 3631 6901 -9925 -9005 -1147 -4618 9716
1375 9716 6909 -6350 -2463 -5544 7734 17320 -1268 -3228 -3718 -2467 11620 1193 -3714 -1147
1389 -1147 -11989 -364 6392 988 3459 -10883 -8614 9978 5458 5148 -3211 -12523 2686 2228
1403 2228 1810 6925 -8046 -7165 -1929 -891 13877 3643 -8780 -879 -1308 9322 9857 -5688
1417 -5688 -125 -3197 -4380 7446 -753 -1730 -3137 -12289 4015 7504 -731 300 -8915 -582 10816
1432 10816 105 2907 -1720 -8659 2319 -430 3547 6425 -10423 -5746 1056 2124 10740 -2163
1446 -2163 -5486 4024 -1804 4757 5198 -3762 2194 -4982 -4212 7665 -2288 -2603 -2700 -5497 8265 2376
1462 2376 -4771 1996 -3719 2492 5642 -3154 4025 -2532 -8095 3557 34 2731 1270 -10212
1476 -10212 1475 3382 -1008 5296 -2412 597 5086 -4828 3250 2803 -3977 3069 -2769 68 4511
1491 4511 -8273 -1652 2970 -115 5861 -4156 -4723 4335 -2705 3077 3995 -4280 853 -5230 -3283
1506 -3283 7865 -1974 -2033 -1112 -4065 7283 1329 -3767 4230 -1759 2689 5062 -3109 2883 -3140
1521 -3140 -6024 6610 2073 765 -2581 -11196 2155 5537 488 3930 -6546 -4876 2278 -2063
1535 -2063 7661 3056 -7994 -1896 -3003 4265 8675 -5719 -2410 400 -931 8381 72 -2832
1549 -2832 1836 -5254 4073 7939 -1902 -1166 -8740 -3582 10737 2257 -1070 -5095 -10525 3118 3930
1564 3930 2265 5400 -8868 -6863 1671 2402 10620 -202 -9818 174 43 5939 6006 -6153 -935
1579 -935 -1102 -1186 9282 476 -4037 -3104 -6065 8522 8353 -4150 -3875 -8573 -261 10180 598 450
1595 450 -4963 -10894 2598 4362 5649 3986 -11671 -4809 4455 4201 8908 -3032 -7322 2324 -745
1610 -745 5598 5162 -6217 -2311 -3566 1144 10706 -2303 -6371 -3569 -2560 10521 5079 -4924
1624 -4924 -2078 -7509 582 8770 1282 1359 -7909 -10876 4986 5304 4494 273 -11032 -521 5159
1639 5159 2728 7407 -3236 -4979 1545 -947 7329 2921 -8931 -2914 -1820 4491 8491 -6077
1653 -6077 -4692 -1053 -1016 9689 3167 -3235 -2114 -8872 1858 8589 -174 -943 -9741 -7084 7326
1668 7326 2904 2320 -102 -7519 2574 3622 3217 7441 -4889 -4764 2258 808 6919 -1433 -9395
1683 -9395 -87 -374 4092 5413 -5824 -2070 -1381 -1157 9651 1892 -3960 -3592 -7891 4141 6102
1698 6102 -3436 -1739 -7065 -2767 6534 821 3609 805 -5641 4230 4284 3686 4480 -7247 -2376 3704
1714 3704 -42 3600 -4522 -6845 1928 -1468 3525 4284 -5527 -1240 -2058 673 8880 -2085 -4888
1729 -4888 -2740 -4648 4927 1948 -4111 701 -4555 -65 6679 785 3986 -428 -3895 6948 3369
1744 3369 1105 661 -7392 452 2493 -2742 1885 -4985 -5044 1948 -1734 4542 2550 -6287 495 130
1760 130 1938 5474 -5077 -2507 215 -3280 3998 -72 -2934 2165 -3474 3163 7017 -780 2083
1775 2083 -1506 -1011 7368 -574 -1757 -918 -6370 1438 -118 -3254 1961 -5264 -2971 3971 -88
1790 -88 4149 -247 -4790 4347 879 880 2429 -5590 -20 613 -2511 4452 -1594 -3101 2293 -1173
1806 -1173 5603 4491 -3985 1317 -895 419 4977 -4097 -1778 -941 -5609 2509 -273 -2664 1142
1821 1142 -4810 1332 5829 -1003 1984 -1542 -1838 6146 -416 -280 519 -5943 1367 1416 -366 4186
1837 4186 -4482 -2464 4062 830 5566 683 -5106 2254 -1005 519 3240 -5432 -1816 -1899 -3440
1852 -3440 4957 -749 -3576 503 -2648 5311 4779 -3033 1156 -2314 -515 5991 -981 -79 -1776
1867 -1776 -6844 3180 3237 964 2179 -6323 -902 5396 1060 4662 -1308 -5107 2058 -1845 1838
1882 1838 2689 -6596 -2095 -1522 -387 6004 -2628 -3482 952 -1214 6198 3251 -3502 489 -3869 301
1898 301 6654 -1005 -734 -3941 -5682 5765 3203 797 1244 -5970 1034 3964 515 4332 -2858
1913 -2858 -5001 1537 -1487 2953 577 -7268 -417 -92 1034 4743 -4144 -2536 1438 -1082 6230
1928 6230 1945 -3561 -188 -4188 2488 6546 -1953 -694 -3416 -2994 6263 1295 531 991 -5406 1576
1944 1576 2881 -114 3203 -4848 -3793 2865 -1195 2165 -1499 -6145 2331 330 1040 3665 -4737
1959 -4737 -754 1275 47 6524 -224 -4091 136 -2462 4334 4404 -3758 123 -2752 -1229 5495
1974 5495 -671 292 -117 -5164 3282 1970 -1440 1039 -5380 -514 4169 -2014 1283 -2432 -4237
1989 -4237 3892 363 1742 2223 -5609 318 2213 1449 5641 -2998 -3625 1681 -1021 4815 1837 -4463
2005 -4463 720 -2635 269 5020 -2810 -941 -1563 -3336 5121 671 -2455 -54 -4393 2087 3804
2020 3804 -2328 1217 -3446 -3025 5003 639 2012 -223 -6144 2242 2919 1640 3856 -4800 -2118
2035 -2118 2329 -588 4835 67 -5130 365 -2242 1984 4078 -4706 -1415 -1327 -1142 5800 -1192 -2565
2051 -2565 273 -3581 3814 3439 -2284 607 -4640 -1054 5830 55 1284 -1850 -4889 4181 2589
2066 2589 1254 2560 -5244 -485 2499 15 4363 -2464 -5399 994 -1499 2889 1927 -5922 -390
2081 -390 -624 483 5521 -2043 -2032 84 -2304 5130 2418 -3205 -216 -4360 1243 5805 -1480 378
2097 378 -2612 -3170 5588 1877 1248 891 -5888 601 2893 303 2747 -4892 -4587 1995 -801 2955
2113 2955 87 -5601 935 -252 1920 5228 -3420 -1705 33 -964 6093 255 -4039 -538 -3393
2128 -3393 3257 5020 -2428 38 -2779 -1591 6586 1500 700 -1084 -6269 2229 2593 -253 1291
2143 1291 -6158 -3371 2413 -664 3603 -725 -5137 1876 432 3100 4291 -4544 -1028 353 259
2158 259 5788 -1687 -3824 -261 -2615 4401 4056 -2542 94 -3498 -169 6795 261 82 -2488 -5692
2174 -5692 2887 1650 -492 854 -6187 -2031 2309 42 3989 -1410 -3829 2854 481 3287 2718
2189 2718 -4971 354 235 246 4524 -2769 -2948 42 -2102 4981 2750 -2798 388 -3136 1050 5481
2205 5481 -1423 -97 -2593 -4476 3127 -94 -372 972 -5235 347 2334 -601 3686 -1553 -1758
2220 -1758 3924 -351 2227 763 -4249 1975 144 -45 2983 -3880 -1667 1012 -962 4766 421
2235 421 -3053 1298 -2394 1853 3039 -2811 477 -2209 -2998 3079 -1524 -578 932 -3239 2632 1586
2251 1586 -1497 2606 -1768 928 4314 -1631 968 -1064 -3421 3220 199 -37 1328 -5050 57
2266 57 1925 2 3492 -1952 -2681 1837 -1679 2181 1272 -4219 676 -1706 -760 3119 -3005 -716
2282 -716 1020 -988 4581 784 -2385 1433 -1726 2669 4298 -2224 -89 -2571 -2343 4711 597
2297 597 -214 -541 -5296 1715 2578 241 2715 -3482 -2242 2161 -1045 2571 -259 -4611 1017 -951
2313 -951 1003 2945 -3796 -575 1229 356 5139 -603 -2511 529 -1944 3405 3550 -2747 -663 -3687
2329 -3687 -1393 5071 11 66 -1489 -4787 2508 2107 181 2016 -4104 -1444 2040 -778 2536 -1542
2345 -1542 -4097 2119 -307 2014 2116 -4342 461 1307 873 4935 -1734 -2656 161 -1615 4246 2361
2361 2361 -3369 -531 -3630 -126 4687 -1133 42 -1822 -3831 3260 961 -138 1033 -4302 341
2376 341 2296 -1229 1841 -2538 -2468 3014 -59 2176 590 -4297 1411 1262 1474 4036 -3222 -2292
2392 -2292 382 -1005 4398 442 -3761 -145 -2900 1037 3620 -2223 99 -1891 -2266 3826 -238
2407 -238 -802 226 -3678 2167 2443 -1155 1219 -3254 -866 4156 207 1919 -934 -4202 2485 1464
2423 1464 1702 2624 -4713 -1719 874 -64 4258 -1346 -3649 159 -2041 2574 2669 -3230 -403 -2097
2439 -2097 -321 4373 -1085 -1149 -544 -2639 3655 2423 -1181 518 -3686 289 4438 291 1543 -2245
2455 -2245 -4106 2848 1281 2047 1452 -5117 -733 1014 350 3752 -2536 -3392 285 -1463 3194 1531
2471 1531 -3461 -282 -1386 862 4191 -1415 -893 -748 -2106 4456 1798 -782 380 -3986 1063
2486 1063 3857 -110 1479 -2858 -2956 3026 599 1691 325 -4953 97 504 323 2958 -3009 -2297
2502 -2297 671 -1129 3461 480 -3402 396 -1418 1701 3659 -2170 -224 -977 -1174 4586 292
2517 292 -851 19 -3243 1991 2547 -905 1076 -2821 -1780 2889 -422 1011 -544 -3532 1467 327
2533 327 -241 1875 -3350 -956 1309 -738 2996 -800 -2328 1322 -766 2346 2400 -2469 459 -507
2549 -507 -85 3862 -1075 -912 230 -2644 2489 1197 -1791 700 -2584 -366 2940 -1491 559 -1100
2565 -1100 -2493 2793 40 -233 828 -3621 649 1681 -676 2357 -1992 -1754 2211 -382 2342
2580 2342 1189 -2865 1200 -287 523 3106 -2437 -914 121 -1605 2725 -271 -2560 521 -2192
2595 -2192 1139 2385 -2068 61 -1627 -1210 3268 -448 -398 -93 -3115 1828 1502 -378 1762 -2439
2611 -2439 -697 2555 -182 2169 -303 -2688 1801 -334 723 1832 -3273 -356 329 -745 2597
2626 2597 -1405 -2188 507 -1408 2172 1691 -2616 95 -1609 -316 3324 -850 -212 -491 -2448 2791
2642 2791 968 -286 1388 -2515 467 2381 -726 1703 -1222 -2193 2457 -382 416 291 -3629 470
2658 470 748 -230 1996 -2460 -1886 952 -772 2709 257 -2948 598 -1267 818 3155 -1946 -239
2674 -239 -629 -1193 3617 405 -701 816 -2166 1688 2153 -1198 766 -2244 -1286 2864 -482 368
2690 368 -902 -3694 1626 800 258 1437 -3536 -1315 1345 38 2905 -403 -2983 575 -773 1859
2706 1859 2530 -2462 -275 -804 -315 3514 -85 -881 127 -1927 2454 1672 -1491 36 -2742 -659
2722 -659 3084 -569 88 -1792 -3333 2131 989 791 816 -3769 -428 1431 369 2984 -1418 -2504
2738 -2504 1069 -454 2571 1943 -2467 11 -703 422 3666 -1157 -860 -66 -1794 2836 890 -1533
2754 -1533 35 -3027 292 2408 -1262 411 -2192 -2580 2621 667 882 537 -3424 508 1277 433
2770 433 2480 -1706 -1519 1255 -535 2353 773 -2274 869 -723 702 2490 -1964 -388 -192 -1187
2786 -1187 2756 -335 -1783 -5 -2283 1273 1881 -1646 471 -1809 -1002 2684 -269 508 -114 -2598
2802 -2598 1614 1007 -21 1800 -2197 -249 1792 -559 2135 -607 -2269 1519 -372 906 1315
2817 1315 -2861 -11 17 -392 2196 -1765 -1773 648 -1503 2123 700 -2319 290 -1588 463 3110
2833 3110 -998 92 -638 -1719 2932 1036 -285 672 -2587 694 2248 -478 1478 -1731 -1975 2121
2849 2121 -44 1130 85 -3373 573 260 283 2022 -2577 -1553 517 -510 2906 381 -2682 22
2865 22 -1277 1561 2921 -1345 -479 -1387 -1059 3307 648 -392 -373 -2963 1316 1801 -348 860 -2600
2882 -2600 -1439 1960 -172 1228 -458 -3377 732 456 938 1821 -2967 -1143 401 102 3085 -294
2898 -294 -2145 110 -1123 2191 2587 -1679 -48 -1337 -640 3220 51 -11 -621 -2778 1602 1228 -505
2915 -505 695 -2717 -917 1666 -336 1388 -1047 -2675 1377 242 785 1267 -2802 -162 471 227
2931 227 3090 -1062 -1515 482 -973 2466 1761 -1716 342 -1492 -125 2828 -697 238 -650 -2375
2947 -2375 1661 126 -702 775 -2415 28 1324 -1317 1073 -1057 -1387 1787 -358 617 833 -2331
2963 -2331 819 411 154 2322 -1654 -858 932 -917 2105 625 -1469 762 -1285 268 1740 -1498
2979 -1498 160 -405 -1538 1648 -745 -736 726 -1877 894 821 -1489 816 -1171 -196 2246 -758 552
2996 552 38 -1969 1757 299 240 1263 -2136 -122 1033 -733 1844 -374 -1470 1294 -1109 681
3012 681 845 -1955 635 -152 -746 1629 -1646 -1006 715 -1070 1737 497 -1865 690 -1202 639
3028 639 2456 -1182 533 -704 -1439 2306 194 -3 858 -2371 762 1034 -929 1438 -1250 -1149
3044 -1149 1531 -1325 610 120 -2213 960 -144 -316 1288 -2387 -430 872 -637 2461 -237
3059 -237 -1692 727 -1291 1241 2005 -1228 416 -1036 -1040 2388 -279 243 541 -2126 1152 480 -855
3076 -855 1188 -1546 -503 1306 -1385 560 -544 -1963 1657 -457 129 885 -2366 350 897 -269
3092 -269 2046 -743 -1383 1106 -741 1781 1159 -1678 853 -658 -371 1964 -1040 8 459 -1732
3108 -1732 1582 -232 -1223 766 -1640 434 990 -1695 334 -1047 -989 2179 -160 276 265 -2157 1289
3125 1289 1157 -80 1770 -1758 -476 1328 -661 1660 137 -1727 872 -391 316 1377 -1878
3140 -1878 79 220 -604 2051 -918 -1475 671 -1272 1567 1052 -2078 -128 -1580 -187 2720 -452
3156 -452 -34 -429 -2039 2107 1077 4 793 -2114 -123 1818 -185 1743 -1174 -1994 1190 -265
3172 -265 770 748 -2736 51 114 180 2273 -1837 -1738 87 -769 2365 1075 -2013 -307 -1591 678
3189 678 3070 -623 290 -912 -1720 2518 1011 223 484 -2791 570 1691 -227 1479 -1799 -1654
3205 -1654 1431 -304 1371 211 -3146 363 170 785 1972 -2319 -1265 133 -658 3011 594 -1598
3221 -1598 -169 -1640 1291 2824 -753 252 -1321 -1225 2679 676 95 -32 -2646 1202 1235 -6
3237 -6 1094 -2206 -1299 1297 -346 1595 -496 -2775 606 -142 805 1790 -2156 -654 41 -288 2847
3254 2847 -206 -1343 251 -1270 1732 1877 -1039 363 -1397 -735 2331 -206 146 -281 -2164 1485
3270 1485 852 -365 888 -2369 -656 1250 -395 1232 -1121 -2285 1028 -139 1011 1292 -2135
3285 -2135 90 198 86 2395 -695 -1200 532 -930 1853 1173 -1580 462 -1203 61 2033 -1039
3301 -1039 141 -471 -1512 1878 2 -509 316 -2292 224 1214 -770 960 -1320 -1308 1304 -19
3317 -19 989 483 -2050 765 335 199 1853 -1492 -521 770 -864 1785 217 -1510 703 -981
3333 -981 767 1666 -1464 76 -714 -1259 1949 -412 -740 42 -1890 1090 691 -782 1154 -1328 -202
3350 -202 1953 -318 1000 -171 -1805 1350 237 269 1078 -2083 -46 834 -784 1547 -993 -1438
3366 -1438 752 -884 1001 988 -1918 111 -593 -434 1926 -1342 -442 216 -1228 1758 371 -896
3382 -896 969 -1247 454 2097 -642 662 -539 -1247 1924 -94 155 664 -1922 554 587 -549
3398 -549 1312 -1292 -1061 1200 -657 1336 145 -2044 610 -538 -20 1387 -1746 -389 263 -806
3414 -806 1921 -133 -811 793 -919 1187 1508 -1178 251 -938 -504 2135 -551 -140 152 -1776
3430 -1776 1294 584 -254 986 -1724 -361 1290 -631 976 -514 -1630 983 -470 278 1128 -1694
3446 -1694 135 263 -210 1970 -682 -975 517 -823 1522 1045 -1324 402 -1101 -123 1901 -749
3462 -749 322 -451 -1628 1532 257 -295 665 -1926 142 1060 -674 802 -1025 -1351 1206 -382
3478 -382 803 609 -1987 493 297 -4 1776 -1086 -560 843 -700 1809 200 -1205 568 -1051
3494 -1051 502 1664 -1133 41 -584 -1079 1621 -140 -531 293 -1752 738 919 -898 835 -1189
3510 -1189 -740 1234 -268 762 278 -1499 1210 373 276 1287 -1475 75 767 -460 1443 -381
3526 -381 -1132 777 -1046 474 874 -1719 173 -558 -573 1610 -901 -784 85 -1188 1376 433 -863
3543 -863 380 -1282 62 1612 -346 656 -242 -1107 1621 94 -3 818 -1499 389 672 -578 1270
3560 1270 -893 -1097 845 -562 871 315 -1954 304 -349 11 1573 -1486 -439 190 -853 1712
3576 1712 298 -777 373 -1319 875 1618 -652 559 -508 -778 1882 -37 187 234 -1838 808
3592 808 565 -356 764 -1831 -639 1095 -455 986 -466 -1695 447 -514 656 1246 -1497 -282
3608 -282 -186 -321 2065 -233 -630 353 -929 1095 976 -685 760 -749 -209 1715 -503 46 -279
3625 -279 -1704 1118 544 -487 569 -1791 -324 936 -334 1199 -680 -1473 808 -214 1036 907
3641 907 -1437 75 -22 -86 1638 -704 -514 522 -907 1317 702 -1076 406 -955 29 1571 -1047
3658 -1047 57 -568 -1260 1671 74 -256 257 -1865 421 983 -188 926 -1051 -1120 878 43 1057
3675 1057 513 -1404 561 -148 217 1441 -1024 -85 487 -663 1386 71 -1294 604 -899 652
3691 652 1051 -1221 62 -686 -723 1602 -406 -424 -267 -1759 1019 745 -185 680 -1320 -263 1265 -253
3709 -253 1027 93 -1368 1099 265 312 1103 -1408 74 380 -275 1175 -769 -1075 568 -642 1068
3726 1068 556 -1489 -53 -908 -256 1736 -207 -338 -436 -1280 1323 725 -155 533 -1427 98 1428
3743 1428 -343 1131 -213 -829 1214 -207 299 656 -1776 254 394 -313 962 -1053 -1031 534 -590
3760 -590 1314 320 -1616 -56 -808 366 1729 -641 -135 -439 -836 1643 288 -17 637 -1135 481
3777 481 987 -353 879 -803 -928 1408 -259 365 -198 -1500 642 120 -381 738 -1512 -614 276
3794 276 -367 1579 -53 -1232 142 -687 643 1454 -927 157 -502 -762 1445 -12 22 389 -1123
3811 -1123 788 695 -629 521 -1086 -420 1244 -717 162 -342 -1444 920 75 -33 756 -1572 -334
3828 -334 344 -186 1186 -498 -1054 721 -663 652 934 -967 482 -515 -478 1370 -511 50 356
3845 356 -988 1071 167 -710 748 -842 150 862 -912 275 -733 -807 1028 -168 150 397 -1504
3862 -1504 332 506 -138 1206 -740 -516 600 -706 699 167 -860 890 -80 -103 995 -1103 340
3879 340 360 -555 1153 -408 -951 570 -642 666 585 -1111 302 -819 -395 1373 -557 -184 14
3896 14 -1361 853 246 -517 615 -884 -26 1189 -621 562 -463 -894 1041 122 524 369 -1144
3913 -1144 454 481 -157 965 -927 -936 456 -461 986 326 -1316 -43 -825 283 1559 -708 -29
3930 -29 -284 -957 1380 104 -556 268 -1078 508 1112 -164 652 -849 -631 1326 -29 379 40 -1805
3948 -1805 668 332 129 1001 -1326 -1066 188 -260 1185 84 -1443 61 -609 630 1484 -748 48
3965 48 -321 -630 1693 282 -120 33 -1396 887 1032 -164 556 -977 -353 1346 -231 696 -310
3982 -310 -1760 667 35 299 924 -1542 -895 328 -240 1367 -161 -1422 320 -593 669 1326 -829
3999 -829 156 -431 -291 1707 -190 -281 -30 -1203 1087 596 -704 362 -1249 -120 1234 -135 444
4016 444 -606 -1287 871 212 312 582 -1594 -34 450 -143 1279 -264 -753 493 -433 1288 678
4033 678 -683 229 -306 147 1337 -463 -81 -187 -710 1039 28 -456 103 -1297 299 1137 -568
4050 -568 524 -912 -920 1085 -330 338 238 -1294 333 185 18 1143 -768 -476 610 -267 1139
4067 1139 297 -1050 752 -349 504 1164 -945 -46 -207 -485 1203 -321 -585 118 -1222 502 820
4084 820 -778 267 -863 -260 1249 -451 376 -103 -1293 761 317 -20 760 -1319 41 624 -44
4101 -44 1013 -344 -739 662 -457 677 783 -1182 269 -161 -325 1011 -672 -326 217 -942 954
4118 954 266 -744 371 -938 -94 1102 -572 592 -264 -958 1080 283 231 522 -1004 286 822
4135 822 -287 1006 -520 -430 758 -561 802 171 -1215 304 -70 -283 718 -1011 -576 102 -515
4152 -515 761 -168 -857 444 -815 339 1055 -667 511 -299 -199 1324 -345 -88 503 -819 609
4169 609 365 -379 550 -939 -465 821 -709 508 -203 -1257 549 -191 -302 550 -1037 -17 313
4186 313 -272 1161 -437 -631 662 -467 823 584 -831 397 -297 -72 1225 -571 38 270 -871
4203 -871 637 186 -398 357 -1039 171 735 -854 347 -472 -924 867 -216 172 400 -1251 651
4220 651 339 -163 1049 -651 -459 702 -552 941 71 -975 466 -333 66 1056 -1034 12 -117
4237 -117 -599 1082 -288 -756 129 -991 601 827 -659 279 -706 -232 1077 -212 322 -48 -1269
4254 -1269 766 286 -29 722 -924 -215 695 -399 924 -216 -1064 474 -376 572 879 -1021 272
4271 272 -346 -201 1482 -686 -478 177 -820 1145 587 -890 361 -974 185 1215 -402 249 -339
4288 -339 -823 1080 48 169 597 -1157 318 556 -166 863 -624 -624 522 -397 574 343 -1253 246
4306 246 -51 -33 1209 -861 -406 187 -687 900 51 -798 248 -833 351 1065 -600 477 -148 -726
4324 -726 1258 26 98 355 -854 570 496 -129 767 -840 -476 608 -425 622 261 -1181 644
4341 644 -244 70 819 -1073 -146 86 -530 943 -126 -687 427 -434 700 667 -757 443 -232 -88
4359 -88 1494 -446 151 116 -949 594 520 -367 564 -909 -55 823 -587 638 -284 -880 559 -465
4377 -465 217 467 -1090 189 125 -243 978 -768 -430 788 -33 984 323 -767 688 -217 450 1008
4395 1008 -629 -154 -254 -698 1188 61 -398 294 -1026 277 674 -658 418 -668 -600 865 -344
4412 -344 235 31 -1235 641 287 -256 799 -1128 -288 667 -191 1154 -37 -1006 461 -201 591 870
4430 870 -1038 -317 -90 -418 977 -99 -544 148 -1151 457 410 -610 383 -995 -343 1242 -396
4447 -396 390 -231 -1215 1008 58 -49 669 -1010 42 781 -121 1041 -399 -921 597 -420 507 568
4465 568 -1062 -115 -370 -259 1347 -557 -297 -177 -725 756 198 -755 219 -994 -7 1037 -434 93
4483 93 -283 -690 1119 12 63 331 -1325 244 517 -117 1059 -864 -734 591 -389 723 199 -899
4501 -899 153 -474 12 621 -958 -424 -8 -777 896 221 -745 172 -706 591 744 -692 435 -297
4519 -297 -219 1114 -48 182 446 -1096 843 511 80 555 -972 -495 645 -468 549 -252 -930 379
4537 379 -463 269 697 -1082 -238 53 -410 1169 -365 -544 430 -410 623 764 -593 162 -478 -29
4555 -29 1352 -204 193 -59 -915 997 167 -319 461 -1165 -274 429 -241 628 -448 -968 696 -351
4573 -351 360 488 -1133 326 20 216 757 -324 -345 466 -547 949 414 -573 379 -695 352 913
4591 913 -510 98 -335 -844 793 -53 -229 322 -1033 63 549 -247 619 -734 -486 601 -464 488
4609 488 88 -741 408 -7 163 1022 -479 -218 242 -301 784 -37 -542 250 -728 108 569 -800 208
4628 208 -268 -706 740 -289 -17 357 -680 423 204 -410 700 -529 -167 594 -577 346 -3 -906
4646 -906 781 82 151 546 -755 235 380 -502 815 -366 -475 552 -497 312 385 -881 242 -286
4664 -286 -119 578 -600 36 378 -533 811 42 -555 521 -600 323 796 -542 123 -480 -537 896
4682 896 -82 20 154 -878 687 504 -266 523 -679 -330 541 -547 613 -240 -790 634 -298 80
4700 80 780 -877 -78 -155 -359 1037 -419 -671 391 -434 442 621 -547 271 -459 -218 1085 -192
4718 -192 -84 90 -784 713 197 165 509 -1096 -116 529 -377 638 -328 -864 471 -249 407 420 -1030
4737 -1030 -52 53 -2 1111 -301 -459 171 -495 892 756 -509 374 -555 138 1117 -448 283 -137
4755 -137 -553 625 39 -188 192 -935 160 383 -265 559 -604 -563 758 -491 427 112 -1107 279
4773 279 110 264 924 -371 -56 257 -413 972 36 -716 265 -332 218 841 -607 242 -366 -602 688
4792 688 -252 -180 34 -971 487 676 -293 254 -867 -247 840 -21 478 -96 -898 500 13 209 633
4811 633 -984 -132 211 -110 1004 -261 -673 270 -583 645 516 -586 185 -500 -33 859 -485 -175
4829 -175 -127 -731 723 287 48 510 -955 50 669 -390 485 -121 -861 634 27 367 419 -939 359
4848 359 263 -152 917 -450 -292 257 -682 742 154 -668 227 -390 63 807 -455 -135 -230 -715 836
4867 836 -81 -107 423 -930 283 608 -205 409 -493 -515 644 -193 339 435 -495 497 202 -13 546 -795
4887 -795 -219 344 -438 527 109 -696 285 -477 106 704 -494 -11 -37 -433 823 -26 -142 250 -703 339
4907 339 613 -297 654 -247 -262 824 -284 414 25 -657 641 0 -144 431 -777 11 462 -493 494
4926 494 -325 -702 367 -467 541 305 -782 66 -338 -161 995 -328 21 280 -390 595 454 -438
4944 -438 294 -544 -113 719 -446 142 -172 -499 707 -121 -271 21 -908 276 262 -354 352 -761 -691
4963 -691 606 -333 440 -11 -625 236 -7 102 831 -578 88 338 -244 894 -136 -329 192 -498 362
4982 362 582 -956 -95 -652 -368 877 -331 -122 -117 -1020 505 384 -164 399 -891 -321 918 -8 649
5001 649 -81 -812 596 48 446 619 -813 -19 136 -105 775 -434 -576 142 -593 424 267 -935
5019 -935 -255 -671 -278 1154 -437 -120 -311 -897 774 555 -153 365 -810 -77 749 -96 724 -253 -610
5038 -610 616 -318 337 493 -993 69 16 -124 586 -618 -570 265 -434 675 34 -760 206 -437 259
5057 259 832 -388 47 -11 -507 935 45 134 317 -893 165 488 -357 719 -444 -488 547 -644
5075 -644 399 -43 -820 234 -88 -115 333 -829 -71 297 -510 720 142 -417 247 -634 362 725 -475
5094 -475 278 -372 -318 905 -221 44 174 -673 293 191 -202 252 -558 -147 667 -476 156 -7 -565
5113 -565 593 -174 77 447 -773 15 346 -290 637 -131 -593 442 -313 394 448 -496 276 -413 -201
5132 -201 731 -526 107 153 -340 736 155 -186 339 -544 7 710 -433 244 -111 -471 748 -200 -92
5151 -92 185 -885 145 342 -262 497 -722 -502 388 -349 584 258 -653 399 -433 76 900 -497 61
5170 61 303 -390 784 -12 -366 419 -750 533 549 -649 131 -331 -282 610 -334 16 -208 -1111 503
5189 503 321 -354 415 -660 -291 487 -374 734 -20 -550 651 -205 353 623 -670 220 -39 -287 559
5208 559 -391 -246 198 -491 451 167 -561 328 -566 -167 590 -328 166 -96 -850 455 -68 181 578 -682
5228 -682 221 543 -217 708 65 -279 582 -17 274 238 -601 264 -187 -210 464 -660 -166 198 -504 634
5248 634 -214 -707 339 -393 429 639 -446 67 -185 -514 823 -273 -53 303 -769 427 353 -489
5266 -489 308 -311 -244 525 -496 470 -66 -527 739 15 4 307 -627 -50 120 -376 583 -632 -651 419
5286 419 -588 480 488 -468 248 -107 -239 910 -278 -70 349 -437 574 195 -390 463 -636 49 714
5305 714 -316 121 -291 -795 475 -33 72 137 -898 109 310 -267 824 -344 -333 546 -407 645
5323 645 366 -670 172 -261 -39 681 -589 32 214 -506 650 30 -199 377 -825 400 326 -598 198
5342 198 -584 -484 643 -90 342 -37 -956 394 190 -28 747 -717 -236 401 -301 599 144 -471 315
5361 315 -146 445 627 -327 139 -127 -475 834 -145 -313 83 -898 397 163 -372 223 -657 -376 570
5380 570 -337 239 201 -782 313 6 13 645 -562 48 494 -134 597 -14 -343 456 -261 379 528 -465
5400 -465 182 -40 -216 691 -448 -320 124 -458 475 -17 -712 311 -702 -137 776 -388 303 -183 -472
5419 -472 792 80 98 371 -463 610 484 -89 686 -221 -359 572 -363 298 60 -877 452 -307 -372 517
5439 517 -657 -73 160 -324 638 33 -474 293 -344 331 670 -280 325 -212 -379 709 -264 284 52
5458 52 -636 443 188 -354 307 -540 -313 411 -339 284 -217 -740 369 -278 1 381 -896 130 100
5477 100 -293 909 -37 -135 632 -232 604 540 -400 510 -291 -277 726 -400 133 133 -499 692 200 -295
5497 -295 160 -607 125 513 -383 317 -283 -626 585 -143 274 374 -907 117 -34 -313 974 -448
5515 -448 -375 333 -393 533 52 -635 379 -293 -108 553 -363 -28 -53 -523 695 -262 -147 272 -800 277
5535 277 458 -281 474 -416 -195 585 -216 257 82 -780 327 117 43 518 -568 -142 385 -635 713
5554 713 -200 -320 424 -466 28 458 -635 208 19 -338 736 -329 -176 157 -708 392 102 -391 241
5573 241 -698 -56 463 -470 239 27 -945 507 -199 29 439 -587 -24 307 -357 669 7 -290 640
5592 640 -233 648 446 -509 367 -230 -200 663 -538 -166 50 -546 549 8 -240 409 -554 -48 510 -542
5612 -542 348 -148 -212 575 -119 76 446 -521 457 88 -213 660 -306 -4 705 -299 314 66 -719 339
5632 339 -457 -155 566 -740 29 -72 -571 391 -241 -330 315 -571 414 381 -488 489 -61 -129 888 -140
5652 -140 36 239 -510 616 98 -281 326 -596 -175 469 -573 505 -342 -629 434 -252 -1 462 -653
5671 -653 50 242 -430 592 -367 -281 482 -349 386 102 -535 617 -164 119 680 -522 -36 -171 -374
5690 -374 648 31 -448 295 -470 -18 432 -580 276 -251 -504 391 -245 107 120 -626 211 159 -180 514
5710 514 -394 45 421 -408 621 205 -552 268 -215 213 452 -760 111 -153 -395 696 -222 -346 32
5729 32 -812 237 399 -434 268 -553 -160 565 -445 282 22 -647 590 49 -79 583 -565 227 421
5748 421 -196 669 -225 -598 413 -288 328 470 -608 39 -238 -338 773 -398 -159 -142 -706 604 109
5767 109 -659 371 -509 10 521 -437 162 -202 -568 744 -23 1 483 -737 85 180 -78 766 -341
5786 -341 -493 385 -255 421 311 -764 154 -434 -287 727 -413 4 37 -579 367 23 -375 131 -591
5805 -591 106 483 -241 385 -196 -306 845 -149 194 323 -924 462 132 -256 456 -520 -223 569 -278
5824 -278 406 -125 -569 14 -440 126 477 -543 -34 152 -256 734 1 -298 270 -555 543 447 -464 341
5844 341 -107 -179 795 -132 28 -113 -693 541 100 105 278 -663 -141 273 -276 553 -186 -789 161 -325 244
5865 244 367 -503 332 -85 -70 717 -243 -43 423 -437 536 307 -354 489 -405 -117 543 -516 65 -176
5885 -176 -489 449 -191 -203 193 -857 105 214 -479 402 -409 -421 340 -210 137 418 -606 409 -14 -37
5905 -37 770 -236 74 80 -303 749 -53 -400 295 -613 75 412 -466 21 -288 -343 549 -284 -238 208 -685
5926 -685 265 318 -223 473 -322 -263 328 -314 424 172 -588 332 -146 68 521 -388 100 45 -243 634 -70
5947 -70 -456 332 -199 329 358 -425 449 -87 -306 638 -456 5 284 -593 444 141 -315 170 -609 -40
5967 -40 425 -453 365 -300 -534 374 -98 -26 526 -503 302 183 -1 549 -309 -290 451 -436 391 77 -534
5988 -534 215 -218 -145 593 -689 84 112 -384 438 -47 -132 439 -483 141 104 -325 373 -191 -99 544 -80
6009 -80 299 424 -531 302 -185 43 355 -419 -179 299 -317 240 -59 -551 277 -488 150 320 -749 64
6029 64 -17 -351 441 -253 -184 303 -524 267 108 -258 493 -228 -188 612 -565 104 32 -482 499 90 -320
6050 -320 286 -344 229 203 -506 428 -302 -562 350 -269 220 49 -445 166 10 -124 507 -184 91 312
6070 312 -477 462 212 -356 324 -235 50 638 -404 158 -49 -267 478 -181 -252 322 -538 285 122 -310
6090 -310 395 -282 -220 561 -380 146 241 -487 442 14 -269 484 -332 155 232 -270 635 101 -233 331 -458
6111 -458 165 369 -569 12 -182 -134 510 -536 -78 214 -613 325 35 -327 297 -514 -105 523 -184 242
6131 242 -1 -292 590 -122 67 225 -536 268 362 -64 704 -450 -349 311 -538 292 82 -558 -3 -295
6151 -295 -114 638 -539 28 126 -355 676 30 -199 497 -596 57 563 -225 295 -119 -316 656 -5
6170 -5 141 176 -408 362 109 -211 467 -411 -311 268 -366 374 15 -582 399 -364 93 646 -395 -83 -259
6191 -259 -524 540 -91 -172 288 -460 245 455 -54 287 -316 -5 555 -40 83 -88 -760 314 167 -250
6211 -250 264 -660 -206 324 -204 698 -60 -571 146 -581 242 459 -362 83 -235 -235 827 -124 -67 143 -229
6232 -229 405 342 -138 362 -320 -44 711 -322 346 -82 -500 365 1 71 195 -772 -38 122 -183 530
6252 530 -338 -290 377 -407 437 437 -365 434 -275 115 741 -226 211 142 -429 570 120 -189 457 -263 -62
6273 -62 438 -431 188 -292 -592 452 -271 65 242 -736 152 7 -118 492 -338 -131 495 -277 358 279
6293 279 -461 309 -57 25 382 -242 5 -108 -588 645 -27 -337 426 -558 173 212 -470 104 -458 -251
6313 -251 255 -197 -92 103 -401 499 -139 -291 637 -235 -188 321 -424 564 51 -201 392 -119 85 713
6333 713 -419 111 -23 -528 554 -247 -162 306 -349 434 61 -402 461 -451 -42 463 -388 216 217 -471
6353 -471 525 -150 -159 415 -423 -51 244 -347 273 -79 -338 515 -255 84 226 -519 345 59 16 489 -498
6374 -498 -211 37 -411 433 -171 -600 197 -382 216 435 -462 368 74 -471 485 -86 -2 244 -486 511
6394 511 210 -336 295 -356 -121 516 -275 150 105 -805 420 175 -200 376 -483 -64 175 -241 217 -179
6414 -179 -491 427 -339 104 295 -403 51 58 4 512 -186 30 202 -322 519 206 -358 290 -396 -71 577
6435 577 -426 328 -79 -319 338 -406 -191 186 -399 115 65 -256 317 -332 -267 494 -140 335 108 -428
6455 -428 72 -199 -67 471 -358 32 313 -434 460 130 -279 215 -460 122 335 -596 139 -80 -309 656
6475 656 -305 32 80 -520 303 -68 -176 410 -425 -19 237 -309 520 245 -419 554 -134 104 454 -329
6495 -329 114 86 -385 672 -196 -223 562 -461 129 247 -462 189 -386 -274 362 -240 81 42 -409 285
6515 285 238 -22 521 -376 -13 267 -224 625 -113 -215 271 -265 150 169 -456 61 -69 -373 422 -253 131
6536 131 200 -529 110 143 -519 349 -419 -83 377 -402 262 148 -408 489 256 -63 546 -461 239 365
6556 365 -189 509 -296 -266 536 -354 197 210 -533 248 56 -201 513 -556 -76 241 -266 350 -108 -306
6576 -306 200 -508 98 365 -319 283 -52 -173 503 -19 -23 328 -367 233 154 -207 498 -334 -209 401 -268
6597 -268 194 83 -327 322 -226 -108 269 -618 71 121 -350 581 -115 -319 283 -317 293 182 -280 457
6617 457 -188 -142 542 -150 21 258 -255 503 22 -108 353 -164 168 358 -568 260 -2 -566 442 -139
6637 -139 -107 232 -591 122 241 -390 453 -104 -52 479 -401 346 219 -276 434 6 -21 431 -316 -24 264
6658 264 -271 550 -238 -165 145 -520 91 206 -470 345 -214 -247 392 -242 -128 11 -521 399 8 -273 402
6679 402 -445 72 263 -279 350 220 -385 296 -122 -114 451 -461 107 183 -293 390 -223 -242 223 -543 120
6700 120 57 -376 459 -426 -99 333 -100 125 65 -461 270 50 51 517 -505 77 507 -288 487 -197 -246
6721 -246 336 -219 101 214 -466 250 -81 -189 460 -263 -3 125 -596 316 124 -409 83 -424 -219 412
6741 412 -381 89 55 -408 407 78 -70 454 -397 30 127 -476 497 -311 -324 362 -215 251 166 -512 222
6762 222 -221 -42 469 -515 -100 39 -370 513 -40 -154 75 -403 207 470 -377 358 -21 -208 494 -129
6782 -129 104 195 -469 220 -17 -297 486 -389 -86 44 -371 283 -39 -445 227 -131 -36 267 -488 160 3
6803 3 -186 292 54 -252 329 -139 139 92 -286 419 -160 -128 312 -148 235 351 -284 479 73 -562 242
6824 242 -355 -48 300 -380 315 -207 -303 371 -307 -44 192 -392 314 -88 -367 374 -464 80 334 -313
6844 -313 291 77 -222 418 -229 -90 283 -353 292 -16 -378 418 -211 -178 333 -311 177 241 -469 229 -208
6865 -208 -304 506 -151 2 228 -309 400 -28 -234 283 -404 8 327 -194 355 -154 -145 428 -65 122 277
6886 277 -514 142 -19 -280 370 -76 61 2 -458 219 172 -345 124 -221 -45 349 -205 173 104 -267 428
6907 428 -140 -170 254 -301 68 399 -164 185 -255 -277 337 -400 -108 66 -580 600 142 -89 333 -424
6927 -424 9 165 -222 380 23 -368 192 -240 92 345 -274 297 -33 -434 457 138 24 -36 -645 285
6947 285 91 -173 225 -450 -178 428 -235 329 -75 -187 231 -180 -189 118 -484 133 76 -461 417 -254 -277
6968 -277 206 -95 225 132 -352 136 -119 -97 531 -336 37 -63 -292 229 -9 -130 424 -196 -206 407 -358
6989 -358 130 -68 -214 261 -232 -69 195 -467 27 288 -147 504 -227 -400 385 -224 294 313 -572 190
7009 190 -172 -96 475 -154 156 125 -475 369 10 -164 257 -403 -161 86 -466 205 -223 -241 358 -164 196
7030 196 262 -380 251 -155 102 517 -339 -87 69 -213 371 150 -400 228 -221 -32 488 -425 47 -136
7050 -136 -564 493 32 -403 439 -415 254 221 -368 283 -451 -42 131 -98 132 196 -351 46 162 54
7070 54 297 -145 179 22 -63 445 -58 -440 105 -184 121 324 -285 -41 -230 -118 388 -165 -337 225 -356
7091 -356 297 154 -277 319 -195 -206 287 -128 450 9 -443 444 -116 -181 283 -162 228 11 -129 301 -81
7112 -81 -173 319 -180 53 355 -393 212 -442 -169 319 -321 -17 179 -274 143 -24 -100 320 -193 106 285
7133 285 -184 199 -98 -145 434 -6 184 133 -367 162 145 -127 230 -243 -214 220 -131 121 87 -478 159 -108
7155 -108 -64 388 -347 186 34 -304 255 -107 46 300 -173 336 184 -138 221 -194 -273 474 -189 19 275
7176 275 -552 396 -6 -186 324 -266 144 224 -421 279 64 -333 254 -229 95 337 -326 336 91 -64
7196 -64 276 -243 102 153 -5 445 74 -115 221 -128 70 245 -137 51 147 -456 436 -192 -124 111 -563
7217 -563 98 71 -179 306 -26 -209 238 -123 48 136 -360 269 123 2 420 -245 -134 223 -77 410 128
7238 128 -300 102 -215 56 377 -281 151 -131 -380 401 -188 -64 142 -516 199 179 -312 202 -314 -167
7258 -167 295 -369 347 -20 -548 333 12 30 536 -242 217 225 -211 202 -73 -60 272 -414 378 391 -315 -29
7280 -29 -4 -354 190 -58 -12 329 -271 507 -87 78 255 -305 -55 188 -316 278 -86 -210 323 -189 157
7301 157 307 -212 -102 -66 41 340 -202 -224 -34 -397 288 297 -433 287 65 -84 383 -277 197 -153 -170 473
7323 473 -48 -91 33 -266 -79 428 -190 306 -129 -171 356 -207 184 -32 -383 168 25 -153 276 -365 -124
7344 -124 239 -460 314 -155 -528 114 -269 -43 358 -186 331 126 -191 662 -75 -103 344 78 200 186 -127
7365 -127 268 -98 -127 289 72 85 17 -375 261 22 -27 330 -359 41 313 -261 242 -7 -427 342 -79
7386 -79 -43 369 -311 236 43 -244 488 -177 33 78 -257 329 56 42 301 -188 136 244 -287 154 61 -227
7408 -227 351 -97 -178 148 -250 205 205 -118 312 -143 -11 325 -107 266 200 -335 255 76 -134 354 -273
7429 -273 132 145 -206 490 0 -11 448 -369 -159 388 -213 118 127 -243 225 -118 -99 91 -373 242 -45 -362
7451 -362 -35 -271 -58 239 -289 289 120 -472 127 -104 -81 305 -453 203 25 -395 372 -134 -294 117
7471 117 -386 200 -68 -386 68 -311 -209 407 -362 85 1 -359 307 41 -261 82 -214 32 238 -240
7491 -240 274 -183 -183 359 -172 231 -36 -508 205 52 -182 395 -292 -41 75 -398 242 122 -502 277 -248
7512 -248 -33 318 -401 159 201 -348 492 -52 -50 316 -328 55 201 -350 354 -151 -314 426 115 140 141 -413
7534 -413 180 -82 -86 392 -418 -111 179 -374 384 -118 -227 396 -248 -76 321 -267 233 95 -100 306 -2
7555 -2 -2 12 -292 498 55 -79 319 -251 54 375 -77 178 190 -366 349 -173 -57 204 -423 36 213 -291
7577 -291 331 -219 -93 515 -310 52 190 -142 297 -111 -258 448 -80 -76 22 -241 252 8 -247 280 -407
7598 -407 -104 211 -405 249 53 -454 184 -61 -5 224 -272 148 10 -137 288 -191 -73 288 -389 162
7618 162 64 -378 374 -82 -208 257 -319 149 194 -312 118 -210 -19 420 -205 59 123 -157 109 -94 -343
7639 -343 398 -236 -77 259 -354 439 69 -297 310 -88 -17 345 -198 31 -85 -239 276 -105 -51 297 -420
7660 -420 138 64 -222 268 -339 -97 356 -356 38 96 -371 102 -267 -127 374 -110 23 19 -160 172 -67
7681 -67 -106 349 -423 160 334 -263 447 -62 -309 418 -272 -45 216 -215 306 136 -306 158 -108 -95 241
7702 241 -285 212 144 -145 187 -38 -103 312 -313 -57 149 -326 482 235 -80 310 -237 78 189 -136 105
7723 105 -151 -135 243 -60 152 65 -105 321 -124 -101 296 -300 54 198 -318 274 -39 -332 198 -263 -217
7744 -217 154 -306 175 54 -35 407 -229 -27 280 -310 106 -87 -129 363 -254 -228 190 -344 209 62 -409
7765 -409 436 -34 -219 235 -276 -149 107 -72 275 -153 -41 216 -297 97 127 -127 335 1 -153 401
7785 401 -450 153 181 -190 525 40 -63 362 -184 -92 220 -185 295 -16 -135 209 -141 -156 161 -304 -180
7806 -180 143 -188 488 -229 -206 143 -261 125 137 -199 135 -49 41 290 -300 -15 95 -205 259 -106 -278
7827 -278 73 -387 -19 28 -21 140 12 -289 263 -401 156 100 -183 214 -6 -235 400 -153 175 336 10
7848 10 85 114 -122 226 -50 143 342 -274 -24 -126 -246 421 -347 -223 355 -227 116 56 -374 137 -369
7869 -369 -157 288 -211 198 55 -323 234 -73 29 486 -206 145 210 -51 217 32 27 200 -291 96 222
7890 222 -306 194 -27 -56 399 -296 -197 184 -390 179 17 -217 281 -418 -174 193 -275 221 112 25 309
7911 309 -212 -41 111 -343 279 120 -211 172 -28 69 111 -45 169 34 -102 136 33 99 173 -289 275
7932 275 168 -193 159 -68 -314 405 -215 116 290 -166 70 41 26 408 1 -58 236 -199 85 21 -238
7953 -238 72 -311 45 -41 -510 -8 -109 -168 313 -44 -131 77 -386 144 105 -164 338 -173 -100 191 13 232
7975 232 117 -412 83 -260 -163 444 -96 212 106 -264 249 -73 -122 231 -218 -72 274 -156 111 82 -180
7996 -180 414 -113 39 69 -416 227 -93 -160 289 -200 107 220 -233 231 -8 -149 267 -104 137 136 -274
8017 -274 81 58 -48 175 -251 -187 237 -341 270 235 -173 225 -201 -62 206 -29 60 -84 -304 173 191 91
8039 91 254 -342 -83 -11 -114 229 -8 -136 96 -192 -3 32 -115 -62 51 -95 345 -144 55 198 -57
8060 -57 211 48 -92 183 -94 54 220 -238 285 -123 -254 330 53 -85 154 -171 11 122 -33 284
8080 284 -113 -18 116 -192 5 128 -384 246 -140 -178 361 9 55 107 -223 397 -45 -10 265 -119 14 123
8102 123 -208 189 -20 -78 119 -258 76 100 -342 144 71 -181 312 -134 178 155 -230 151 6 -304 122
8123 122 -97 -125 124 -238 95 13 -260 386 -122 -17 295 -108 41 257 -219 143 -63 90 47 -257 -40
8144 -40 199 -388 32 124 -42 26 -179 146 83 -53 88 -191 -172 38 -252 -56 131 -176 167 49 -228 193
8166 193 -36 -166 -24 -247 175 -41 -266 238 -177 -91 141 -291 169 83 -2 174 -11 -153 -50 -227 270
8187 270 78 -222 195 -71
8191g1
##END NTUPLES=NMR FID
##END=
